<?xml version="1.0" encoding="UTF-8" standalone="no"?>
<svg
   xmlns:dc="http://purl.org/dc/elements/1.1/"
   xmlns:cc="http://creativecommons.org/ns#"
   xmlns:rdf="http://www.w3.org/1999/02/22-rdf-syntax-ns#"
   xmlns:svg="http://www.w3.org/2000/svg"
   xmlns="http://www.w3.org/2000/svg"
   xmlns:sodipodi="http://sodipodi.sourceforge.net/DTD/sodipodi-0.dtd"
   xmlns:inkscape="http://www.inkscape.org/namespaces/inkscape"
   width="20.919378mm"
   height="20.919378mm"
   viewBox="0 0 20.919378 20.919378"
   version="1.1"
   id="svg8"
   inkscape:version="1.0.1 (1.0.1+r73)"
   sodipodi:docname="hsim_logo_rounded.svg"
   inkscape:export-filename="/home/jordano/Development/hsim/hsim/resources/hsim_logo_rounded.png"
   inkscape:export-xdpi="299"
   inkscape:export-ydpi="299">
  <defs
     id="defs2" />
  <sodipodi:namedview
     id="base"
     pagecolor="#ffffff"
     bordercolor="#666666"
     borderopacity="1.0"
     inkscape:pageopacity="0.0"
     inkscape:pageshadow="2"
     inkscape:zoom="3.2809755"
     inkscape:cx="118.03093"
     inkscape:cy="101.18498"
     inkscape:document-units="mm"
     inkscape:current-layer="layer1"
     inkscape:document-rotation="0"
     showgrid="false"
     inkscape:window-width="1920"
     inkscape:window-height="1018"
     inkscape:window-x="0"
     inkscape:window-y="36"
     inkscape:window-maximized="1"
     fit-margin-top="0"
     fit-margin-left="0"
     fit-margin-right="0"
     fit-margin-bottom="0" />
  <metadata
     id="metadata5">
    <rdf:RDF>
      <cc:Work
         rdf:about="">
        <dc:format>image/svg+xml</dc:format>
        <dc:type
           rdf:resource="http://purl.org/dc/dcmitype/StillImage" />
        <dc:title></dc:title>
      </cc:Work>
    </rdf:RDF>
  </metadata>
  <g
     inkscape:label="Layer 1"
     inkscape:groupmode="layer"
     id="layer1"
     transform="translate(-33.011609,-91.872174)">
    <g
       id="g890">
      <circle
         style="fill:#214478;fill-opacity:1;stroke-width:0.396875;stroke-linecap:round;stop-color:#000000"
         id="path839"
         cx="43.471298"
         cy="102.33186"
         r="10.459689" />
      <g
         id="g846"
         transform="matrix(0.55850007,0,0,0.55850007,20.302519,34.713372)"
         style="fill:#ffffff">
        <g
           id="g1098-8"
           transform="matrix(9.6076831e-4,0,0,9.6076831e-4,-369.50048,21.872655)"
           style="fill:#ffffff"
           inkscape:export-filename="/home/jordano/text835.png"
           inkscape:export-xdpi="299"
           inkscape:export-ydpi="299">
          <g
             id="g1100-8"
             style="fill:#ffffff"
             transform="translate(-550.77448)">
            <path
               d="m 429569.03,114328.18 c 0,-7370.74 0,-7370.74 0,-7370.74 -1878.23,2561.47 -1878.23,2561.47 -1878.23,2561.47 -104.33,209.09 -313.02,313.65 -521.7,313.65 -2973.88,0 -2973.88,0 -2973.88,0 -365.22,0 -678.25,-313.65 -678.25,-731.86 0,-365.92 313.03,-679.57 678.25,-679.57 2608.66,0 2608.66,0 2608.66,0 2869.5,-3972.88 2869.5,-3972.88 2869.5,-3972.88 156.52,-209.1 469.56,-313.65 782.59,-209.1 260.87,104.55 469.56,313.65 469.56,627.29 0,6795.72 0,6795.72 0,6795.72 2139.09,-3920.6 2139.09,-3920.6 2139.09,-3920.6 365.22,-522.75 886.94,-313.65 1095.66,-104.55 1304.32,1254.59 1304.32,1254.59 1304.32,1254.59 3652.12,0 3652.12,0 3652.12,0 417.38,0 730.4,313.65 730.4,731.85 0,365.93 -313.02,679.57 -730.4,679.57 -3913,0 -3913,0 -3913,0 -208.69,0 -365.19,-52.27 -521.72,-209.1 -834.78,-888.67 -834.78,-888.67 -834.78,-888.67 -2973.84,5488.85 -2973.84,5488.85 -2973.84,5488.85 -208.68,418.21 -1200,627.3 -1304.35,-365.92 z m 0,0 c 0,0 0,0 0,0"
               style="fill:#ffffff;fill-opacity:1;fill-rule:evenodd;stroke:none"
               id="path1102-8" />
          </g>
        </g>
        <text
           xml:space="preserve"
           style="font-style:normal;font-weight:normal;font-size:14.1111px;line-height:1.25;font-family:sans-serif;fill:#ffffff;fill-opacity:1;stroke:none;stroke-width:0.264583"
           x="25.415394"
           y="124.08783"
           id="text835-5-5-2-6"
           inkscape:export-filename="/home/jordano/text835.png"
           inkscape:export-xdpi="299"
           inkscape:export-ydpi="299"><tspan
             sodipodi:role="line"
             id="tspan833-4-0-9-8"
             x="25.415394"
             y="124.08783"
             style="font-style:normal;font-variant:normal;font-weight:bold;font-stretch:normal;font-size:14.1111px;font-family:Dyuthi;-inkscape-font-specification:Dyuthi;fill:#ffffff;stroke-width:0.264583">HS </tspan></text>
        <ellipse
           style="fill:#ffffff;stroke:none;stroke-width:0.62585;stroke-linecap:round;stroke-miterlimit:4;stroke-dasharray:none;stop-color:#000000"
           id="path1225"
           cx="43.595879"
           cy="118.28578"
           rx="1.8459338"
           ry="1.9285114" />
        <text
           xml:space="preserve"
           style="font-style:normal;font-weight:normal;font-size:14.1111px;line-height:1.25;font-family:sans-serif;fill:#ffffff;fill-opacity:1;stroke:none;stroke-width:0.264583"
           x="45.535988"
           y="124.27367"
           id="text835-5-5-2-6-2"
           inkscape:export-filename="/home/jordano/text835.png"
           inkscape:export-xdpi="299"
           inkscape:export-ydpi="299"><tspan
             sodipodi:role="line"
             id="tspan833-4-0-9-8-3"
             x="45.535988"
             y="124.27367"
             style="font-style:normal;font-variant:normal;font-weight:bold;font-stretch:normal;font-size:14.1111px;font-family:Dyuthi;-inkscape-font-specification:Dyuthi;fill:#ffffff;stroke-width:0.264583">m</tspan></text>
      </g>
    </g>
  </g>
</svg>
