[
  {
    "entity": {
      "code": "PS-PC",
      "title": "Project codename",
      "description": "Project codename. Can not match with actual brand name",
      "updating": 1
    }
  },
  {
    "entity": {
      "code": "PS-PREFIX",
      "title": "Project Prefix",
      "description": "Project Prefix. Project codename should be defined.",
      "updating": 2
    }
  },
  {
    "entity": {
      "code": "PS-MAIN",
      "title": "Main Document",
      "description": "Project Main Document",
      "updating": 3
    }
  }
]