{
  "swagger": "2.0",
  "info": {
    "title": "orderspb/events.proto",
    "version": "version not set"
  },
  "tags": [
    {
      "name": "OrderingService"
    }
  ],
  "consumes": [
    "application/json"
  ],
  "produces": [
    "application/json"
  ],
  "paths": {
    "/api/order": {
      "get": {
        "operationId": "OrderingService_GetOrder",
        "responses": {
          "200": {
            "description": "A successful response.",
            "schema": {
              "$ref": "#/definitions/orderpbGetOrderResponse"
            }
          },
          "default": {
            "description": "An unexpected error response.",
            "schema": {
              "$ref": "#/definitions/rpcStatus"
            }
          }
        },
        "parameters": [
          {
            "name": "id",
            "in": "query",
            "required": false,
            "type": "string"
          }
        ],
        "tags": [
          "OrderingService"
        ]
      }
    },
    "/api/order/cancel": {
      "post": {
        "operationId": "OrderingService_CancelOrder",
        "responses": {
          "200": {
            "description": "A successful response.",
            "schema": {
              "$ref": "#/definitions/orderpbCancelOrderResponse"
            }
          },
          "default": {
            "description": "An unexpected error response.",
            "schema": {
              "$ref": "#/definitions/rpcStatus"
            }
          }
        },
        "parameters": [
          {
            "name": "body",
            "in": "body",
            "required": true,
            "schema": {
              "$ref": "#/definitions/orderpbCancelOrderRequest"
            }
          }
        ],
        "tags": [
          "OrderingService"
        ]
      }
    },
    "/api/order/checkout": {
      "post": {
        "operationId": "OrderingService_CheckoutOrder",
        "responses": {
          "200": {
            "description": "A successful response.",
            "schema": {
              "$ref": "#/definitions/orderpbCheckoutOrderResponse"
            }
          },
          "default": {
            "description": "An unexpected error response.",
            "schema": {
              "$ref": "#/definitions/rpcStatus"
            }
          }
        },
        "parameters": [
          {
            "name": "body",
            "in": "body",
            "required": true,
            "schema": {
              "$ref": "#/definitions/orderpbCheckoutOrderRequest"
            }
          }
        ],
        "tags": [
          "OrderingService"
        ]
      }
    },
    "/api/order/complete": {
      "post": {
        "operationId": "OrderingService_CompleteOrder",
        "responses": {
          "200": {
            "description": "A successful response.",
            "schema": {
              "$ref": "#/definitions/orderpbCompleteOrderResponse"
            }
          },
          "default": {
            "description": "An unexpected error response.",
            "schema": {
              "$ref": "#/definitions/rpcStatus"
            }
          }
        },
        "parameters": [
          {
            "name": "body",
            "in": "body",
            "required": true,
            "schema": {
              "$ref": "#/definitions/orderpbCompleteOrderRequest"
            }
          }
        ],
        "tags": [
          "OrderingService"
        ]
      }
    },
    "/api/order/create": {
      "post": {
        "operationId": "OrderingService_CreateOrder",
        "responses": {
          "200": {
            "description": "A successful response.",
            "schema": {
              "$ref": "#/definitions/orderpbCreateOrderResponse"
            }
          },
          "default": {
            "description": "An unexpected error response.",
            "schema": {
              "$ref": "#/definitions/rpcStatus"
            }
          }
        },
        "parameters": [
          {
            "name": "body",
            "in": "body",
            "required": true,
            "schema": {
              "$ref": "#/definitions/orderpbCreateOrderRequest"
            }
          }
        ],
        "tags": [
          "OrderingService"
        ]
      }
    },
    "/api/order/item": {
      "post": {
        "operationId": "OrderingService_AddItem",
        "responses": {
          "200": {
            "description": "A successful response.",
            "schema": {
              "$ref": "#/definitions/orderpbAddItemResponse"
            }
          },
          "default": {
            "description": "An unexpected error response.",
            "schema": {
              "$ref": "#/definitions/rpcStatus"
            }
          }
        },
        "parameters": [
          {
            "name": "body",
            "in": "body",
            "required": true,
            "schema": {
              "$ref": "#/definitions/orderpbAddItemRequest"
            }
          }
        ],
        "tags": [
          "OrderingService"
        ]
      }
    },
    "/api/order/ready": {
      "post": {
        "operationId": "OrderingService_ReadyOrder",
        "responses": {
          "200": {
            "description": "A successful response.",
            "schema": {
              "$ref": "#/definitions/orderpbReadyOrderResponse"
            }
          },
          "default": {
            "description": "An unexpected error response.",
            "schema": {
              "$ref": "#/definitions/rpcStatus"
            }
          }
        },
        "parameters": [
          {
            "name": "body",
            "in": "body",
            "required": true,
            "schema": {
              "$ref": "#/definitions/orderpbReadyOrderRequest"
            }
          }
        ],
        "tags": [
          "OrderingService"
        ]
      }
    },
    "/api/order/search": {
      "get": {
        "operationId": "OrderingService_SearchOrders",
        "responses": {
          "200": {
            "description": "A successful response.",
            "schema": {
              "$ref": "#/definitions/orderpbSearchOrdersResponse"
            }
          },
          "default": {
            "description": "An unexpected error response.",
            "schema": {
              "$ref": "#/definitions/rpcStatus"
            }
          }
        },
        "parameters": [
          {
            "name": "filters.customerId",
            "in": "query",
            "required": false,
            "type": "string"
          },
          {
            "name": "filters.after",
            "in": "query",
            "required": false,
            "type": "string",
            "format": "date-time"
          },
          {
            "name": "filters.before",
            "in": "query",
            "required": false,
            "type": "string",
            "format": "date-time"
          },
          {
            "name": "filters.productIds",
            "in": "query",
            "required": false,
            "type": "array",
            "items": {
              "type": "string"
            },
            "collectionFormat": "multi"
          },
          {
            "name": "filters.minTotal",
            "in": "query",
            "required": false,
            "type": "number",
            "format": "double"
          },
          {
            "name": "filters.maxTotal",
            "in": "query",
            "required": false,
            "type": "number",
            "format": "double"
          },
          {
            "name": "filters.status",
            "in": "query",
            "required": false,
            "type": "string"
          },
          {
            "name": "next",
            "in": "query",
            "required": false,
            "type": "string"
          },
          {
            "name": "limit",
            "in": "query",
            "required": false,
            "type": "integer",
            "format": "int32"
          }
        ],
        "tags": [
          "OrderingService"
        ]
      }
    }
  },
  "definitions": {
    "SearchOrdersRequestFilters": {
      "type": "object",
      "properties": {
        "customerId": {
          "type": "string"
        },
        "after": {
          "type": "string",
          "format": "date-time"
        },
        "before": {
          "type": "string",
          "format": "date-time"
        },
        "productIds": {
          "type": "array",
          "items": {
            "type": "string"
          }
        },
        "minTotal": {
          "type": "number",
          "format": "double"
        },
        "maxTotal": {
          "type": "number",
          "format": "double"
        },
        "status": {
          "type": "string"
        }
      }
    },
    "orderpbAddItemRequest": {
      "type": "object",
      "properties": {
        "orderId": {
          "type": "string"
        },
        "productId": {
          "type": "string"
        },
        "quantity": {
          "type": "integer",
          "format": "int32"
        }
      }
    },
    "orderpbAddItemResponse": {
      "type": "object"
    },
    "orderpbCancelOrderRequest": {
      "type": "object",
      "properties": {
        "id": {
          "type": "string"
        }
      }
    },
    "orderpbCancelOrderResponse": {
      "type": "object"
    },
    "orderpbCheckoutOrderRequest": {
      "type": "object",
      "properties": {
        "id": {
          "type": "string"
        }
      }
    },
    "orderpbCheckoutOrderResponse": {
      "type": "object"
    },
    "orderpbCompleteOrderRequest": {
      "type": "object",
      "properties": {
        "id": {
          "type": "string"
        },
        "paymentId": {
          "type": "string"
        }
      }
    },
    "orderpbCompleteOrderResponse": {
      "type": "object"
    },
    "orderpbCreateOrderRequest": {
      "type": "object",
      "properties": {
        "customerId": {
          "type": "string"
        }
      }
    },
    "orderpbCreateOrderResponse": {
      "type": "object",
      "properties": {
        "id": {
          "type": "string"
        }
      }
    },
    "orderpbGetOrderResponse": {
      "type": "object",
      "properties": {
        "order": {
          "$ref": "#/definitions/orderpbOrder"
        }
      }
    },
    "orderpbItem": {
      "type": "object",
      "properties": {
        "productId": {
          "type": "string"
        },
        "productName": {
          "type": "string"
        },
        "price": {
          "type": "number",
          "format": "double"
        },
        "quantity": {
          "type": "integer",
          "format": "int32"
        }
      }
    },
    "orderpbOrder": {
      "type": "object",
      "properties": {
        "id": {
          "type": "string"
        },
        "customerId": {
          "type": "string"
        },
        "paymentId": {
          "type": "string"
        },
        "items": {
          "type": "array",
          "items": {
            "type": "object",
            "$ref": "#/definitions/orderpbItem"
          }
        },
        "status": {
          "type": "string"
        }
      }
    },
    "orderpbReadyOrderRequest": {
      "type": "object",
      "properties": {
        "id": {
          "type": "string"
        },
        "paymentId": {
          "type": "string"
        }
      }
    },
    "orderpbReadyOrderResponse": {
      "type": "object"
    },
    "orderpbSearchOrdersResponse": {
      "type": "object",
      "properties": {
        "orders": {
          "type": "array",
          "items": {
            "type": "object",
            "$ref": "#/definitions/orderpbOrder"
          }
        },
        "next": {
          "type": "string"
        }
      }
    },
    "protobufAny": {
      "type": "object",
      "properties": {
        "@type": {
          "type": "string"
        }
      },
      "additionalProperties": {}
    },
    "rpcStatus": {
      "type": "object",
      "properties": {
        "code": {
          "type": "integer",
          "format": "int32"
        },
        "message": {
          "type": "string"
        },
        "details": {
          "type": "array",
          "items": {
            "type": "object",
            "$ref": "#/definitions/protobufAny"
          }
        }
      }
    }
  }
}
