{
  "swagger": "2.0",
  "info": {
    "title": "productspb/events.proto",
    "version": "version not set"
  },
  "tags": [
    {
      "name": "ProductsService"
    }
  ],
  "consumes": [
    "application/json"
  ],
  "produces": [
    "application/json"
  ],
  "paths": {
    "/api/product": {
      "get": {
        "operationId": "ProductsService_GetProduct",
        "responses": {
          "200": {
            "description": "A successful response.",
            "schema": {
              "$ref": "#/definitions/productpbGetProductResponse"
            }
          },
          "default": {
            "description": "An unexpected error response.",
            "schema": {
              "$ref": "#/definitions/rpcStatus"
            }
          }
        },
        "parameters": [
          {
            "name": "id",
            "in": "query",
            "required": false,
            "type": "string"
          }
        ],
        "tags": [
          "ProductsService"
        ]
      },
      "delete": {
        "operationId": "ProductsService_DeleteProduct",
        "responses": {
          "200": {
            "description": "A successful response.",
            "schema": {
              "$ref": "#/definitions/productpbDeleteProductResponse"
            }
          },
          "default": {
            "description": "An unexpected error response.",
            "schema": {
              "$ref": "#/definitions/rpcStatus"
            }
          }
        },
        "parameters": [
          {
            "name": "id",
            "in": "query",
            "required": false,
            "type": "string"
          }
        ],
        "tags": [
          "ProductsService"
        ]
      },
      "post": {
        "operationId": "ProductsService_CreateProduct",
        "responses": {
          "200": {
            "description": "A successful response.",
            "schema": {
              "$ref": "#/definitions/productpbCreateProductResponse"
            }
          },
          "default": {
            "description": "An unexpected error response.",
            "schema": {
              "$ref": "#/definitions/rpcStatus"
            }
          }
        },
        "parameters": [
          {
            "name": "body",
            "in": "body",
            "required": true,
            "schema": {
              "$ref": "#/definitions/productpbCreateProductRequest"
            }
          }
        ],
        "tags": [
          "ProductsService"
        ]
      }
    },
    "/api/product/price/decrease": {
      "post": {
        "operationId": "ProductsService_DecreasePrice",
        "responses": {
          "200": {
            "description": "A successful response.",
            "schema": {
              "$ref": "#/definitions/productpbDecreasePriceResponse"
            }
          },
          "default": {
            "description": "An unexpected error response.",
            "schema": {
              "$ref": "#/definitions/rpcStatus"
            }
          }
        },
        "parameters": [
          {
            "name": "body",
            "in": "body",
            "required": true,
            "schema": {
              "$ref": "#/definitions/productpbDecreasePriceRequest"
            }
          }
        ],
        "tags": [
          "ProductsService"
        ]
      }
    },
    "/api/product/price/increase": {
      "post": {
        "operationId": "ProductsService_IncreasePrice",
        "responses": {
          "200": {
            "description": "A successful response.",
            "schema": {
              "$ref": "#/definitions/productpbIncreasePriceResponse"
            }
          },
          "default": {
            "description": "An unexpected error response.",
            "schema": {
              "$ref": "#/definitions/rpcStatus"
            }
          }
        },
        "parameters": [
          {
            "name": "body",
            "in": "body",
            "required": true,
            "schema": {
              "$ref": "#/definitions/productpbIncreasePriceRequest"
            }
          }
        ],
        "tags": [
          "ProductsService"
        ]
      }
    }
  },
  "definitions": {
    "productpbCreateProductRequest": {
      "type": "object",
      "properties": {
        "name": {
          "type": "string"
        },
        "description": {
          "type": "string"
        },
        "price": {
          "type": "number",
          "format": "double"
        }
      }
    },
    "productpbCreateProductResponse": {
      "type": "object",
      "properties": {
        "statusCode": {
          "type": "string"
        },
        "id": {
          "type": "string"
        }
      }
    },
    "productpbDecreasePriceRequest": {
      "type": "object",
      "properties": {
        "id": {
          "type": "string"
        },
        "price": {
          "type": "number",
          "format": "double"
        }
      }
    },
    "productpbDecreasePriceResponse": {
      "type": "object",
      "properties": {
        "statusCode": {
          "type": "string"
        }
      }
    },
    "productpbDeleteProductResponse": {
      "type": "object",
      "properties": {
        "statusCode": {
          "type": "string"
        }
      }
    },
    "productpbGetProductResponse": {
      "type": "object",
      "properties": {
        "statusCode": {
          "type": "string"
        },
        "product": {
          "$ref": "#/definitions/productpbProduct"
        }
      }
    },
    "productpbIncreasePriceRequest": {
      "type": "object",
      "properties": {
        "id": {
          "type": "string"
        },
        "price": {
          "type": "number",
          "format": "double"
        }
      }
    },
    "productpbIncreasePriceResponse": {
      "type": "object",
      "properties": {
        "statusCode": {
          "type": "string"
        }
      }
    },
    "productpbProduct": {
      "type": "object",
      "properties": {
        "id": {
          "type": "string"
        },
        "name": {
          "type": "string"
        },
        "description": {
          "type": "string"
        },
        "price": {
          "type": "number",
          "format": "double"
        }
      }
    },
    "protobufAny": {
      "type": "object",
      "properties": {
        "@type": {
          "type": "string"
        }
      },
      "additionalProperties": {}
    },
    "rpcStatus": {
      "type": "object",
      "properties": {
        "code": {
          "type": "integer",
          "format": "int32"
        },
        "message": {
          "type": "string"
        },
        "details": {
          "type": "array",
          "items": {
            "type": "object",
            "$ref": "#/definitions/protobufAny"
          }
        }
      }
    }
  }
}
