{
  "$schema": "http://json-schema.org/draft-07/schema#",
  "type": "object",
  "properties": {
    "inputs": {
      "type": "object",
      "properties": {
        "current-schema": {
          "type": "string"
        },
        "new-schema": {
          "type": "string"
        },
        "current-version": {
          "type": "string"
        },
        "ruleset": {
          "type": "string"
        }
      },
      "required": ["current-schema", "new-schema", "current-version", "ruleset"]
    },
    "outputs": {
      "type": "object",
      "properties": {
        "changeset": {
          "type": "array",
          "items": {
            "type": "object",
            "properties": {
              "type": {
                "type": "integer"
              },
              "path": {
                "type": "string"
              },
              "typeA": {
                "type": "string"
              },
              "typeB": {
                "type": "string"
              },
              "version": {
                "type": "string"
              }
            },
            "required": ["type", "path", "version"]
          }
        }
      }
    }
  },
  "required": ["inputs", "outputs"]
}
