{
  "sections": {
    "main": {
      "type": "product",
      "blocks": {
        "c7f2fe06-1561-40dd-bfdb-32583e13622a": {
          "type": "shopify:\/\/apps\/okendo-product-reviews-ugc\/blocks\/star-rating\/bb689e69-ea70-4661-8fb7-ad24a2e23c29",
          "settings": {
            "product": "health"
          }
        }
      },
      "block_order": [
        "c7f2fe06-1561-40dd-bfdb-32583e13622a"
      ],
      "settings": {
        "bg_color": "#f7fafb",
        "margin_top": 0,
        "margin_bottom": 0,
        "padding_top": 80,
        "padding_bottom": 72,
        "title": "{{ product.vendor }}",
        "add_to_cart_desc": "<p>*1 Year Plan,<strong>$40.00 automatically billed annually<\/strong><\/p>"
      }
    },
    "featured_columns": {
      "type": "featured-columns",
      "blocks": {
        "70c76851-0c28-4c14-a431-c9376a796737": {
          "type": "icon_and_text",
          "settings": {
            "image": "shopify:\/\/shop_images\/Group_12843_2048x_05a6280d-e4d9-4c00-9e62-a2ce40588728.webp",
            "title": "Daily Check-Ins",
            "description": "Keep a daily log of how your pet is feeling. Add notes to understand how different factors affect their emotional and physical health."
          }
        },
        "fb0bd7f4-3a32-49f6-b683-3d68bd61d5b7": {
          "type": "icon_and_text",
          "settings": {
            "image": "shopify:\/\/shop_images\/Group_12843_2048x_05a6280d-e4d9-4c00-9e62-a2ce40588728.webp",
            "title": "Ask a Vet",
            "description": "With Whistle’s Ask a Vet feature, you can connect with a licensed vet via chat, call, video, or email—straight from the app."
          }
        },
        "87ba43a4-4b59-4467-8a97-a8550f8a581c": {
          "type": "icon_and_text",
          "settings": {
            "image": "shopify:\/\/shop_images\/Group_12815_2048x_39463d48-5b10-4caf-bcc6-8f834fcb901a.webp",
            "title": "Health Monitoring",
            "description": "With Whistle’s Ask a Vet feature, you can connect with a licensed vet via chat, call, video, or email—straight from the app."
          }
        },
        "81367274-e551-4af0-87a2-b393c995b942": {
          "type": "icon_and_text",
          "settings": {
            "image": "shopify:\/\/shop_images\/Group_12815_2048x_39463d48-5b10-4caf-bcc6-8f834fcb901a.webp",
            "title": "Ask a Vet",
            "description": "With Whistle’s Ask a Vet feature, you can connect with a licensed vet via chat, call, video, or email—straight from the app."
          }
        },
        "8c4e685d-4dc2-4dc3-b92e-50a368b2a029": {
          "type": "icon_and_text",
          "settings": {
            "image": "shopify:\/\/shop_images\/Group_12843_2048x_05a6280d-e4d9-4c00-9e62-a2ce40588728.webp",
            "title": "Health Monitoring",
            "description": "With Whistle’s Ask a Vet feature, you can connect with a licensed vet via chat, call, video, or email—straight from the app."
          }
        },
        "4fa6e256-8d25-452f-ada1-3a182841c34f": {
          "type": "icon_and_text",
          "settings": {
            "image": "shopify:\/\/shop_images\/Group_12815_2048x_39463d48-5b10-4caf-bcc6-8f834fcb901a.webp",
            "title": "Daily Check-Ins",
            "description": "Keep a daily log of how your pet is feeling. Add notes to understand how different factors affect their emotional and physical health."
          }
        }
      },
      "block_order": [
        "70c76851-0c28-4c14-a431-c9376a796737",
        "fb0bd7f4-3a32-49f6-b683-3d68bd61d5b7",
        "87ba43a4-4b59-4467-8a97-a8550f8a581c",
        "81367274-e551-4af0-87a2-b393c995b942",
        "8c4e685d-4dc2-4dc3-b92e-50a368b2a029",
        "4fa6e256-8d25-452f-ada1-3a182841c34f"
      ],
      "settings": {
        "bg_color": "#f7fafb",
        "title": "Your pet’s health, in the palm of your hand.",
        "link_text": "Learn more about the Whistle app and technology",
        "link_url": "shopify:\/\/pages\/contact",
        "margin_top": 0,
        "margin_bottom": 0,
        "padding_top": 36,
        "padding_bottom": 36
      }
    },
    "1673241586153b21f9": {
      "type": "apps",
      "blocks": {
        "dd69ee60-1eb3-4826-97f0-2119812e8dd9": {
          "type": "shopify:\/\/apps\/okendo-product-reviews-ugc\/blocks\/reviews-widget\/bb689e69-ea70-4661-8fb7-ad24a2e23c29",
          "settings": {
            "product": "{{product}}",
            "widget_type": "reviews_widget"
          }
        },
        "22f71a27-d5a7-4546-99eb-814e9acb2bbe": {
          "type": "shopify:\/\/apps\/okendo-product-reviews-ugc\/blocks\/questions-widget\/bb689e69-ea70-4661-8fb7-ad24a2e23c29",
          "settings": {
            "product": "{{product}}"
          }
        }
      },
      "block_order": [
        "dd69ee60-1eb3-4826-97f0-2119812e8dd9",
        "22f71a27-d5a7-4546-99eb-814e9acb2bbe"
      ],
      "settings": {
        "include_margins": true
      }
    },
    "fb243ba9-75a8-4c74-925b-0a6d57c5af7c": {
      "type": "fqa",
      "blocks": {
        "9a5ea1c6-74d9-4534-86ec-016ebf2f81e1": {
          "type": "faq",
          "settings": {
            "title": "TitHow long will my Whistle™ Health Limited Edition battery last?",
            "description": "descriptionYes, you’ll need an annual subscription so your Whistle™ Health Limited Edition can connect to the service needed to collect your pet’s data."
          }
        },
        "47cd0d51-3c96-4dee-82bd-ead9d5459262": {
          "type": "faq",
          "settings": {
            "title": "TitleTitHow long will my Whistle™ Health Limited Edition battery last?",
            "description": "descriptionYes, you’ll need an annual subscription so your Whistle™ Health Limited Edition can connect to the service needed to collect your pet’s data."
          }
        }
      },
      "block_order": [
        "9a5ea1c6-74d9-4534-86ec-016ebf2f81e1",
        "47cd0d51-3c96-4dee-82bd-ead9d5459262"
      ],
      "settings": {
        "bg_color": "",
        "title": "Frequently asked questions",
        "margin_top": 0,
        "margin_bottom": 0,
        "padding_top": 36,
        "padding_bottom": 36
      }
    }
  },
  "order": [
    "main",
    "featured_columns",
    "1673241586153b21f9",
    "fb243ba9-75a8-4c74-925b-0a6d57c5af7c"
  ]
}