====== Physique ======

===== Bandes dessinées =====
{{topic>Physique +BD&nodate&nouser&sort}}

===== Mangas =====
{{topic>Physique +Manga&nodate&nouser&sort}}

===== Comics =====
{{topic>Physique +Comic&nodate&nouser&sort}}

{{tag>Theme}}
