====== Sport ======

===== Sous-genres =====
{{topic>Sport +SousGenre&nodate&nouser&sort}}

===== Bandes dessinées =====
{{topic>Sport +BD&nodate&nouser&sort}}

===== Mangas =====
{{topic>Sport +Manga&nodate&nouser&sort}}

{{tag>Genre}}
