====== Blog ======

===== Sous-genres =====
{{topic>Blog +SousGenre&nodate&nouser&sort}}

===== Bandes dessinées =====
{{topic>Blog +BD&nodate&nouser&sort}}

===== Mangas =====
{{topic>Blog +Manga&nodate&nouser&sort}}

{{tag>Genre}}
