====== Shôjo ======

===== Sous-genres =====
{{topic>Shojo +SousGenre&nodate&nouser&sort}}

===== Bandes dessinées =====
{{topic>Shojo +BD&nodate&nouser&sort}}

===== Mangas =====
{{topic>Shojo +Manga&nodate&nouser&sort}}

{{tag>Genre}}
