====== Lyrique ======

===== Bandes dessinées =====
{{topic>Lyrique +BD&nodate&nouser&sort}}

===== Mangas =====
{{topic>Lyrique +Manga&nodate&nouser&sort}}

===== Comics =====
{{topic>Lyrique +Comic&nodate&nouser&sort}}

{{tag>Registre}}
