====== @!PAGE@ ======

@!PAGE@ est un ?

  * Nombre de tomes : 
  * Scénario : [[auteur:]]
  * Dessins : [[auteur:]]
  * Couleurs : 
  * Genre : [[genre:]]
  * Registre : [[registre:]]
  * Thème : [[theme:]]
  * Éditeur : 
  * Collection : [[collection:]]
  * Rang : {{tagpage>rang|?}}
  * Sortie : 

===== Liens =====
  * [[|Wikipédia]]
  * [[|BDgest']]


{{tag>truc sc dess}}
