====== Femmes ======

===== Bandes dessinées =====
{{topic>Femmes +BD&nodate&nouser&sort}}

===== Mangas =====
{{topic>Femmes +Manga&nodate&nouser&sort}}

===== Comics =====
{{topic>Femmes +Comic&nodate&nouser&sort}}

{{tag>Theme}}
