====== Vie dans le monde ======

===== Sous-genres =====
{{topic>Monde +SousGenre&nodate&nouser&sort}}

===== Bandes dessinées =====
{{topic>Monde +BD&nodate&nouser&sort}}

===== Mangas =====
{{topic>Monde +Manga&nodate&nouser&sort}}

===== Comics =====
{{topic>Monde +Comic&nodate&nouser&sort}}

{{tag>Genre}}
