====== Bande dessinée ======

Liste des bandes dessinées

===== Rang 1 =====
{{topic>BD +rang1&nodate&nodesc&nouser&sort}}

===== Rang 2 =====
{{topic>BD +rang2&nodate&nodesc&nouser&sort}}

===== Rang 3 =====
{{topic>BD +rang3&nodate&nodesc&nouser&sort}}

===== Rang 4 =====
{{topic>BD +rang4&nodate&nodesc&nouser&sort}}

===== Rang 5 =====
{{topic>BD +rang5&nodate&nodesc&nouser&sort}}

{{tag>Type}}