====== Engagé (genre) ======

===== Sous-genres =====
{{topic>Engage +SousGenre&nodate&nouser&sort}}

===== Bandes dessinées =====
{{topic>Engage +BD&nodate&nouser&sort}}

===== Mangas =====
{{topic>Engage +Manga&nodate&nouser&sort}}

===== Comics =====
{{topic>Engage +Comic&nodate&nouser&sort}}

{{tag>Genre}}
