{
  "environment": "web",
  "format": "html",
  "prefix": "https://storage.googleapis.com",
  "mainga": "UA-49880327-14",
  "updated": "2020-06-24T13:46:49+02:00",
  "id": "tp3",
  "duration": 20,
  "title": "TP3 - DevOps, Cloud et Infra-Code",
  "authors": "OCTO Technology",
  "summary": "TP3",
  "source": "tp3.md",
  "theme": "",
  "status": [
    "published"
  ],
  "category": [
    "tp",
    "api"
  ],
  "tags": [
    "api",
    "flask"
  ],
  "feedback": "https://gitlab.com/octo-technology/octo-bda/cercle-formation/dsin2/-/issues/new",
  "url": "tp3"
}
