Star Wars, épisode VII : Le Réveil de la Force		J. J. Abrams	10485154	2015
Les Minions		Kyle BaldaetPierre Coffin	6588715	2015
Jurassic World		Colin Trevorrow	5204879	2015
007 Spectre		Sam Mendes	4982985	2015
Fast and Furious 7		James Wan	4637718	2015
Vice-versa		Pete DocteretRonnie del Carmen	4501572	2015
Les Nouvelles Aventures d'Aladin		Arthur Benzaquen	4437899	2015
Avengers : L'Ère d'Ultron		Joss Whedon	4326331	2015
Cinquante nuances de Grey		Sam Taylor-Wood	4068085	2015
Les Profs 2		Pierre-François Martin-Laval	3496409	2015
Babysitting 2		Philippe LacheauetNicolas Benamou	3203541	2015
American Sniper		Clint Eastwood	3130825	2015
Le Labyrinthe : La Terre brûlée		Wes Ball	3119737	2015
Papa ou Maman		Martin Bourboulon	2887383	2015
Hunger Games : La Révolte, partie 2		Francis Lawrence	2882374	2015
Mission impossible : Rogue Nation		Christopher McQuarrie	2798766	2015
Le Voyage d'Arlo		Peter Sohn	2741038	2015
Taken 3		Olivier Megaton	2614008	2015
Seul sur Mars		Ridley Scott	2511458	2015
Divergente 2 : L'Insurrection		Robert Schwentke	2412922	2015
Pourquoi j'ai pas mangé mon père		Jamel Debbouze	2410703	2015
Mad Max: Fury Road		George Miller	2360586	2015
Hôtel Transylvanie 2		Genndy Tartakovsky	2301547	2015
Le Petit Prince		Mark Osborne	1951629	2015
Ant-Man		Peyton Reed	1762642	2015
Belle et Sébastien : l'aventure continue		Christian Duguay	1802429	2015
Cendrillon		Kenneth Branagh	1721458	2015
Les Nouveaux Héros		Don HalletChris Williams	1710223	2015
Kingsman : Services secrets		Matthew Vaughn	1656721	2015
La Nuit au musée : Le Secret des Pharaons		Shawn Levy	1576649	2015
Bis		Dominique Farrugia	1512945	2015
Terminator Genisys		Alan Taylor	1426224	2015
Bob l'éponge, le film : Un héros sort de l'eau		Paul Tibbitt	1308970	2015
Le Dernier Loup		Jean-Jacques Annaud	1277584	2015
En route !		Tim Johnson	1213616	2015
Les Quatre Fantastiques		Josh Trank	1201597	2015
Connasse, princesse des cœurs		Eloïse LangetNoémie Saglio	1199096	2015
Le Grand Partage		Alexandra Leclère	1167470	2015
San Andreas		Brad Peyton	1151994	2015
Ted 2		Seth MacFarlane	1145097	2015
Demain		Cyril DionetMélanie Laurent	1086410	2015
Imitation Game		Morten Tyldum	1073025	2015
Les Souvenirs		Jean-Paul Rouve	1068625	2015
Marguerite		Xavier Giannoli	1065499	2015
Une heure de tranquillité		Patrice Leconte	1039996	2015
La Grande Aventure de Maya l'abeille		Alexs Stadermann	1006536	2015
Shaun le mouton		Mark BurtonetRichard Starzack	1003022	2015
La Loi du marché		Stéphane Brizé	1001498	2015
L'Hermine		Christian Vincent	1000465	2015
Qu'est-ce qu'on a fait au Bon Dieu ?		Philippe de Chauveron	12361430	2014
La Famille Bélier		Éric Lartigau	7450944	2014
Supercondriaque		Dany Boon	5269404	2014
Lucy		Luc Besson	5201019	2014
Le Hobbit : La Bataille des Cinq Armées		Peter Jackson	4848676	2014
La Planète des singes : L'Affrontement		Matt Reeves	3783833	2014
Dragons 2		Dean DeBlois	3376525	2014
X-Men: Days of Future Past		Bryan Singer	3289100	2014
Rio 2		Carlos Saldanha	3261547	2014
Hunger Games : La Révolte, partie 1		Francis Lawrence	3228348	2014
Le Labyrinthe		Wes Ball	3126743	2014
Samba		Éric ToledanoetOlivier Nakache	3109720	2014
Astérix : Le Domaine des dieux		Alexandre AstieretLouis Clichy	2996184	2014
Paddington		Paul King	2782705	2014
Interstellar		Christopher Nolan	2640439	2014
Les Vacances du petit Nicolas		Laurent Tirard	2455294	2014
Les Gardiens de la Galaxie		James Gunn	2393763	2014
Babysitting		Philippe LacheauetNicolas Benamou	2358733	2014
Transformers : L'Âge de l'extinction		Michael Bay	2343189	2014
Les Pingouins de Madagascar		Eric DarnelletSimon J. Smith	2327491	2014
The Amazing Spider-Man : Le Destin d'un héros		Marc Webb	2323393	2014
Les Trois Frères : Le Retour		Les Inconnus	2289408	2014
Maléfique		Robert Stromberg	2046776	2014
Fiston		Pascal Bourdiaux	1922868	2014
Captain America : Le Soldat de l'hiver		Anthony et Joe Russo	1922648	2014
Gone Girl		David Fincher	1904894	2014
La Belle et la Bête		Christophe Gans	1827336	2014
Ninja Turtles		Jonathan Liebesman	1783919	2014
12 Years a Slave		Steve McQueen	1696935	2014
Yves Saint Laurent		Jalil Lespert	1639214	2014
Barbecue		Éric Lavaine	1600584	2014
300 : La Naissance d'un Empire		Noam Murro	1563297	2014
Annabelle		John R. Leonetti	1538114	2014
La French		Cédric Jimenez	1530106	2014
Exodus: Gods and Kings		Ridley Scott	1515929	2014
La Grande Aventure Lego		Phil LordetChris Miller	1513034	2014
Divergente		Neil Burger	1492110	2014
The Grand Budapest Hotel		Wes Anderson	1473971	2014
Minuscule : La Vallée des fourmis perdues		Hélène GiraudetThomas Szabo	1466204	2014
M. Peabody et Sherman : Les Voyages dans le temps		Rob Minkoff	1418220	2014
Sous les jupes des filles		Audrey Dana	1390061	2014
Godzilla		Gareth Edwards	1361689	2014
Noé		Darren Aronofsky	1318800	2014
Monuments Men		Georges Clooney	1288727	2014
Edge of Tomorrow		Doug Liman	1239848	2014
Non-Stop		Jaume Collet-Serra	1233868	2014
Le Crocodile du Botswanga		Fabrice ÉbouéetLionel Steketee	1227314	2014
Mommy		Xavier Dolan	1194684	2014
Opération Casse-noisette		Peter Lepeniotis	1192627	2014
Timbuktu		Abderrahmane Sissako	1186882	2014
Expendables 3		Patrick Hughes	1063124	2014
Magic in the Moonlight		Woody Allen	1060193	2014
Tu veux ou tu veux pas		Tonie Marshall	1059794	2014
Clochette et la Fée pirate		Peggy Holmes	1055301	2014
Nos étoiles contraires		Josh Boone	1046134	2014
La Reine des neiges		Chris BucketJennifer Lee	5149518	2013
Le Hobbit : La Désolation de Smaug		Peter Jackson	4701246	2013
Moi, moche et méchant 2		Pierre CoffinetChris Renaud	4655036	2013
Iron Man 3		Shane Black	4386939	2013
Django Unchained		Quentin Tarantino	4303569	2013
Gravity		Alfonso Cuarón	4094466	2013
Les Profs		Pierre-François Martin-Laval	3957176	2013
Hunger Games : L'Embrasement		Francis Lawrence	3140889	2013
Le Loup de Wall Street		Martin Scorsese	3009494	2013
Insaisissables		Louis Leterrier	3005837	2013
Fast and Furious 6		Justin Lin	2994362	2013
Belle et Sébastien		Nicolas Vanier	2966318	2013
Les Garçons et Guillaume, à table !		Guillaume Gallienne	2818013	2013
Turbo		David Soren	2472511	2013
World War Z		Marc Forster	2444735	2013
Thor : Le Monde des ténèbres		Alan Taylor	2353234	2013
Les Croods		Chris SandersetKirk DeMicco	2350349	2013
Man of Steel		Zack Snyder	2303132	2013
Les Schtroumpfs 2		Raja Gosnell	2263030	2013
Monstres Academy		Dan Scanlon	2135699	2013
9 mois ferme		Albert Dupontel	2070776	2013
Boule et Bill		Alexandre CharlotetFranck Magnier	2006408	2013
Wolverine : Le Combat de l'immortel		James Mangold	1989081	2013
Le Majordome		Lee Daniels	1932081	2013
Very Bad Trip 3		Todd Phillips	1925020	2013
Die Hard : Belle journée pour mourir		John Moore	1824376	2013
Jappeloup		Christian Duguay	1821968	2013
Eyjafjallajökull		Alexandre Coffre	1787433	2013
Hôtel Transylvanie		Genndy Tartakovsky	1709998	2013
Les Gamins		Anthony Marciano	1647260	2013
Le Monde Fantastique d'Oz		Sam Raimi	1592409	2013
Gatsby le Magnifique		Baz Luhrmann	1570321	2013
Elysium		Neill Blomkamp	1517597	2013
Casse-tête chinois		Cédric Klapisch	1515154	2013
Percy Jackson : La Mer des monstres		Thor Freudenthal	1470269	2013
Blue Jasmine		Woody Allen	1454894	2013
20 ans d'écart		David Moreau	1400146	2013
Sur le chemin de l'école		Pascal Plisson	1384572	2013
Oblivion		Joseph Kosinski	1331599	2013
Lincoln		Steven Spielberg	1320425	2013
After Earth		M. Night Shyamalan	1276118	2013
La Cage dorée		Ruben Alves	1231760	2013
Epic : La Bataille du royaume secret		Chris Wedge	1211919	2013
Lone Ranger, naissance d'un héros		Gore Verbinski	1175633	2013
Alceste à bicyclette		Philippe Le Guay	1169254	2013
Conjuring : Les Dossiers Warren		James Wan	1163218	2013
Prisoners		Denis Villeneuve	1155295	2013
Vive la France		Michaël Youn	1107835	2013
Möbius		Éric Rochant	1095433	2013
Happiness Therapy		David O. Russell	1067238	2013
La Vie d'Adèle		Abdellatif Kechiche	1036811	2013
Paulette		Jérôme Enrico	1035257	2013
Le Manoir magique		Ben StassenetJeremy Degruson	1025319	2013
Pacific Rim		Guillermo del Toro	1019101	2013
Skyfall		Sam Mendes	7003902	2012
L'Âge de glace 4 : La Dérive des Continents		Steve MartinoetMike Thurmeier	6588883	2012
Sur la piste du Marsupilami		Alain Chabat	5304366	2012
La Vérité si je mens ! 3		Thomas Gilou	4613791	2012
Twilight - Chapitre V : Révélation - 2epartie		Bill Condon	4525647	2012
Avengers		Joss Whedon	4510704	2012
Le Hobbit : Un Voyage inattendu		Peter Jackson	4505525	2012
The Dark Knight Rises		Christopher Nolan	4413773	2012
Astérix et Obélix : Au service de Sa Majesté		Laurent Tirard	3820404	2012
Le Prénom		A. PatellièreetM. Delaporte	3347000	2012
Madagascar 3 : Bons baisers d'Europe		E. Darnell,C. VernonetT. McGrath	3343533	2012
Rebelle		Mark AndrewsetBrenda Chapman	3235000	2012
Taken 2		Olivier Megaton	2904902	2012
Les Cinq Légendes		Peter Ramsey	2833326	2012
Les Seigneurs		Olivier Dahan	2729000	2012
The Amazing Spider-Man 		Marc Webb	2541995	2012
Sherlock Holmes : Jeu d'ombres		Guy Ritchie	2381964	2012
Les Infidèles		Jean Dujardin,Gilles Lellouche…	2301045	2012
De l'autre côté du périph		David Charhon	2231910	2012
Men in Black 3		Barry Sonnenfeld	2129210	2012
Expendables 2 : Unité spéciale		Simon West	1962967	2012
Blanche-Neige et le Chasseur		Rupert Sanders	1955857	2012
Dark Shadows		Tim Burton	1952000	2012
De rouille et d'os		Jacques Audiard	1932000	2012
Stars 80		Frédéric ForestieretThomas Langmann	1866509	2012
Projet X		Nima Nourizadeh	1847000	2012
Prometheus		Ridley Scott	1837125	2012
Un bonheur n'arrive jamais seul		James Huth	1828750	2012
Cloclo		Florent Emilio Siri	1791770	2012
Les Mondes de Ralph		Rich Moore	1753000	2012
Hunger Games		Gary Ross	1730052	2012
L'Odyssée de Pi		Ang Lee	1594514	2012
American Pie 4		Hayden SchlossbergetJon Hurwitz	1525337	2012
Clochette et le Secret des fées		Peggy HolmesetBobs Gannaway	1483000	2012
Zarafa		Rémi Bezançon	1458000	2012
Mince alors !		Charlotte de Turckheim	1450000	2012
J. Edgar		Clint Eastwood	1443476	2012
Jack Reacher		Christopher McQuarrie	1410051	2012
Ted		Seth MacFarlane	1378875	2012
Argo		Ben Affleck	1379000	2012
Voyage au centre de la Terre 2 : l'île mystérieuse		Brad Peyton	1303369	2012
Total Recall : Mémoires programmées		Len Wiseman	1277000	2012
Un plan parfait		Pascal Chaumeil	1203215	2012
Dans la maison		François Ozon	1195518	2012
Populaire		Régis Roinsard	1167403	2012
Titanic 3D		James Cameron	1139388	2012
Kirikou et les hommes et les femmes		Michel Ocelot	1135000	2012
Sexy Dance 4 : Miami Heat		Scott Speer	1121544	2012
Millénium : Les Hommes qui n'aimaient pas les femmes		David Fincher	1080239	2012
Battleship		Peter Berg	1063484	2012
Les Vacances de Ducobu		Philippe de Chauveron	1057000	2012
Les Saveurs du palais		Christian Vincent	1022766	2012
John Carter		Andrew Stanton	1021013	2012
Chronicle		Josh Trank	1020366	2012
Les Kaïra		Franck Gastambide	1016184	2012
Intouchables		E.Toledano/O.Nakache	19440920	2011
Rien à déclarer		Dany Boon	8150825	2011
Harry Potter et les Reliques de la Mort - 2epartie		David Yates	6512424	2011
Les Aventures de Tintin : Le Secret de La Licorne		Steven Spielberg	5316452	2011
Pirates des Caraïbes : La Fontaine de jouvence		Rob Marshall	4755984	2011
Le Chat Potté		Chris Miller	3794833	2011
Twilight - Chapitre IV : Révélation - 1repartie		Bill Condon	3638210	2011
La Planète des Singes : Les Origines		Rupert Wyatt	3240118	2011
The Artist		Michel Hazanavicius	3064873	2011
Le Discours d'un roi		Tom Hooper	3024322	2011
Cars 2		J.Lasseter/B.Lewis	2977049	2011
Les Schtroumpfs		Raja Gosnell	2773800	2011
Kung Fu Panda 2		Jennifer Yuh(en)	2646097	2011
Transformers 3 : La Face cachée de la Lune		Michael Bay	2622932	2011
Black Swan		Darren Aronofsky	2617032	2011
Fast and Furious 5		Justin Lin	2517576	2011
Very Bad Trip 2		Todd Phillips	2505081	2011
Mission Impossible : Protocole Fantôme		Brad Bird	2415037	2011
Polisse		Maïwenn	2414418	2011
Alvin et les Chipmunks 3		Mike Mitchell	2402251	2011
Rio		Carlos Saldanha	2376481	2011
Hollywoo		F.Berthe/P.Serieis	2350667	2011
Les Femmes du 6e étage		Philippe Le Guay	2274327	2011
X-Men : Le Commencement		Matthew Vaughn	2096575	2011
Au-delà		Clint Eastwood	1905487	2011
Case Départ		F.Éboué/T.N'Gijol/L.Steketee	1799957	2011
Un monstre à Paris		Bibo Bergeron	1748205	2011
Minuit à Paris		Woody Allen	1739215	2011
Thor		Kenneth Branagh	1714453	2011
Drive		Nicolas Winding Refn	1580623	2011
La Nouvelle Guerre des boutons		Christophe Barratier	1542231	2011
Les Tuche		Olivier Baroux	1534651	2011
Super 8		J. J. Abrams	1506877	2011
L'Elève Ducobu		Philippe de Chauveron	1487565	2011
La Guerre des boutons		Yann Samuell	1480018	2011
Bienvenue à Bord		Éric Lavaine	1425093	2011
True Grit		EthanetJoel Coen	1402149	2011
La Fille du Puisatier		Daniel Auteuil	1401489	2011
Largo Winch 2		Jérôme Salle	1350999	2011
Hugo Cabret		Martin Scorsese	1285647	2011
Titeuf, le film		Zep	1267763	2011
Rango		Gore Verbinski	1259129	2011
Le Fils à Jo		Philippe Guillard	1238549	2011
Tron : L'Héritage		Joseph Kosinski	1215956	2011
Les Lyonnais		Olivier Marchal	1208076	2011
Real Steel		Shawn Levy	1103871	2011
Time Out		Andrew Niccol	1099016	2011
Scream 4		Wes Craven	1070890	2011
Captain America : First Avenger		Joe Johnston	1061166	2011
Animaux & Cie		R.Klooss/H.Tappe	1054619	2011
La Chance de ma vie		Nicolas Cuche	1047705	2011
Ma part du gâteau		Cédric Klapisch	1025887	2011
Sans Identité		Jaume Collet-Serra	1003434	2011
Le Dernier des Templiers		Dominic Sena	1000723	2011
Harry Potter et les Reliques de la Mort -1repartie		David Yates	6016779	2010
Les Petits Mouchoirs		Guillaume Canet	5457251	2010
Inception		Christopher Nolan	4915637	2010
Shrek 4 : Il était une fin		Mike Mitchell	4626169	2010
Alice au pays des merveilles		Tim Burton	4536669	2010
Toy Story 3		Lee Unkrich	4362849	2010
Raiponce		B.Howard/N.Greno	4022966	2010
Camping 2		Fabien Onteniente	3978284	2010
Twilight - Chapitre III : Hésitation		David Slade	3930577	2010
La Princesse et la Grenouille		Ron Clements	3843786	2010
L'Arnacœur		Pascal Chaumeil	3798089	2010
Des hommes et des dieux		Xavier Beauvois	3204147	2010
Arthur 3 : la Guerre des deux mondes		Luc Besson	3127246	2010
Shutter Island		Martin Scorsese	3113153	2010
Invictus		Clint Eastwood	3110394	2010
Moi, moche et méchant		C.Renaud/P.Coffin	3008069	2010
Le Monde de Narnia : L'Odyssée du Passeur d'Aurore		Michael Apted	2893712	2010
Océans		Jacques Perrin	2874748	2010
La Rafle		Roselyne Bosch	2851122	2010
Iron Man 2		Jon Favreau	2575265	2010
Robin des Bois		Ridley Scott	2385387	2010
Potiche		François Ozon	2318221	2010
Dragons(How To Train Your Dragon)		D.DeBlois/C.Sanders	2316829	2010
Prince of Persia : Les Sables du temps		Mike Newell	2169122	2010
Sherlock Holmes		Guy Ritchie	2143123	2010
Le Choc des Titans		Louis Leterrier	1876286	2010
Night and Day		James Mangold	1755434	2010
L'Apprenti Sorcier 		Jon Turteltaub	1690662	2010
Expendables : Unité spéciale		Sylvester Stallone	1651610	2010
Les Aventures extraordinaires d'Adèle Blanc-Sec		Luc Besson	1629404	2010
The Social Network		David Fincher	1494682	2010
Le Mac		Pascal Bourdiaux	1481381	2010
Salt		Phillip Noyce	1474193	2010
Tout ce qui brille		Géraldine Nakache	1420183	2010
Sex and the City 2		Michael Patrick King	1315049	2010
Le Voyage Extraordinaire de Samy		Ben Stassen	1298046	2010
Karate Kid		Harald Zwart	1288145	2010
Mon beau-père et nous		Paul Weitz	1277762	2010
La Tête en friche		Jean Becker	1271856	2010
Megamind		Tom McGrath	1233106	2010
Percy Jackson : Le Voleur de foudre		Chris Columbus	1225182	2010
Fatal		Michaël Youn	1208113	2010
Gainsbourg (Vie Héroïque)		Joann Sfar	1199451	2010
L'homme qui voulait vivre sa vie		Éric Lartigau	1196015	2010
Valentine’s Day		Garry Marshall	1187409	2010
Le Dernier Maître de l'Air		M. Night Shyamalan	1184473	2010
L'Agence tous risques		Joe Carnahan	1179449	2010
Les émotifs anonymes		Jean-Pierre Améris	1159326	2010
L'Immortel		Richard Berry	1129959	2010
L'amour c'est mieux à deux		D.Farrugia/A.Lemort	1123061	2010
L'Italien		Olivier Baroux	1111907	2010
The Town		Ben Affleck	1086699	2010
The Ghost Writer		Roman Polanski	1081016	2010
Un balcon sur la mer		Nicole Garcia	1047647	2010
Avatar		James Cameron	14677888	2009
L'Âge de glace 3 : Le Temps des dinosaures		Carlos Saldanha	7803757	2009
Harry Potter et le Prince de sang-mêlé		David Yates	6054081	2009
Le Petit Nicolas		Laurent Tirard	5520194	2009
2012		Roland Emmerich	4631838	2009
Là-haut		Bob Peterson/Pete Docter	4508940	2009
Twilight - Chapitre II : Tentation		Chris Weitz	4201484	2009
Arthur et la Vengeance de Maltazard		Luc Besson	3871771	2009
LOL		Lisa Azuelos	3660204	2009
Gran Torino		Clint Eastwood	3411031	2009
Coco		Gad Elmaleh	3008677	2009
Volt, star malgré lui		Chris Williams	2970770	2009
Inglourious Basterds		Quentin Tarantino	2847740	2009
Twilight - Chapitre I : Fascination		Catherine Hardwicke	2772499	2009
Slumdog Millionaire		Danny Boyle	2700935	2009
L'Étrange Histoire de Benjamin Button		David Fincher	2595615	2009
OSS 117 : Rio ne répond plus		Michel Hazanavicius	2520877	2009
Neuilly sa mère !		Gabriel Julien-Laferrière	2517140	2009
Transformers 2 : la Revanche		Michael Bay	2276748	2009
Anges & Démons		Ron Howard	2042698	2009
Very Bad Trip		Todd Phillips	2001563	2009
Safari		Olivier Baroux	1964527	2009
X-Men Origins : Wolverine		Gavin Hood	1958789	2009
Le Concert		Radu Mihaileanu	1886676	2009
Lucky Luke		James Huth	1865726	2009
Fast and Furious 4		Justin Lin	1811984	2009
De l'autre côté du lit		Pascale Pouzadoux	1792382	2009
La Première Étoile		Lucien Jean-Baptiste	1647603	2009
La Nuit au Musée 2		Shawn Levy	1635276	2009
Le Code a changé		Danièle Thompson	1626878	2009
Terminator Renaissance		McG	1560211	2009
Michael Jackson's This Is It		Kenny Ortega	1544540	2009
Public Enemies		Michael Mann	1537488	2009
Alvin et les Chipmunks 2		Betty Thomas	1413162	2009
Mission-G		Hoyt Yeatman	1410903	2009
Le Drôle de Noël de Scrooge		Robert Zemeckis	1410673	2009
Prédictions		Alex Proyas	1401915	2009
Un prophète		Jacques Audiard	1309098	2009
Monstres contre Aliens		Conrad Vernon	1264483	2009
Micmacs à tire-larigot		Jean-Pierre Jeunet	1258804	2009
Incognito		Éric Lavaine	1250138	2009
Millénium, le film		Niels Arden Oplev	1216189	2009
Welcome		Philippe Lioret	1205065	2009
Loup		Nicolas Vanier	1191092	2009
Les Noces Rebelles		Sam Mendes	1142067	2009
Destination Finale 4		David R. Ellis	1109984	2009
Sept vies		Gabriele Muccino	1108938	2009
District 9		Neill Blomkamp	1108053	2009
Banlieue 13 Ultimatum		Patrick Alessandrin	1106804	2009
Paranormal Activity		Oren Peli	1105953	2009
Coco avant Chanel		Anne Fontaine	1030096	2009
Clones		Jonathan Mostow	1021427	2009
17 ans encore		Burr Steers	1010753	2009
R.T.T.		Frédéric Berthe	1007032	2009
Bienvenue chez les Ch'tis		Dany Boon	20489303	2008
Astérix aux Jeux olympiques		Thomas Langmannet	6817803	2008
Madagascar 2 : La Grande Évasion		Eric Darnell	5248793	2008
Indiana Jones et le Royaume du crâne de cristal		Steven Spielberg	4199771	2008
Quantum of Solace		Marc Forster	3721442	2008
WALL-E		Andrew Stanton	3261002	2008
Kung Fu Panda		M.Osborne/J.Stevenson	3231982	2008
Hancock		Peter Berg	3078077	2008
The Dark Knight		Christopher Nolan	3036568	2008
Disco		Fabien Onteniente	2435015	2008
Mesrine : L'Instinct de mort		Jean-François Richet	2274424	2008
Enfin veuve		Isabelle Mergault	2210676	2008
Iron Man		Jon Favreau	2040037	2008
Sex and the City, le film		Michael Patrick King	2003410	2008
Benjamin Gates et le Livre des secrets		Jon Turteltaub	1989237	2008
High School Musical 3 : Nos années lycée		Kenny Ortega	1934664	2008
Vicky Cristina Barcelona		Woody Allen	1914781	2008
Largo Winch		Jérôme Salle	1768577	2008
Australia		Baz Luhrmann	1741348	2008
Paris		Cédric Klapisch	1723642	2008
Horton		J.Hayward/S.Martino	1672006	2008
Entre les murs		Laurent Cantet	1612356	2008
La Momie 3 : La Tombe de l'Empereur Dragon		Rob Cohen	1555572	2008
Mamma Mia ! Le Film		Phyllida Lloyd	1554066	2008
Mesrine : L'Ennemi public n° 1		Jean-François Richet	1522976	2008
Burn After Reading		Frères Coen	1458557	2008
Into the wild		Sean Penn	1448136	2008
Le Transporteur 3		Olivier Megaton	1430308	2008
L'Échange		Clint Eastwood	1421793	2008
Faubourg 36		Christophe Barratier	1331585	2008
Phénomènes		M. Night Shyamalan	1301971	2008
Agathe Cléry		Étienne Chatiliez	1252822	2008
Les Chimpanzés de l'espace		Kirk De Micco	1240790	2008
Voyage au centre de la Terre		Eric Brevig	1219196	2008
Le Premier Jour du reste de ta vie		Rémi Bezançon	1211010	2008
Le Crime est notre affaire		Pascal Thomas	1192806	2008
Le Jour où la Terre s'Arrêta		Scott Derrickson	1154592	2008
Jumper		Doug Liman	1154065	2008
Ca$h		Éric Besnard	1105919	2008
Deux jours à tuer		Jean Becker	1088794	2008
Wanted : Choisis ton destin		Timur Bekmambetov	1088456	2008
Jackpot		Tom Vaughan	1050114	2008
Sweeney Todd : Le Diabolique Barbier de Fleet Street		Tim Burton	1047271	2008
L'Incroyable Hulk		Louis Leterrier	1022782	2008
Taken		Pierre Morel	1018518	2008
Vilaine		J-P.Benes/A.Mauduit	1004950	2008
Parlez-moi de la pluie		Agnès Jaoui	1004267	2008
Ratatouille		Brad Bird	7845210	2007
Spider-Man 3		Sam Raimi	6331084	2007
Harry Potter et l'Ordre du Phénix		David Yates	6224517	2007
Pirates des Caraïbes 3 : Jusqu'au bout du monde		Gore Verbinski	5763630	2007
Shrek le troisième		Chris Miller	5549908	2007
La Môme		Olivier Dahan	5242769	2007
Taxi 4		Gérard Krawczyk	4562928	2007
Les Simpson, le film		David Silverman	3561697	2007
À la Croisée des Mondes : La Boussole d'Or		Chris Weitz	3001796	2007
Je suis une légende		Francis Lawrence	2970084	2007
Il était une fois		Kevin Lima	2799547	2007
Le Renard et l'Enfant		Luc Jacquet	2499137	2007
Ensemble, c'est tout 		Claude Berry	2312638	2007
La Nuit au Musée		Shawn Levy	2276017	2007
Die Hard 4 : Retour en enfer		Len Wiseman	2272369	2007
Transformers		Michael Bay	1984829	2007
Le Cœur des hommes 2		Marc Esposito	1823019	2007
Un secret		Claude Miller	1691907	2007
Les 4 Fantastiques et le Surfer d'Argent		Tim Story	1671715	2007
300		Zack Snyder	1661288	2007
Ocean's Thirteen		Steven Soderbergh	1633507	2007
La Vengeance dans la Peau		Paul Greengrass	1539364	2007
Les Rois de la glisse		Ash Brannon,Chris Buck	1536151	2007
La Vie des autres		F.Henckel von Donnersmarck	1516801	2007
Un jour sur Terre		Alastair Fothergill	1416261	2007
Le Prix à Payer		Alexandra Leclère	1368791	2007
Dialogue avec mon jardinier		Jean Becker	1367086	2007
Blood Diamond		Edward Zwick	1310691	2007
Bee Movie		Steve Hickner	1300554	2007
Molière		Laurent Tirard	1242083	2007
99 F		Jan Kounen	1233503	2007
American Gangster		Ridley Scott	1219831	2007
Persépolis		M.Satrapi/V.Paronnaud	1208587	2007
Rocky Balboa		Sylvester Stallone	1156933	2007
Zodiac		David Fincher	1130683	2007
La Faille		Gregory Hoblit	1107322	2007
Ghost Rider		Mark Steven Johnson	1069617	2007
Les Vacances de Mr. Bean		Steve Bendelack	1066963	2007
Le Secret de Terabithia		Gabor Csupo	1036507	2007
Alvin et les Chipmunks		Tim Hill	1016772	2007
Danse avec lui		Valérie Guignabodet	1012317	2007
La Graine et le Mulet		Abdellatif Kechiche	1010910	2007
Les Bronzés 3 - Amis pour la vie		Patrice Leconte	10355928	2006
Pirates des Caraïbes 2 : Le Secret du coffre maudit		Gore Verbinski	6657405	2006
L'Âge de Glace 2		Carlos Saldanha	6642528	2006
Arthur et les Minimoys		Luc Besson	6396989	2006
Camping		Fabien Onteniente	5490482	2006
Da Vinci Code		Ron Howard	4189814	2006
Prête-moi ta main		Éric Lartigau	3734644	2006
Je vous trouve très beau		Isabelle Mergault	3556921	2006
Casino Royale		Martin Campbell	3182602	2006
Ne le dis à personne		Guillaume Canet	3111809	2006
La Doublure		Francis Veber	3087562	2006
Indigènes		Rachid Bouchareb	3065282	2006
X-Men 3 : l'affrontement final		Brett Ratner	2824519	2006
Eragon		Stefen Fangmeier	2792673	2006
Volver		Pedro Almodóvar	2346472	2006
OSS 117 : Le Caire, nid d'espions		Michel Hazanavicius	2304430	2006
Le Diable s'habille en Prada		David Frankel	2177476	2006
Hors de Prix		Pierre Salvadori	2153956	2006
Cars		John Lasseter	2080302	2006
Fauteuils d'Orchestre		Danièle Thompson	1968438	2006
Mission impossible 3		J. J. Abrams	1918786	2006
Bambi 2		Brian Pimental	1890332	2006
Les Infiltrés		Martin Scorsese	1875783	2006
Azur et Asmar		Michel Ocelot	1773341	2006
Miami Vice : Deux flics à Miami		Michael Mann	1577035	2006
Les Rebelles de la Forêt		A.Stacchi,J.Culton&R.Allers	1575002	2006
Happy Feet		George Miller	1519778	2006
Superman Returns		Bryan Singer	1495213	2006
Nos jours heureux		Eric Toledano&Olivier Nakache	1473273	2006
Nos voisins, les hommes		Karey Kirkpatrick&Tim Johnson	1471602	2006
Astérix et les Vikings		Stefan Fjeldmark&Jesper Møller	1374027	2006
Le Secret de Brokeback Mountain		Ang Lee	1345781	2006
Lord of War		Andrew Niccol	1322203	2006
Souris City		David Bowers&Sam Fell	1302832	2006
Jean-Philippe		Laurent Tuel	1288541	2006
Garfield 2		Tim Hill	1279346	2006
Marie-Antoinette		Sofia Coppola	1222462	2006
Inside Man : L'Homme de l'intérieur		Spike Lee	1166242	2006
La Maison du Bonheur		Dany Boon	1146781	2006
Little Miss Sunshine		Jonathan Dayton&Valerie Faris	1128976	2006
L'Ivresse du pouvoir		Claude Chabrol	1103122	2006
Mon Meilleur Ami		Patrice Leconte	1067616	2006
Comme t'y es belle !		Lisa Azuelos	1066999	2006
Munich		Steven Spielberg	1039340	2006
The Holiday		Nancy Meyers	1001522	2006
Harry Potter et la Coupe de Feu		Mike Newell	7732071	2005
Star Wars, épisode III : La Revanche des Sith		George Lucas	7247809	2005
Le Monde de Narnia : Le Lion, la Sorcière blanche et l'Armoire magique		Andrew Adamson	5262124	2005
Brice de Nice		James Huth	4424136	2005
Charlie et la Chocolaterie		Tim Burton	4318491	2005
La Guerre des mondes		Steven Spielberg	3910795	2005
King Kong		Peter Jackson	3592872	2005
Madagascar		Eric Darnell,Tom McGrath	3194853	2005
Million Dollar Baby		Clint Eastwood	3160585	2005
Mr. et Mrs. Smith		Doug Liman	2992385	2005
Les Poupées Russes		Cédric Klapisch	2865813	2005
Palais Royal !		Valérie Lemercier	2762386	2005
Iznogoud		Patrick Braoudé	2544546	2005
Chicken Little		Mark Dindal	2329245	2005
Wallace et Gromit:Le Mystère du lapin-garou		Nick Park	2280291	2005
Les 4 Fantastiques		Tim Story	2223838	2005
La Légende de Zorro		Martin Campbell	2174876	2005
Hitch, expert en séduction		Andy Tennant	2108581	2005
Kirikou et les Bêtes sauvages		Michel Ocelot,Bénédicte Galup	2033884	2005
Joyeux Noël		Christian Carion	2029864	2005
La Marche de l'empereur		Luc Jacquet	1948812	2005
Espace détente		Bruno Solo,Yvan Le Bolloc'h	1787163	2005
Aviator		Martin Scorsese	1783958	2005
Mon beau-père, mes parents et moi		Jay Roach	1676573	2005
Ray		Taylor Hackford	1602295	2005
Match Point		Woody Allen	1567793	2005
The Island		Michael Bay	1556590	2005
Oliver Twist		Roman Polanski	1513871	2005
Batman Begins		Christopher Nolan	1506332	2005
Les Frères Grimm		Terry Gilliam	1487506	2005
Tout pour plaire		Cécile Telerman	1427016	2005
Les Noces funèbres		Tim Burton	1384877	2005
Le Château ambulant		Hayao Miyazaki	1352952	2005
La Coccinelle Revient		Angela Robinson	1344445	2005
Les Chevaliers du Ciel		Gérard Pirès	1289605	2005
Kingdom of Heaven		Ridley Scott	1282912	2005
Mon petit doigt m'a dit...		Pascal Thomas	1274280	2005
Sin City		Frank Miller	1261533	2005
Alexandre		Oliver Stone	1258802	2005
Le Transporteur 2		Louis Leterrier	1230444	2005
Constantine		Francis Lawrence	1228248	2005
Boudu		Gérard Jugnot	1199369	2005
Vaillant, pigeon de combat !		Gary Chapman	1163655	2005
Robots		Chris Wedge	1126593	2005
De battre mon cœur s'est arrêté		Jacques Audiard	1078048	2005
Broken Flowers		Jim Jarmusch	1033150	2005
Les Choristes		Christophe Barratier	8451680	2004
Shrek 2		A.Adamson,C.Vernon,K.Asbury	7120257	2004
Harry Potter et le prisonnier d'Azkaban		Alfonso Cuaron	7060057	2004
Les Indestructibles		Brad Bird	5688549	2004
Spider-Man 2		Sam Raimi	5335462	2004
Un long dimanche de fiançailles		Jean-Pierre Jeunet	4454783	2004
Podium		Yann Moix	3582213	2004
Frère des ours		Aaron Blaise,Bob Walker	3567214	2004
Deux frères		Jean-Jacques Annaud	3336476	2004
Gang de requins		Bibo Bergeron,Vicky Jenson	3040837	2004
Les 11 commandements		François Desagnat,Thomas Sorriaux	2971700	2004
Ocean's Twelve		Steven Soderbergh	2954468	2004
Troie		Wolfgang Petersen	2774740	2004
Le Jour d'Après		Roland Emmerich	2691632	2004
L'Enquête Corse		Alain Berbérian	2667275	2004
Le Village		M. Night Shyamalan	2430910	2004
Fahrenheit 9/11		Michael Moore	2369621	2004
Le Dernier Trappeur		Nicolas Vanier	2254521	2004
Le Dernier Samouraï		Edward Zwick	2213315	2004
Bridget Jones : L'Âge de raison		Beeban Kidron	2133018	2004
I, Robot		Alex Proyas	2096836	2004
Les Rivières pourpres 2 - Les anges de l'apocalypse		Olivier Dahan	2090248	2004
36 quai des Orfèvres		Olivier Marchal	2089232	2004
Mariages !		Valérie Guignabodet	2008899	2004
Les Dalton		Philippe Haim	1955836	2004
Double Zéro		Gérard Pirès	1850031	2004
La Passion du Christ		Mel Gibson	1762536	2004
RRRrrrr!!!		Alain Chabat	1703125	2004
Comme une image		Agnès Jaoui	1640312	2004
Le Roi Arthur		Antoine Fuqua	1637233	2004
Le Pôle Express		Robert Zemeckis	1556088	2004
Benjamin Gates et le Trésor des Templiers		Jon Turteltaub	1533436	2004
Gothika		Mathieu Kassovitz	1525792	2004
Van Helsing		Stephen Sommers	1525561	2004
Starsky et Hutch		Todd Phillips	1517047	2004
Malabar Princess		Gilles Legrand	1470701	2004
Kill Bill : Volume 2		Quentin Tarantino	1465940	2004
Peter Pan		P. J. Hogan	1462531	2004
Collatéral		Michael Mann	1458995	2004
Les Sœurs fâchées		Alexandra Leclère	1450584	2004
Scooby-Doo 2 : les monstres se déchaînent		Raja Gosnell	1393180	2004
Lost in Translation		Sofia Coppola	1384220	2004
Ladykillers		Ethan Coen,Joel Coen	1280351	2004
Garfield le film		Peter Hewitt	1227090	2004
Vipère au poing		Philippe de Broca	1204134	2004
Arsène Lupin		Jean-Paul Salomé	1184240	2004
Big Fish		Tim Burton	1173319	2004
Le Terminal		Steven Spielberg	1145263	2004
La Mort dans la peau		Paul Greengrass	1142893	2004
Le Manoir hanté et les 999 Fantômes		Rob Minkoff	1088572	2004
La Mauvaise Éducation		Pedro Almodóvar	1086731	2004
Le Monde de Nemo		Andrew Stanton/Lee Unkrich	9387283	2003
Le Seigneur des anneaux : Le Retour du roi		Peter Jackson	7393904	2003
Taxi 3		Gérard Krawczyk	6151691	2003
Matrix Reloaded		Andy Wachowski/Larry Wachowski	5701222	2003
Pirates des Caraïbes : La Malédiction du Black Pearl		Gore Verbinski	3886529	2003
Chouchou		Merzak Allouache	3876572	2003
Arrête-moi si tu peux		Steven Spielberg	3639440	2003
Matrix Revolutions		Andy Wachowski/Larry Wachowski	3535174	2003
Le Livre de la Jungle 2		Steve Trenbirth	3354206	2003
Terminator 3 : Le Soulèvement des machines		Jonathan Mostow	3307768	2003
Tais-toi !		Francis Veber	3139104	2003
X-Men 2		Bryan Singer	2825132	2003
Bruce tout-puissant		Tom Shadyac	2682314	2003
Gangs of New York		Martin Scorsese	2267036	2003
8 Mile		Curtis Hanson	2266462	2003
La Beuze		F.Desagnat/T.Sorriaux	1982196	2003
American Pie 3 : Marions-les !		Jesse Dylan	1952917	2003
Bad Boys 2		Michael Bay	1942671	2003
Fast & Furious 2		John Singleton	1827554	2003
Kill Bill : Volume 1		Quentin Tarantino	1779690	2003
Hulk		Ang Lee	1676794	2003
7 ans de mariage		Didier Bourdon	1646043	2003
Charlie's Angels 2 : Les anges se déchaînent !		McG	1607343	2003
Le Cœur des hommes		Marc Esposito	1563280	2003
18 ans après		Coline Serreau	1550011	2003
Good Bye, Lenin!		Wolfgang Becker	1545859	2003
Scary Movie 3		David Zucker	1388424	2003
Daredevil		Mark Steven Johnson	1342746	2003
Les Invasions barbares		Denys Arcand	1301905	2003
Sinbad - la Légende des sept mers		Patrick Gilmore /Tim Johnson	1277585	2003
Le Mystère de la chambre jaune		Bruno Podalydès	1263905	2003
Intolérable Cruauté		Ethan Coen	1257935	2003
Lara Croft : Tomb Raider, le berceau de la vie		Jan de Bont	1244405	2003
Fanfan la tulipe		Gérard Krawczyk	1238765	2003
Les Sentiments		Noémie Lvovsky	1235706	2003
Mystic River		Clint Eastwood	1210568	2003
Père et Fils		Michel Boujenah	1162909	2003
Rire et Châtiment		Isabelle Doval	1138636	2003
Chicago		Rob Marshall	1136750	2003
Le Coût de la vie		Philippe Le Guay	1131697	2003
Mauvais esprit		Patrick Alessandrin	1106439	2003
Jeux d'enfants		Yann Samuell	1098398	2003
La Fleur du mal		Claude Chabrol	1080105	2003
Moi César, 10 ans ½, 1m39		Richard Berry	1042733	2003
Effroyables Jardins		Jean Becker	1034539	2003
La Ligue des gentlemen extraordinaires		Stephen Norrington	1027435	2003
La Prophétie des grenouilles		Jacques-Rémy Girerd	1001800	2003
Astérix et Obélix : Mission Cléopâtre		Alain Chabat	14559509	2002
Harry Potter et la Chambre des secrets		Chris Columbus	9144701	2002
Le Seigneur des anneaux : Les Deux Tours		Peter Jackson	6981252	2002
Spider-Man		Sam Raimi	6477438	2002
Star Wars, épisode II : L'Attaque des clones		George Lucas	5713593	2002
Men in Black 2		Barry Sonnenfeld	4707082	2002
Ocean's Eleven		Steven Soderbergh	4658537	2002
Meurs un Autre Jour		Lee Tamahori	4015654	2002
8 Femmes		François Ozon	3711394	2002
Minority Report		Steven Spielberg	3709488	2002
Monstres et Cie		D.Silverman/L.Unkrich/P.Docter	3535621	2002
Le Boulet		Alain Berberian/Frédéric Forestier	3141774	2002
L'Âge de Glace		Carlos Saldanha/Chris Wedge	3058970	2002
La Planète au trésor, un nouvel univers		John Musker/Ron Clements	2986175	2002
L'Auberge Espagnole		Cédric Klapisch	2971899	2002
Scooby-Doo		Raja Gosnell	2307000	2002
Parle avec elle		Pedro Almodóvar	2157752	2002
Stuart Little 2		Rob Minkoff	2103011	2002
Signes		M. Night Shyamalan	2059812	2002
Être et avoir		Nicolas Philibert	1821981	2002
Le Pianiste		Roman Polanski	1775310	2002
Monsieur Batignole		Gérard Jugnot	1773472	2002
Peter Pan 2 : Retour au Pays Imaginaire		Dovonan Cook/Robin Budd	1661055	2002
Embrassez qui vous voudrez		Michel Blanc	1528784	2002
Spy Game, jeu d'espions		Tony Scott	1481402	2002
Le Raid		Djamel Bensalah	1456267	2002
Dragon Rouge		Brett Ratner	1438878	2002
Le Voyage de Chihiro		Hayao Miyazaki	1436845	2002
Lilo & Stitch		Chris Sanders/Dean DeBlois	1337994	2002
Panic Room		David Fincher	1324402	2002
Amen		Costa-Gavras	1319719	2002
xXx		Rob Cohen	1295657	2002
3 Zéros		Fabien Onteniente	1271238	2002
Blade II		Guillermo del Toro	1238432	2002
Spirit, l'étalon des plaines		Kelly Asbury/Lorna Cook	1235109	2002
40 jours et 40 nuits		Michael Lehmann	1215978	2002
Vanilla Sky		Cameron Crowe	1175666	2002
Ah ! si j'étais riche		Gérard Bitton/Michel Munz	1142152	2002
Le Papillon		Philippe Muyl	1138828	2002
Resident Evil		Paul W. S. Anderson	1106093	2002
Décalage horaire		Danièle Thompson	1069417	2002
L'Adversaire		Nicole Garcia	1066195	2002
Ali		Michael Mann	1035630	2002
Bowling for Columbine		Michael Moore	1035476	2002
Harry Potter à l’école des sorciers		Chris Columbus	9470090	2001
Le Fabuleux Destin d'Amélie Poulain		Jean-Pierre Jeunet	8636041	2001
La Vérité si je mens ! 2		Thomas Gilou	7469664	2001
Le Seigneur des anneaux : La Communauté de l'anneau		Peter Jackson	6876402	2001
Le Placard		Francis Veber	5317828	2001
Le Pacte des loups		Christophe Gans	5179154	2001
Tanguy		Etienne Chatiliez	4310477	2001
Atlantide, l'empire perdu		Gary Trousdale/Kirk Wise	4303919	2001
Shrek		Andrew Adamson/Vicky Jenson	4181039	2001
La Planète des Singes		Tim Burton	3970011	2001
Le Journal de Bridget Jones		Sharon Maguire	3489384	2001
American Pie 2		James B. Rogers	3374202	2001
Ce que veulent les femmes		Nancy Meyers	3014191	2001
Les 102 Dalmatiens		Kevin Lima	2970759	2001
Le Peuple migrateur		Jacques Perrin/Jacques Cluzaud	2750459	2001
Hannibal		Ridley Scott	2579878	2001
Pearl Harbor		Michael Bay	2514353	2001
Lara Croft : Tomb Raider		Simon West	2509857	2001
Yamakasi		Ariel Zeitoun	2484292	2001
Une hirondelle a fait le printemps		Christian Carion	2318867	2001
Les Rois mages		Bernard Campan/Didier Bourdon	2302937	2001
Le Retour de la momie		Stephen Sommers	2298749	2001
Scary Movie 2		Keenen Ivory Wayans	2163759	2001
Un crime au paradis		Jean Becker	2137829	2001
La Tour Montparnasse infernale		Charles Nemes	2083034	2001
Jurassic Park 3		Joe Johnston	2077462	2001
Belphégor, le fantôme du Louvre		Jean-Paul Salomé	2032144	2001
Traffic		Steven Soderbergh	1938732	2001
Vidocq		Pitof	1881086	2001
Mon beau-père et moi		Jay Roach	1843354	2001
Seul au monde		Robert Zemeckis	1792436	2001
Kuzco, l'empereur mégalo		Mark Dindal	1727123	2001
Rush Hour 2		Brett Ratner	1722560	2001
A.I. Intelligence artificielle		Steven Spielberg	1575170	2001
Les Autres		Alejandro Amenabar	1565492	2001
Final Fantasy : les Créatures de l'esprit		Hironobu Sakaguchi	1472452	2001
Absolument Fabuleux		Gabriel Aghion	1370394	2001
Moulin Rouge !		Baz Luhrmann	1361629	2001
15-août		Patrick Alessandrin	1356003	2001
L'Exorciste, version intégrale		William Friedkin	1301872	2001
Wasabi		Gérard Krawczyk	1283256	2001
Le Petit Poucet		Olivier Dahan	1231269	2001
Les Visiteurs en Amérique		Jean-Marie Poiré	1219488	2001
Vertical Limit		Martin Campbell	1186367	2001
Chaos		Coline Serreau	1182802	2001
Stalingrad		Jean-Jacques Annaud	1110380	2001
Le Baiser mortel du dragon		Chris Nahon	1098367	2001
Fast and Furious		Rob Cohen	1070360	2001
Taxi 2		Gérard Krawczyk	10349454	2000
Sixième Sens		M. Night Shyamalan	7799130	2000
Dinosaure		Eric LeightonetRalph Zondag	5156328	2000
Gladiator		Ridley Scott	4806654	2000
Toy Story 2		Ash Brannon,John LasseteretLee Unkrich	4531702	2000
Mission : Impossible 2		John Woo	4097256	2000
Le Goût des autres		Agnès Jaoui	3859151	2000
Scary Movie		Keenen Ivory Wayans	3777452	2000
Incassable		M. Night Shyamalan	3450178	2000
Les rivières pourpres		Mathieu Kassovitz	3255184	2000
Chicken Run		Nick Park,Peter Lord	3192445	2000
American Beauty		Sam Mendes	3001844	2000
Scream 3		Wes Craven	2655005	2000
Erin Brockovich, seule contre tous		Steven Soderbergh	2570294	2000
Billy Elliot		Stephen Daldry	2514645	2000
Sleepy Hollow		Tim Burton	2491374	2000
60 secondes chrono		Dominic Sena	2441122	2000
La Plage		Danny Boyle	2280331	2000
Pokémon, le film : Mewtwo contre-attaque		Kunikiki Yuyama	2224456	2000
Harry, un ami qui vous veut du bien		Dominik Moll	1970948	2000
Jet Set		Fabien Onteniente	1912895	2000
X-Men		Bryan Singer	1862436	2000
Stuart Little		Rob Minkoff	1858983	2000
Charlie et ses drôles de dames		McG	1858930	2000
Apparences		Robert Zemeckis	1842572	2000
Tigre et Dragon		Ang Lee	1764894	2000
Mon voisin le tueur		Jonathan Lynn	1752686	2000
La Ligne verte		Frank Darabont	1740897	2000
Hollow Man		Paul Verhoeven	1512638	2000
O'Brother		Joel Coen	1499393	2000
En Pleine Tempête		Wolfgang Petersen	1403086	2000
Meilleur Espoir féminin		Gérard Jugnot	1184971	2000
Dancer in the Dark		Lars von Trier	1166150	2000
The Patriot, le chemin de la liberté		Roland Emmerich	1160975	2000
In the Mood for Love		Wong Kar-wai	1096985	2000
Anna et le roi		Andy Tennant	1076068	2000
Escrocs mais pas trop		Woody Allen	1038868	2000
Le Prince du Pacifique		Alain Corneau	1028773	2000
Astérix et Obélix contre César		Claude Zidi	8948624	1999
Tarzan		Chris Buck,Kevin Lima	7914863	1999
Star Wars, épisode I : La Menace fantôme		George Lucas	7303131	1999
Matrix		Andy Wachowski,Larry Wachowski	4771685	1999
Coup de foudre à Notting Hill		Roger Michell	4532898	1999
Le Monde ne Suffit Pas		Michael Apted	3599609	1999
1001 pattes		Andrew Stanton,John Lasseter	3161913	1999
La Momie		Stephen Sommers	3153017	1999
Wild Wild West		Barry Sonnenfeld	3101250	1999
Jeanne d'Arc		Luc Besson	2991860	1999
Himalaya : L'Enfance d'un chef		Eric Valli	2853392	1999
American Pie		Paul Weitz	2628556	1999
Haute Voltige		Jon Amiel	2621111	1999
Les Enfants du marais		Jean Becker	2136345	1999
Ennemi d'État		Tony Scott	2063211	1999
Tout sur ma mère		Pedro Almodóvar	2018846	1999
Just married (ou presque)		Garry Marshall	2007956	1999
Quasimodo d'El Paris		Patrick Timsit	1707386	1999
Shakespeare in Love		John Madden	1699764	1999
Eyes Wide Shut		Stanley Kubrick	1660789	1999
La Bûche		Danièle Thompson	1625709	1999
The Faculty		Robert Rodriguez	1526423	1999
La Neuvième Porte		Roman Polanski	1423095	1999
Payback		Brian Helgeland	1405380	1999
Vénus beauté (institut)		Tonie Marshall	1327798	1999
La Fin des Temps		Peter Hyams	1298541	1999
Belle Maman		Gabriel Aghion	1257317	1999
Rush Hour		Brett Ratner	1245984	1999
Sexe Intentions		Roger Kumble	1236625	1999
Le 13e Guerrier		John McTiernan	1229687	1999
Inspecteur gadget		David Kellogg	1227689	1999
Mafia Blues		Harold Ramis	1227067	1999
Le Ciel, les Oiseaux et... ta mère !		Djamel Bensalah	1224963	1999
Souviens-toi... l'été Dernier 2		Danny Cannon	1190275	1999
Austin Powers 2 : L'Espion qui m'a tirée		Jay Roach	1161194	1999
Fight club		David Fincher	1086760	1999
Hantise		Jan de Bont	1062781	1999
Vous avez un mess@ge		Nora Ephron	1058239	1999
Les Razmoket, le film		Igor Kovalyov,Norton Virgien	1026527	1999
South Park, le film : Plus long, plus grand et pas coupé		Trey Parker	1013674	1999
Urban Legend		Jamie Blanks	1006325	1999
Titanic		James Cameron	20634793	1998
Le Dîner de cons		Francis Veber	9247001	1998
Les Couloirs du temps : Les Visiteurs 2		Jean-Marie Poiré	8043129	1998
Taxi		Gérard Pirès	6522121	1998
Mulan		Barry Cook,Tony Bancroft	5793697	1998
La vie est belle		Roberto Benigni	4721003	1998
Armageddon		Michael Bay	4606936	1998
Il faut sauver le soldat Ryan		Steven Spielberg	4143325	1998
Le Prince d'Égypte		B.Chapman,S.Wells,S.Hickner	3941989	1998
Mary à tout prix		Bobby Farrelly,Peter Farrelly	3561680	1998
Le Masque de Zorro		Martin Campbell	3440187	1998
L'Arme Fatale 4		Richard Donner	3309591	1998
L'Homme qui murmurait à l'oreille des chevaux		Robert Redford	2997201	1998
Godzilla		Roland Emmerich	2917195	1998
Anastasia		Don Bluth,Gary Goldman	2782019	1998
L'Homme au masque de fer		Randall Wallace	2291139	1998
Scream 2		Wes Craven	2171460	1998
The X Files, le film		Rob Bowman	1774391	1998
The Truman Show		Peter Weir	1641062	1998
Kirikou et la Sorcière		Michel Ocelot	1536669	1998
FourmiZ		Eric Darnell,Tim Johnson	1529819	1998
La Vie rêvée des anges		Érick Zonca	1458909	1998
Jackie Brown		Quentin Tarantino	1335402	1998
Chapeau melon et bottes de cuir		Jeremiah Chechik	1326891	1998
L'Associé du diable		Taylor Hackford	1304042	1998
Harry dans tous ses états		Woody Allen	1283446	1998
6 jours, 7 nuits		Ivan Reitman	1275096	1998
SexCrimes		John McNaughton	1267959	1998
Dr. Dolittle		Betty Thomas	1242555	1998
Pour le pire et pour le meilleur		James L. Brooks	1234208	1998
Flubber		Les Mayfield	1222584	1998
In and Out(In & Out)		Frank Oz	1221161	1998
Souviens-toi... l'été Dernier		Jim Gillespie	1193441	1998
Deep Impact		Mimi Leder	1181456	1998
Le Chacal		Michael Caton-Jones	1148915	1998
Snake Eyes		Brian De Palma	1096038	1998
1 chance sur 2		Patrice Leconte	1056810	1998
Will Hunting		Gus Van Sant	1050224	1998
La Cité des Anges		Brad Silberling	1024559	1998
Le Cinquième Élément		Luc Besson	7727697	1997
Men in Black		Barry Sonnenfeld	5799742	1997
La Vérité si je mens !		Thomas Gilou	4899862	1997
Le Monde perdu : Jurassic Park		Steven Spielberg	4862258	1997
Hercule		John Musker,Ron Clements	4406679	1997
Les 101 Dalmatiens		Stephen Herek	4023892	1997
Le Pari		Bernard Campan,Didier Bourdon	3884858	1997
Demain ne Meurt Jamais		Roger Spottiswoode	3571826	1997
The Full Monty		Peter Cattaneo	3506472	1997
Bean		Mel Smith	3169258	1997
Didier		Alain Chabat	2902960	1997
Sept ans au Tibet		Jean-Jacques Annaud	2793855	1997
Marius et Jeannette		Robert Guédiguian	2655205	1997
On connaît la chanson		Alain Resnais	2649299	1997
Alien 4 : la résurrection		Jean-Pierre Jeunet	2634373	1997
Le Bossu		Philippe de Broca	2328601	1997
La Rançon		Ron Howard	2207701	1997
Le Mariage de mon meilleur ami		P. J. Hogan	2201013	1997
Mars Attacks!		Tim Burton	2183138	1997
Le Patient anglais		Anthony Minghella	2149284	1997
Scream		Wes Craven	2043965	1997
Space Jam		Joe Pytka	1933542	1997
Un nouvel espoir(Édition spéciale)		George Lucas	1795614	1997
Lucie Aubrac		Claude Berri	1708050	1997
Volte-Face		John Woo	1650150	1997
Tout le monde dit I love you		Woody Allen	1555752	1997
Menteur, menteur		Tom Shadyac	1551253	1997
Les Randonneurs		Philippe Harel	1422318	1997
Le Pic de Dante		Roger Donaldson	1395626	1997
Batman & Robin		Joel Schumacher	1370818	1997
Ennemis rapprochés		Alan J. Pakula	1288360	1997
Roméo + Juliette		Baz Luhrmann	1254893	1997
Complots		Richard Donner	1202722	1997
The Game		David Fincher	1202516	1997
L'Empire contre-attaque(Édition spéciale)		Irvin Kershner	1170275	1997
Western		Manuel Poirier	1110257	1997
Volcano		Mick Jackson	1020389	1997
Les Ailes de l'Enfer		Simon West	1009031	1997
Le Bossu de Notre-Dame		Gary Trousdale,Kirk Wise	6833195	1996
Independence Day		Roland Emmerich	5656991	1996
Se7en		David Fincher	4954781	1996
Pédale douce		Gabriel Aghion	4126380	1996
Mission impossible		Brian De Palma	4120262	1996
Le Huitième Jour		Jaco Van Dormael	3610901	1996
Microcosmos : Le Peuple de l'herbe		Claude Nuridsany,Marie Pérennou	3515336	1996
Toy Story		John Lasseter	2759457	1996
Twister		Jan de Bont	2515282	1996
Un Air de famille		Cédric Klapisch	2442289	1996
Le Jaguar		Francis Veber	2390580	1996
L'Armée des douze singes		Terry Gilliam	2287321	1996
Le Plus Beau Métier du monde		Gérard Lauzier	2269925	1996
Le Professeur Foldingue		Tom Shadyac	2199835	1996
Ridicule		Patrice Leconte	2064010	1996
Jumanji		Joe Johnston	2034972	1996
Beaumarchais, l'insolent		Édouard Molinaro	1944589	1996
Rock		Michael Bay	1894549	1996
Sleepers		Barry Levinson	1762652	1996
Casino		Martin Scorsese	1657908	1996
Pinocchio		Steve Barron	1559547	1996
Babe, le cochon devenu berger		Chris Noonan	1537311	1996
L'Effaceur		Chuck Russell	1500847	1996
Le Facteur		Michael Radford	1488517	1996
Secrets et mensonges		Mike Leigh	1471933	1996
Heat		Michael Mann	1434256	1996
Esprits rebelles		John N. Smith	1351242	1996
Daylight		Rob Cohen	1312321	1996
Hommes, femmes, mode d'emploi		Claude Lelouch	1265867	1996
Les Deux Papas et la Maman		Jean-Marc Longval,Smaïn	1080519	1996
Maudite Aphrodite		Woody Allen	1063526	1996
Trainspotting		Danny Boyle	1051859	1996
Les Trois Frères		Bernard Campan,Didier Bourdon	6897098	1995
Les Anges Gardiens		Jean-Marie Poiré	5793034	1995
Pocahontas, une légende indienne		Eric Goldberg,Mike Gabriel	5656757	1995
Le Bonheur est dans le pré		Étienne Chatiliez	4931227	1995
Gazon Maudit		Josiane Balasko	3990094	1995
GoldenEye		Martin Campbell	3493610	1995
Une Journée en enfer		John McTiernan	3458382	1995
Stargate, la porte des étoiles		Roland Emmerich	2698444	1995
Élisa		Jean Becker	2535262	1995
Le Hussard sur le toit		Jean-Paul Rappeneau	2494053	1995
Casper		Brad Silberling	2253291	1995
Waterworld		Kevin Reynolds	2211654	1995
Apollo 13		Ron Howard	2082298	1995
La Haine		Mathieu Kassovitz	2042070	1995
Batman Forever		Joel Schumacher	1681063	1995
Bad Boys		Michael Bay	1624670	1995
Lancelot, le premier chevalier		Jerry Zucker	1607247	1995
Alerte !		Wolfgang Petersen	1596239	1995
Nelly et Monsieur Arnaud		Claude Sautet	1537561	1995
Harcèlement		Barry Levinson	1528132	1995
Légendes d'automne		Edward Zwick	1469570	1995
Sur la route de Madison		Clint Eastwood	1457496	1995
Nell		Michael Apted	1450902	1995
La Cité des enfants perdus		Jean-Pierre Jeunet,Marc Caro	1304898	1995
Braveheart		Mel Gibson	1231534	1995
Usual Suspects		Bryan Singer	1224032	1995
Frankenstein		Kenneth Branagh	1174543	1995
Judge Dredd		Danny Cannon	1172717	1995
Street Fighter - L'Ultime Combat		Steven E. de Souza	1163378	1995
Petits meurtres entre amis		Danny Boyle	1113351	1995
Smoke		Paul Auster,Wayne Wang	1066700	1995
Astérix et les Indiens		Gerhard Hahn	1059709	1995
Coups de feu sur Broadway		Woody Allen	1022313	1995
Les Misérables		Claude Lelouch	1001967	1995
La Cérémonie		Claude Chabrol	1000271	1995
Le Roi Lion		Rob Minkoff,Roger Allers	10135871	1994
Un Indien dans la ville		Hervé Palud	7870802	1994
Quatre mariages et un enterrement		Mike Newell	5791728	1994
Madame Doubtfire		Chris Columbus	5025829	1994
Forrest Gump		Robert Zemeckis	3963919	1994
The Mask		Chuck Russell	3775146	1994
Léon		Luc Besson	3546077	1994
Pulp Fiction		Quentin Tarantino	2864640	1994
Philadelphia		Jonathan Demme	2741445	1994
La Liste de Schindler		Steven Spielberg	2669900	1994
Rasta Rockett		Jon Turteltaub	2542562	1994
Speed		Jan de Bont	2400213	1994
La Cité de la peur		Alain Berberian	2279190	1994
Les Aristochats(rep)		Wolfgang Reitherman	2225483	1994
La Vengeance d'une blonde		Jeannot Szwarc	2039370	1994
Grosse Fatigue		Michel Blanc	2015230	1994
Le Flic de Beverly Hills 3		John Landis	2006637	1994
La Reine Margot		Patrice Chéreau	2002915	1994
True Lies		James Cameron	1891086	1994
Demolition Man		Marco Brambilla	1729811	1994
Le Colonel Chabert		Yves Angelo	1694670	1994
Entretien avec un vampire		Neil Jordan	1636853	1994
La Fille de d'Artagnan		Bertrand Tavernier	1502540	1994
Maverick		Richard Donner	1430843	1994
L'Expert		Luis Llosa	1375231	1994
Farinelli		Gérard Corbiau	1327339	1994
Wolf		Mike Nichols	1323148	1994
L'Affaire Pélican		Alan J. Pakula	1310105	1994
Sauvez Willy		Simon Wincer	1295804	1994
Sister Act 2		Bill Duke	1112002	1994
L'Étrange Noël de monsieur Jack		Henry Selick	1062963	1994
Piège en eaux troubles		Rowdy Herrington	1040120	1994
Casque Bleu		Gérard Jugnot	1015156	1994
Les Visiteurs		Jean-Marie Poiré	13782991	1993
Aladdin		John Musker,Ron Clements	7414324	1993
Jurassic Park		Steven Spielberg	6553581	1993
Germinal		Claude Berri	6161776	1993
Le Fugitif		Andrew Davis	3536519	1993
Dracula		Francis Ford Coppola	3166906	1993
Un monde parfait		Clint Eastwood	3148826	1993
La Leçon de piano		Jane Campion	2664718	1993
Cliffhanger : Traque au sommet		Renny Harlin	2653454	1993
Le Livre de la jungle(rep)		Wolfgang Reitherman	2285936	1993
Last Action Hero		John McTiernan	1905346	1993
Tout ça... pour ça !		Claude Lelouch	1887398	1993
Héros malgré lui		Stephen Frears	1732905	1993
Hot Shots! 2		Jim Abrahams	1657037	1993
Beethoven 2		Rod Daniel	1653508	1993
Meurtre mystérieux à Manhattan		Woody Allen	1553577	1993
La Soif de l'or		Gérard Oury	1517890	1993
Bambi(rep)		Walt Disney,David Hand	1480229	1993
Little Buddha		Bernardo Bertolucci	1359483	1993
Chérie, j'ai agrandi le bébé		Randal Kleiser	1343558	1993
Proposition indécente		Adrian Lyne	1340641	1993
Sliver		Phillip Noyce	1308295	1993
Piège en haute mer		Andrew Davis	1299224	1993
La Firme		Sydney Pollack	1291726	1993
Et au milieu coule une rivière		Robert Redford	1242365	1993
Trois Couleurs : Bleu		Krzysztof Kieslowski	1237416	1993
Made in America		Richard Benjamin	1205482	1993
Monsieur le député		Jonathan Lynn	1129246	1993
Forever young		Steve Miner	1117152	1993
Fortress		Stuart Gordon	1082591	1993
Cavale sans issue		Robert Harmon	1060614	1993
Fanfan		Alexandre Jardin	1045393	1993
Ma saison préférée		André Téchiné	1010748	1993
Sommersby		Jon Amiel	1008606	1993
Basic Instinct		Paul Verhoeven	4615376	1992
L'Arme Fatale 3		Richard Donner	4385039	1992
La Belle et la Bête		Gary Trousdale,Kirk Wise	4189365	1992
Bodyguard		Mick Jackson	3779343	1992
Hook ou la Revanche du Capitaine Crochet		Steven Spielberg	3401004	1992
Indochine		Régis Wargnier	3211258	1992
L'Amant		Jean-Jacques Annaud	3156124	1992
1492 : Christophe Colomb		Ridley Scott	3082110	1992
Les Nuits fauves		Cyril Collard	2811124	1992
JFK		Oliver Stone	2588745	1992
Sister Act		Emile Ardolino	2546106	1992
Beethoven		Brian Levant	2497527	1992
Maman j'ai encore raté l'avion		Chris Columbus	2359212	1992
La Crise		Coline Serreau	2350189	1992
Blanche-Neige et les Sept Nains(rep)		Irvin Kershner	1900000	1992
Le Zèbre		Jean Poiret	1867714	1992
La Cité de la joie		Roland Joffé	1851102	1992
Alien³		David Fincher	1652838	1992
Universal Soldier		Roland Emmerich	1538373	1992
Talons aiguilles		Pedro Almodóvar	1494860	1992
Orange mécanique(rep)		Stanley Kubrick	1408500	1992
Les Nerfs à vif		Martin Scorsese	1376234	1992
Un cœur en hiver		Claude Sautet	1349586	1992
Le Bal des casse-pieds		Yves Robert	1333914	1992
Le Dernier des Mohicans		Michael Mann	1241932	1992
Jeux de guerre		Phillip Noyce	1241321	1992
Batman, le défi		Tim Burton	1239329	1992
La Famille Addams		Barry Sonnenfeld	1230560	1992
La mort vous va si bien		Robert Zemeckis	1117535	1992
Des hommes d'honneur		Rob Reiner	1052615	1992
Danse avec les loups		Kevin Costner	7280124	1991
Terminator 2 : Le Jugement dernier		James Cameron	6118250	1991
Robin des Bois : Prince des voleurs		Kevin Reynolds	4938602	1991
Croc Blanc		Randal Kleiser	3501373	1991
Le Silence des agneaux		Jonathan Demme	3110147	1991
Bernard et Bianca au pays des kangourous		Hendel Butoy,Mike Gabriel	2403254	1991
Hot Shots!		Jim Abrahams	2121622	1991
Tous les matins du monde		Alain Corneau	2107197	1991
Un flic à la maternelle		Ivan Reitman	1938677	1991
Double Impact		Sheldon Lettich	1743544	1991
Jamais sans ma fille		Brian Gilbert	1725659	1991
Allô maman, c'est encore moi		Amy Heckerling	1706349	1991
Une époque formidable...		Gérard Jugnot	1672754	1991
La Totale		Claude Zidi	1639813	1991
L'Opération Corned-Beef		Jean-Marie Poiré	1475580	1991
L'expérience interdite		Joel Schumacher	1465121	1991
Mon père, ce héros		Gérard Lauzier	1428871	1991
Delicatessen		Jean-Pierre Jeunet	1407818	1991
Highlander, le retour		Russell Mulcahy	1377109	1991
Point Break		Kathryn Bigelow	1351132	1991
Van Gogh		Maurice Pialat	1307437	1991
Madame Bovary		Claude Chabrol	1292151	1991
Alice		Woody Allen	1244890	1991
The Doors		Oliver Stone	1230999	1991
Backdraft		Ron Howard	1201511	1991
Ma vie est un enfer		Josiane Balasko	1170523	1991
Lucky Luke		Terence Hill	1103626	1991
Merci la vie		Bertrand Blier	1088777	1991
Atlantis		Luc Besson	1068772	1991
Y a-t-il un flic pour sauver le président ?		David Zucker	1021666	1991
Le Cercle des poètes disparus		Peter Weir	6599969	1990
La Gloire de mon père		Yves Robert	6291402	1990
Cyrano de Bergerac		Jean-Paul Rappeneau	4734235	1990
Le Château de ma mère		Yves Robert	4269318	1990
Chérie, j'ai rétréci les gosses		Joe Johnston	4263514	1990
Pretty Woman		Garry Marshall	4030715	1990
Allô maman, ici bébé		Amy Heckerling	4023879	1990
Nikita		Luc Besson	3787845	1990
La Petite Sirène		John Musker,Ron Clements	3747111	1990
Ghost		Jerry Zucker	3053319	1990
Ripoux contre Ripoux		Claude Zidi	2917115	1990
Uranus		Claude Berri	2542412	1990
Gremlins 2		Joe Dante	2391391	1990
Total Recall		Paul Verhoeven	2360003	1990
Maman, j'ai raté l'avion		Chris Columbus	2240518	1990
Tatie Danielle		Étienne Chatiliez	2151463	1990
Retour vers le futur III		Robert Zemeckis	1695563	1990
Il y a des jours... et des lunes		Claude Lelouch	1481621	1990
48 heures de plus		Walter Hill	1464004	1990
La Discrète		Christian Vincent	1405415	1990
Jours de tonnerre		Tony Scott	1385536	1990
Rocky 5		John G. Avildsen	1352214	1990
Promotion Canapé		Didier Kaminka	1324814	1990
Milou en mai		Louis Malle	1294177	1990
Full contact		Sheldon Lettich	1226025	1990
Les Tortues ninja		Steve Barron	1191665	1990
À la poursuite d'Octobre Rouge		John McTiernan	1150251	1990
Né un 4 juillet		Oliver Stone	1010205	1990
Touche pas à ma fille		Stan Dragoti	1009871	1990
RoboCop 2		Irvin Kershner	1008434	1990
