\relax 
\providecommand\hyper@newdestlabel[2]{}
\@writefile{toc}{\contentsline {part}{II\hspace  {1em}ajout de fonctionnalit\IeC {\'e}}{15}{part.2}}
\@writefile{toc}{\contentsline {section}{\numberline {2.4}ligne de d\IeC {\'e}part}{16}{section.2.4}}
\@writefile{lol}{\contentsline {lstlisting}{./sources/start\textunderscore line.js}{16}{lstlisting.2.-8}}
\@writefile{toc}{\contentsline {section}{\numberline {2.5}zone de ralentissement}{17}{section.2.5}}
\@writefile{lol}{\contentsline {lstlisting}{./sources/slow\textunderscore area.js}{17}{lstlisting.2.-9}}
\@writefile{toc}{\contentsline {section}{\numberline {2.6}voiture}{20}{section.2.6}}
\@writefile{lol}{\contentsline {lstlisting}{./sources/car.js}{20}{lstlisting.2.-10}}
\@writefile{toc}{\contentsline {section}{\numberline {2.7}acc\IeC {\'e}l\IeC {\'e}ration et d\IeC {\'e}c\IeC {\'e}l\IeC {\'e}ration}{21}{section.2.7}}
\@writefile{lol}{\contentsline {lstlisting}{./sources/vitesse.js}{21}{lstlisting.2.-11}}
\@writefile{toc}{\contentsline {section}{\numberline {2.8}zone de boost}{23}{section.2.8}}
\@writefile{lol}{\contentsline {lstlisting}{./sources/boost.js}{23}{lstlisting.2.-12}}
\@writefile{toc}{\contentsline {section}{\numberline {2.9}variable Gui de vitesse}{25}{section.2.9}}
\@writefile{lol}{\contentsline {lstlisting}{./sources/Gui4.js}{25}{lstlisting.2.-13}}
\@writefile{toc}{\contentsline {section}{\numberline {2.10}multiplayer}{26}{section.2.10}}
\@writefile{lol}{\contentsline {lstlisting}{./sources/serv.py}{26}{lstlisting.2.-14}}
\@writefile{lol}{\contentsline {lstlisting}{./sources/multi.js}{28}{lstlisting.2.-15}}
\@setckpt{features}{
\setcounter{page}{31}
\setcounter{equation}{0}
\setcounter{enumi}{0}
\setcounter{enumii}{0}
\setcounter{enumiii}{0}
\setcounter{enumiv}{0}
\setcounter{footnote}{3}
\setcounter{mpfootnote}{0}
\setcounter{part}{2}
\setcounter{chapter}{2}
\setcounter{section}{10}
\setcounter{subsection}{0}
\setcounter{subsubsection}{0}
\setcounter{paragraph}{0}
\setcounter{subparagraph}{0}
\setcounter{figure}{0}
\setcounter{table}{0}
\setcounter{FBcaption@count}{0}
\setcounter{lstnumber}{78}
\setcounter{Item}{0}
\setcounter{Hfootnote}{6}
\setcounter{bookmark@seq@number}{18}
\setcounter{lstlisting}{0}
\setcounter{section@level}{1}
}
