\babel@toc {french}{}
\contentsline {part}{I\hspace {1em}TP initial}{2}{part.1}
\contentsline {chapter}{\numberline {1}TP4}{3}{chapter.1}
\contentsline {section}{\numberline {1.1}gestion de la rotation}{3}{section.1.1}
\contentsline {section}{\numberline {1.2}espace central bleu}{4}{section.1.2}
\contentsline {section}{\numberline {1.3}zone navigable}{5}{section.1.3}
\contentsline {section}{\numberline {1.4}avancer en tournant}{6}{section.1.4}
\contentsline {chapter}{\numberline {2}TP5: Gui}{9}{chapter.2}
\contentsline {section}{\numberline {2.1}compteur de distance}{9}{section.2.1}
\contentsline {section}{\numberline {2.2}compteur de tours}{10}{section.2.2}
\contentsline {section}{\numberline {2.3}compteur de temps}{13}{section.2.3}
\contentsline {part}{II\hspace {1em}ajout de fonctionnalit\IeC {\'e}}{15}{part.2}
\contentsline {section}{\numberline {2.4}ligne de d\IeC {\'e}part}{16}{section.2.4}
\contentsline {section}{\numberline {2.5}zone de ralentissement}{17}{section.2.5}
\contentsline {section}{\numberline {2.6}voiture}{20}{section.2.6}
\contentsline {section}{\numberline {2.7}acc\IeC {\'e}l\IeC {\'e}ration et d\IeC {\'e}c\IeC {\'e}l\IeC {\'e}ration}{21}{section.2.7}
\contentsline {section}{\numberline {2.8}zone de boost}{23}{section.2.8}
\contentsline {section}{\numberline {2.9}variable Gui de vitesse}{25}{section.2.9}
\contentsline {section}{\numberline {2.10}multiplayer}{26}{section.2.10}
