\relax 
\providecommand\hyper@newdestlabel[2]{}
\@writefile{toc}{\contentsline {part}{I\hspace  {1em}TP initial}{2}{part.1}}
\@writefile{toc}{\contentsline {chapter}{\numberline {1}TP4}{3}{chapter.1}}
\@writefile{lof}{\addvspace {10\p@ }}
\@writefile{lot}{\addvspace {10\p@ }}
\@writefile{toc}{\contentsline {section}{\numberline {1.1}gestion de la rotation}{3}{section.1.1}}
\@writefile{lol}{\contentsline {lstlisting}{./sources/deplacement1.js}{3}{lstlisting.1.-1}}
\@writefile{toc}{\contentsline {section}{\numberline {1.2}espace central bleu}{4}{section.1.2}}
\@writefile{lol}{\contentsline {lstlisting}{./sources/zone\textunderscore bleu.js}{4}{lstlisting.1.-2}}
\@writefile{toc}{\contentsline {section}{\numberline {1.3}zone navigable}{5}{section.1.3}}
\@writefile{lol}{\contentsline {lstlisting}{./sources/deplacement2.js}{5}{lstlisting.1.-3}}
\@writefile{toc}{\contentsline {section}{\numberline {1.4}avancer en tournant}{6}{section.1.4}}
\@writefile{lol}{\contentsline {lstlisting}{./sources/deplacement3.js}{6}{lstlisting.1.-4}}
\@writefile{toc}{\contentsline {chapter}{\numberline {2}TP5: Gui}{9}{chapter.2}}
\@writefile{lof}{\addvspace {10\p@ }}
\@writefile{lot}{\addvspace {10\p@ }}
\@writefile{toc}{\contentsline {section}{\numberline {2.1}compteur de distance}{9}{section.2.1}}
\@writefile{lol}{\contentsline {lstlisting}{./sources/Gui1.js}{9}{lstlisting.2.-5}}
\@writefile{toc}{\contentsline {section}{\numberline {2.2}compteur de tours}{10}{section.2.2}}
\@writefile{lol}{\contentsline {lstlisting}{./sources/Gui2.js}{10}{lstlisting.2.-6}}
\@writefile{toc}{\contentsline {section}{\numberline {2.3}compteur de temps}{13}{section.2.3}}
\@writefile{lol}{\contentsline {lstlisting}{./sources/Gui3.js}{13}{lstlisting.2.-7}}
\@setckpt{projet_init}{
\setcounter{page}{15}
\setcounter{equation}{0}
\setcounter{enumi}{0}
\setcounter{enumii}{0}
\setcounter{enumiii}{0}
\setcounter{enumiv}{0}
\setcounter{footnote}{2}
\setcounter{mpfootnote}{0}
\setcounter{part}{1}
\setcounter{chapter}{2}
\setcounter{section}{3}
\setcounter{subsection}{0}
\setcounter{subsubsection}{0}
\setcounter{paragraph}{0}
\setcounter{subparagraph}{0}
\setcounter{figure}{0}
\setcounter{table}{0}
\setcounter{FBcaption@count}{0}
\setcounter{lstnumber}{35}
\setcounter{Item}{0}
\setcounter{Hfootnote}{5}
\setcounter{bookmark@seq@number}{10}
\setcounter{lstlisting}{0}
\setcounter{section@level}{1}
}
