{"id":1,"deviceid":1,"firstname":"Louis","lastname":"Roberts","score":10,"reviewtext":"Really cool device!"}
{"id":2,"deviceid":2,"firstname":"Louis","lastname":"Roberts","score":7,"reviewtext":"Alright device!"}
{"id":3,"deviceid":3,"firstname":"Hideo","lastname":"Kojima","score":7,"reviewtext":"Liked it!"}
{"id":4,"deviceid":4,"firstname":"Linus","lastname":"Sebastian","score":10,"reviewtext":"Really cool device!"}
{"id":5,"deviceid":1,"firstname":"louis","lastname":"roberts","score":8,"reviewtext":"Cool Device!"}
{"id":6,"deviceid":1,"firstname":"Louis","lastname":"Roberts","score":5,"reviewtext":"I like this device"}
