{
  "project_info": {
    "project_number": "666519440370",
    "project_id": "ankerdata-48d33",
    "storage_bucket": "ankerdata-48d33.appspot.com"
  },
  "client": [
    {
      "client_info": {
        "mobilesdk_app_id": "1:666519440370:android:1763fb2f4b9dd1e511f96b",
        "android_client_info": {
          "package_name": "za.co.softserve.easiconnect"
        }
      },
      "oauth_client": [
        {
          "client_id": "666519440370-gj7jra8bcjea6i1m0p15keg77jvsh00s.apps.googleusercontent.com",
          "client_type": 3
        }
      ],
      "api_key": [
        {
          "current_key": "AIzaSyB424GRTBYyrMUH4rg6oo8miHblKO5LOWI"
        }
      ],
      "services": {
        "appinvite_service": {
          "other_platform_oauth_client": [
            {
              "client_id": "666519440370-gj7jra8bcjea6i1m0p15keg77jvsh00s.apps.googleusercontent.com",
              "client_type": 3
            }
          ]
        }
      }
    }
  ],
  "configuration_version": "1"
}