{
  "routes": [
    {
      "method": "GET",
      "path": "/celdas",
      "handler": "celdas.find",
      "config": {
        "policies": []
      }
    },
    {
      "method": "GET",
      "path": "/celdas/count",
      "handler": "celdas.count",
      "config": {
        "policies": []
      }
    },
    {
      "method": "GET",
      "path": "/celdas/:id",
      "handler": "celdas.findOne",
      "config": {
        "policies": []
      }
    },
    {
      "method": "POST",
      "path": "/celdas",
      "handler": "celdas.create",
      "config": {
        "policies": []
      }
    },
    {
      "method": "PUT",
      "path": "/celdas/:id",
      "handler": "celdas.update",
      "config": {
        "policies": []
      }
    },
    {
      "method": "DELETE",
      "path": "/celdas/:id",
      "handler": "celdas.delete",
      "config": {
        "policies": []
      }
    }
  ]
}
