{
  "kind": "collectionType",
  "collectionName": "abogados",
  "info": {
    "name": "Abogados"
  },
  "options": {
    "increments": true,
    "timestamps": true,
    "draftAndPublish": true
  },
  "attributes": {
    "cedula": {
      "type": "string",
      "required": true,
      "unique": true
    },
    "nombre": {
      "type": "string",
      "required": true
    },
    "apellido": {
      "type": "string",
      "required": true
    },
    "telefono": {
      "type": "string",
      "required": true
    },
    "correo": {
      "type": "email",
      "required": true
    }
  }
}
