%YAML 1.1
%TAG !u! tag:unity3d.com,2011:
--- !u!1 &8891884526750386406
GameObject:
  m_ObjectHideFlags: 0
  m_CorrespondingSourceObject: {fileID: 0}
  m_PrefabInstance: {fileID: 0}
  m_PrefabAsset: {fileID: 0}
  serializedVersion: 6
  m_Component:
  - component: {fileID: 8891884526750386392}
  - component: {fileID: 8891884526750386393}
  - component: {fileID: 6370469100436336569}
  m_Layer: 0
  m_Name: WaterEagle
  m_TagString: Untagged
  m_Icon: {fileID: 0}
  m_NavMeshLayer: 0
  m_StaticEditorFlags: 0
  m_IsActive: 1
--- !u!4 &8891884526750386392
Transform:
  m_ObjectHideFlags: 0
  m_CorrespondingSourceObject: {fileID: 0}
  m_PrefabInstance: {fileID: 0}
  m_PrefabAsset: {fileID: 0}
  m_GameObject: {fileID: 8891884526750386406}
  m_LocalRotation: {x: 0, y: 0, z: 0, w: 1}
  m_LocalPosition: {x: 0, y: 0, z: 0}
  m_LocalScale: {x: 1, y: 1, z: 1}
  m_ConstrainProportionsScale: 0
  m_Children:
  - {fileID: 4121064953458473782}
  m_Father: {fileID: 0}
  m_RootOrder: 0
  m_LocalEulerAnglesHint: {x: 0, y: 0, z: 0}
--- !u!82 &8891884526750386393
AudioSource:
  m_ObjectHideFlags: 0
  m_CorrespondingSourceObject: {fileID: 0}
  m_PrefabInstance: {fileID: 0}
  m_PrefabAsset: {fileID: 0}
  m_GameObject: {fileID: 8891884526750386406}
  m_Enabled: 1
  serializedVersion: 4
  OutputAudioMixerGroup: {fileID: 0}
  m_audioClip: {fileID: 8300000, guid: 2c5983b9b32240c48870c180947b9295, type: 3}
  m_PlayOnAwake: 1
  m_Volume: 0.5
  m_Pitch: 1
  Loop: 0
  Mute: 0
  Spatialize: 0
  SpatializePostEffects: 0
  Priority: 128
  DopplerLevel: 0
  MinDistance: 1
  MaxDistance: 500
  Pan2D: 0
  rolloffMode: 0
  BypassEffects: 0
  BypassListenerEffects: 0
  BypassReverbZones: 0
  rolloffCustomCurve:
    serializedVersion: 2
    m_Curve:
    - serializedVersion: 3
      time: 0
      value: 1
      inSlope: 0
      outSlope: 0
      tangentMode: 0
      weightedMode: 0
      inWeight: 0.33333334
      outWeight: 0.33333334
    - serializedVersion: 3
      time: 1
      value: 0
      inSlope: 0
      outSlope: 0
      tangentMode: 0
      weightedMode: 0
      inWeight: 0.33333334
      outWeight: 0.33333334
    m_PreInfinity: 2
    m_PostInfinity: 2
    m_RotationOrder: 4
  panLevelCustomCurve:
    serializedVersion: 2
    m_Curve:
    - serializedVersion: 3
      time: 0
      value: 1
      inSlope: 0
      outSlope: 0
      tangentMode: 0
      weightedMode: 0
      inWeight: 0.33333334
      outWeight: 0.33333334
    m_PreInfinity: 2
    m_PostInfinity: 2
    m_RotationOrder: 4
  spreadCustomCurve:
    serializedVersion: 2
    m_Curve:
    - serializedVersion: 3
      time: 0
      value: 0
      inSlope: 0
      outSlope: 0
      tangentMode: 0
      weightedMode: 0
      inWeight: 0.33333334
      outWeight: 0.33333334
    m_PreInfinity: 2
    m_PostInfinity: 2
    m_RotationOrder: 4
  reverbZoneMixCustomCurve:
    serializedVersion: 2
    m_Curve:
    - serializedVersion: 3
      time: 0
      value: 1
      inSlope: 0
      outSlope: 0
      tangentMode: 0
      weightedMode: 0
      inWeight: 0.33333334
      outWeight: 0.33333334
    m_PreInfinity: 2
    m_PostInfinity: 2
    m_RotationOrder: 4
--- !u!114 &6370469100436336569
MonoBehaviour:
  m_ObjectHideFlags: 0
  m_CorrespondingSourceObject: {fileID: 0}
  m_PrefabInstance: {fileID: 0}
  m_PrefabAsset: {fileID: 0}
  m_GameObject: {fileID: 8891884526750386406}
  m_Enabled: 1
  m_EditorHideFlags: 0
  m_Script: {fileID: 11500000, guid: 36a936393386198439014822d91e85f3, type: 3}
  m_Name: 
  m_EditorClassIdentifier: 
  autodestructionTimer: 10
  chasingAnimationTime: 1
--- !u!1001 &4520012865721687261
PrefabInstance:
  m_ObjectHideFlags: 0
  serializedVersion: 2
  m_Modification:
    m_TransformParent: {fileID: 8891884526750386392}
    m_Modifications:
    - target: {fileID: -8679921383154817045, guid: 462f18cf3ee0678418610139b374a5ce, type: 3}
      propertyPath: m_RootOrder
      value: 0
      objectReference: {fileID: 0}
    - target: {fileID: -8679921383154817045, guid: 462f18cf3ee0678418610139b374a5ce, type: 3}
      propertyPath: m_LocalScale.x
      value: 2.6999998
      objectReference: {fileID: 0}
    - target: {fileID: -8679921383154817045, guid: 462f18cf3ee0678418610139b374a5ce, type: 3}
      propertyPath: m_LocalScale.y
      value: 2.7
      objectReference: {fileID: 0}
    - target: {fileID: -8679921383154817045, guid: 462f18cf3ee0678418610139b374a5ce, type: 3}
      propertyPath: m_LocalScale.z
      value: 2.6999998
      objectReference: {fileID: 0}
    - target: {fileID: -8679921383154817045, guid: 462f18cf3ee0678418610139b374a5ce, type: 3}
      propertyPath: m_LocalPosition.x
      value: 0
      objectReference: {fileID: 0}
    - target: {fileID: -8679921383154817045, guid: 462f18cf3ee0678418610139b374a5ce, type: 3}
      propertyPath: m_LocalPosition.y
      value: 0.042
      objectReference: {fileID: 0}
    - target: {fileID: -8679921383154817045, guid: 462f18cf3ee0678418610139b374a5ce, type: 3}
      propertyPath: m_LocalPosition.z
      value: 0.489
      objectReference: {fileID: 0}
    - target: {fileID: -8679921383154817045, guid: 462f18cf3ee0678418610139b374a5ce, type: 3}
      propertyPath: m_LocalRotation.w
      value: 0.7071068
      objectReference: {fileID: 0}
    - target: {fileID: -8679921383154817045, guid: 462f18cf3ee0678418610139b374a5ce, type: 3}
      propertyPath: m_LocalRotation.x
      value: -0
      objectReference: {fileID: 0}
    - target: {fileID: -8679921383154817045, guid: 462f18cf3ee0678418610139b374a5ce, type: 3}
      propertyPath: m_LocalRotation.y
      value: 0.7071068
      objectReference: {fileID: 0}
    - target: {fileID: -8679921383154817045, guid: 462f18cf3ee0678418610139b374a5ce, type: 3}
      propertyPath: m_LocalRotation.z
      value: -0
      objectReference: {fileID: 0}
    - target: {fileID: -8679921383154817045, guid: 462f18cf3ee0678418610139b374a5ce, type: 3}
      propertyPath: m_LocalEulerAnglesHint.x
      value: 0
      objectReference: {fileID: 0}
    - target: {fileID: -8679921383154817045, guid: 462f18cf3ee0678418610139b374a5ce, type: 3}
      propertyPath: m_LocalEulerAnglesHint.y
      value: 90
      objectReference: {fileID: 0}
    - target: {fileID: -8679921383154817045, guid: 462f18cf3ee0678418610139b374a5ce, type: 3}
      propertyPath: m_LocalEulerAnglesHint.z
      value: 0
      objectReference: {fileID: 0}
    - target: {fileID: 919132149155446097, guid: 462f18cf3ee0678418610139b374a5ce, type: 3}
      propertyPath: m_Name
      value: SM_Mant
      objectReference: {fileID: 0}
    m_RemovedComponents: []
  m_SourcePrefab: {fileID: 100100000, guid: 462f18cf3ee0678418610139b374a5ce, type: 3}
--- !u!4 &4121064953458473782 stripped
Transform:
  m_CorrespondingSourceObject: {fileID: -8679921383154817045, guid: 462f18cf3ee0678418610139b374a5ce, type: 3}
  m_PrefabInstance: {fileID: 4520012865721687261}
  m_PrefabAsset: {fileID: 0}
