{
    "stationName": "planumLite_test",
    "port": "auto",
    "controller": "PicoArduino - Board CDC",
    "loggingLevel": "info",
    "lat": 43.4001,
    "lon": 39.9665,
    "alt": 1,       
    "timeZone": 3,
    "horizon": 10,
    "minApogee": 30,
    "schedulerTimer": 6,
    "scheduleLength": 24,
    "demo": false,
    "dataPath": "/home/planum/lorett/data/",
    "workingPath": "/home/planum/lorett/upper/",
    "logPath": "/home/planum/lorett/upper/log/",
    "logURL": "http://eus.lorett.org/eus/log_post"
}