C:\Users\Lorenzo\Desktop\programmi\Progetti\node reader project\src\main\java\it\nodereader\entity\NodeEntity.java
C:\Users\Lorenzo\Desktop\programmi\Progetti\node reader project\src\main\java\it\nodereader\service\NodeService.java
C:\Users\Lorenzo\Desktop\programmi\Progetti\node reader project\src\main\java\it\nodreader\web\GlobalControllerExceptionHandler.java
C:\Users\Lorenzo\Desktop\programmi\Progetti\node reader project\src\main\java\it\nodereader\controller\NodeController.java
C:\Users\Lorenzo\Desktop\programmi\Progetti\node reader project\src\main\java\it\nodereader\service\impl\NodeServiceImpl.java
C:\Users\Lorenzo\Desktop\programmi\Progetti\node reader project\src\main\java\it\nodereader\model\FrontendResponse.java
C:\Users\Lorenzo\Desktop\programmi\Progetti\node reader project\src\main\java\it\nodereader\Application.java
C:\Users\Lorenzo\Desktop\programmi\Progetti\node reader project\src\main\java\it\nodereader\config\ApplicationConfig.java
C:\Users\Lorenzo\Desktop\programmi\Progetti\node reader project\src\main\java\it\nodereader\model\ModifyNodeRequest.java
C:\Users\Lorenzo\Desktop\programmi\Progetti\node reader project\src\main\java\it\nodereader\model\FrontendListResponse.java
C:\Users\Lorenzo\Desktop\programmi\Progetti\node reader project\src\main\java\it\nodereader\model\RetrieveNodeTreeRequest.java
C:\Users\Lorenzo\Desktop\programmi\Progetti\node reader project\src\main\java\it\nodereader\model\InsertNodeRequest.java
C:\Users\Lorenzo\Desktop\programmi\Progetti\node reader project\src\main\java\it\nodereader\repository\NodeRepository.java
C:\Users\Lorenzo\Desktop\programmi\Progetti\node reader project\src\main\java\it\nodereader\model\Node.java
