-------------------------------------------------------------------------------
Test set: it.nodereader.controller.NodeControllerTest
-------------------------------------------------------------------------------
Tests run: 1, Failures: 0, Errors: 0, Skipped: 0, Time elapsed: 6.222 s - in it.nodereader.controller.NodeControllerTest
