Symbol,Name,Last Sale,Net Change,% Change,Market Cap,Country,IPO Year,Volume,Sector,Industry
AAMC,Altisource Asset Management Corp Com,$24.67,-0.44,-1.752%,50710690.00,United States,,2347,Finance,Investment Managers
AAU,Almaden Minerals Ltd. Common Shares,$0.3775,0.0063,1.697%,51801082.00,Canada,2015,445992,,
ACU,Acme United Corporation. Common Stock,$36.69,-0.88,-2.342%,129835197.00,United States,1988,11787,Consumer Durables,Home Furnishings
ACY,AeroCentury Corp. Common Stock,$47.36,1.98,4.363%,208527359.00,United States,,28110,Technology,Diversified Commercial Services
ADRA,Adara Acquisition Corp. Class A Common Stock,$9.84,0.00,0.00%,141450000.00,United States,2021,4845,,
AE,Adams Resources & Energy Inc. Common Stock,$32.60,-0.30,-0.912%,138790523.00,United States,,42355,Energy,Oilfield Services/Equipment
AEF,Aberdeen Emerging Markets Equity Income Fund Inc. Common Stock,$8.52,-0.03,-0.351%,432405149.00,United States,,40265,Finance,Finance/Investors Services
AGE,AgeX Therapeutics Inc. Common Stock,$0.8181,-0.0219,-2.607%,31036368.00,,2018,99628,Health Care,Biotechnology: Pharmaceutical Preparations
AIM,AIM ImmunoTech Inc. Common Stock,$1.77,0.01,0.568%,70251321.00,United States,,157091,Health Care,Biotechnology: Biological Products (No Diagnostic Substances)
AINC,Ashford Inc. (Holding Company) Common Stock,$18.98,1.47,8.395%,57371909.00,United States,2014,7902,Finance,Investment Managers
AIRI,Air Industries Group Common Stock,$1.0599,-0.0301,-2.761%,33998974.00,United States,,96705,Capital Goods,Military/Government/Technical
AMBO,Ambow Education Holding Ltd. American Depository Shares each representing two Class A ordinary shares,$1.3192,-0.0203,-1.515%,30774753.00,China,,114560,Miscellaneous,Service to the Health Industry
AMPE,Ampio Pharmaceuticals Inc.,$1.595,-0.065,-3.916%,319730441.00,United States,,421980,Health Care,Biotechnology: Pharmaceutical Preparations
AMS,American Shared Hospital Services Common Stock,$2.91,-0.19,-6.129%,17075880.00,United States,,27689,Health Care,Medical Specialities
ANVS,Annovis Bio Inc. Common Stock,$30.26,0.25,0.833%,245123248.00,United States,2020,745292,Consumer Durables,Specialty Chemicals
APT,Alpha Pro Tech Ltd. Common Stock,$5.885,-0.565,-8.76%,77783522.00,Canada,,360189,,
ARMP,Armata Pharmaceuticals Inc. Common Stock,$3.9689,0.1689,4.445%,98975738.00,United States,,9136,Health Care,Biotechnology: Biological Products (No Diagnostic Substances)
ASM,Avino Silver & Gold Mines Ltd. Common Shares (Canada),$0.9585,0.0199,2.12%,97194498.00,Canada,,374530,,
ASXC,Asensus Surgical Inc. Common Stock,$2.1979,0.3479,18.805%,515020682.00,United States,,14296833,Health Care,Medical/Dental Instruments
ATNM,Actinium Pharmaceuticals Inc. (Delaware) Common Stock,$8.56,-0.24,-2.727%,188526870.00,United States,,156145,Health Care,Biotechnology: Pharmaceutical Preparations
AUMN,Golden Minerals Company Common Stock,$0.4315,-0.0285,-6.196%,70250190.00,United States,,2381533,Basic Industries,Metal Mining
AWX,Avalon Holdings Corporation Common Stock,$3.975,-0.065,-1.609%,15500238.00,United States,,12917,Public Utilities,Environmental Services
AXU,Alexco Resource Corp Common Shares (Canada),$1.83,-0.04,-2.139%,276162231.00,Canada,,370701,,
BATL,Battalion Oil Corporation Common Stock,$10.03,-0.2584,-2.512%,163168411.00,,,634,Energy,Oil & Gas Production
BCV,Bancroft Fund Ltd.,$30.35,0.06,0.198%,167464805.00,United States,,8614,Finance,Finance/Investors Services
BCV^A,Bancroft Fund Limited 5.375% Series A Cumulative Preferred Shares,$25.4701,0.00,0.00%,,United States,,60,,
BDL,Flanigan's Enterprises Inc. Common Stock,$29.51,0.46,1.583%,54848673.00,United States,,15977,Consumer Services,Restaurants
BDR,Blonder Tongue Laboratories Inc. Common Stock,$1.12,0.01,0.901%,13885497.00,United States,,555149,Technology,Radio And Television Broadcasting And Communications Equipment
BGI,Birks Group Inc. Common Stock,$3.2027,0.0027,0.084%,58702106.00,Canada,,1032957,,
BHB,Bar Harbor Bankshares Inc. Common Stock,$30.05,-0.57,-1.862%,450359350.00,United States,,4042,Finance,Major Banks
BKTI,BK Technologies Corporation Common Stock,$2.9903,-0.0197,-0.654%,54617040.00,United States,,9750,Technology,Radio And Television Broadcasting And Communications Equipment
BMTX,BM Technologies Inc. Common Stock,$9.9305,-0.1295,-1.287%,121155854.00,,2018,21864,Technology,EDP Services
BRBS,Blue Ridge Bankshares Inc. Common Stock,$18.40,-0.42,-2.232%,345507049.00,,,47455,Finance,Commercial Banks
BRG,Bluerock Residential Growth REIT Inc. Class A Common Stock,$13.515,-0.015,-0.111%,357983833.00,,2014,66497,Consumer Services,Real Estate Investment Trusts
BRG^C,Bluerock Residential Growth REIT Inc. 7.625% Series C Cumulative Redeemable Preferred Stock,$25.29,0.00,0.00%,,,,2,,
BRG^D,Bluerock Residential Growth REIT Inc. 7.125% Series D Cumulative Preferred Stock ($0.01 par value per share),$25.265,-0.01,-0.04%,,,,21925,,
BRN,Barnwell Industries Inc. Common Stock,$2.54,-0.03,-1.167%,23990673.00,United States,,12922,Energy,Oil & Gas Production
BTG,B2Gold Corp Common shares (Canada),$4.25,0.02,0.473%,4485236399.00,Canada,,2940306,,
BTN,Ballantyne Strong Inc. Common Stock,$3.00,-0.19,-5.956%,55425054.00,United States,,16156,Miscellaneous,Industrial Machinery/Components
BTTR,Better Choice Company Inc. Common Stock,$3.90,-0.06,-1.515%,115385759.00,,2021,40458,Consumer Non-Durables,Food Distributors
CANF,Can-Fite Biopharma Ltd Sponsored ADR (Israel),$1.528,0.038,2.55%,29171878.00,Israel,,151188,Health Care,Biotechnology: Pharmaceutical Preparations
CCF,Chase Corporation Common Stock,$100.71,0.41,0.409%,951633766.00,United States,,2406,Basic Industries,Paints/Coatings
CDOR,Condor Hospitality Trust Inc. Common Stock,$7.28,0.01,0.138%,107179997.00,United States,,35078,Consumer Services,Real Estate Investment Trusts
CEI,Camber Energy Inc. Common Stock,$1.23,-0.02,-1.60%,306962993.00,United States,,27600241,Energy,Oil & Gas Production
CET,Central Securities Corporation Common Stock,$44.55,0.2383,0.538%,1169165879.00,United States,,19343,Finance,Finance/Investors Services
CEV,Eaton Vance California Municipal Income Trust Shares of Beneficial Interest,$13.975,0.055,0.395%,99691711.00,United States,1999,4337,Finance,Finance/Investors Services
CIK,Credit Suisse Asset Management Income Fund Inc. Common Stock,$3.4625,0.0118,0.342%,181135068.00,United States,,158855,Finance,Finance/Investors Services
CIX,CompX International Inc. Common Stock,$21.90,-0.35,-1.573%,271683888.00,United States,1998,3786,Miscellaneous,Diversified Manufacture
CKX,CKX Lands Inc. Common Stock,$11.76,0.00,0.00%,22843741.00,United States,,8,Energy,Oil & Gas Production
CLM,Cornerstone Strategic Value Fund Inc. New Common Stock,$14.125,0.125,0.893%,1665036736.00,United States,1987,662774,Finance,Finance/Investors Services
CMCL,Caledonia Mining Corporation Plc Common Shares,$12.70,-0.14,-1.09%,153909052.00,Canada,,19841,Basic Industries,Precious Metals
CMT,Core Molding Technologies Inc Common Stock,$11.26,0.01,0.089%,95535211.00,United States,,5904,Consumer Durables,Electronic Components
COHN,Cohen & Company Inc.,$18.6733,-0.0767,-0.409%,30330836.00,United States,,33562,Finance,Investment Managers
CPHI,China Pharma Holdings Inc. Common Stock,$0.6164,0.0124,2.053%,26862439.00,China,,188594,Health Care,Biotechnology: Pharmaceutical Preparations
CQP,Cheniere Energy Partners LP Cheniere Energy Partners LP Common Units,$42.94,-0.65,-1.491%,20783995842.00,United States,2007,82859,Public Utilities,Oil/Gas Transmission
CRF,Cornerstone Total Return Fund Inc. (The) Common Stock,$13.6366,0.0266,0.195%,848555613.00,United States,,409380,Finance,Finance/Investors Services
CTEK,CynergisTek Inc. Common Stock,$1.81,0.05,2.841%,21938463.00,United States,2017,64969,Technology,Retail: Computer Software & Peripheral Equipment
CVM,Cel-Sci Corporation Common Stock,$12.19,-0.63,-4.914%,524513149.00,United States,,332804,Health Care,Biotechnology: Biological Products (No Diagnostic Substances)
CVR,Chicago Rivet & Machine Co. Common Stock,$26.53,-0.49,-1.813%,25631482.00,United States,,458,Consumer Non-Durables,Industrial Specialties
CVU,CPI Aerostructures Inc. Common Stock,$2.9901,-0.0699,-2.284%,36569781.00,United States,,11480,Capital Goods,Military/Government/Technical
CYBN,Cybin Inc. Common Shares,$1.925,0.035,1.852%,324108048.00,,,1603630,,
DHY,Credit Suisse High Yield Bond Fund Common Stock,$2.515,0.005,0.199%,260321116.00,United States,1998,221517,Finance,Finance/Investors Services
DIT,AMCON Distributing Company Common Stock,$126.00,-0.01,-0.008%,69472494.00,United States,,385,Consumer Non-Durables,Food Distributors
DLA,Delta Apparel Inc. Common Stock,$26.76,-0.47,-1.726%,186641902.00,United States,,1628,Consumer Non-Durables,Department/Specialty Retail Stores
DMF,BNY Mellon Municipal Income Inc. Common Stock,$8.76,0.01,0.114%,181776990.00,United States,1988,48745,Finance,Finance/Investors Services
DNN,Denison Mines Corp Ordinary Shares (Canada),$1.90,-0.02,-1.042%,1533491860.00,Canada,,14385160,,
DPW,Ault Global Holdings Inc. Common Stock,$2.1102,-0.0198,-0.93%,137062977.00,United States,,3074160,Capital Goods,Industrial Machinery/Components
DSS,DSS Inc. Common Stock,$1.22,-0.02,-1.613%,97289981.00,United States,,333659,Consumer Services,Recreational Products/Toys
DXF,Dunxin Financial Holdings Limited American Depositary Shares,$1.37,-0.03,-2.143%,28604486.00,China,,1183206,Consumer Non-Durables,Apparel
DXR,Daxor Corporation Common Stock,$11.13,-0.0479,-0.429%,44897051.00,United States,,825,Health Care,Medical/Dental Instruments
EAD,Wells Fargo Income Opportunities Fund Common Shares,$8.93,-0.04,-0.446%,541034891.00,United States,2003,66403,Finance,Finance/Investors Services
ECF,Ellsworth Growth and Income Fund Ltd.,$14.08,0.0968,0.692%,190072369.00,United States,1986,12663,Finance,Finance/Investors Services
ECF^A,Ellsworth Growth and Income Fund Ltd. 5.25% Series A Cumulative Preferred Shares (Liquidation Preference $25.00 per share),$25.83,-0.17,-0.654%,,United States,,602,,
EIM,Eaton Vance Municipal Bond Fund Common Shares of Beneficial Interest $.01 par value,$13.42,0.03,0.224%,965611729.00,United States,2002,45963,Finance,Finance/Investors Services
ELA,Envela Corporation Common Stock,$4.30,0.05,1.176%,115774838.00,United States,,73267,Consumer Services,Consumer Specialties
ELLO,Ellomay Capital Ltd Ordinary Shares (Israel),$32.95,0.2563,0.784%,423059120.00,Israel,,1294,Public Utilities,Electric Utilities: Central
ELMD,Electromed Inc. Common Stock,$11.1488,-0.0012,-0.011%,95532317.00,United States,2011,3376,Health Care,Biotechnology: Electromedical & Electrotherapeutic Apparatus
EMAN,eMagin Corporation Common Stock,$2.805,-0.025,-0.883%,203372778.00,United States,,347021,Capital Goods,Industrial Machinery/Components
EMX,EMX Royalty Corporation Common Shares (Canada),$2.64,-0.06,-2.222%,292677684.00,Canada,,94881,,
ENSV,Enservco Corporation Common Stock,$1.335,0.105,8.537%,15262689.00,United States,,352186,Energy,Oilfield Services/Equipment
ENX,Eaton Vance New York Municipal Bond Fund Common Shares of Beneficial Interest $.01 par value,$12.3003,-0.0397,-0.322%,222860452.00,United States,2002,24492,Finance,Finance/Investors Services
EPM,Evolution Petroleum Corporation Inc. Common Stock,$5.67,-0.13,-2.241%,190692017.00,United States,,64616,Energy,Oil & Gas Production
EQX,Equinox Gold Corp. Common Shares,$7.485,0.065,0.876%,2248860241.00,Canada,,1306483,,
ERC,Wells Fargo Multi-Sector Income Fund Common Stock no par value,$13.38,-0.09,-0.668%,375544475.00,United States,2003,114803,Finance,Finance/Investors Services
ERH,Wells Fargo Utilities and High Income Fund,$14.478,0.038,0.263%,134445314.00,,2004,5404,Finance,Finance/Investors Services
ESP,Espey Mfg. & Electronics Corp. Common Stock,$14.79,0.00,0.00%,39971942.00,United States,,114,Capital Goods,Industrial Machinery/Components
EVBN,Evans Bancorp Inc. Common Stock,$39.68,0.03,0.076%,216923537.00,United States,,972,Finance,Major Banks
EVI,EVI Industries Inc.  Common Stock,$31.96,-0.03,-0.094%,392418655.00,United States,,6139,Capital Goods,Industrial Machinery/Components
EVM,Eaton Vance California Municipal Bond Fund Common Shares of Beneficial Interest $.01 par value,$11.97,0.08,0.673%,299182238.00,United States,2002,64059,Finance,Finance/Investors Services
EVV,Eaton Vance Limited Duration Income Fund Common Shares of Beneficial Interest,$13.27,-0.03,-0.226%,1541270929.00,United States,2003,220444,Finance,Finance/Investors Services
EXN,Excellon Resources Inc. Common Shares,$1.32,0.02,1.538%,43247802.00,,2020,27596,,
FAX,Aberdeen Asia-Pacific Income Fund Inc Common Stock,$4.1401,-0.0499,-1.191%,1025485253.00,United States,1986,760980,Finance,Investment Managers
FCO,Aberdeen Global Income Fund Inc. Common Stock,$8.34,0.06,0.725%,72910949.00,United States,1992,32647,Finance,Investment Managers
FEN,First Trust Energy Income and Growth Fund,$14.64,-0.13,-0.88%,284683145.00,United States,2004,35704,Finance,Finance/Investors Services
FRD,Friedman Industries Inc. Common Stock,$13.90,-0.28,-1.975%,95903564.00,United States,,7476,Basic Industries,Steel/Iron Ore
FSI,Flexible Solutions International Inc. Common Stock (CDA),$3.57,-0.04,-1.108%,44008268.00,Canada,,4093,Capital Goods,Recreational Products/Toys
FSP,Franklin Street Properties Corp. Common Stock,$4.655,-0.145,-3.021%,499922622.00,United States,,129071,Consumer Services,Real Estate Investment Trusts
FTF,Franklin Limited Duration Income Trust Common Shares of Beneficial Interest,$9.0673,0.0223,0.247%,273277859.00,United States,2003,296727,Finance,Finance/Investors Services
FTSI,FTS International Inc. Class A Common Stock,$26.44,-0.07,-0.264%,371789841.00,United States,2020,99591,Energy,Oilfield Services/Equipment
FURY,Fury Gold Mines Limited Common Shares,$0.6486,-0.0013,-0.20%,81329370.00,,2020,89967,,
GAU,Galiano Gold Inc.,$0.8097,0.0135,1.696%,182136714.00,Canada,,199232,,
GBR,New Concept Energy Inc Common Stock,$3.87,-0.17,-4.208%,19860585.00,United States,,76357,Consumer Services,Real Estate
GDP,Goodrich Petroleum Corporation Common Stock,$21.66,0.91,4.386%,294769749.00,United States,2017,47968,Energy,Oil & Gas Production
GGN,GAMCO Global Gold Natural Resources & Income Trust,$3.895,0.015,0.387%,599973858.00,United States,2005,349900,Finance,Finance/Investors Services
GGN^B,GAMCO Global Gold Natural Reources & Income Trust 5.00% Series B Cumulative 25.00 Liquidation Preference,$25.39,0.03,0.118%,,United States,,398,,
GLDG,GoldMining Inc. Common Shares,$1.3334,-0.0266,-1.956%,199667143.00,,,262378,,
GLO,Clough Global Opportunities Fund Common Stock,$12.9502,-0.0598,-0.46%,515716359.00,United States,2006,101987,Finance,Finance/Investors Services
GLQ,Clough Global Equity Fund Clough Global Equity Fund Common Shares of Beneficial Interest,$15.69,0.04,0.256%,276967584.00,United States,2005,69652,Finance,Finance/Investors Services
GLTA,Galata Acquisition Corp. Class A Ordinary Shares,$9.9415,0.0615,0.622%,178636328.00,,2021,420,,
GLU,Gabelli Global Utility Common Shares of Beneficial Ownership,$20.3458,-0.0842,-0.412%,109360486.00,United States,2004,6839,Finance,Finance/Investors Services
GLU^B,The Gabelli Global Utility and Income Trust Series B Cumulative Puttable and Callable Preferred Shares,$51.10,0.03,0.059%,,United States,,5650,,
GLV,Clough Global Dividend and Income Fund Common Shares of beneficial interest,$11.42,0.03,0.263%,128342756.00,United States,2004,29484,Finance,Finance/Investors Services
GOED,1847 Goedeker Inc. Commom Stock,$2.805,-0.185,-6.187%,298416466.00,United States,2020,2408157,Capital Goods,Recreational Products/Toys
GORO,Gold Resource Corporation Common Stock,$1.845,-0.045,-2.381%,137603198.00,United States,,519616,Basic Industries,Precious Metals
GPL,Great Panther Mining Limited Ordinary Shares (Canada),$0.3881,-0.0569,-12.787%,138472352.00,Canada,,8370437,,
GRF,Eagle Capital Growth Fund Inc. Common Stock,$9.7395,0.0851,0.881%,39534744.00,United States,,2006,Finance,Finance/Investors Services
GROY,Gold Royalty Corp. Common Shares,$4.8347,-0.0353,-0.725%,350629477.00,,2021,324388,,
GSAT,Globalstar Inc. Common Stock,$1.64,-0.01,-0.606%,2940520000.00,United States,2006,3052264,Consumer Services,Telecommunications Equipment
GSS,Golden Star Resources Ltd Common Stock,$3.705,-0.015,-0.403%,428761299.00,United States,,858662,,
GSV,Gold Standard Ventures Corporation Common Stock (Canada),$0.4752,-0.0011,-0.231%,170107463.00,Canada,,637176,,
GTE,Gran Tierra Energy Inc. Common Stock,$0.8433,-0.0299,-3.424%,309612957.00,Canada,,3250822,Energy,Oil & Gas Production
HMG,HMG/Courtland Properties Inc. Common Stock,$18.25,0.00,0.00%,18557476.00,United States,,5,Consumer Services,Real Estate Investment Trusts
HNW,Pioneer Diversified High Income Fund Inc.,$15.68,-0.02,-0.127%,130658147.00,United States,2007,17769,Finance,Finance/Investors Services
HUSA,Houston American Energy Corporation Common Stock,$1.88,-0.02,-1.053%,18655875.00,United States,,58804,Energy,Oil & Gas Production
HWM^,Howmet Aerospace Inc. $3.75 Preferred Stock,$75.75,0.00,0.00%,,United States,,99,,
IAF,Aberdeen Australia Equity Fund Inc Common Stock,$6.06,-0.05,-0.818%,142380494.00,United States,,28503,Finance,Finance/Investors Services
IBIO,iBio Inc. Common Stock,$0.9279,0.0923,11.046%,202242851.00,United States,,10022362,Health Care,Biotechnology: Pharmaceutical Preparations
ID,PARTS iD Inc. Class A Common Stock,$4.20,-0.16,-3.67%,139328515.00,United States,2017,16064,Miscellaneous,Diversified Commercial Services
IDW,IDW Media Holdings Class B Common Stock,$3.25,0.03,0.932%,42134430.00,,2021,13224,Consumer Services,Newspapers/Magazines
IGC,India Globalization Capital Inc. Common Stock,$1.46,0.00,0.00%,74534485.00,United States,,4433248,Technology,Engineering & Construction
IHT,InnSuites Hospitality Trust Shares of Beneficial Interest,$3.88,0.01,0.258%,35388432.00,United States,,30864,Consumer Services,Real Estate Investment Trusts
IMH,Impac Mortgage Holdings Inc. Common Stock ,$1.4147,-0.0053,-0.373%,30179348.00,United States,1997,48341,Finance,Finance: Consumer Services
IMO,Imperial Oil Limited Common Stock,$33.02,-0.62,-1.843%,22968712000.00,Canada,,325670,,
INDO,Indonesia Energy Corporation Limited Ordinary Shares,$4.08,0.03,0.741%,30367256.00,,2019,1831,Energy,Oil & Gas Production
INFU,InfuSystems Holdings Inc. Common Stock,$16.56,-0.30,-1.779%,340614178.00,United States,,19776,Health Care,Medical/Dental Instruments
INTT,inTest Corporation Common Stock,$12.485,0.245,2.002%,134623033.00,United States,1997,49027,Technology,Semiconductors
INUV,Inuvo Inc.,$0.72,-0.003,-0.415%,85496548.00,United States,,771856,Technology,Advertising
IOR,Income Opportunity Realty Investors Inc. Common Stock,$12.55,0.00,0.00%,52313596.00,United States,,39,Finance,Diversified Financial Services
ISDR,Issuer Direct Corporation Common Stock,$26.15,0.00,0.00%,99017629.00,United States,,2040,Technology,EDP Services
ISR,IsoRay Inc. Common Stock (DE),$0.6699,-0.0103,-1.514%,95069037.00,United States,,424031,Health Care,Medical/Dental Instruments
ITP,IT Tech Packaging Inc. Common Stock,$0.4825,0.0634,15.128%,47791577.00,China,,84270446,Basic Industries,Paper
ITRG,Integra Resources Corp. Common Shares,$2.40,0.055,2.345%,149057532.00,,,56477,,
JOB,GEE Group Inc. Common Stock,$0.4775,-0.0148,-3.006%,54482967.00,United States,,1006153,Technology,Diversified Commercial Services
KIQ,Kelso Technologies Inc Ordinary Shares,$0.6746,0.0145,2.197%,36644330.00,Canada,,453301,,
KULR,KULR Technology Group Inc. Common Stock,$3.4276,0.2676,8.468%,348591249.00,United States,,3259368,,
LCTX,Lineage Cell Therapeutics Inc. Common Stock,$2.57,-0.04,-1.533%,385452062.00,United States,,319834,Health Care,Biotechnology: Biological Products (No Diagnostic Substances)
LEU,Centrus Energy Corp. Class A Common Stock,$73.07,2.30,3.25%,1021613810.00,United States,2014,250040,,
LGL,LGL Group Inc. (The) Common Stock,$11.80,-0.10,-0.84%,62212007.00,United States,,43185,Capital Goods,Industrial Machinery/Components
LNG,Cheniere Energy Inc. Common Stock,$106.26,0.62,0.587%,26948271107.00,United States,,1247278,Public Utilities,Oil/Gas Transmission
LODE,Comstock Mining Inc. Common Stock,$2.31,-0.02,-0.858%,147716621.00,United States,,238451,Finance,Real Estate
LOV,Spark Networks Inc. American Depositary Shares (each representing one-tenth of an Ordinary Share),$2.49,-0.11,-4.231%,65070124.00,United States,2017,73488,Miscellaneous,Other Consumer Services
LSF,Laird Superfood Inc. Common Stock,$18.34,0.17,0.936%,165067905.00,,2020,13967,Consumer Non-Durables,Specialty Foods
LXFR,Luxfer Holdings PLC Ordinary Shares,$21.229,0.349,1.671%,588147704.00,United Kingdom,2012,142711,Capital Goods,Metal Fabrications
MAG,MAG Silver Corporation Ordinary Shares,$20.47,0.17,0.837%,1943834332.00,Canada,,229949,,
MCF,Contango Oil & Gas Company Common Stock (TX),$3.98,-0.08,-1.97%,800697825.00,United States,,653692,Energy,Oil & Gas Production
MHH,Mastech Digital Inc Common Stock,$19.15,0.56,3.012%,219037949.00,United States,,23697,Consumer Services,Professional Services
MIMO,Airspan Networks Holdings Inc. Common Stock,$7.44,-0.17,-2.234%,535861811.00,,2020,43854,Consumer Services,Telecommunications Equipment
MITQ,Moving iMage Technologies Inc. Common Stock,$2.778,-0.012,-0.43%,29547580.00,United States,2021,166983,Capital Goods,Telecommunications Equipment
MLSS,Milestone Scientific Inc. Common Stock,$2.2916,-0.0084,-0.365%,153918586.00,United States,2015,122672,Health Care,Industrial Specialties
MMX,Maverix Metals Inc. Common Shares,$4.91,0.00,0.00%,716100693.00,,,74313,,
MSN,Emerson Radio Corporation Common Stock,$1.18,-0.04,-3.279%,24830329.00,United States,,7949,Consumer Non-Durables,Consumer Electronics/Appliances
MTA,Metalla Royalty & Streaming Ltd. Common Shares,$7.40,0.00,0.00%,322783849.00,,,96023,,
MTNB,Matinas Biopharma Holdings Inc. Common Stock,$1.07,-0.03,-2.727%,231378322.00,United States,2017,1078350,Health Care,Biotechnology: Pharmaceutical Preparations
MXC,Mexco Energy Corporation Common Stock,$11.90,0.04,0.337%,24896775.00,United States,,7203,Energy,Oil & Gas Production
MYO,Myomo Inc. Common Stock,$10.6988,0.1788,1.70%,61300882.00,United States,2017,23035,Health Care,Industrial Specialties
NAK,Northern Dynasty Minerals Ltd. Common Stock,$0.4152,-0.0069,-1.635%,219445234.00,Canada,,4448429,,
NAVB,Navidea Biopharmaceuticals Inc. Common Stock,$1.4998,-0.0102,-0.675%,45238835.00,United States,,53647,Health Care,Biotechnology: In Vitro & In Vivo Diagnostic Substances
NBH,Neuberger Berman Municipal Fund Inc. Common Stock,$15.31,0.04,0.262%,288276522.00,United States,2002,22118,Finance,Finance/Investors Services
NBO,Neuberger Berman New York Municipal Fund Inc. Common Stock,$12.56,0.00,0.00%,63772358.00,United States,2002,7682,Finance,Finance/Investors Services
NBW,Neuberger Berman California Municipal Fund Inc Common Stock,$13.96,0.09,0.649%,77492574.00,United States,2002,1438,Finance,Finance/Investors Services
NBY,NovaBay Pharmaceuticals Inc. Common Stock,$0.5651,-0.0447,-7.33%,25397495.00,United States,2007,810491,Health Care,Biotechnology: Pharmaceutical Preparations
NEN,New England Realty Associates Limited Partnership Class A Depositary Receipts Evidencing Units of Limited Partnership,$60.50,0.00,0.00%,220988108.00,United States,,36,Finance,Real Estate
NES,Nuverra Environmental Solutions Inc. Common Stock,$2.0514,0.0514,2.57%,32822564.00,United States,2017,16821,Public Utilities,Water Supply
NEWP,New Pacific Metals Corp. Common Shares,$3.65,-0.03,-0.815%,566095878.00,,2021,62798,,
NFGC,New Found Gold Corp Common Shares,$7.60,-0.14,-1.809%,1196226806.00,,2021,48544,,
NG,Novagold Resources Inc.,$7.38,-0.08,-1.072%,2447780341.00,Canada,,324369,,
NGD,New Gold Inc.,$1.425,-0.035,-2.397%,970140000.00,Canada,,4606354,,
NHC,National HealthCare Corporation Common Stock,$71.96,-0.11,-0.153%,1109856350.00,United States,,5963,Health Care,Hospital/Nursing Management
NHS,Neuberger Berman High Yield Strategies Fund,$13.10,0.00,0.00%,192063908.00,United States,,17933,Finance,Trusts Except Educational Religious and Charitable
NML,Neuberger Berman MLP and Energy Income Fund Inc. Common Stock,$5.41,-0.01,-0.185%,306524800.00,,2013,57857,Finance,Finance/Investors Services
NNVC,NanoViricides Inc. Common Stock,$5.36,-0.11,-2.011%,61720400.00,United States,,95269,Health Care,Biotechnology: Pharmaceutical Preparations
NOG,Northern Oil and Gas Inc. Common Stock,$23.675,-0.085,-0.358%,1566624396.00,United States,,224791,Energy,Oil & Gas Production
NRO,Neuberger Berman Real Estate Securities Income Fund Inc. Neuberger Berman Real Estate Securities Income Fund Inc.,$5.04,-0.04,-0.787%,239109263.00,United States,2003,74732,Finance,Finance/Investors Services
NTIP,Network-1 Technologies Inc. Common Stock,$2.89,0.03,1.049%,69615415.00,United States,,7921,,
NXE,Nexgen Energy Ltd. Common Shares,$5.91,-0.08,-1.336%,2813848013.00,,,1689711,,
OGEN,Oragenics Inc. Common Stock,$0.637,-0.0372,-5.518%,74143491.00,United States,,2843998,Health Care,Biotechnology: Pharmaceutical Preparations
OPTT,Ocean Power Technologies Inc. Common Stock,$2.195,-0.015,-0.679%,115145334.00,United States,2007,461258,Capital Goods,Industrial Machinery/Components
ORLA,Orla Mining Ltd. Common Shares,$3.39,-0.05,-1.453%,836558056.00,,2020,28697,,
OZ,Belpointe PREP LLC Class A Units,$100.25,-2.05,-2.004%,0.00,,,31891,,
PCG^A,Pacific Gas & Electric Co. 6% Preferred Stock,$29.4476,0.1426,0.487%,,United States,,494,,
PCG^B,Pacific Gas & Electric Co. 5 1/2% Preferred Stock,$26.50,-0.12,-0.451%,,United States,,230,,
PCG^C,Pacific Gas & Electric Co. 5% 1st Preferred Stock,$25.9394,0.00,0.00%,,United States,,18,,
PCG^D,Pacific Gas & Electric Co. 5% 1st  Red. Preferred Stock,$24.7501,-0.0599,-0.241%,,United States,,2373,,
PCG^E,Pacific Gas & Electric Co. 5% 1st A Preferred Stock,$25.10,0.00,0.00%,,United States,,44,,
PCG^G,Pacific Gas & Electric Co. 4.80% 1st Preferred Stock,$26.49,1.9958,8.148%,,United States,,119,,
PCG^H,Pacific Gas & Electric Co. 4.50% 1st Preferred Stock,$22.88,0.0146,0.064%,,United States,,904,,
PCG^I,Pacific Gas & Electric Co. 4.36% 1st Preferred Stock,$23.50,0.84,3.707%,,United States,,235,,
PED,Pedevco Corp. Common Stock,$1.52,-0.01,-0.654%,127999509.00,United States,,994652,,
PHGE,BiomX Inc. COmmon Stock,$2.26,-0.04,-1.739%,63719742.00,,2019,42496,Health Care,Biotechnology: Pharmaceutical Preparations
PLAG,Planet Green Holdings Corp. Common Stock,$1.37,0.04,3.008%,40664244.00,China,,36066,,
PLG,Platinum Group Metals Ltd. Ordinary Shares (Canada),$2.61,0.06,2.353%,196245161.00,Canada,,600535,,
PLM,Polymet Mining Corporation Ordinary Shares (Canada),$3.24,-0.10,-2.994%,326842517.00,Canada,,31293,,
PLX,Protalix BioTherapeutics Inc. (DE) Common Stock,$1.155,-0.015,-1.282%,52617927.00,Israel,,248684,Health Care,Biotechnology: Biological Products (No Diagnostic Substances)
PLYM^A,Plymouth Industrial REIT Inc. 7.50% Series A Cumulative Redeemable Preferred Stock,$26.61,0.1207,0.456%,,United States,,1853,,
PRK,Park National Corporation Common Stock,$132.46,-1.92,-1.429%,2146670205.00,United States,,9986,Finance,Major Banks
PTN,Palatin Technologies Inc. Common Stock,$0.4237,0.0021,0.498%,97984073.00,United States,,437780,Health Care,Biotechnology: Pharmaceutical Preparations
PW,Power REIT (MD) Common Stock,$50.75,1.34,2.712%,168613475.00,United States,,3731,Consumer Services,Real Estate Investment Trusts
PW^A,Power REIT 7.75% Series A Cumulative Perpetual Preferred Stock,$26.5101,0.00,0.00%,,United States,,5,,
PZG,Paramount Gold Nevada Corp. Common Stock,$0.80,0.00,0.00%,32420121.00,United States,2015,60289,Basic Industries,Precious Metals
RCG,RENN Fund Inc Common Stock,$2.985,0.12,4.188%,17766586.00,United States,,20403,Finance,Investment Managers
RCOR,Renovacor Inc. Common Stock,$8.00,0.00,0.00%,138048336.00,,2020,33705,Health Care,Biotechnology: Pharmaceutical Preparations
REI,Ring Energy Inc. Common Stock,$3.705,-0.075,-1.984%,368095992.00,United States,,1011229,Energy,Oil & Gas Production
REPX,Riley Exploration Permian Inc. Common Stock,$24.00,-1.21,-4.80%,466776720.00,United States,,8604,Energy,Oil & Gas Production
RHE,Regional Health Properties Inc. Common Stock,$7.40,0.35,4.965%,13132077.00,,2017,59220,Health Care,Hospital/Nursing Management
RHE^A,Regional Health Properties Inc. 10.875% Series A Cumulative Redeemable Preferred Stock,$4.896,-0.004,-0.082%,,,,1704,,
RLGT,Radiant Logistics Inc. Common Stock,$7.09,0.07,0.997%,353920782.00,United States,,44426,Transportation,Oil Refining/Marketing
RMED,Ra Medical Systems Inc. Common Stock,$3.0809,-0.0491,-1.569%,21656996.00,,2018,75609,Health Care,Medical/Dental Instruments
RVP,Retractable Technologies Inc. Common Stock,$9.42,0.03,0.319%,320365760.00,United States,,98809,Health Care,Medical/Dental Instruments
SACC,Sachem Capital Corp. 6.875% Notes due 2024,$25.3864,0.0364,0.144%,0.00,United States,2019,2556,Consumer Services,Real Estate Investment Trusts
SACH,Sachem Capital Corp. Common Shares,$5.71,0.08,1.421%,161683960.00,United States,2017,96966,Consumer Services,Real Estate Investment Trusts
SACH^A,Sachem Capital Corp. 7.75% Series A Cumulative Redeemable Preferred Stock,$25.7719,-0.0081,-0.031%,,United States,,4382,,
SBEV,Splash Beverage Group Inc. Common Stock,$1.92,-0.07,-3.518%,58525279.00,,2021,53839,Consumer Non-Durables,Beverages (Production/Distribution)
SCCB,Sachem Capital Corp. 7.125% Notes due 2024,$25.26,-0.09,-0.355%,0.00,United States,2019,3276,Consumer Services,Real Estate Investment Trusts
SCCC,Sachem Capital Corp. 7.75% Notes due 2025,$25.8501,-0.0344,-0.133%,0.00,United States,2020,2277,Consumer Services,Real Estate Investment Trusts
SDPI,Superior Drilling Products Inc. Common Stock,$1.17,0.00,0.00%,33602900.00,,2014,110679,Energy,Metal Fabrications
SEB,Seaboard Corporation Common Stock,$4066.845,55.255,1.377%,4720708272.00,United States,1996,171,Finance,Investment Bankers/Brokers/Service
SENS,Senseonics Holdings Inc. Common Stock,$3.835,-0.075,-1.918%,1707552898.00,United States,,8654773,Health Care,Medical Specialities
SIF,SIFCO Industries Inc. Common Stock,$7.5201,-0.2929,-3.749%,45038849.00,United States,,5511,Capital Goods,Office Equipment/Supplies/Services
SILV,SilverCrest Metals Inc. Common Shares,$8.925,-0.085,-0.943%,1292902275.00,,2018,350038,Capital Goods,Industrial Machinery/Components
SIM,Grupo Simec S.A.B. de C.V. American Depositary Shares,$23.11,-0.90,-3.748%,3564944533.00,Mexico,1993,1161,Basic Industries,Aluminum
SLI,Standard Lithium Ltd. Common Shares,$12.02,0.00,0.00%,1696817760.00,,2021,1076477,,
SMTS,Sierra Metals Inc. Common Stock,$1.72,-0.16,-8.511%,281048000.00,,,1805408,,
SNMP,Evolve Transition Infrastructure LP Common Stock,$1.2094,0.0294,2.492%,95208219.00,United States,,30019903,Energy,Oil & Gas Production
SSY,SunLink Health Systems Inc. Common Stock,$2.47,-0.01,-0.403%,17102653.00,United States,,11055,Health Care,Medical/Nursing Services
STXS,Stereotaxis Inc. Common Stock,$6.18,-0.17,-2.677%,460456851.00,United States,,140898,Health Care,Biotechnology: Electromedical & Electrotherapeutic Apparatus
SVM,Silvercorp Metals Inc. Common Shares,$4.16,-0.07,-1.655%,733633019.00,,,1140684,,
SVT,Servotronics Inc. Common Stock,$11.31,0.00,0.00%,28180754.00,United States,,49,Consumer Durables,Metal Fabrications
SYN,Synthetic Biologics Inc. Common Stock,$0.433,0.0005,0.116%,57174419.00,United States,,1328049,Health Care,Biotechnology: Pharmaceutical Preparations
TELL,Tellurian Inc. Common Stock,$4.32,0.00,0.00%,2033509126.00,United States,,6652135,Energy,Oil & Gas Production
TGB,Taseko Mines Ltd. Common Stock,$2.2013,-0.0387,-1.728%,624885653.00,Canada,,1890806,,
THM,International Tower Hill Mines Ltd. Ordinary Shares (Canada),$0.7001,-0.0169,-2.357%,136455220.00,Canada,,150408,,
TKAT,Takung Art Co. Ltd. Common Stock,$6.38,-0.14,-2.147%,79104810.00,,,357121,Consumer Services,Catalog/Specialty Distribution
TMBR,Timber Pharmaceuticals Inc. Common Stock,$0.557,-0.0054,-0.96%,20419445.00,United States,2015,6531395,Consumer Durables,Specialty Chemicals
TMP,Tompkins Financial Corporation Common Stock,$82.03,-2.30,-2.727%,1195364210.00,United States,,13059,Finance,Major Banks
TMQ,Trilogy Metals Inc. Common Stock,$1.98,0.00,0.00%,286013940.00,Canada,,59323,,
TPHS,Trinity Place Holdings Inc. Common Stock,$2.00,0.06,3.093%,70392588.00,,,31093,Consumer Services,Real Estate
TRT,Trio-Tech International Common Stock,$4.90,0.26,5.603%,19173970.00,United States,,99811,Technology,Industrial Machinery/Components
TRX,Tanzanian Gold Corporation Common Stock,$0.4709,0.0059,1.269%,120018545.00,Canada,,386699,,
UAMY,United States Antimony Corporation Common Stock,$0.9333,0.026,2.866%,98934685.00,United States,,889660,,
UAVS,AgEagle Aerial Systems Inc. Common Stock,$3.0361,0.0461,1.542%,228149854.00,United States,,1862013,,
UEC,Uranium Energy Corp. Common Stock,$4.4985,0.1185,2.705%,1165052250.00,Canada,,4493684,Basic Industries,Other Metals and Minerals
UFAB,Unique Fabricating Inc. Common Stock,$3.155,-0.015,-0.473%,37018079.00,United States,2015,12884,Capital Goods,Auto Parts:O.E.M.
URG,Ur Energy Inc Common Shares (Canada),$1.875,0.005,0.267%,395288873.00,Canada,,2001582,,
USAS,Americas Gold and Silver Corporation Common Shares no par value,$0.8827,0.0094,1.076%,121041724.00,,2017,409376,,
UTG,Reaves Utility Income Fund Common Shares of Beneficial Interest,$33.71,-0.20,-0.59%,2004584365.00,United States,2004,140871,Finance,Investment Managers
UUU,Universal Security Instruments Inc. Common Stock,$5.05,-0.11,-2.132%,11680079.00,United States,,30038,Miscellaneous,Diversified Manufacture
UUUU,Energy Fuels Inc Ordinary Shares (Canada),$10.07,0.30,3.071%,1567099915.00,,,3742650,,
VCF,Delaware Investments Colorado Municipal Income Fund Inc  Common Stock,$14.23,0.02,0.141%,68831933.00,United States,1993,2311,Finance,Finance/Investors Services
VFL,Delaware Investments National Municipal Income Fund Common Stock,$13.714,-0.066,-0.479%,62103067.00,United States,1993,1398,Finance,Finance/Investors Services
VGZ,Vista Gold Corp Common Stock,$0.77,-0.0001,-0.013%,90235709.00,United States,,153639,,
VHAQ,Viveon Health Acquisition Corp. Common Stock,$10.01,0.01,0.10%,251814063.00,,2021,3017,,
VKI,Invesco Advantage Municipal Income Trust II Common Shares of Beneficial Interest (DE),$12.12,-0.04,-0.329%,538025598.00,United States,,43703,Finance,Finance Companies
VMM,Delaware Investments Minnesota Municipal Income Fund II Inc. Common Stock,$14.145,-0.025,-0.176%,162737871.00,United States,1993,1535,Finance,Finance/Investors Services
VNRX,VolitionRX Limited Common Stock,$3.65,0.01,0.275%,194261618.00,Singapore,2015,92971,Health Care,Biotechnology: Biological Products (No Diagnostic Substances)
VOLT,Volt Information Sciences Inc. Common Stock,$3.21,-0.02,-0.619%,70874482.00,United States,,30062,Technology,Diversified Commercial Services
WLMS,Williams Industrial Services Group Inc. Common Stock,$4.665,-0.085,-1.789%,120895817.00,,2021,14022,Capital Goods,Engineering & Construction
WRN,Western Copper and Gold Corporation Common Stock,$1.6401,-0.0599,-3.524%,246959903.00,Canada,2011,148415,,
WTT,Wireless Telecom Group  Inc. Common Stock,$2.1983,0.002,0.091%,48819838.00,United States,,4291,Capital Goods,Telecommunications Equipment
WWR,Westwater Resources Inc. Common Stock,$3.49,0.06,1.749%,120879860.00,United States,,603628,Basic Industries,Other Metals and Minerals
WYY,WidePoint Corporation Common Stock,$5.4593,0.0494,0.913%,49772760.00,United States,,17429,Technology,EDP Services
XPL,Solitario Zinc Corp. Common Stock,$0.5285,-0.0129,-2.383%,30887530.00,United States,,199422,Basic Industries,Metal Mining
XTNT,Xtant Medical Holdings Inc. Common Stock,$1.18,-0.08,-6.349%,102314597.00,United States,,238468,Health Care,Medical Specialities
YCBD,cbdMD Inc. Common Stock,$1.74,-0.06,-3.333%,100532137.00,United States,2017,93376,Health Care,Biotechnology: Pharmaceutical Preparations
YCBD^A,cbdMD Inc. 8.0% Series A Cumulative Convertible Preferred Stock,$6.10,0.06,0.993%,,United States,,5611,,
ZDGE,Zedge Inc. Class B Common Stock ,$11.365,-0.735,-6.074%,161230038.00,,2016,143863,Technology,Computer Software: Prepackaged Software
ZOM,Zomedica Corp. Common Shares,$0.566,0.0462,8.888%,554526143.00,United States,2017,32785053,,
