%YAML 1.1
%TAG !u! tag:unity3d.com,2011:
--- !u!1045 &1
EditorBuildSettings:
  m_ObjectHideFlags: 0
  serializedVersion: 2
  m_Scenes:
  - enabled: 1
    path: Assets/Scenes/MenuLobby.unity
    guid: f351ef0babb5a5948b5c5e5e9c950b5b
  - enabled: 1
    path: Assets/Scenes/MainScene.unity
    guid: 2cda990e2423bbf4892e6590ba056729
  - enabled: 0
    path: Assets/Mirror/Examples/Pong/Scenes/MirrorPong.unity
    guid: 89a84548859e3b643b4fb27984dc2b0d
  m_configObjects: {}
