%YAML 1.1
%TAG !u! tag:unity3d.com,2011:
--- !u!21 &2100000
Material:
  serializedVersion: 8
  m_ObjectHideFlags: 0
  m_CorrespondingSourceObject: {fileID: 0}
  m_PrefabInstance: {fileID: 0}
  m_PrefabAsset: {fileID: 0}
  m_Name: Custom_Refraction
  m_Shader: {fileID: 4800000, guid: 451a0783a91439d45ac61b50fef69b9d, type: 3}
  m_Parent: {fileID: 0}
  m_ModifiedSerializedProperties: 0
  m_ValidKeywords: []
  m_InvalidKeywords: []
  m_LightmapFlags: 4
  m_EnableInstancingVariants: 0
  m_DoubleSidedGI: 0
  m_CustomRenderQueue: -1
  stringTagMap: {}
  disabledShaderPasses: []
  m_LockedProperties: 
  m_SavedProperties:
    serializedVersion: 3
    m_TexEnvs:
    - _MainTex:
        m_Texture: {fileID: 0}
        m_Scale: {x: 1, y: 1}
        m_Offset: {x: 0, y: 0}
    m_Ints: []
    m_Floats:
    - _FresnelPower: 1.41
    - _Metallic: 0.471
    - _RefractIndex: 0.357
    - _Smoothness: 0.703
    - _Strength: 0.377
    - _Transparency: 0.981
    m_Colors:
    - _Color: {r: 1, g: 0.16509432, b: 0.16509432, a: 1}
    - _FresnelColor: {r: 0.41720778, g: 1, b: 0.28773582, a: 1}
    - _VECTOR: {r: 0, g: 0, b: 0, a: 0}
  m_BuildTextureStacks: []
