﻿Log file open, 04/02/21 21:04:27
LogInit: Display: Running engine for game: TowerDefenseC
LogPlatformFile: Not using cached read wrapper
LogTaskGraph: Started task graph with 5 named threads and 20 total threads with 3 sets of task threads.
LogStats: Stats thread started at 0.175881
LogD3D11RHI: Loaded GFSDK_Aftermath_Lib.x64.dll
LogICUInternationalization: ICU TimeZone Detection - Raw Offset: +8:00, Platform Override: ''
LogPluginManager: Mounting plugin Paper2D
LogPluginManager: Mounting plugin AISupport
LogPluginManager: Mounting plugin LightPropagationVolume
LogPluginManager: Mounting plugin CameraShakePreviewer
LogPluginManager: Mounting plugin ActorLayerUtilities
LogPluginManager: Mounting plugin AnimationSharing
LogPluginManager: Mounting plugin CLionSourceCodeAccess
LogPluginManager: Mounting plugin CodeLiteSourceCodeAccess
LogPluginManager: Mounting plugin GitSourceControl
LogPluginManager: Mounting plugin KDevelopSourceCodeAccess
LogPluginManager: Mounting plugin NullSourceCodeAccess
LogPluginManager: Mounting plugin PerforceSourceControl
LogPluginManager: Mounting plugin PlasticSourceControl
LogPluginManager: Mounting plugin RiderSourceCodeAccess
LogPluginManager: Mounting plugin SubversionSourceControl
LogPluginManager: Mounting plugin UObjectPlugin
LogPluginManager: Mounting plugin VisualStudioCodeSourceCodeAccess
LogPluginManager: Mounting plugin VisualStudioSourceCodeAccess
LogPluginManager: Mounting plugin XCodeSourceCodeAccess
LogPluginManager: Mounting plugin AssetManagerEditor
LogPluginManager: Mounting plugin CryptoKeys
LogPluginManager: Mounting plugin CurveEditorTools
LogPluginManager: Mounting plugin DataValidation
LogPluginManager: Mounting plugin EditorScriptingUtilities
LogPluginManager: Mounting plugin FacialAnimation
LogPluginManager: Mounting plugin GameplayTagsEditor
LogPluginManager: Mounting plugin GeometryMode
LogPluginManager: Mounting plugin MacGraphicsSwitching
LogPluginManager: Mounting plugin MaterialAnalyzer
LogPluginManager: Mounting plugin MobileLauncherProfileWizard
LogPluginManager: Mounting plugin PluginBrowser
LogPluginManager: Mounting plugin SpeedTreeImporter
LogPluginManager: Mounting plugin DatasmithContent
LogPluginManager: Mounting plugin VariantManagerContent
LogPluginManager: Mounting plugin AlembicImporter
LogPluginManager: Mounting plugin AutomationUtils
LogPluginManager: Mounting plugin BackChannel
LogPluginManager: Mounting plugin ChaosCloth
LogPluginManager: Mounting plugin ChaosClothEditor
LogPluginManager: Mounting plugin ChaosEditor
LogPluginManager: Mounting plugin ChaosNiagara
LogPluginManager: Mounting plugin ChaosSolverPlugin
LogPluginManager: Mounting plugin CharacterAI
LogPluginManager: Mounting plugin GeometryCache
LogPluginManager: Mounting plugin GeometryCollectionPlugin
LogPluginManager: Mounting plugin GeometryProcessing
LogPluginManager: Mounting plugin PlanarCut
LogPluginManager: Mounting plugin PlatformCrypto
LogPluginManager: Mounting plugin ProxyLODPlugin
LogPluginManager: Mounting plugin SkeletalReduction
LogPluginManager: Mounting plugin Niagara
LogPluginManager: Mounting plugin MagicLeap
LogPluginManager: Mounting plugin MagicLeapLightEstimation
LogPluginManager: Mounting plugin MagicLeapMedia
LogPluginManager: Mounting plugin MagicLeapPassableWorld
LogPluginManager: Mounting plugin MLSDK
LogPluginManager: Mounting plugin AndroidMedia
LogPluginManager: Mounting plugin AvfMedia
LogPluginManager: Mounting plugin ImgMedia
LogPluginManager: Mounting plugin MediaCompositing
LogPluginManager: Mounting plugin MediaPlayerEditor
LogPluginManager: Mounting plugin WebMMedia
LogPluginManager: Mounting plugin WmfMedia
LogPluginManager: Mounting plugin MeshPainting
LogPluginManager: Mounting plugin TcpMessaging
LogPluginManager: Mounting plugin UdpMessaging
LogPluginManager: Mounting plugin ActorSequence
LogPluginManager: Mounting plugin LevelSequenceEditor
LogPluginManager: Mounting plugin MatineeToLevelSequence
LogPluginManager: Mounting plugin MovieRenderPipeline
LogPluginManager: Mounting plugin TemplateSequence
LogPluginManager: Mounting plugin NetcodeUnitTest
LogPluginManager: Mounting plugin NUTUnrealEngine4
LogPluginManager: Mounting plugin OnlineSubsystemGooglePlay
LogPluginManager: Mounting plugin OnlineSubsystemIOS
LogPluginManager: Mounting plugin OnlineSubsystem
LogPluginManager: Mounting plugin OnlineSubsystemNull
LogPluginManager: Mounting plugin OnlineSubsystemUtils
LogPluginManager: Mounting plugin LauncherChunkInstaller
LogPluginManager: Mounting plugin AndroidDeviceProfileSelector
LogPluginManager: Mounting plugin AndroidMoviePlayer
LogPluginManager: Mounting plugin AndroidPermission
LogPluginManager: Mounting plugin AppleImageUtils
LogPluginManager: Mounting plugin AppleMoviePlayer
LogPluginManager: Mounting plugin ArchVisCharacter
LogPluginManager: Mounting plugin AssetTags
LogPluginManager: Mounting plugin AudioCapture
LogPluginManager: Mounting plugin CableComponent
LogPluginManager: Mounting plugin CustomMeshComponent
LogPluginManager: Mounting plugin EditableMesh
LogPluginManager: Mounting plugin ExampleDeviceProfileSelector
LogPluginManager: Mounting plugin GoogleCloudMessaging
LogPluginManager: Mounting plugin GooglePAD
LogPluginManager: Mounting plugin IOSDeviceProfileSelector
LogPluginManager: Mounting plugin LinuxDeviceProfileSelector
LogPluginManager: Mounting plugin LocationServicesBPLibrary
LogPluginManager: Mounting plugin MobilePatchingUtils
LogPluginManager: Mounting plugin OculusVR
LogPluginManager: Mounting plugin PhysXVehicles
LogPluginManager: Mounting plugin PostSplashScreen
LogPluginManager: Mounting plugin ProceduralMeshComponent
LogPluginManager: Mounting plugin RuntimePhysXCooking
LogPluginManager: Mounting plugin SignificanceManager
LogPluginManager: Mounting plugin SoundFields
LogPluginManager: Mounting plugin SteamVR
LogPluginManager: Mounting plugin Synthesis
LogPluginManager: Mounting plugin WebMMoviePlayer
LogPluginManager: Mounting plugin WindowsMoviePlayer
LogPluginManager: Mounting plugin ScreenshotTools
LogInit: Using libcurl 7.55.1-DEV
LogInit:  - built for x86_64-pc-win32
LogInit:  - supports SSL with OpenSSL/1.1.1
LogInit:  - supports HTTP deflate (compression) using libz 1.2.8
LogInit:  - other features:
LogInit:      CURL_VERSION_SSL
LogInit:      CURL_VERSION_LIBZ
LogInit:      CURL_VERSION_IPV6
LogInit:      CURL_VERSION_ASYNCHDNS
LogInit:      CURL_VERSION_LARGEFILE
LogInit:      CURL_VERSION_IDN
LogInit:  CurlRequestOptions (configurable via config and command line):
LogInit:  - bVerifyPeer = true  - Libcurl will verify peer certificate
LogInit:  - bUseHttpProxy = false  - Libcurl will NOT use HTTP proxy
LogInit:  - bDontReuseConnections = false  - Libcurl will reuse connections
LogInit:  - MaxHostConnections = 16  - Libcurl will limit the number of connections to a host
LogInit:  - LocalHostAddr = Default
LogInit:  - BufferSize = 65536
LogOnline: OSS: Creating online subsystem instance for: NULL
LogInit: WinSock: version 1.1 (2.2), MaxSocks=32767, MaxUdp=65467
LogOnline: OSS: TryLoadSubsystemAndSetDefault: Loaded subsystem for module [NULL]
LogInit: Build: ++UE4+Release-4.25-CL-13942748
LogInit: Engine Version: 4.25.3-13942748+++UE4+Release-4.25
LogInit: Compatible Engine Version: 4.25.0-13144385+++UE4+Release-4.25
LogInit: Net CL: 13144385
LogInit: OS: Windows 10 (Release 1909) (), CPU: Intel(R) Core(TM) i5-9400F CPU @ 2.90GHz, GPU: NVIDIA GeForce GTX 1660
LogInit: Compiled (64-bit): Jul 25 2020 02:07:48
LogInit: Compiled with Visual C++: 19.24.28315.00
LogInit: Build Configuration: Development
LogInit: Branch Name: ++UE4+Release-4.25
LogInit: Command Line: 
LogInit: Base Directory: E:/Unreal/UE_4.25/Engine/Binaries/Win64/
LogInit: Allocator: TBB
LogInit: Installed Engine Build: 1
LogDevObjectVersion: Number of dev versions registered: 26
LogDevObjectVersion:   Dev-Blueprints (B0D832E4-1F89-4F0D-ACCF-7EB736FD4AA2): 10
LogDevObjectVersion:   Dev-Build (E1C64328-A22C-4D53-A36C-8E866417BD8C): 0
LogDevObjectVersion:   Dev-Core (375EC13C-06E4-48FB-B500-84F0262A717E): 4
LogDevObjectVersion:   Dev-Editor (E4B068ED-F494-42E9-A231-DA0B2E46BB41): 38
LogDevObjectVersion:   Dev-Framework (CFFC743F-43B0-4480-9391-14DF171D2073): 37
LogDevObjectVersion:   Dev-Mobile (B02B49B5-BB20-44E9-A304-32B752E40360): 2
LogDevObjectVersion:   Dev-Networking (A4E4105C-59A1-49B5-A7C5-40C4547EDFEE): 0
LogDevObjectVersion:   Dev-Online (39C831C9-5AE6-47DC-9A44-9C173E1C8E7C): 0
LogDevObjectVersion:   Dev-Physics (78F01B33-EBEA-4F98-B9B4-84EACCB95AA2): 4
LogDevObjectVersion:   Dev-Platform (6631380F-2D4D-43E0-8009-CF276956A95A): 0
LogDevObjectVersion:   Dev-Rendering (12F88B9F-8875-4AFC-A67C-D90C383ABD29): 43
LogDevObjectVersion:   Dev-Sequencer (7B5AE74C-D270-4C10-A958-57980B212A5A): 12
LogDevObjectVersion:   Dev-VR (D7296918-1DD6-4BDD-9DE2-64A83CC13884): 3
LogDevObjectVersion:   Dev-LoadTimes (C2A15278-BFE7-4AFE-6C17-90FF531DF755): 1
LogDevObjectVersion:   Private-Geometry (6EACA3D4-40EC-4CC1-B786-8BED09428FC5): 3
LogDevObjectVersion:   Dev-AnimPhys (29E575DD-E0A3-4627-9D10-D276232CDCEA): 17
LogDevObjectVersion:   Dev-Anim (AF43A65D-7FD3-4947-9873-3E8ED9C1BB05): 7
LogDevObjectVersion:   Dev-ReflectionCapture (6B266CEC-1EC7-4B8F-A30B-E4D90942FC07): 1
LogDevObjectVersion:   Dev-Automation (0DF73D61-A23F-47EA-B727-89E90C41499A): 1
LogDevObjectVersion:   FortniteMain (601D1886-AC64-4F84-AA16-D3DE0DEAC7D6): 31
LogDevObjectVersion:   Dev-Enterprise (9DFFBCD6-494F-0158-E221-12823C92A888): 10
LogDevObjectVersion:   Dev-Niagara (F2AED0AC-9AFE-416F-8664-AA7FFA26D6FC): 1
LogDevObjectVersion:   Dev-Destruction (174F1F0B-B4C6-45A5-B13F-2EE8D0FB917D): 10
LogDevObjectVersion:   Dev-Physics-Ext (35F94A83-E258-406C-A318-09F59610247C): 37
LogDevObjectVersion:   Dev-PhysicsMaterial-Chaos (B68FC16E-8B1B-42E2-B453-215C058844FE): 1
LogDevObjectVersion:   Dev-CineCamera (B2E18506-4273-CFC2-A54E-F4BB758BBA07): 1
LogInit: Presizing for max 25165824 objects, including 0 objects not considered by GC, pre-allocating 0 bytes for permanent pool.
LogConfig: Applying CVar settings from Section [/Script/Engine.StreamingSettings] File [E:/GAMPRG2/TowerDefenseC/TowerDefenseC/Saved/Config/Windows/Engine.ini]
LogConfig: Setting CVar [[s.MinBulkDataSizeForAsyncLoading:131072]]
LogConfig: Setting CVar [[s.AsyncLoadingThreadEnabled:0]]
LogConfig: Setting CVar [[s.EventDrivenLoaderEnabled:1]]
LogConfig: Setting CVar [[s.WarnIfTimeLimitExceeded:0]]
LogConfig: Setting CVar [[s.TimeLimitExceededMultiplier:1.5]]
LogConfig: Setting CVar [[s.TimeLimitExceededMinTime:0.005]]
LogConfig: Setting CVar [[s.UseBackgroundLevelStreaming:1]]
LogConfig: Setting CVar [[s.PriorityAsyncLoadingExtraTime:15.0]]
LogConfig: Setting CVar [[s.LevelStreamingActorsUpdateTimeLimit:5.0]]
LogConfig: Setting CVar [[s.PriorityLevelStreamingActorsUpdateExtraTime:5.0]]
LogConfig: Setting CVar [[s.LevelStreamingComponentsRegistrationGranularity:10]]
LogConfig: Setting CVar [[s.UnregisterComponentsTimeLimit:1.0]]
LogConfig: Setting CVar [[s.LevelStreamingComponentsUnregistrationGranularity:5]]
LogConfig: Setting CVar [[s.FlushStreamingOnExit:1]]
LogInit: Object subsystem initialized
LogConfig: Setting CVar [[con.DebugEarlyDefault:1]]
LogConfig: Setting CVar [[r.setres:1280x720]]
[2021.04.02-13.04.27:785][  0]LogConfig: Setting CVar [[r.VSync:0]]
[2021.04.02-13.04.27:785][  0]LogConfig: Setting CVar [[r.RHICmdBypass:0]]
[2021.04.02-13.04.27:785][  0]LogConfig: Applying CVar settings from Section [/Script/Engine.RendererSettings] File [E:/GAMPRG2/TowerDefenseC/TowerDefenseC/Saved/Config/Windows/Engine.ini]
[2021.04.02-13.04.27:785][  0]LogConfig: Setting CVar [[r.GPUCrashDebugging:0]]
[2021.04.02-13.04.27:785][  0]LogConfig: Applying CVar settings from Section [/Script/Engine.RendererOverrideSettings] File [E:/GAMPRG2/TowerDefenseC/TowerDefenseC/Saved/Config/Windows/Engine.ini]
[2021.04.02-13.04.27:785][  0]LogConfig: Applying CVar settings from Section [/Script/Engine.StreamingSettings] File [E:/GAMPRG2/TowerDefenseC/TowerDefenseC/Saved/Config/Windows/Engine.ini]
[2021.04.02-13.04.27:785][  0]LogConfig: Setting CVar [[s.MinBulkDataSizeForAsyncLoading:131072]]
[2021.04.02-13.04.27:785][  0]LogConfig: Setting CVar [[s.AsyncLoadingThreadEnabled:0]]
[2021.04.02-13.04.27:785][  0]LogConfig: Setting CVar [[s.EventDrivenLoaderEnabled:1]]
[2021.04.02-13.04.27:785][  0]LogConfig: Setting CVar [[s.WarnIfTimeLimitExceeded:0]]
[2021.04.02-13.04.27:786][  0]LogConfig: Setting CVar [[s.TimeLimitExceededMultiplier:1.5]]
[2021.04.02-13.04.27:786][  0]LogConfig: Setting CVar [[s.TimeLimitExceededMinTime:0.005]]
[2021.04.02-13.04.27:786][  0]LogConfig: Setting CVar [[s.UseBackgroundLevelStreaming:1]]
[2021.04.02-13.04.27:786][  0]LogConfig: Setting CVar [[s.PriorityAsyncLoadingExtraTime:15.0]]
[2021.04.02-13.04.27:786][  0]LogConfig: Setting CVar [[s.LevelStreamingActorsUpdateTimeLimit:5.0]]
[2021.04.02-13.04.27:786][  0]LogConfig: Setting CVar [[s.PriorityLevelStreamingActorsUpdateExtraTime:5.0]]
[2021.04.02-13.04.27:786][  0]LogConfig: Setting CVar [[s.LevelStreamingComponentsRegistrationGranularity:10]]
[2021.04.02-13.04.27:786][  0]LogConfig: Setting CVar [[s.UnregisterComponentsTimeLimit:1.0]]
[2021.04.02-13.04.27:786][  0]LogConfig: Setting CVar [[s.LevelStreamingComponentsUnregistrationGranularity:5]]
[2021.04.02-13.04.27:786][  0]LogConfig: Setting CVar [[s.FlushStreamingOnExit:1]]
[2021.04.02-13.04.27:786][  0]LogConfig: Applying CVar settings from Section [/Script/Engine.GarbageCollectionSettings] File [E:/GAMPRG2/TowerDefenseC/TowerDefenseC/Saved/Config/Windows/Engine.ini]
[2021.04.02-13.04.27:786][  0]LogConfig: Setting CVar [[gc.MaxObjectsNotConsideredByGC:1]]
[2021.04.02-13.04.27:786][  0]LogConfig: Setting CVar [[gc.SizeOfPermanentObjectPool:0]]
[2021.04.02-13.04.27:786][  0]LogConfig: Setting CVar [[gc.FlushStreamingOnGC:0]]
[2021.04.02-13.04.27:786][  0]LogConfig: Setting CVar [[gc.NumRetriesBeforeForcingGC:10]]
[2021.04.02-13.04.27:786][  0]LogConfig: Setting CVar [[gc.AllowParallelGC:1]]
[2021.04.02-13.04.27:786][  0]LogConfig: Setting CVar [[gc.TimeBetweenPurgingPendingKillObjects:61.1]]
[2021.04.02-13.04.27:786][  0]LogConfig: Setting CVar [[gc.MaxObjectsInEditor:25165824]]
[2021.04.02-13.04.27:786][  0]LogConfig: Setting CVar [[gc.IncrementalBeginDestroyEnabled:1]]
[2021.04.02-13.04.27:786][  0]LogConfig: Setting CVar [[gc.CreateGCClusters:1]]
[2021.04.02-13.04.27:786][  0]LogConfig: Setting CVar [[gc.MinGCClusterSize:5]]
[2021.04.02-13.04.27:786][  0]LogConfig: Setting CVar [[gc.ActorClusteringEnabled:0]]
[2021.04.02-13.04.27:786][  0]LogConfig: Setting CVar [[gc.BlueprintClusteringEnabled:0]]
[2021.04.02-13.04.27:786][  0]LogConfig: Setting CVar [[gc.UseDisregardForGCOnDedicatedServers:0]]
[2021.04.02-13.04.27:786][  0]LogConfig: Applying CVar settings from Section [/Script/Engine.NetworkSettings] File [E:/GAMPRG2/TowerDefenseC/TowerDefenseC/Saved/Config/Windows/Engine.ini]
[2021.04.02-13.04.27:786][  0]LogConfig: Applying CVar settings from Section [/Script/UnrealEd.CookerSettings] File [E:/GAMPRG2/TowerDefenseC/TowerDefenseC/Saved/Config/Windows/Engine.ini]
[2021.04.02-13.04.27:790][  0]LogConfig: Applying CVar settings from Section [ViewDistanceQuality@3] File [E:/GAMPRG2/TowerDefenseC/TowerDefenseC/Saved/Config/Windows/Scalability.ini]
[2021.04.02-13.04.27:790][  0]LogConfig: Setting CVar [[r.SkeletalMeshLODBias:0]]
[2021.04.02-13.04.27:790][  0]LogConfig: Setting CVar [[r.ViewDistanceScale:1.0]]
[2021.04.02-13.04.27:790][  0]LogConfig: Applying CVar settings from Section [AntiAliasingQuality@3] File [E:/GAMPRG2/TowerDefenseC/TowerDefenseC/Saved/Config/Windows/Scalability.ini]
[2021.04.02-13.04.27:790][  0]LogConfig: Setting CVar [[r.PostProcessAAQuality:4]]
[2021.04.02-13.04.27:790][  0]LogConfig: Applying CVar settings from Section [ShadowQuality@3] File [E:/GAMPRG2/TowerDefenseC/TowerDefenseC/Saved/Config/Windows/Scalability.ini]
[2021.04.02-13.04.27:790][  0]LogConfig: Setting CVar [[r.LightFunctionQuality:1]]
[2021.04.02-13.04.27:790][  0]LogConfig: Setting CVar [[r.ShadowQuality:5]]
[2021.04.02-13.04.27:790][  0]LogConfig: Setting CVar [[r.Shadow.CSM.MaxCascades:10]]
[2021.04.02-13.04.27:790][  0]LogConfig: Setting CVar [[r.Shadow.MaxResolution:2048]]
[2021.04.02-13.04.27:790][  0]LogConfig: Setting CVar [[r.Shadow.MaxCSMResolution:2048]]
[2021.04.02-13.04.27:790][  0]LogConfig: Setting CVar [[r.Shadow.RadiusThreshold:0.01]]
[2021.04.02-13.04.27:790][  0]LogConfig: Setting CVar [[r.Shadow.DistanceScale:1.0]]
[2021.04.02-13.04.27:790][  0]LogConfig: Setting CVar [[r.Shadow.CSM.TransitionScale:1.0]]
[2021.04.02-13.04.27:790][  0]LogConfig: Setting CVar [[r.Shadow.PreShadowResolutionFactor:1.0]]
[2021.04.02-13.04.27:790][  0]LogConfig: Setting CVar [[r.DistanceFieldShadowing:1]]
[2021.04.02-13.04.27:790][  0]LogConfig: Setting CVar [[r.DistanceFieldAO:1]]
[2021.04.02-13.04.27:790][  0]LogConfig: Setting CVar [[r.AOQuality:2]]
[2021.04.02-13.04.27:790][  0]LogConfig: Setting CVar [[r.VolumetricFog:1]]
[2021.04.02-13.04.27:790][  0]LogConfig: Setting CVar [[r.VolumetricFog.GridPixelSize:8]]
[2021.04.02-13.04.27:790][  0]LogConfig: Setting CVar [[r.VolumetricFog.GridSizeZ:128]]
[2021.04.02-13.04.27:790][  0]LogConfig: Setting CVar [[r.VolumetricFog.HistoryMissSupersampleCount:4]]
[2021.04.02-13.04.27:790][  0]LogConfig: Setting CVar [[r.LightMaxDrawDistanceScale:1]]
[2021.04.02-13.04.27:790][  0]LogConfig: Setting CVar [[r.CapsuleShadows:1]]
[2021.04.02-13.04.27:790][  0]LogConfig: Applying CVar settings from Section [PostProcessQuality@3] File [E:/GAMPRG2/TowerDefenseC/TowerDefenseC/Saved/Config/Windows/Scalability.ini]
[2021.04.02-13.04.27:790][  0]LogConfig: Setting CVar [[r.MotionBlurQuality:4]]
[2021.04.02-13.04.27:790][  0]LogConfig: Setting CVar [[r.AmbientOcclusionMipLevelFactor:0.4]]
[2021.04.02-13.04.27:790][  0]LogConfig: Setting CVar [[r.AmbientOcclusionMaxQuality:100]]
[2021.04.02-13.04.27:790][  0]LogConfig: Setting CVar [[r.AmbientOcclusionLevels:-1]]
[2021.04.02-13.04.27:790][  0]LogConfig: Setting CVar [[r.AmbientOcclusionRadiusScale:1.0]]
[2021.04.02-13.04.27:790][  0]LogConfig: Setting CVar [[r.DepthOfFieldQuality:2]]
[2021.04.02-13.04.27:790][  0]LogConfig: Setting CVar [[r.RenderTargetPoolMin:400]]
[2021.04.02-13.04.27:790][  0]LogConfig: Setting CVar [[r.LensFlareQuality:2]]
[2021.04.02-13.04.27:790][  0]LogConfig: Setting CVar [[r.SceneColorFringeQuality:1]]
[2021.04.02-13.04.27:790][  0]LogConfig: Setting CVar [[r.EyeAdaptationQuality:2]]
[2021.04.02-13.04.27:790][  0]LogConfig: Setting CVar [[r.BloomQuality:5]]
[2021.04.02-13.04.27:790][  0]LogConfig: Setting CVar [[r.FastBlurThreshold:100]]
[2021.04.02-13.04.27:790][  0]LogConfig: Setting CVar [[r.Upscale.Quality:3]]
[2021.04.02-13.04.27:790][  0]LogConfig: Setting CVar [[r.Tonemapper.GrainQuantization:1]]
[2021.04.02-13.04.27:790][  0]LogConfig: Setting CVar [[r.LightShaftQuality:1]]
[2021.04.02-13.04.27:790][  0]LogConfig: Setting CVar [[r.Filter.SizeScale:1]]
[2021.04.02-13.04.27:790][  0]LogConfig: Setting CVar [[r.Tonemapper.Quality:5]]
[2021.04.02-13.04.27:790][  0]LogConfig: Setting CVar [[r.DOF.Gather.AccumulatorQuality:1        ; higher gathering accumulator quality]]
[2021.04.02-13.04.27:790][  0]LogConfig: Setting CVar [[r.DOF.Gather.PostfilterMethod:1          ; Median3x3 postfilering method]]
[2021.04.02-13.04.27:790][  0]LogConfig: Setting CVar [[r.DOF.Gather.EnableBokehSettings:0       ; no bokeh simulation when gathering]]
[2021.04.02-13.04.27:790][  0]LogConfig: Setting CVar [[r.DOF.Gather.RingCount:4                 ; medium number of samples when gathering]]
[2021.04.02-13.04.27:790][  0]LogConfig: Setting CVar [[r.DOF.Scatter.ForegroundCompositing:1    ; additive foreground scattering]]
[2021.04.02-13.04.27:790][  0]LogConfig: Setting CVar [[r.DOF.Scatter.BackgroundCompositing:2    ; additive background scattering]]
[2021.04.02-13.04.27:790][  0]LogConfig: Setting CVar [[r.DOF.Scatter.EnableBokehSettings:1      ; bokeh simulation when scattering]]
[2021.04.02-13.04.27:790][  0]LogConfig: Setting CVar [[r.DOF.Scatter.MaxSpriteRatio:0.1         ; only a maximum of 10% of scattered bokeh]]
[2021.04.02-13.04.27:790][  0]LogConfig: Setting CVar [[r.DOF.Recombine.Quality:1                ; cheap slight out of focus]]
[2021.04.02-13.04.27:790][  0]LogConfig: Setting CVar [[r.DOF.Recombine.EnableBokehSettings:0    ; no bokeh simulation on slight out of focus]]
[2021.04.02-13.04.27:790][  0]LogConfig: Setting CVar [[r.DOF.TemporalAAQuality:1                ; more stable temporal accumulation]]
[2021.04.02-13.04.27:790][  0]LogConfig: Setting CVar [[r.DOF.Kernel.MaxForegroundRadius:0.025]]
[2021.04.02-13.04.27:790][  0]LogConfig: Setting CVar [[r.DOF.Kernel.MaxBackgroundRadius:0.025]]
[2021.04.02-13.04.27:790][  0]LogConfig: Applying CVar settings from Section [TextureQuality@3] File [E:/GAMPRG2/TowerDefenseC/TowerDefenseC/Saved/Config/Windows/Scalability.ini]
[2021.04.02-13.04.27:790][  0]LogConfig: Setting CVar [[r.Streaming.MipBias:0]]
[2021.04.02-13.04.27:790][  0]LogConfig: Setting CVar [[r.Streaming.AmortizeCPUToGPUCopy:0]]
[2021.04.02-13.04.27:790][  0]LogConfig: Setting CVar [[r.Streaming.MaxNumTexturesToStreamPerFrame:0]]
[2021.04.02-13.04.27:790][  0]LogConfig: Setting CVar [[r.Streaming.Boost:1]]
[2021.04.02-13.04.27:790][  0]LogConfig: Setting CVar [[r.MaxAnisotropy:8]]
[2021.04.02-13.04.27:790][  0]LogConfig: Setting CVar [[r.VT.MaxAnisotropy:8]]
[2021.04.02-13.04.27:790][  0]LogConfig: Setting CVar [[r.Streaming.LimitPoolSizeToVRAM:0]]
[2021.04.02-13.04.27:790][  0]LogConfig: Setting CVar [[r.Streaming.PoolSize:1000]]
[2021.04.02-13.04.27:790][  0]LogConfig: Setting CVar [[r.Streaming.MaxEffectiveScreenSize:0]]
[2021.04.02-13.04.27:790][  0]LogConfig: Applying CVar settings from Section [EffectsQuality@3] File [E:/GAMPRG2/TowerDefenseC/TowerDefenseC/Saved/Config/Windows/Scalability.ini]
[2021.04.02-13.04.27:790][  0]LogConfig: Setting CVar [[r.TranslucencyLightingVolumeDim:64]]
[2021.04.02-13.04.27:790][  0]LogConfig: Setting CVar [[r.RefractionQuality:2]]
[2021.04.02-13.04.27:790][  0]LogConfig: Setting CVar [[r.SSR.Quality:3]]
[2021.04.02-13.04.27:790][  0]LogConfig: Setting CVar [[r.SSR.HalfResSceneColor:0]]
[2021.04.02-13.04.27:790][  0]LogConfig: Setting CVar [[r.SceneColorFormat:4]]
[2021.04.02-13.04.27:790][  0]LogConfig: Setting CVar [[r.DetailMode:2]]
[2021.04.02-13.04.27:790][  0]LogConfig: Setting CVar [[r.TranslucencyVolumeBlur:1]]
[2021.04.02-13.04.27:790][  0]LogConfig: Setting CVar [[r.MaterialQualityLevel:1 ; High quality]]
[2021.04.02-13.04.27:790][  0]LogConfig: Setting CVar [[r.SSS.Scale:1]]
[2021.04.02-13.04.27:790][  0]LogConfig: Setting CVar [[r.SSS.SampleSet:2]]
[2021.04.02-13.04.27:790][  0]LogConfig: Setting CVar [[r.SSS.Quality:1]]
[2021.04.02-13.04.27:790][  0]LogConfig: Setting CVar [[r.SSS.HalfRes:0]]
[2021.04.02-13.04.27:790][  0]LogConfig: Setting CVar [[r.SSGI.Quality:3]]
[2021.04.02-13.04.27:790][  0]LogConfig: Setting CVar [[r.EmitterSpawnRateScale:1.0]]
[2021.04.02-13.04.27:790][  0]LogConfig: Setting CVar [[r.ParticleLightQuality:2]]
[2021.04.02-13.04.27:790][  0]LogConfig: Setting CVar [[r.SkyAtmosphere.AerialPerspectiveLUT.FastApplyOnOpaque:1 ; Always have FastSkyLUT 1 in this case to avoid wrong sky]]
[2021.04.02-13.04.27:790][  0]LogConfig: Setting CVar [[r.SkyAtmosphere.AerialPerspectiveLUT.SampleCountPerSlice:1]]
[2021.04.02-13.04.27:790][  0]LogConfig: Setting CVar [[r.SkyAtmosphere.AerialPerspectiveLUT.DepthResolution:16.0]]
[2021.04.02-13.04.27:790][  0]LogConfig: Setting CVar [[r.SkyAtmosphere.FastSkyLUT:1]]
[2021.04.02-13.04.27:790][  0]LogConfig: Setting CVar [[r.SkyAtmosphere.FastSkyLUT.SampleCountMin:4.0]]
[2021.04.02-13.04.27:790][  0]LogConfig: Setting CVar [[r.SkyAtmosphere.FastSkyLUT.SampleCountMax:32.0]]
[2021.04.02-13.04.27:790][  0]LogConfig: Setting CVar [[r.SkyAtmosphere.SampleCountMin:4.0]]
[2021.04.02-13.04.27:790][  0]LogConfig: Setting CVar [[r.SkyAtmosphere.SampleCountMax:32.0]]
[2021.04.02-13.04.27:790][  0]LogConfig: Setting CVar [[r.SkyAtmosphere.TransmittanceLUT.UseSmallFormat:0]]
[2021.04.02-13.04.27:790][  0]LogConfig: Setting CVar [[r.SkyAtmosphere.TransmittanceLUT.SampleCount:10.0]]
[2021.04.02-13.04.27:790][  0]LogConfig: Setting CVar [[r.SkyAtmosphere.MultiScatteringLUT.SampleCount:15.0]]
[2021.04.02-13.04.27:790][  0]LogConfig: Applying CVar settings from Section [FoliageQuality@3] File [E:/GAMPRG2/TowerDefenseC/TowerDefenseC/Saved/Config/Windows/Scalability.ini]
[2021.04.02-13.04.27:790][  0]LogConfig: Setting CVar [[foliage.DensityScale:1.0]]
[2021.04.02-13.04.27:790][  0]LogConfig: Setting CVar [[grass.DensityScale:1.0]]
[2021.04.02-13.04.27:790][  0]LogConfig: Applying CVar settings from Section [ShadingQuality@3] File [E:/GAMPRG2/TowerDefenseC/TowerDefenseC/Saved/Config/Windows/Scalability.ini]
[2021.04.02-13.04.27:790][  0]LogConfig: Setting CVar [[r.HairStrands.SkyLighting.SampleCount:16]]
[2021.04.02-13.04.27:790][  0]LogConfig: Setting CVar [[r.HairStrands.SkyLighting.JitterIntegration:0]]
[2021.04.02-13.04.27:790][  0]LogConfig: Setting CVar [[r.HairStrands.SkyAO.SampleCount:16]]
[2021.04.02-13.04.27:790][  0]LogConfig: Setting CVar [[r.HairStrands.DeepShadow.SuperSampling:0]]
[2021.04.02-13.04.27:790][  0]LogConfig: Setting CVar [[r.HairStrands.VisibilityPPLL:0]]
[2021.04.02-13.04.27:790][  0]LogConfig: Setting CVar [[r.HairStrands.RasterizationScale:0.5]]
[2021.04.02-13.04.27:790][  0]LogConfig: Setting CVar [[r.HairStrands.VelocityRasterizationScale:1]]
[2021.04.02-13.04.27:790][  0]LogInit: Selected Device Profile: [Windows]
[2021.04.02-13.04.27:790][  0]LogInit: Applying CVar settings loaded from the selected device profile: [Windows]
[2021.04.02-13.04.27:790][  0]LogHAL: Display: Platform has ~ 24 GB [25701867520 / 34359738368 / 24], which maps to Larger [LargestMinGB=32, LargerMinGB=12, DefaultMinGB=8, SmallerMinGB=6, SmallestMinGB=0)
[2021.04.02-13.04.27:790][  0]LogInit: Going up to parent DeviceProfile []
[2021.04.02-13.04.27:790][  0]LogConfig: Applying CVar settings from Section [ViewDistanceQuality@3] File [E:/GAMPRG2/TowerDefenseC/TowerDefenseC/Saved/Config/Windows/Scalability.ini]
[2021.04.02-13.04.27:790][  0]LogConfig: Setting CVar [[r.SkeletalMeshLODBias:0]]
[2021.04.02-13.04.27:790][  0]LogConfig: Setting CVar [[r.ViewDistanceScale:1.0]]
[2021.04.02-13.04.27:790][  0]LogConfig: Applying CVar settings from Section [AntiAliasingQuality@3] File [E:/GAMPRG2/TowerDefenseC/TowerDefenseC/Saved/Config/Windows/Scalability.ini]
[2021.04.02-13.04.27:790][  0]LogConfig: Setting CVar [[r.PostProcessAAQuality:4]]
[2021.04.02-13.04.27:790][  0]LogConfig: Applying CVar settings from Section [ShadowQuality@3] File [E:/GAMPRG2/TowerDefenseC/TowerDefenseC/Saved/Config/Windows/Scalability.ini]
[2021.04.02-13.04.27:791][  0]LogConfig: Setting CVar [[r.LightFunctionQuality:1]]
[2021.04.02-13.04.27:791][  0]LogConfig: Setting CVar [[r.ShadowQuality:5]]
[2021.04.02-13.04.27:791][  0]LogConfig: Setting CVar [[r.Shadow.CSM.MaxCascades:10]]
[2021.04.02-13.04.27:791][  0]LogConfig: Setting CVar [[r.Shadow.MaxResolution:2048]]
[2021.04.02-13.04.27:791][  0]LogConfig: Setting CVar [[r.Shadow.MaxCSMResolution:2048]]
[2021.04.02-13.04.27:791][  0]LogConfig: Setting CVar [[r.Shadow.RadiusThreshold:0.01]]
[2021.04.02-13.04.27:791][  0]LogConfig: Setting CVar [[r.Shadow.DistanceScale:1.0]]
[2021.04.02-13.04.27:791][  0]LogConfig: Setting CVar [[r.Shadow.CSM.TransitionScale:1.0]]
[2021.04.02-13.04.27:791][  0]LogConfig: Setting CVar [[r.Shadow.PreShadowResolutionFactor:1.0]]
[2021.04.02-13.04.27:791][  0]LogConfig: Setting CVar [[r.DistanceFieldShadowing:1]]
[2021.04.02-13.04.27:791][  0]LogConfig: Setting CVar [[r.DistanceFieldAO:1]]
[2021.04.02-13.04.27:791][  0]LogConfig: Setting CVar [[r.AOQuality:2]]
[2021.04.02-13.04.27:791][  0]LogConfig: Setting CVar [[r.VolumetricFog:1]]
[2021.04.02-13.04.27:791][  0]LogConfig: Setting CVar [[r.VolumetricFog.GridPixelSize:8]]
[2021.04.02-13.04.27:791][  0]LogConfig: Setting CVar [[r.VolumetricFog.GridSizeZ:128]]
[2021.04.02-13.04.27:791][  0]LogConfig: Setting CVar [[r.VolumetricFog.HistoryMissSupersampleCount:4]]
[2021.04.02-13.04.27:791][  0]LogConfig: Setting CVar [[r.LightMaxDrawDistanceScale:1]]
[2021.04.02-13.04.27:791][  0]LogConfig: Setting CVar [[r.CapsuleShadows:1]]
[2021.04.02-13.04.27:791][  0]LogConfig: Applying CVar settings from Section [PostProcessQuality@3] File [E:/GAMPRG2/TowerDefenseC/TowerDefenseC/Saved/Config/Windows/Scalability.ini]
[2021.04.02-13.04.27:791][  0]LogConfig: Setting CVar [[r.MotionBlurQuality:4]]
[2021.04.02-13.04.27:791][  0]LogConfig: Setting CVar [[r.AmbientOcclusionMipLevelFactor:0.4]]
[2021.04.02-13.04.27:791][  0]LogConfig: Setting CVar [[r.AmbientOcclusionMaxQuality:100]]
[2021.04.02-13.04.27:791][  0]LogConfig: Setting CVar [[r.AmbientOcclusionLevels:-1]]
[2021.04.02-13.04.27:791][  0]LogConfig: Setting CVar [[r.AmbientOcclusionRadiusScale:1.0]]
[2021.04.02-13.04.27:791][  0]LogConfig: Setting CVar [[r.DepthOfFieldQuality:2]]
[2021.04.02-13.04.27:791][  0]LogConfig: Setting CVar [[r.RenderTargetPoolMin:400]]
[2021.04.02-13.04.27:791][  0]LogConfig: Setting CVar [[r.LensFlareQuality:2]]
[2021.04.02-13.04.27:791][  0]LogConfig: Setting CVar [[r.SceneColorFringeQuality:1]]
[2021.04.02-13.04.27:791][  0]LogConfig: Setting CVar [[r.EyeAdaptationQuality:2]]
[2021.04.02-13.04.27:791][  0]LogConfig: Setting CVar [[r.BloomQuality:5]]
[2021.04.02-13.04.27:791][  0]LogConfig: Setting CVar [[r.FastBlurThreshold:100]]
[2021.04.02-13.04.27:791][  0]LogConfig: Setting CVar [[r.Upscale.Quality:3]]
[2021.04.02-13.04.27:791][  0]LogConfig: Setting CVar [[r.Tonemapper.GrainQuantization:1]]
[2021.04.02-13.04.27:791][  0]LogConfig: Setting CVar [[r.LightShaftQuality:1]]
[2021.04.02-13.04.27:791][  0]LogConfig: Setting CVar [[r.Filter.SizeScale:1]]
[2021.04.02-13.04.27:791][  0]LogConfig: Setting CVar [[r.Tonemapper.Quality:5]]
[2021.04.02-13.04.27:791][  0]LogConfig: Setting CVar [[r.DOF.Gather.AccumulatorQuality:1        ; higher gathering accumulator quality]]
[2021.04.02-13.04.27:791][  0]LogConfig: Setting CVar [[r.DOF.Gather.PostfilterMethod:1          ; Median3x3 postfilering method]]
[2021.04.02-13.04.27:791][  0]LogConfig: Setting CVar [[r.DOF.Gather.EnableBokehSettings:0       ; no bokeh simulation when gathering]]
[2021.04.02-13.04.27:791][  0]LogConfig: Setting CVar [[r.DOF.Gather.RingCount:4                 ; medium number of samples when gathering]]
[2021.04.02-13.04.27:791][  0]LogConfig: Setting CVar [[r.DOF.Scatter.ForegroundCompositing:1    ; additive foreground scattering]]
[2021.04.02-13.04.27:791][  0]LogConfig: Setting CVar [[r.DOF.Scatter.BackgroundCompositing:2    ; additive background scattering]]
[2021.04.02-13.04.27:791][  0]LogConfig: Setting CVar [[r.DOF.Scatter.EnableBokehSettings:1      ; bokeh simulation when scattering]]
[2021.04.02-13.04.27:791][  0]LogConfig: Setting CVar [[r.DOF.Scatter.MaxSpriteRatio:0.1         ; only a maximum of 10% of scattered bokeh]]
[2021.04.02-13.04.27:791][  0]LogConfig: Setting CVar [[r.DOF.Recombine.Quality:1                ; cheap slight out of focus]]
[2021.04.02-13.04.27:791][  0]LogConfig: Setting CVar [[r.DOF.Recombine.EnableBokehSettings:0    ; no bokeh simulation on slight out of focus]]
[2021.04.02-13.04.27:791][  0]LogConfig: Setting CVar [[r.DOF.TemporalAAQuality:1                ; more stable temporal accumulation]]
[2021.04.02-13.04.27:791][  0]LogConfig: Setting CVar [[r.DOF.Kernel.MaxForegroundRadius:0.025]]
[2021.04.02-13.04.27:791][  0]LogConfig: Setting CVar [[r.DOF.Kernel.MaxBackgroundRadius:0.025]]
[2021.04.02-13.04.27:791][  0]LogConfig: Applying CVar settings from Section [TextureQuality@3] File [E:/GAMPRG2/TowerDefenseC/TowerDefenseC/Saved/Config/Windows/Scalability.ini]
[2021.04.02-13.04.27:791][  0]LogConfig: Setting CVar [[r.Streaming.MipBias:0]]
[2021.04.02-13.04.27:791][  0]LogConfig: Setting CVar [[r.Streaming.AmortizeCPUToGPUCopy:0]]
[2021.04.02-13.04.27:791][  0]LogConfig: Setting CVar [[r.Streaming.MaxNumTexturesToStreamPerFrame:0]]
[2021.04.02-13.04.27:791][  0]LogConfig: Setting CVar [[r.Streaming.Boost:1]]
[2021.04.02-13.04.27:791][  0]LogConfig: Setting CVar [[r.MaxAnisotropy:8]]
[2021.04.02-13.04.27:791][  0]LogConfig: Setting CVar [[r.VT.MaxAnisotropy:8]]
[2021.04.02-13.04.27:791][  0]LogConfig: Setting CVar [[r.Streaming.LimitPoolSizeToVRAM:0]]
[2021.04.02-13.04.27:791][  0]LogConfig: Setting CVar [[r.Streaming.PoolSize:1000]]
[2021.04.02-13.04.27:791][  0]LogConfig: Setting CVar [[r.Streaming.MaxEffectiveScreenSize:0]]
[2021.04.02-13.04.27:791][  0]LogConfig: Applying CVar settings from Section [EffectsQuality@3] File [E:/GAMPRG2/TowerDefenseC/TowerDefenseC/Saved/Config/Windows/Scalability.ini]
[2021.04.02-13.04.27:791][  0]LogConfig: Setting CVar [[r.TranslucencyLightingVolumeDim:64]]
[2021.04.02-13.04.27:791][  0]LogConfig: Setting CVar [[r.RefractionQuality:2]]
[2021.04.02-13.04.27:791][  0]LogConfig: Setting CVar [[r.SSR.Quality:3]]
[2021.04.02-13.04.27:791][  0]LogConfig: Setting CVar [[r.SSR.HalfResSceneColor:0]]
[2021.04.02-13.04.27:791][  0]LogConfig: Setting CVar [[r.SceneColorFormat:4]]
[2021.04.02-13.04.27:791][  0]LogConfig: Setting CVar [[r.DetailMode:2]]
[2021.04.02-13.04.27:791][  0]LogConfig: Setting CVar [[r.TranslucencyVolumeBlur:1]]
[2021.04.02-13.04.27:791][  0]LogConfig: Setting CVar [[r.MaterialQualityLevel:1 ; High quality]]
[2021.04.02-13.04.27:791][  0]LogConfig: Setting CVar [[r.SSS.Scale:1]]
[2021.04.02-13.04.27:791][  0]LogConfig: Setting CVar [[r.SSS.SampleSet:2]]
[2021.04.02-13.04.27:791][  0]LogConfig: Setting CVar [[r.SSS.Quality:1]]
[2021.04.02-13.04.27:791][  0]LogConfig: Setting CVar [[r.SSS.HalfRes:0]]
[2021.04.02-13.04.27:791][  0]LogConfig: Setting CVar [[r.SSGI.Quality:3]]
[2021.04.02-13.04.27:791][  0]LogConfig: Setting CVar [[r.EmitterSpawnRateScale:1.0]]
[2021.04.02-13.04.27:791][  0]LogConfig: Setting CVar [[r.ParticleLightQuality:2]]
[2021.04.02-13.04.27:791][  0]LogConfig: Setting CVar [[r.SkyAtmosphere.AerialPerspectiveLUT.FastApplyOnOpaque:1 ; Always have FastSkyLUT 1 in this case to avoid wrong sky]]
[2021.04.02-13.04.27:791][  0]LogConfig: Setting CVar [[r.SkyAtmosphere.AerialPerspectiveLUT.SampleCountPerSlice:1]]
[2021.04.02-13.04.27:791][  0]LogConfig: Setting CVar [[r.SkyAtmosphere.AerialPerspectiveLUT.DepthResolution:16.0]]
[2021.04.02-13.04.27:791][  0]LogConfig: Setting CVar [[r.SkyAtmosphere.FastSkyLUT:1]]
[2021.04.02-13.04.27:791][  0]LogConfig: Setting CVar [[r.SkyAtmosphere.FastSkyLUT.SampleCountMin:4.0]]
[2021.04.02-13.04.27:791][  0]LogConfig: Setting CVar [[r.SkyAtmosphere.FastSkyLUT.SampleCountMax:32.0]]
[2021.04.02-13.04.27:791][  0]LogConfig: Setting CVar [[r.SkyAtmosphere.SampleCountMin:4.0]]
[2021.04.02-13.04.27:791][  0]LogConfig: Setting CVar [[r.SkyAtmosphere.SampleCountMax:32.0]]
[2021.04.02-13.04.27:792][  0]LogConfig: Setting CVar [[r.SkyAtmosphere.TransmittanceLUT.UseSmallFormat:0]]
[2021.04.02-13.04.27:792][  0]LogConfig: Setting CVar [[r.SkyAtmosphere.TransmittanceLUT.SampleCount:10.0]]
[2021.04.02-13.04.27:792][  0]LogConfig: Setting CVar [[r.SkyAtmosphere.MultiScatteringLUT.SampleCount:15.0]]
[2021.04.02-13.04.27:792][  0]LogConfig: Applying CVar settings from Section [FoliageQuality@3] File [E:/GAMPRG2/TowerDefenseC/TowerDefenseC/Saved/Config/Windows/Scalability.ini]
[2021.04.02-13.04.27:792][  0]LogConfig: Setting CVar [[foliage.DensityScale:1.0]]
[2021.04.02-13.04.27:792][  0]LogConfig: Setting CVar [[grass.DensityScale:1.0]]
[2021.04.02-13.04.27:792][  0]LogConfig: Applying CVar settings from Section [ShadingQuality@3] File [E:/GAMPRG2/TowerDefenseC/TowerDefenseC/Saved/Config/Windows/Scalability.ini]
[2021.04.02-13.04.27:792][  0]LogConfig: Setting CVar [[r.HairStrands.SkyLighting.SampleCount:16]]
[2021.04.02-13.04.27:792][  0]LogConfig: Setting CVar [[r.HairStrands.SkyLighting.JitterIntegration:0]]
[2021.04.02-13.04.27:792][  0]LogConfig: Setting CVar [[r.HairStrands.SkyAO.SampleCount:16]]
[2021.04.02-13.04.27:792][  0]LogConfig: Setting CVar [[r.HairStrands.DeepShadow.SuperSampling:0]]
[2021.04.02-13.04.27:792][  0]LogConfig: Setting CVar [[r.HairStrands.VisibilityPPLL:0]]
[2021.04.02-13.04.27:792][  0]LogConfig: Setting CVar [[r.HairStrands.RasterizationScale:0.5]]
[2021.04.02-13.04.27:792][  0]LogConfig: Setting CVar [[r.HairStrands.VelocityRasterizationScale:1]]
[2021.04.02-13.04.27:792][  0]LogConfig: Applying CVar settings from Section [Startup] File [../../../Engine/Config/ConsoleVariables.ini]
[2021.04.02-13.04.27:792][  0]LogConfig: Setting CVar [[net.UseAdaptiveNetUpdateFrequency:0]]
[2021.04.02-13.04.27:792][  0]LogConfig: Setting CVar [[p.chaos.AllowCreatePhysxBodies:1]]
[2021.04.02-13.04.27:792][  0]LogConfig: Setting CVar [[fx.SkipVectorVMBackendOptimizations:1]]
[2021.04.02-13.04.27:792][  0]LogConfig: Applying CVar settings from Section [ConsoleVariables] File [E:/GAMPRG2/TowerDefenseC/TowerDefenseC/Saved/Config/Windows/Engine.ini]
[2021.04.02-13.04.27:792][  0]LogInit: Computer: PS2019RJJZOVQQ
[2021.04.02-13.04.27:792][  0]LogInit: User: Admin
[2021.04.02-13.04.27:792][  0]LogInit: CPU Page size=4096, Cores=6
[2021.04.02-13.04.27:792][  0]LogInit: High frequency timer resolution =10.000000 MHz
[2021.04.02-13.04.27:792][  0]LogMemory: Memory total: Physical=23.9GB (24GB approx)
[2021.04.02-13.04.27:792][  0]LogMemory: Platform Memory Stats for Windows
[2021.04.02-13.04.27:792][  0]LogMemory: Process Physical Memory: 114.73 MB used, 114.73 MB peak
[2021.04.02-13.04.27:792][  0]LogMemory: Process Virtual Memory: 95.84 MB used, 95.84 MB peak
[2021.04.02-13.04.27:792][  0]LogMemory: Physical Memory: 12973.76 MB used,  11537.45 MB free, 24511.21 MB total
[2021.04.02-13.04.27:792][  0]LogMemory: Virtual Memory: 5137.28 MB used,  134212592.00 MB free, 134217728.00 MB total
[2021.04.02-13.04.27:797][  0]LogWindows: WindowsPlatformFeatures enabled
[2021.04.02-13.04.27:846][  0]LogInit: Physics initialised using underlying interface: PhysX
[2021.04.02-13.04.27:847][  0]LogInit: Using OS detected language (en-US).
[2021.04.02-13.04.27:847][  0]LogInit: Using OS detected locale (en-US).
[2021.04.02-13.04.27:848][  0]LogTextLocalizationManager: No specific localization for 'en-US' exists, so the 'en' localization will be used.
[2021.04.02-13.04.28:021][  0]LogInit: Setting process to per monitor DPI aware
[2021.04.02-13.04.28:072][  0]LogSlate: New Slate User Created.  User Index 0, Is Virtual User: 0
[2021.04.02-13.04.28:072][  0]LogSlate: Slate User Registered.  User Index 0, Is Virtual User: 0
[2021.04.02-13.04.28:171][  0]LogHMD: Failed to initialize OpenVR with code 110
[2021.04.02-13.04.28:171][  0]LogD3D11RHI: D3D11 min allowed feature level: 11_0
[2021.04.02-13.04.28:171][  0]LogD3D11RHI: D3D11 max allowed feature level: 11_0
[2021.04.02-13.04.28:171][  0]LogD3D11RHI: D3D11 adapters:
[2021.04.02-13.04.28:243][  0]LogD3D11RHI:    0. 'NVIDIA GeForce GTX 1660' (Feature Level 11_0)
[2021.04.02-13.04.28:243][  0]LogD3D11RHI:       5991/0/12255 MB DedicatedVideo/DedicatedSystem/SharedSystem, Outputs:2, VendorId:0x10de
[2021.04.02-13.04.28:246][  0]LogD3D11RHI:    1. 'Microsoft Basic Render Driver' (Feature Level 11_0)
[2021.04.02-13.04.28:246][  0]LogD3D11RHI:       0/0/12255 MB DedicatedVideo/DedicatedSystem/SharedSystem, Outputs:0, VendorId:0x1414
[2021.04.02-13.04.28:246][  0]LogD3D11RHI: Chosen D3D11 Adapter: 0
[2021.04.02-13.04.28:253][  0]LogD3D11RHI: Creating new Direct3DDevice
[2021.04.02-13.04.28:253][  0]LogD3D11RHI:     GPU DeviceId: 0x2184 (for the marketing name, search the web for "GPU Device Id")
[2021.04.02-13.04.28:253][  0]LogWindows: EnumDisplayDevices:
[2021.04.02-13.04.28:253][  0]LogWindows:    0. 'NVIDIA GeForce GTX 1660' (P:1 D:1)
[2021.04.02-13.04.28:253][  0]LogWindows:    1. 'NVIDIA GeForce GTX 1660' (P:0 D:1)
[2021.04.02-13.04.28:254][  0]LogWindows:    2. 'NVIDIA GeForce GTX 1660' (P:0 D:0)
[2021.04.02-13.04.28:254][  0]LogWindows:    3. 'NVIDIA GeForce GTX 1660' (P:0 D:0)
[2021.04.02-13.04.28:254][  0]LogWindows: DebugString: FoundDriverCount:4 
[2021.04.02-13.04.28:254][  0]LogD3D11RHI:     Adapter Name: NVIDIA GeForce GTX 1660
[2021.04.02-13.04.28:254][  0]LogD3D11RHI:   Driver Version: 461.40 (internal:27.21.14.6140, unified:461.40)
[2021.04.02-13.04.28:254][  0]LogD3D11RHI:      Driver Date: 1-22-2021
[2021.04.02-13.04.28:254][  0]LogRHI: Texture pool is 4193 MB (70% of 5991 MB)
[2021.04.02-13.04.28:313][  0]LogD3D11RHI: RHI has support for 64 bit atomics
[2021.04.02-13.04.28:316][  0]LogD3D11RHI: [Aftermath] Enabled and primed
[2021.04.02-13.04.28:316][  0]LogD3D11RHI: Async texture creation enabled
[2021.04.02-13.04.28:316][  0]LogD3D11RHI: Array index from any shader is supported
[2021.04.02-13.04.28:347][  0]LogD3D11RHI: GPU Timing Frequency: 1000.000000 (Debug: 2 1)
[2021.04.02-13.04.28:664][  0]LogTargetPlatformManager: Display: Loaded TargetPlatform 'AllDesktop'
[2021.04.02-13.04.28:682][  0]LogTargetPlatformManager: Display: Loaded TargetPlatform 'Android'
[2021.04.02-13.04.28:682][  0]LogTargetPlatformManager: Display: Loaded TargetPlatform 'Android_ASTC'
[2021.04.02-13.04.28:682][  0]LogTargetPlatformManager: Display: Loaded TargetPlatform 'Android_DXT'
[2021.04.02-13.04.28:682][  0]LogTargetPlatformManager: Display: Loaded TargetPlatform 'Android_ETC2'
[2021.04.02-13.04.28:682][  0]LogTargetPlatformManager: Display: Loaded TargetPlatform 'AndroidClient'
[2021.04.02-13.04.28:682][  0]LogTargetPlatformManager: Display: Loaded TargetPlatform 'Android_ASTCClient'
[2021.04.02-13.04.28:682][  0]LogTargetPlatformManager: Display: Loaded TargetPlatform 'Android_DXTClient'
[2021.04.02-13.04.28:682][  0]LogTargetPlatformManager: Display: Loaded TargetPlatform 'Android_ETC2Client'
[2021.04.02-13.04.28:682][  0]LogTargetPlatformManager: Display: Loaded TargetPlatform 'Android_Multi'
[2021.04.02-13.04.28:682][  0]LogTargetPlatformManager: Display: Loaded TargetPlatform 'Android_MultiClient'
[2021.04.02-13.04.28:702][  0]LogTargetPlatformManager: Display: Loaded TargetPlatform 'IOSClient'
[2021.04.02-13.04.28:702][  0]LogTargetPlatformManager: Display: Loaded TargetPlatform 'IOS'
[2021.04.02-13.04.28:710][  0]LogTargetPlatformManager: Display: Loaded TargetPlatform 'Linux'
[2021.04.02-13.04.28:719][  0]LogTargetPlatformManager: Display: Loaded TargetPlatform 'LinuxNoEditor'
[2021.04.02-13.04.28:727][  0]LogTargetPlatformManager: Display: Loaded TargetPlatform 'LinuxClient'
[2021.04.02-13.04.28:736][  0]LogTargetPlatformManager: Display: Loaded TargetPlatform 'LinuxServer'
[2021.04.02-13.04.28:743][  0]LogTargetPlatformManager: Display: Loaded TargetPlatform 'LinuxAArch64NoEditor'
[2021.04.02-13.04.28:752][  0]LogTargetPlatformManager: Display: Loaded TargetPlatform 'LinuxAArch64Client'
[2021.04.02-13.04.28:760][  0]LogTargetPlatformManager: Display: Loaded TargetPlatform 'LinuxAArch64Server'
[2021.04.02-13.04.28:783][  0]LogTargetPlatformManager: Display: Loaded TargetPlatform 'Lumin'
[2021.04.02-13.04.28:783][  0]LogTargetPlatformManager: Display: Loaded TargetPlatform 'LuminClient'
[2021.04.02-13.04.28:795][  0]LogTargetPlatformManager: Display: Loaded TargetPlatform 'TVOSClient'
[2021.04.02-13.04.28:795][  0]LogTargetPlatformManager: Display: Loaded TargetPlatform 'TVOS'
[2021.04.02-13.04.28:803][  0]LogTargetPlatformManager: Display: Loaded TargetPlatform 'WindowsNoEditor'
[2021.04.02-13.04.28:811][  0]LogTargetPlatformManager: Display: Loaded TargetPlatform 'Windows'
[2021.04.02-13.04.28:819][  0]LogTargetPlatformManager: Display: Loaded TargetPlatform 'WindowsClient'
[2021.04.02-13.04.28:826][  0]LogTargetPlatformManager: Display: Loaded TargetPlatform 'WindowsServer'
[2021.04.02-13.04.28:826][  0]LogTargetPlatformManager: Display: Building Assets For Windows
[2021.04.02-13.04.28:834][  0]LogAudioDebug: Display: Lib vorbis DLL was dynamically loaded.
[2021.04.02-13.04.28:883][  0]LogShaderCompilers: Guid format shader working directory is -5 characters bigger than the processId version (../../../../../GAMPRG2/TowerDefenseC/TowerDefenseC/Intermediate/Shaders/WorkingDirectory/10152/).
[2021.04.02-13.04.28:883][  0]LogShaderCompilers: Cleaned the shader compiler working directory 'C:/Users/Admin/AppData/Local/Temp/UnrealShaderWorkingDir/4CD7DA9F4D32D08CD6C51AB176633F3E/'.
[2021.04.02-13.04.28:884][  0]LogXGEController: Cannot use XGE Controller as Incredibuild is not installed on this machine.
[2021.04.02-13.04.28:884][  0]LogShaderCompilers: Cannot use XGE Shader Compiler as Incredibuild is not installed on this machine.
[2021.04.02-13.04.28:884][  0]LogShaderCompilers: Display: Using Local Shader Compiler.
[2021.04.02-13.04.29:588][  0]LogDerivedDataCache: Display: Max Cache Size: 512 MB
[2021.04.02-13.04.29:643][  0]LogDerivedDataCache: Loaded boot cache 0.05s 79MB C:/Users/Admin/AppData/Local/UnrealEngine/4.25/DerivedDataCache/Boot.ddc.
[2021.04.02-13.04.29:643][  0]LogDerivedDataCache: Display: Loaded Boot cache: C:/Users/Admin/AppData/Local/UnrealEngine/4.25/DerivedDataCache/Boot.ddc
[2021.04.02-13.04.29:644][  0]LogDerivedDataCache: FDerivedDataBackendGraph:  Pak pak cache file ../../../../../GAMPRG2/TowerDefenseC/TowerDefenseC/DerivedDataCache/DDC.ddp not found, will not use a pak cache.
[2021.04.02-13.04.29:644][  0]LogDerivedDataCache: Unable to find inner node Pak for hierarchical cache Hierarchy.
[2021.04.02-13.04.29:644][  0]LogDerivedDataCache: FDerivedDataBackendGraph:  CompressedPak pak cache file ../../../../../GAMPRG2/TowerDefenseC/TowerDefenseC/DerivedDataCache/Compressed.ddp not found, will not use a pak cache.
[2021.04.02-13.04.29:644][  0]LogDerivedDataCache: Unable to find inner node CompressedPak for hierarchical cache Hierarchy.
[2021.04.02-13.04.29:653][  0]LogDerivedDataCache: Display: Pak cache opened for reading ../../../Engine/DerivedDataCache/Compressed.ddp.
[2021.04.02-13.04.29:653][  0]LogDerivedDataCache: FDerivedDataBackendGraph:  EnterprisePak pak cache file ../../../Enterprise/DerivedDataCache/Compressed.ddp not found, will not use a pak cache.
[2021.04.02-13.04.29:653][  0]LogDerivedDataCache: Unable to find inner node EnterprisePak for hierarchical cache Hierarchy.
[2021.04.02-13.04.29:654][  0]LogDerivedDataCache: Using Local data cache path C:/Users/Admin/AppData/Local/UnrealEngine/Common/DerivedDataCache: Writable
[2021.04.02-13.04.29:654][  0]LogDerivedDataCache: Shared data cache path not found in *engine.ini, will not use an Shared cache.
[2021.04.02-13.04.29:654][  0]LogDerivedDataCache: Unable to find inner node Shared for hierarchical cache Hierarchy.
[2021.04.02-13.04.29:699][  0]LogSlate: Using FreeType 2.10.0
[2021.04.02-13.04.29:699][  0]LogSlate: SlateFontServices - WITH_FREETYPE: 1, WITH_HARFBUZZ: 1
[2021.04.02-13.04.29:722][  0]LogAssetRegistry: FAssetRegistry took 0.0029 seconds to start up
[2021.04.02-13.04.29:928][  0]LogInit: Selected Device Profile: [Windows]
[2021.04.02-13.04.30:029][  0]LogMeshReduction: Using QuadricMeshReduction for automatic static mesh reduction
[2021.04.02-13.04.30:029][  0]LogMeshReduction: Using SimplygonMeshReduction for automatic skeletal mesh reduction
[2021.04.02-13.04.30:029][  0]LogMeshReduction: Using ProxyLODMeshReduction for automatic mesh merging
[2021.04.02-13.04.30:029][  0]LogMeshReduction: No distributed automatic mesh merging module available
[2021.04.02-13.04.30:029][  0]LogMeshMerging: No distributed automatic mesh merging module available
[2021.04.02-13.04.30:042][  0]LogNetVersion: TowerDefenseC 1.0.0, NetCL: 13144385, EngineNetVer: 14, GameNetVer: 0 (Checksum: 2203959320)
[2021.04.02-13.04.30:429][  0]LogAISub: UAISubsystem::UAISubsystem AISubsystem (0000026428DC5B40), frame # 0
[2021.04.02-13.04.30:429][  0]LogAISub: UAISubsystem::UAISubsystem AIPerceptionSystem (0000026428CEF9C0), frame # 0
[2021.04.02-13.04.30:430][  0]LogAISub: UAISubsystem::UAISubsystem EnvQueryManager (0000026428D17200), frame # 0
[2021.04.02-13.04.30:476][  0]LogPackageLocalizationCache: Processed 19 localized package path(s) for 1 prioritized culture(s) in 0.040737 seconds
[2021.04.02-13.04.30:480][  0]LogUObjectArray: 15917 objects as part of root set at end of initial load.
[2021.04.02-13.04.30:480][  0]LogUObjectAllocator: 3965568 out of 0 bytes used by permanent object pool.
[2021.04.02-13.04.30:480][  0]LogUObjectArray: CloseDisregardForGC: 0/0 objects in disregard for GC pool
[2021.04.02-13.04.30:765][  0]LogTcpMessaging: Initializing TcpMessaging bridge
[2021.04.02-13.04.30:769][  0]LogUdpMessaging: Initializing bridge on interface 0.0.0.0:0 to multicast group 230.0.0.1:6666.
[2021.04.02-13.04.30:951][  0]SourceControl: Source control is disabled
[2021.04.02-13.04.30:951][  0]SourceControl: Source control is disabled
[2021.04.02-13.04.30:954][  0]SourceControl: Source control is disabled
[2021.04.02-13.04.30:957][  0]SourceControl: Source control is disabled
[2021.04.02-13.04.30:963][  0]SourceControl: Source control is disabled
[2021.04.02-13.04.31:180][  0]LogAndroidPermission: UAndroidPermissionCallbackProxy::GetInstance
[2021.04.02-13.04.31:196][  0]LogAudioCaptureCore: Display: No Audio Capture implementations found. Audio input will be silent.
[2021.04.02-13.04.31:196][  0]LogAudioCaptureCore: Display: No Audio Capture implementations found. Audio input will be silent.
[2021.04.02-13.04.31:241][  0]LogOcInput: OculusInput pre-init called
[2021.04.02-13.04.31:249][  0]LogWindows: Failed to load 'OVRPlugin.dll' (GetLastError=126)
[2021.04.02-13.04.31:249][  0]LogWindows: File 'OVRPlugin.dll' does not exist
[2021.04.02-13.04.31:302][  0]LogEngine: Initializing Engine...
[2021.04.02-13.04.31:303][  0]LogHMD: Failed to initialize OpenVR with code 110
[2021.04.02-13.04.31:303][  0]LogMagicLeap: Warning: VR disabled because ZI is not enabled.  To enable, in the editor, Edit -> Project Settings -> Plugins -> Magic Leap Plugin -> Enable Zero Iteration
[2021.04.02-13.04.31:303][  0]LogStats: UGameplayTagsManager::InitializeManager -  0.000 s
[2021.04.02-13.04.31:415][  0]LogInit: Initializing FReadOnlyCVARCache
[2021.04.02-13.04.31:422][  0]LogAIModule: Creating AISystem for world Untitled
[2021.04.02-13.04.31:422][  0]LogAISub: UAISubsystem::UAISubsystem EnvQueryManager (000002642E829C00), frame # 0
[2021.04.02-13.04.31:422][  0]LogAISub: UAISubsystem::UAISubsystem AIPerceptionSystem (000002642B425300), frame # 0
[2021.04.02-13.04.31:439][  0]LogAudioMixer: Display: Audio Mixer Platform Settings:
[2021.04.02-13.04.31:439][  0]LogAudioMixer: Display: 	Sample Rate:						  48000
[2021.04.02-13.04.31:439][  0]LogAudioMixer: Display: 	Callback Buffer Frame Size Requested: 1024
[2021.04.02-13.04.31:439][  0]LogAudioMixer: Display: 	Callback Buffer Frame Size To Use:	  1024
[2021.04.02-13.04.31:439][  0]LogAudioMixer: Display: 	Number of buffers to queue:			  2
[2021.04.02-13.04.31:439][  0]LogAudioMixer: Display: 	Max Channels (voices):				  32
[2021.04.02-13.04.31:439][  0]LogAudioMixer: Display: 	Number of Async Source Workers:		  0
[2021.04.02-13.04.31:439][  0]LogAudio: Display: AudioDevice MaxSources: 32
[2021.04.02-13.04.31:440][  0]LogAudio: Display: Using built-in audio occlusion.
[2021.04.02-13.04.31:440][  0]LogAudioMixer: Display: Initializing audio mixer.
[2021.04.02-13.04.31:449][  0]LogAudioMixer: Display: 0: FrontLeft
[2021.04.02-13.04.31:449][  0]LogAudioMixer: Display: 1: FrontRight
[2021.04.02-13.04.31:489][  0]LogAudioMixer: Display: Using Audio Device Speakers (Realtek High Definition Audio)
[2021.04.02-13.04.31:492][  0]LogAudioMixer: Display: Initializing Sound Submixes...
[2021.04.02-13.04.31:493][  0]LogAudioMixer: Display: Creating Master Submix 'MasterSubmixDefault'
[2021.04.02-13.04.31:493][  0]LogAudioMixer: Display: Creating Master Submix 'MasterReverbSubmixDefault'
[2021.04.02-13.04.31:494][  0]LogAudioMixer: Display: Creating Master Submix 'MasterEQSubmixDefault'
[2021.04.02-13.04.31:495][  0]LogInit: FAudioDevice initialized.
[2021.04.02-13.04.31:495][  0]LogNetVersion: Set ProjectVersion to 1.0.0.0. Version Checksum will be recalculated on next use.
[2021.04.02-13.04.31:604][  0]LogDerivedDataCache: Saved boot cache 0.11s 79MB C:/Users/Admin/AppData/Local/UnrealEngine/4.25/DerivedDataCache/Boot.ddc.
[2021.04.02-13.04.31:608][  0]LogInit: Texture streaming: Enabled
[2021.04.02-13.04.31:622][  0]LogEngineSessionManager: EngineSessionManager initialized
[2021.04.02-13.04.31:622][  0]LogEditorSessionSummary: Verbose: Initializing EditorSessionSummaryWriter for editor session tracking
[2021.04.02-13.04.31:624][  0]LogEditorSessionSummary: EditorSessionSummaryWriter initialized
[2021.04.02-13.04.31:683][  0]LogInit: Transaction tracking system initialized
[2021.04.02-13.04.31:701][  0]BlueprintLog: New page: Editor Load
[2021.04.02-13.04.31:758][  0]LocalizationService: Localization service is disabled
[2021.04.02-13.04.31:882][  0]LogCook: Display: Max memory allowance for cook 16384mb min free memory 0mb
[2021.04.02-13.04.31:882][  0]LogCook: Display: Mobile HDR setting 1
[2021.04.02-13.04.31:993][  0]LogFileCache: Scanning file cache for directory 'E:/GAMPRG2/TowerDefenseC/TowerDefenseC/Content/' took 0.01s
[2021.04.02-13.04.32:206][  0]SourceControl: Source control is disabled
[2021.04.02-13.04.32:206][  0]LogUnrealEdMisc: Loading editor; pre map load, took 5.477
[2021.04.02-13.04.32:206][  0]Cmd: MAP LOAD FILE="../../../../../GAMPRG2/TowerDefenseC/TowerDefenseC/Content/TDLevel.umap" TEMPLATE=0 SHOWPROGRESS=1 FEATURELEVEL=3
[2021.04.02-13.04.32:206][  0]LightingResults: New page: Lighting Build
[2021.04.02-13.04.32:207][  0]LogWorld: UWorld::CleanupWorld for Untitled, bSessionEnded=true, bCleanupResources=true
[2021.04.02-13.04.32:207][  0]LogSlate: InvalidateAllWidgets triggered.  All widgets were invalidated
[2021.04.02-13.04.32:207][  0]MapCheck: New page: Map Check
[2021.04.02-13.04.32:207][  0]LightingResults: New page: Lighting Build
[2021.04.02-13.04.32:216][  0]LogAISub: UAISubsystem::~UAISubsystem EnvQueryManager (000002642E829C00), frame # 0
[2021.04.02-13.04.32:217][  0]LogAISub: UAISubsystem::~UAISubsystem AIPerceptionSystem (000002642B425300), frame # 0
[2021.04.02-13.04.32:217][  0]LogUObjectHash: Compacting FUObjectHashTables data took   0.85ms
[2021.04.02-13.04.32:376][  0]LogAIModule: Creating AISystem for world TDLevel
[2021.04.02-13.04.32:377][  0]LogAISub: UAISubsystem::UAISubsystem EnvQueryManager (000002642E8BD400), frame # 0
[2021.04.02-13.04.32:377][  0]LogAISub: UAISubsystem::UAISubsystem AIPerceptionSystem (000002642E902980), frame # 0
[2021.04.02-13.04.32:380][  0]LogPhysics: Warning: Scale for /Game/TDLevel.TDLevel:PersistentLevel.MyBuild_Node_2.StaticMesh has a component set to zero, which will result in a bad body instance. Scale:X=12.500 Y=12.500 Z=0.000
[2021.04.02-13.04.32:380][  0]LogPhysics: Warning: PopulatePhysXGeometryAndTransform(Convex): ConvexElem has invalid transform
[2021.04.02-13.04.32:380][  0]LogPhysics: Warning: ForeachShape(Convex): ScaledElem[0] invalid
[2021.04.02-13.04.32:383][  0]LogPhysics: Warning: Scale for /Game/TDLevel.TDLevel:PersistentLevel.MyBuild_Node_2.StaticMesh has a component set to zero, which will result in a bad body instance. Scale:X=12.500 Y=12.500 Z=0.000
[2021.04.02-13.04.32:383][  0]LogPhysics: Warning: PopulatePhysXGeometryAndTransform(Convex): ConvexElem has invalid transform
[2021.04.02-13.04.32:383][  0]LogPhysics: Warning: ForeachShape(Convex): ScaledElem[0] invalid
[2021.04.02-13.04.32:383][  0]LogPhysics: Warning: Scale for /Game/TDLevel.TDLevel:PersistentLevel.MyBuild_Node_2.StaticMesh has a component set to zero, which will result in a bad body instance. Scale:X=12.500 Y=12.500 Z=0.000
[2021.04.02-13.04.32:383][  0]LogPhysics: Warning: PopulatePhysXGeometryAndTransform(Convex): ConvexElem has invalid transform
[2021.04.02-13.04.32:383][  0]LogPhysics: Warning: ForeachShape(Convex): ScaledElem[0] invalid
[2021.04.02-13.04.32:383][  0]LogPhysics: Warning: Scale for /Game/TDLevel.TDLevel:PersistentLevel.MyBuild_Node_2.StaticMesh has a component set to zero, which will result in a bad body instance. Scale:X=12.500 Y=12.500 Z=0.000
[2021.04.02-13.04.32:383][  0]LogPhysics: Warning: PopulatePhysXGeometryAndTransform(Convex): ConvexElem has invalid transform
[2021.04.02-13.04.32:383][  0]LogPhysics: Warning: ForeachShape(Convex): ScaledElem[0] invalid
[2021.04.02-13.04.32:384][  0]LogEditorServer: Finished looking for orphan Actors (0.000 secs)
[2021.04.02-13.04.32:400][  0]LogUObjectHash: Compacting FUObjectHashTables data took   0.76ms
[2021.04.02-13.04.32:400][  0]Cmd: MAP CHECKDEP NOCLEARLOG
[2021.04.02-13.04.32:400][  0]MapCheck: Map check complete: 0 Error(s), 0 Warning(s), took 0.093ms to complete.
[2021.04.02-13.04.32:400][  0]LogFileHelpers: Loading map 'TDLevel' took 0.195
[2021.04.02-13.04.32:402][  0]LogUnrealEdMisc: Total Editor Startup Time, took 5.674
[2021.04.02-13.04.32:609][  0]LogSlate: Updating window title bar state: overlay mode, drag disabled, window buttons hidden, title bar hidden
[2021.04.02-13.04.32:616][  0]LogSlate: Updating window title bar state: overlay mode, drag disabled, window buttons hidden, title bar hidden
[2021.04.02-13.04.32:624][  0]LogSlate: Updating window title bar state: overlay mode, drag disabled, window buttons hidden, title bar hidden
[2021.04.02-13.04.32:630][  0]LogSlate: Updating window title bar state: overlay mode, drag disabled, window buttons hidden, title bar hidden
[2021.04.02-13.04.32:636][  0]LogCollectionManager: Loaded 0 collections in 0.000633 seconds
[2021.04.02-13.04.32:650][  0]LogFileCache: Scanning file cache for directory 'E:/GAMPRG2/TowerDefenseC/TowerDefenseC/Saved/Collections/' took 0.00s
[2021.04.02-13.04.32:650][  0]LogFileCache: Scanning file cache for directory 'E:/GAMPRG2/TowerDefenseC/TowerDefenseC/Content/Developers/Admin/Collections/' took 0.00s
[2021.04.02-13.04.32:650][  0]LogFileCache: Scanning file cache for directory 'E:/GAMPRG2/TowerDefenseC/TowerDefenseC/Content/Collections/' took 0.00s
[2021.04.02-13.04.32:650][  0]LogContentBrowser: Native class hierarchy populated in 0.0086 seconds. Added 3445 classes and 823 folders.
[2021.04.02-13.04.32:652][  0]LogContentBrowser: Native class hierarchy updated for 'WidgetCarousel' in 0.0003 seconds. Added 0 classes and 0 folders.
[2021.04.02-13.04.32:688][  0]LogContentBrowser: Native class hierarchy updated for 'AddContentDialog' in 0.0005 seconds. Added 0 classes and 0 folders.
[2021.04.02-13.04.32:696][  0]LogContentBrowser: Native class hierarchy updated for 'SceneOutliner' in 0.0003 seconds. Added 2 classes and 0 folders.
[2021.04.02-13.04.32:821][  0]LogSlate: Took 0.000235 seconds to synchronously load lazily loaded font '../../../Engine/Content/Slate/Fonts/Roboto-Regular.ttf' (155K)
[2021.04.02-13.04.32:823][  0]LogSlate: Took 0.000166 seconds to synchronously load lazily loaded font '../../../Engine/Content/Slate/Fonts/Roboto-Bold.ttf' (160K)
[2021.04.02-13.04.32:829][  0]LogSlate: Took 0.000177 seconds to synchronously load lazily loaded font '../../../Engine/Content/Editor/Slate/Fonts/FontAwesome.ttf' (139K)
[2021.04.02-13.04.32:830][  0]LogSlate: Took 0.000112 seconds to synchronously load lazily loaded font '../../../Engine/Content/Slate/Fonts/DroidSansMono.ttf' (77K)
[2021.04.02-13.04.32:935][  0]LogRenderer: Reallocating scene render targets to support 1208x572 Format 10 NumSamples 1 (Frame:1).
[2021.04.02-13.04.33:016][  0]LogContentBrowser: Native class hierarchy updated for 'HierarchicalLODOutliner' in 0.0003 seconds. Added 0 classes and 0 folders.
[2021.04.02-13.04.33:016][  0]LogLoad: (Engine Initialization) Total time: 6.29 seconds
[2021.04.02-13.04.33:016][  0]LogLoad: (Engine Initialization) Total Blueprint compile time: 0.00 seconds
[2021.04.02-13.04.33:053][  0]LogAssetRegistry: Asset discovery search completed in 3.3328 seconds
[2021.04.02-13.04.33:058][  0]LogCollectionManager: Fixed up redirectors for 0 collections in 0.000002 seconds (updated 0 objects)
[2021.04.02-13.04.33:060][  0]LogContentStreaming: Texture pool size now 1000 MB
[2021.04.02-13.04.41:818][ 26]LogTemp: Repeating last play command: Selected Viewport
[2021.04.02-13.04.41:835][ 26]LogPlayLevel: PlayLevel: No blueprints needed recompiling
[2021.04.02-13.04.41:835][ 26]PIE: New page: PIE session: TDLevel (Apr 3, 2021, 5:04:41 AM)
[2021.04.02-13.04.41:836][ 26]LogOnline: OSS: Creating online subsystem instance for: NULL
[2021.04.02-13.04.41:837][ 26]LogOnline: OSS: TryLoadSubsystemAndSetDefault: Loaded subsystem for module [NULL]
[2021.04.02-13.04.41:837][ 26]LogPlayLevel: Creating play world package: /Game/UEDPIE_0_TDLevel
[2021.04.02-13.04.41:846][ 26]LogPlayLevel: PIE: StaticDuplicateObject took: (0.008117s)
[2021.04.02-13.04.41:847][ 26]LogAIModule: Creating AISystem for world TDLevel
[2021.04.02-13.04.41:847][ 26]LogAISub: UAISubsystem::UAISubsystem EnvQueryManager (00000264468B5800), frame # 1026
[2021.04.02-13.04.41:847][ 26]LogAISub: UAISubsystem::UAISubsystem AIPerceptionSystem (000002642E878900), frame # 1026
[2021.04.02-13.04.41:847][ 26]LogPlayLevel: PIE: World Init took: (0.001193s)
[2021.04.02-13.04.41:847][ 26]LogPlayLevel: PIE: Created PIE world by copying editor world from /Game/TDLevel.TDLevel to /Game/UEDPIE_0_TDLevel.TDLevel (0.009503s)
[2021.04.02-13.04.41:854][ 26]LogUObjectHash: Compacting FUObjectHashTables data took   0.54ms
[2021.04.02-13.04.41:855][ 26]LogAudioMixer: Display: Audio Mixer Platform Settings:
[2021.04.02-13.04.41:856][ 26]LogAudioMixer: Display: 	Sample Rate:						  48000
[2021.04.02-13.04.41:856][ 26]LogAudioMixer: Display: 	Callback Buffer Frame Size Requested: 1024
[2021.04.02-13.04.41:856][ 26]LogAudioMixer: Display: 	Callback Buffer Frame Size To Use:	  1024
[2021.04.02-13.04.41:856][ 26]LogAudioMixer: Display: 	Number of buffers to queue:			  2
[2021.04.02-13.04.41:856][ 26]LogAudioMixer: Display: 	Max Channels (voices):				  32
[2021.04.02-13.04.41:856][ 26]LogAudioMixer: Display: 	Number of Async Source Workers:		  0
[2021.04.02-13.04.41:856][ 26]LogAudio: Display: AudioDevice MaxSources: 32
[2021.04.02-13.04.41:856][ 26]LogAudio: Display: Using built-in audio occlusion.
[2021.04.02-13.04.41:856][ 26]LogAudioMixer: Display: Initializing audio mixer.
[2021.04.02-13.04.41:858][ 26]LogAudioMixer: Display: 0: FrontLeft
[2021.04.02-13.04.41:858][ 26]LogAudioMixer: Display: 1: FrontRight
[2021.04.02-13.04.41:886][ 26]LogAudioMixer: Display: Using Audio Device Speakers (Realtek High Definition Audio)
[2021.04.02-13.04.41:886][ 26]LogAudioMixer: Display: Initializing Sound Submixes...
[2021.04.02-13.04.41:886][ 26]LogAudioMixer: Display: Creating Master Submix 'MasterSubmixDefault'
[2021.04.02-13.04.41:886][ 26]LogAudioMixer: Display: Creating Master Submix 'MasterReverbSubmixDefault'
[2021.04.02-13.04.41:886][ 26]LogAudioMixer: Display: Creating Master Submix 'MasterEQSubmixDefault'
[2021.04.02-13.04.41:896][ 26]LogInit: FAudioDevice initialized.
[2021.04.02-13.04.41:907][ 26]LogLoad: Game class is 'MyTDGameMode_C'
[2021.04.02-13.04.41:909][ 26]LogPhysics: Warning: Scale for /Game/UEDPIE_0_TDLevel.TDLevel:PersistentLevel.MyBuild_Node_2.StaticMesh has a component set to zero, which will result in a bad body instance. Scale:X=12.500 Y=12.500 Z=0.000
[2021.04.02-13.04.41:909][ 26]LogPhysics: Warning: PopulatePhysXGeometryAndTransform(Convex): ConvexElem has invalid transform
[2021.04.02-13.04.41:909][ 26]LogPhysics: Warning: ForeachShape(Convex): ScaledElem[0] invalid
[2021.04.02-13.04.41:910][ 26]LogWorld: Bringing World /Game/UEDPIE_0_TDLevel.TDLevel up for play (max tick rate 0) at 2021.04.02-21.04.41
[2021.04.02-13.04.41:910][ 26]LogWorld: Bringing up level for play took: 0.001745
[2021.04.02-13.04.41:910][ 26]LogOnline: OSS: Creating online subsystem instance for: :Context_1
[2021.04.02-13.04.41:913][ 26]LogContentBrowser: Native class hierarchy updated for 'MovieSceneCapture' in 0.0004 seconds. Added 20 classes and 0 folders.
[2021.04.02-13.04.41:916][ 26]PIE: Server logged in
[2021.04.02-13.04.41:917][ 26]PIE: Play in editor total start time 0.083 seconds.
[2021.04.02-13.04.42:819][124]LogTemp: Warning: Recieved Wave Data
[2021.04.02-13.04.42:820][124]LogTemp: Warning: Moving
[2021.04.02-13.04.42:820][124]LogTemp: Warning: Waypoint Checked Moving
[2021.04.02-13.04.42:820][124]LogOutputDevice: Warning: 

Script Stack (0 frames):

[2021.04.02-13.04.43:352][124]LogStats: FPlatformStackWalk::StackWalkAndDump -  0.532 s
[2021.04.02-13.04.43:352][124]LogOutputDevice: Error: === Handled ensure: ===
[2021.04.02-13.04.43:352][124]LogOutputDevice: Error: 
[2021.04.02-13.04.43:352][124]LogOutputDevice: Error: Ensure condition failed: this->IsBound() [File:E:\Unreal\UE_4.25\Engine\Source\Runtime\Core\Public\Delegates/DelegateSignatureImpl.inl] [Line: 1132]
[2021.04.02-13.04.43:352][124]LogOutputDevice: Error: Unable to bind delegate to 'EnemySpawned' (function might not be marked as a UFUNCTION or object may be pending kill)
[2021.04.02-13.04.43:352][124]LogOutputDevice: Error: Stack: 
[2021.04.02-13.04.43:352][124]LogOutputDevice: Error: [Callstack] 0x00007ffa3a108618 UE4Editor-TowerDefenseC-5857.dll!DispatchCheckVerify<bool,<lambda_36829471fc2bfb2af9ad7b607b5f96fb> >() [E:\Unreal\UE_4.25\Engine\Source\Runtime\Core\Public\Misc\AssertionMacros.h:161]
[2021.04.02-13.04.43:352][124]LogOutputDevice: Error: [Callstack] 0x00007ffa3a0f9624 UE4Editor-TowerDefenseC-5857.dll!ATDGameMode::WaveStarted() [E:\GAMPRG2\TowerDefenseC\TowerDefenseC\Source\TowerDefenseC\TDGameMode.cpp:24]
[2021.04.02-13.04.43:352][124]LogOutputDevice: Error: [Callstack] 0x00007ffa5cf90c1b UE4Editor-Engine.dll!UnknownFunction []
[2021.04.02-13.04.43:352][124]LogOutputDevice: Error: [Callstack] 0x00007ffa5cfea989 UE4Editor-Engine.dll!UnknownFunction []
[2021.04.02-13.04.43:352][124]LogOutputDevice: Error: [Callstack] 0x00007ffa5c707dd4 UE4Editor-Engine.dll!UnknownFunction []
[2021.04.02-13.04.43:352][124]LogOutputDevice: Error: [Callstack] 0x00007ffa59e3af57 UE4Editor-UnrealEd.dll!UnknownFunction []
[2021.04.02-13.04.43:352][124]LogOutputDevice: Error: [Callstack] 0x00007ffa5a711d06 UE4Editor-UnrealEd.dll!UnknownFunction []
[2021.04.02-13.04.43:352][124]LogOutputDevice: Error: [Callstack] 0x00007ff7f1157800 UE4Editor.exe!UnknownFunction []
[2021.04.02-13.04.43:352][124]LogOutputDevice: Error: [Callstack] 0x00007ff7f116ba7c UE4Editor.exe!UnknownFunction []
[2021.04.02-13.04.43:352][124]LogOutputDevice: Error: [Callstack] 0x00007ff7f116bb5a UE4Editor.exe!UnknownFunction []
[2021.04.02-13.04.43:352][124]LogOutputDevice: Error: [Callstack] 0x00007ff7f117e31d UE4Editor.exe!UnknownFunction []
[2021.04.02-13.04.43:352][124]LogOutputDevice: Error: [Callstack] 0x00007ff7f118145a UE4Editor.exe!UnknownFunction []
[2021.04.02-13.04.43:352][124]LogOutputDevice: Error: [Callstack] 0x00007ffaca607c24 KERNEL32.DLL!UnknownFunction []
[2021.04.02-13.04.43:352][124]LogOutputDevice: Error: [Callstack] 0x00007ffacbaad721 ntdll.dll!UnknownFunction []
[2021.04.02-13.04.43:352][124]LogOutputDevice: Error: 
