﻿Log file open, 04/03/21 12:19:56
LogInit: Display: Running engine for game: TowerDefenseC
LogPlatformFile: Not using cached read wrapper
LogTaskGraph: Started task graph with 5 named threads and 20 total threads with 3 sets of task threads.
LogStats: Stats thread started at 0.271873
LogD3D11RHI: Loaded GFSDK_Aftermath_Lib.x64.dll
LogICUInternationalization: ICU TimeZone Detection - Raw Offset: +8:00, Platform Override: ''
LogPluginManager: Mounting plugin Paper2D
LogPluginManager: Mounting plugin AISupport
LogPluginManager: Mounting plugin LightPropagationVolume
LogPluginManager: Mounting plugin CameraShakePreviewer
LogPluginManager: Mounting plugin ActorLayerUtilities
LogPluginManager: Mounting plugin AnimationSharing
LogPluginManager: Mounting plugin CLionSourceCodeAccess
LogPluginManager: Mounting plugin CodeLiteSourceCodeAccess
LogPluginManager: Mounting plugin GitSourceControl
LogPluginManager: Mounting plugin KDevelopSourceCodeAccess
LogPluginManager: Mounting plugin NullSourceCodeAccess
LogPluginManager: Mounting plugin PerforceSourceControl
LogPluginManager: Mounting plugin PlasticSourceControl
LogPluginManager: Mounting plugin RiderSourceCodeAccess
LogPluginManager: Mounting plugin SubversionSourceControl
LogPluginManager: Mounting plugin UObjectPlugin
LogPluginManager: Mounting plugin VisualStudioCodeSourceCodeAccess
LogPluginManager: Mounting plugin VisualStudioSourceCodeAccess
LogPluginManager: Mounting plugin XCodeSourceCodeAccess
LogPluginManager: Mounting plugin AssetManagerEditor
LogPluginManager: Mounting plugin CryptoKeys
LogPluginManager: Mounting plugin CurveEditorTools
LogPluginManager: Mounting plugin DataValidation
LogPluginManager: Mounting plugin EditorScriptingUtilities
LogPluginManager: Mounting plugin FacialAnimation
LogPluginManager: Mounting plugin GameplayTagsEditor
LogPluginManager: Mounting plugin GeometryMode
LogPluginManager: Mounting plugin MacGraphicsSwitching
LogPluginManager: Mounting plugin MaterialAnalyzer
LogPluginManager: Mounting plugin MobileLauncherProfileWizard
LogPluginManager: Mounting plugin PluginBrowser
LogPluginManager: Mounting plugin SpeedTreeImporter
LogPluginManager: Mounting plugin DatasmithContent
LogPluginManager: Mounting plugin VariantManagerContent
LogPluginManager: Mounting plugin AlembicImporter
LogPluginManager: Mounting plugin AutomationUtils
LogPluginManager: Mounting plugin BackChannel
LogPluginManager: Mounting plugin ChaosCloth
LogPluginManager: Mounting plugin ChaosClothEditor
LogPluginManager: Mounting plugin ChaosEditor
LogPluginManager: Mounting plugin ChaosNiagara
LogPluginManager: Mounting plugin ChaosSolverPlugin
LogPluginManager: Mounting plugin CharacterAI
LogPluginManager: Mounting plugin GeometryCache
LogPluginManager: Mounting plugin GeometryCollectionPlugin
LogPluginManager: Mounting plugin GeometryProcessing
LogPluginManager: Mounting plugin PlanarCut
LogPluginManager: Mounting plugin PlatformCrypto
LogPluginManager: Mounting plugin ProxyLODPlugin
LogPluginManager: Mounting plugin SkeletalReduction
LogPluginManager: Mounting plugin Niagara
LogPluginManager: Mounting plugin MagicLeap
LogPluginManager: Mounting plugin MagicLeapLightEstimation
LogPluginManager: Mounting plugin MagicLeapMedia
LogPluginManager: Mounting plugin MagicLeapPassableWorld
LogPluginManager: Mounting plugin MLSDK
LogPluginManager: Mounting plugin AndroidMedia
LogPluginManager: Mounting plugin AvfMedia
LogPluginManager: Mounting plugin ImgMedia
LogPluginManager: Mounting plugin MediaCompositing
LogPluginManager: Mounting plugin MediaPlayerEditor
LogPluginManager: Mounting plugin WebMMedia
LogPluginManager: Mounting plugin WmfMedia
LogPluginManager: Mounting plugin MeshPainting
LogPluginManager: Mounting plugin TcpMessaging
LogPluginManager: Mounting plugin UdpMessaging
LogPluginManager: Mounting plugin ActorSequence
LogPluginManager: Mounting plugin LevelSequenceEditor
LogPluginManager: Mounting plugin MatineeToLevelSequence
LogPluginManager: Mounting plugin MovieRenderPipeline
LogPluginManager: Mounting plugin TemplateSequence
LogPluginManager: Mounting plugin NetcodeUnitTest
LogPluginManager: Mounting plugin NUTUnrealEngine4
LogPluginManager: Mounting plugin OnlineSubsystemGooglePlay
LogPluginManager: Mounting plugin OnlineSubsystemIOS
LogPluginManager: Mounting plugin OnlineSubsystem
LogPluginManager: Mounting plugin OnlineSubsystemNull
LogPluginManager: Mounting plugin OnlineSubsystemUtils
LogPluginManager: Mounting plugin LauncherChunkInstaller
LogPluginManager: Mounting plugin AndroidDeviceProfileSelector
LogPluginManager: Mounting plugin AndroidMoviePlayer
LogPluginManager: Mounting plugin AndroidPermission
LogPluginManager: Mounting plugin AppleImageUtils
LogPluginManager: Mounting plugin AppleMoviePlayer
LogPluginManager: Mounting plugin ArchVisCharacter
LogPluginManager: Mounting plugin AssetTags
LogPluginManager: Mounting plugin AudioCapture
LogPluginManager: Mounting plugin CableComponent
LogPluginManager: Mounting plugin CustomMeshComponent
LogPluginManager: Mounting plugin EditableMesh
LogPluginManager: Mounting plugin ExampleDeviceProfileSelector
LogPluginManager: Mounting plugin GoogleCloudMessaging
LogPluginManager: Mounting plugin GooglePAD
LogPluginManager: Mounting plugin IOSDeviceProfileSelector
LogPluginManager: Mounting plugin LinuxDeviceProfileSelector
LogPluginManager: Mounting plugin LocationServicesBPLibrary
LogPluginManager: Mounting plugin MobilePatchingUtils
LogPluginManager: Mounting plugin OculusVR
LogPluginManager: Mounting plugin PhysXVehicles
LogPluginManager: Mounting plugin PostSplashScreen
LogPluginManager: Mounting plugin ProceduralMeshComponent
LogPluginManager: Mounting plugin RuntimePhysXCooking
LogPluginManager: Mounting plugin SignificanceManager
LogPluginManager: Mounting plugin SoundFields
LogPluginManager: Mounting plugin SteamVR
LogPluginManager: Mounting plugin Synthesis
LogPluginManager: Mounting plugin WebMMoviePlayer
LogPluginManager: Mounting plugin WindowsMoviePlayer
LogPluginManager: Mounting plugin ScreenshotTools
LogInit: Using libcurl 7.55.1-DEV
LogInit:  - built for x86_64-pc-win32
LogInit:  - supports SSL with OpenSSL/1.1.1
LogInit:  - supports HTTP deflate (compression) using libz 1.2.8
LogInit:  - other features:
LogInit:      CURL_VERSION_SSL
LogInit:      CURL_VERSION_LIBZ
LogInit:      CURL_VERSION_IPV6
LogInit:      CURL_VERSION_ASYNCHDNS
LogInit:      CURL_VERSION_LARGEFILE
LogInit:      CURL_VERSION_IDN
LogInit:  CurlRequestOptions (configurable via config and command line):
LogInit:  - bVerifyPeer = true  - Libcurl will verify peer certificate
LogInit:  - bUseHttpProxy = false  - Libcurl will NOT use HTTP proxy
LogInit:  - bDontReuseConnections = false  - Libcurl will reuse connections
LogInit:  - MaxHostConnections = 16  - Libcurl will limit the number of connections to a host
LogInit:  - LocalHostAddr = Default
LogInit:  - BufferSize = 65536
LogOnline: OSS: Creating online subsystem instance for: NULL
LogInit: WinSock: version 1.1 (2.2), MaxSocks=32767, MaxUdp=65467
LogOnline: OSS: TryLoadSubsystemAndSetDefault: Loaded subsystem for module [NULL]
LogInit: Build: ++UE4+Release-4.25-CL-13942748
LogInit: Engine Version: 4.25.3-13942748+++UE4+Release-4.25
LogInit: Compatible Engine Version: 4.25.0-13144385+++UE4+Release-4.25
LogInit: Net CL: 13144385
LogInit: OS: Windows 10 (Release 1909) (), CPU: Intel(R) Core(TM) i5-9400F CPU @ 2.90GHz, GPU: NVIDIA GeForce GTX 1660
LogInit: Compiled (64-bit): Jul 25 2020 02:07:48
LogInit: Compiled with Visual C++: 19.24.28315.00
LogInit: Build Configuration: Development
LogInit: Branch Name: ++UE4+Release-4.25
LogInit: Command Line: 
LogInit: Base Directory: E:/Unreal/UE_4.25/Engine/Binaries/Win64/
LogInit: Allocator: TBB
LogInit: Installed Engine Build: 1
LogDevObjectVersion: Number of dev versions registered: 26
LogDevObjectVersion:   Dev-Blueprints (B0D832E4-1F89-4F0D-ACCF-7EB736FD4AA2): 10
LogDevObjectVersion:   Dev-Build (E1C64328-A22C-4D53-A36C-8E866417BD8C): 0
LogDevObjectVersion:   Dev-Core (375EC13C-06E4-48FB-B500-84F0262A717E): 4
LogDevObjectVersion:   Dev-Editor (E4B068ED-F494-42E9-A231-DA0B2E46BB41): 38
LogDevObjectVersion:   Dev-Framework (CFFC743F-43B0-4480-9391-14DF171D2073): 37
LogDevObjectVersion:   Dev-Mobile (B02B49B5-BB20-44E9-A304-32B752E40360): 2
LogDevObjectVersion:   Dev-Networking (A4E4105C-59A1-49B5-A7C5-40C4547EDFEE): 0
LogDevObjectVersion:   Dev-Online (39C831C9-5AE6-47DC-9A44-9C173E1C8E7C): 0
LogDevObjectVersion:   Dev-Physics (78F01B33-EBEA-4F98-B9B4-84EACCB95AA2): 4
LogDevObjectVersion:   Dev-Platform (6631380F-2D4D-43E0-8009-CF276956A95A): 0
LogDevObjectVersion:   Dev-Rendering (12F88B9F-8875-4AFC-A67C-D90C383ABD29): 43
LogDevObjectVersion:   Dev-Sequencer (7B5AE74C-D270-4C10-A958-57980B212A5A): 12
LogDevObjectVersion:   Dev-VR (D7296918-1DD6-4BDD-9DE2-64A83CC13884): 3
LogDevObjectVersion:   Dev-LoadTimes (C2A15278-BFE7-4AFE-6C17-90FF531DF755): 1
LogDevObjectVersion:   Private-Geometry (6EACA3D4-40EC-4CC1-B786-8BED09428FC5): 3
LogDevObjectVersion:   Dev-AnimPhys (29E575DD-E0A3-4627-9D10-D276232CDCEA): 17
LogDevObjectVersion:   Dev-Anim (AF43A65D-7FD3-4947-9873-3E8ED9C1BB05): 7
LogDevObjectVersion:   Dev-ReflectionCapture (6B266CEC-1EC7-4B8F-A30B-E4D90942FC07): 1
LogDevObjectVersion:   Dev-Automation (0DF73D61-A23F-47EA-B727-89E90C41499A): 1
LogDevObjectVersion:   FortniteMain (601D1886-AC64-4F84-AA16-D3DE0DEAC7D6): 31
LogDevObjectVersion:   Dev-Enterprise (9DFFBCD6-494F-0158-E221-12823C92A888): 10
LogDevObjectVersion:   Dev-Niagara (F2AED0AC-9AFE-416F-8664-AA7FFA26D6FC): 1
LogDevObjectVersion:   Dev-Destruction (174F1F0B-B4C6-45A5-B13F-2EE8D0FB917D): 10
LogDevObjectVersion:   Dev-Physics-Ext (35F94A83-E258-406C-A318-09F59610247C): 37
LogDevObjectVersion:   Dev-PhysicsMaterial-Chaos (B68FC16E-8B1B-42E2-B453-215C058844FE): 1
LogDevObjectVersion:   Dev-CineCamera (B2E18506-4273-CFC2-A54E-F4BB758BBA07): 1
LogInit: Presizing for max 25165824 objects, including 0 objects not considered by GC, pre-allocating 0 bytes for permanent pool.
LogConfig: Applying CVar settings from Section [/Script/Engine.StreamingSettings] File [E:/GAMPRG2/TowerDefenseC/TowerDefenseC/Saved/Config/Windows/Engine.ini]
LogConfig: Setting CVar [[s.MinBulkDataSizeForAsyncLoading:131072]]
LogConfig: Setting CVar [[s.AsyncLoadingThreadEnabled:0]]
LogConfig: Setting CVar [[s.EventDrivenLoaderEnabled:1]]
LogConfig: Setting CVar [[s.WarnIfTimeLimitExceeded:0]]
LogConfig: Setting CVar [[s.TimeLimitExceededMultiplier:1.5]]
LogConfig: Setting CVar [[s.TimeLimitExceededMinTime:0.005]]
LogConfig: Setting CVar [[s.UseBackgroundLevelStreaming:1]]
LogConfig: Setting CVar [[s.PriorityAsyncLoadingExtraTime:15.0]]
LogConfig: Setting CVar [[s.LevelStreamingActorsUpdateTimeLimit:5.0]]
LogConfig: Setting CVar [[s.PriorityLevelStreamingActorsUpdateExtraTime:5.0]]
LogConfig: Setting CVar [[s.LevelStreamingComponentsRegistrationGranularity:10]]
LogConfig: Setting CVar [[s.UnregisterComponentsTimeLimit:1.0]]
LogConfig: Setting CVar [[s.LevelStreamingComponentsUnregistrationGranularity:5]]
LogConfig: Setting CVar [[s.FlushStreamingOnExit:1]]
LogInit: Object subsystem initialized
LogConfig: Setting CVar [[con.DebugEarlyDefault:1]]
LogConfig: Setting CVar [[r.setres:1280x720]]
[2021.04.03-04.19.56:710][  0]LogConfig: Setting CVar [[r.VSync:0]]
[2021.04.03-04.19.56:710][  0]LogConfig: Setting CVar [[r.RHICmdBypass:0]]
[2021.04.03-04.19.56:710][  0]LogConfig: Applying CVar settings from Section [/Script/Engine.RendererSettings] File [E:/GAMPRG2/TowerDefenseC/TowerDefenseC/Saved/Config/Windows/Engine.ini]
[2021.04.03-04.19.56:710][  0]LogConfig: Setting CVar [[r.GPUCrashDebugging:0]]
[2021.04.03-04.19.56:710][  0]LogConfig: Applying CVar settings from Section [/Script/Engine.RendererOverrideSettings] File [E:/GAMPRG2/TowerDefenseC/TowerDefenseC/Saved/Config/Windows/Engine.ini]
[2021.04.03-04.19.56:710][  0]LogConfig: Applying CVar settings from Section [/Script/Engine.StreamingSettings] File [E:/GAMPRG2/TowerDefenseC/TowerDefenseC/Saved/Config/Windows/Engine.ini]
[2021.04.03-04.19.56:710][  0]LogConfig: Setting CVar [[s.MinBulkDataSizeForAsyncLoading:131072]]
[2021.04.03-04.19.56:710][  0]LogConfig: Setting CVar [[s.AsyncLoadingThreadEnabled:0]]
[2021.04.03-04.19.56:710][  0]LogConfig: Setting CVar [[s.EventDrivenLoaderEnabled:1]]
[2021.04.03-04.19.56:710][  0]LogConfig: Setting CVar [[s.WarnIfTimeLimitExceeded:0]]
[2021.04.03-04.19.56:710][  0]LogConfig: Setting CVar [[s.TimeLimitExceededMultiplier:1.5]]
[2021.04.03-04.19.56:710][  0]LogConfig: Setting CVar [[s.TimeLimitExceededMinTime:0.005]]
[2021.04.03-04.19.56:711][  0]LogConfig: Setting CVar [[s.UseBackgroundLevelStreaming:1]]
[2021.04.03-04.19.56:711][  0]LogConfig: Setting CVar [[s.PriorityAsyncLoadingExtraTime:15.0]]
[2021.04.03-04.19.56:711][  0]LogConfig: Setting CVar [[s.LevelStreamingActorsUpdateTimeLimit:5.0]]
[2021.04.03-04.19.56:711][  0]LogConfig: Setting CVar [[s.PriorityLevelStreamingActorsUpdateExtraTime:5.0]]
[2021.04.03-04.19.56:711][  0]LogConfig: Setting CVar [[s.LevelStreamingComponentsRegistrationGranularity:10]]
[2021.04.03-04.19.56:711][  0]LogConfig: Setting CVar [[s.UnregisterComponentsTimeLimit:1.0]]
[2021.04.03-04.19.56:711][  0]LogConfig: Setting CVar [[s.LevelStreamingComponentsUnregistrationGranularity:5]]
[2021.04.03-04.19.56:711][  0]LogConfig: Setting CVar [[s.FlushStreamingOnExit:1]]
[2021.04.03-04.19.56:711][  0]LogConfig: Applying CVar settings from Section [/Script/Engine.GarbageCollectionSettings] File [E:/GAMPRG2/TowerDefenseC/TowerDefenseC/Saved/Config/Windows/Engine.ini]
[2021.04.03-04.19.56:711][  0]LogConfig: Setting CVar [[gc.MaxObjectsNotConsideredByGC:1]]
[2021.04.03-04.19.56:711][  0]LogConfig: Setting CVar [[gc.SizeOfPermanentObjectPool:0]]
[2021.04.03-04.19.56:711][  0]LogConfig: Setting CVar [[gc.FlushStreamingOnGC:0]]
[2021.04.03-04.19.56:711][  0]LogConfig: Setting CVar [[gc.NumRetriesBeforeForcingGC:10]]
[2021.04.03-04.19.56:711][  0]LogConfig: Setting CVar [[gc.AllowParallelGC:1]]
[2021.04.03-04.19.56:711][  0]LogConfig: Setting CVar [[gc.TimeBetweenPurgingPendingKillObjects:61.1]]
[2021.04.03-04.19.56:711][  0]LogConfig: Setting CVar [[gc.MaxObjectsInEditor:25165824]]
[2021.04.03-04.19.56:711][  0]LogConfig: Setting CVar [[gc.IncrementalBeginDestroyEnabled:1]]
[2021.04.03-04.19.56:711][  0]LogConfig: Setting CVar [[gc.CreateGCClusters:1]]
[2021.04.03-04.19.56:711][  0]LogConfig: Setting CVar [[gc.MinGCClusterSize:5]]
[2021.04.03-04.19.56:711][  0]LogConfig: Setting CVar [[gc.ActorClusteringEnabled:0]]
[2021.04.03-04.19.56:711][  0]LogConfig: Setting CVar [[gc.BlueprintClusteringEnabled:0]]
[2021.04.03-04.19.56:711][  0]LogConfig: Setting CVar [[gc.UseDisregardForGCOnDedicatedServers:0]]
[2021.04.03-04.19.56:711][  0]LogConfig: Applying CVar settings from Section [/Script/Engine.NetworkSettings] File [E:/GAMPRG2/TowerDefenseC/TowerDefenseC/Saved/Config/Windows/Engine.ini]
[2021.04.03-04.19.56:711][  0]LogConfig: Applying CVar settings from Section [/Script/UnrealEd.CookerSettings] File [E:/GAMPRG2/TowerDefenseC/TowerDefenseC/Saved/Config/Windows/Engine.ini]
[2021.04.03-04.19.56:715][  0]LogConfig: Applying CVar settings from Section [ViewDistanceQuality@3] File [E:/GAMPRG2/TowerDefenseC/TowerDefenseC/Saved/Config/Windows/Scalability.ini]
[2021.04.03-04.19.56:715][  0]LogConfig: Setting CVar [[r.SkeletalMeshLODBias:0]]
[2021.04.03-04.19.56:715][  0]LogConfig: Setting CVar [[r.ViewDistanceScale:1.0]]
[2021.04.03-04.19.56:715][  0]LogConfig: Applying CVar settings from Section [AntiAliasingQuality@3] File [E:/GAMPRG2/TowerDefenseC/TowerDefenseC/Saved/Config/Windows/Scalability.ini]
[2021.04.03-04.19.56:715][  0]LogConfig: Setting CVar [[r.PostProcessAAQuality:4]]
[2021.04.03-04.19.56:715][  0]LogConfig: Applying CVar settings from Section [ShadowQuality@3] File [E:/GAMPRG2/TowerDefenseC/TowerDefenseC/Saved/Config/Windows/Scalability.ini]
[2021.04.03-04.19.56:715][  0]LogConfig: Setting CVar [[r.LightFunctionQuality:1]]
[2021.04.03-04.19.56:715][  0]LogConfig: Setting CVar [[r.ShadowQuality:5]]
[2021.04.03-04.19.56:715][  0]LogConfig: Setting CVar [[r.Shadow.CSM.MaxCascades:10]]
[2021.04.03-04.19.56:715][  0]LogConfig: Setting CVar [[r.Shadow.MaxResolution:2048]]
[2021.04.03-04.19.56:715][  0]LogConfig: Setting CVar [[r.Shadow.MaxCSMResolution:2048]]
[2021.04.03-04.19.56:715][  0]LogConfig: Setting CVar [[r.Shadow.RadiusThreshold:0.01]]
[2021.04.03-04.19.56:715][  0]LogConfig: Setting CVar [[r.Shadow.DistanceScale:1.0]]
[2021.04.03-04.19.56:715][  0]LogConfig: Setting CVar [[r.Shadow.CSM.TransitionScale:1.0]]
[2021.04.03-04.19.56:716][  0]LogConfig: Setting CVar [[r.Shadow.PreShadowResolutionFactor:1.0]]
[2021.04.03-04.19.56:716][  0]LogConfig: Setting CVar [[r.DistanceFieldShadowing:1]]
[2021.04.03-04.19.56:716][  0]LogConfig: Setting CVar [[r.DistanceFieldAO:1]]
[2021.04.03-04.19.56:716][  0]LogConfig: Setting CVar [[r.AOQuality:2]]
[2021.04.03-04.19.56:716][  0]LogConfig: Setting CVar [[r.VolumetricFog:1]]
[2021.04.03-04.19.56:716][  0]LogConfig: Setting CVar [[r.VolumetricFog.GridPixelSize:8]]
[2021.04.03-04.19.56:716][  0]LogConfig: Setting CVar [[r.VolumetricFog.GridSizeZ:128]]
[2021.04.03-04.19.56:716][  0]LogConfig: Setting CVar [[r.VolumetricFog.HistoryMissSupersampleCount:4]]
[2021.04.03-04.19.56:716][  0]LogConfig: Setting CVar [[r.LightMaxDrawDistanceScale:1]]
[2021.04.03-04.19.56:716][  0]LogConfig: Setting CVar [[r.CapsuleShadows:1]]
[2021.04.03-04.19.56:716][  0]LogConfig: Applying CVar settings from Section [PostProcessQuality@3] File [E:/GAMPRG2/TowerDefenseC/TowerDefenseC/Saved/Config/Windows/Scalability.ini]
[2021.04.03-04.19.56:716][  0]LogConfig: Setting CVar [[r.MotionBlurQuality:4]]
[2021.04.03-04.19.56:716][  0]LogConfig: Setting CVar [[r.AmbientOcclusionMipLevelFactor:0.4]]
[2021.04.03-04.19.56:716][  0]LogConfig: Setting CVar [[r.AmbientOcclusionMaxQuality:100]]
[2021.04.03-04.19.56:716][  0]LogConfig: Setting CVar [[r.AmbientOcclusionLevels:-1]]
[2021.04.03-04.19.56:716][  0]LogConfig: Setting CVar [[r.AmbientOcclusionRadiusScale:1.0]]
[2021.04.03-04.19.56:716][  0]LogConfig: Setting CVar [[r.DepthOfFieldQuality:2]]
[2021.04.03-04.19.56:716][  0]LogConfig: Setting CVar [[r.RenderTargetPoolMin:400]]
[2021.04.03-04.19.56:716][  0]LogConfig: Setting CVar [[r.LensFlareQuality:2]]
[2021.04.03-04.19.56:716][  0]LogConfig: Setting CVar [[r.SceneColorFringeQuality:1]]
[2021.04.03-04.19.56:716][  0]LogConfig: Setting CVar [[r.EyeAdaptationQuality:2]]
[2021.04.03-04.19.56:716][  0]LogConfig: Setting CVar [[r.BloomQuality:5]]
[2021.04.03-04.19.56:716][  0]LogConfig: Setting CVar [[r.FastBlurThreshold:100]]
[2021.04.03-04.19.56:716][  0]LogConfig: Setting CVar [[r.Upscale.Quality:3]]
[2021.04.03-04.19.56:716][  0]LogConfig: Setting CVar [[r.Tonemapper.GrainQuantization:1]]
[2021.04.03-04.19.56:716][  0]LogConfig: Setting CVar [[r.LightShaftQuality:1]]
[2021.04.03-04.19.56:716][  0]LogConfig: Setting CVar [[r.Filter.SizeScale:1]]
[2021.04.03-04.19.56:716][  0]LogConfig: Setting CVar [[r.Tonemapper.Quality:5]]
[2021.04.03-04.19.56:716][  0]LogConfig: Setting CVar [[r.DOF.Gather.AccumulatorQuality:1        ; higher gathering accumulator quality]]
[2021.04.03-04.19.56:716][  0]LogConfig: Setting CVar [[r.DOF.Gather.PostfilterMethod:1          ; Median3x3 postfilering method]]
[2021.04.03-04.19.56:716][  0]LogConfig: Setting CVar [[r.DOF.Gather.EnableBokehSettings:0       ; no bokeh simulation when gathering]]
[2021.04.03-04.19.56:716][  0]LogConfig: Setting CVar [[r.DOF.Gather.RingCount:4                 ; medium number of samples when gathering]]
[2021.04.03-04.19.56:716][  0]LogConfig: Setting CVar [[r.DOF.Scatter.ForegroundCompositing:1    ; additive foreground scattering]]
[2021.04.03-04.19.56:716][  0]LogConfig: Setting CVar [[r.DOF.Scatter.BackgroundCompositing:2    ; additive background scattering]]
[2021.04.03-04.19.56:716][  0]LogConfig: Setting CVar [[r.DOF.Scatter.EnableBokehSettings:1      ; bokeh simulation when scattering]]
[2021.04.03-04.19.56:716][  0]LogConfig: Setting CVar [[r.DOF.Scatter.MaxSpriteRatio:0.1         ; only a maximum of 10% of scattered bokeh]]
[2021.04.03-04.19.56:716][  0]LogConfig: Setting CVar [[r.DOF.Recombine.Quality:1                ; cheap slight out of focus]]
[2021.04.03-04.19.56:716][  0]LogConfig: Setting CVar [[r.DOF.Recombine.EnableBokehSettings:0    ; no bokeh simulation on slight out of focus]]
[2021.04.03-04.19.56:716][  0]LogConfig: Setting CVar [[r.DOF.TemporalAAQuality:1                ; more stable temporal accumulation]]
[2021.04.03-04.19.56:716][  0]LogConfig: Setting CVar [[r.DOF.Kernel.MaxForegroundRadius:0.025]]
[2021.04.03-04.19.56:716][  0]LogConfig: Setting CVar [[r.DOF.Kernel.MaxBackgroundRadius:0.025]]
[2021.04.03-04.19.56:716][  0]LogConfig: Applying CVar settings from Section [TextureQuality@3] File [E:/GAMPRG2/TowerDefenseC/TowerDefenseC/Saved/Config/Windows/Scalability.ini]
[2021.04.03-04.19.56:716][  0]LogConfig: Setting CVar [[r.Streaming.MipBias:0]]
[2021.04.03-04.19.56:716][  0]LogConfig: Setting CVar [[r.Streaming.AmortizeCPUToGPUCopy:0]]
[2021.04.03-04.19.56:716][  0]LogConfig: Setting CVar [[r.Streaming.MaxNumTexturesToStreamPerFrame:0]]
[2021.04.03-04.19.56:716][  0]LogConfig: Setting CVar [[r.Streaming.Boost:1]]
[2021.04.03-04.19.56:716][  0]LogConfig: Setting CVar [[r.MaxAnisotropy:8]]
[2021.04.03-04.19.56:716][  0]LogConfig: Setting CVar [[r.VT.MaxAnisotropy:8]]
[2021.04.03-04.19.56:716][  0]LogConfig: Setting CVar [[r.Streaming.LimitPoolSizeToVRAM:0]]
[2021.04.03-04.19.56:716][  0]LogConfig: Setting CVar [[r.Streaming.PoolSize:1000]]
[2021.04.03-04.19.56:716][  0]LogConfig: Setting CVar [[r.Streaming.MaxEffectiveScreenSize:0]]
[2021.04.03-04.19.56:716][  0]LogConfig: Applying CVar settings from Section [EffectsQuality@3] File [E:/GAMPRG2/TowerDefenseC/TowerDefenseC/Saved/Config/Windows/Scalability.ini]
[2021.04.03-04.19.56:716][  0]LogConfig: Setting CVar [[r.TranslucencyLightingVolumeDim:64]]
[2021.04.03-04.19.56:716][  0]LogConfig: Setting CVar [[r.RefractionQuality:2]]
[2021.04.03-04.19.56:716][  0]LogConfig: Setting CVar [[r.SSR.Quality:3]]
[2021.04.03-04.19.56:716][  0]LogConfig: Setting CVar [[r.SSR.HalfResSceneColor:0]]
[2021.04.03-04.19.56:716][  0]LogConfig: Setting CVar [[r.SceneColorFormat:4]]
[2021.04.03-04.19.56:716][  0]LogConfig: Setting CVar [[r.DetailMode:2]]
[2021.04.03-04.19.56:716][  0]LogConfig: Setting CVar [[r.TranslucencyVolumeBlur:1]]
[2021.04.03-04.19.56:716][  0]LogConfig: Setting CVar [[r.MaterialQualityLevel:1 ; High quality]]
[2021.04.03-04.19.56:716][  0]LogConfig: Setting CVar [[r.SSS.Scale:1]]
[2021.04.03-04.19.56:716][  0]LogConfig: Setting CVar [[r.SSS.SampleSet:2]]
[2021.04.03-04.19.56:716][  0]LogConfig: Setting CVar [[r.SSS.Quality:1]]
[2021.04.03-04.19.56:716][  0]LogConfig: Setting CVar [[r.SSS.HalfRes:0]]
[2021.04.03-04.19.56:716][  0]LogConfig: Setting CVar [[r.SSGI.Quality:3]]
[2021.04.03-04.19.56:716][  0]LogConfig: Setting CVar [[r.EmitterSpawnRateScale:1.0]]
[2021.04.03-04.19.56:716][  0]LogConfig: Setting CVar [[r.ParticleLightQuality:2]]
[2021.04.03-04.19.56:716][  0]LogConfig: Setting CVar [[r.SkyAtmosphere.AerialPerspectiveLUT.FastApplyOnOpaque:1 ; Always have FastSkyLUT 1 in this case to avoid wrong sky]]
[2021.04.03-04.19.56:716][  0]LogConfig: Setting CVar [[r.SkyAtmosphere.AerialPerspectiveLUT.SampleCountPerSlice:1]]
[2021.04.03-04.19.56:716][  0]LogConfig: Setting CVar [[r.SkyAtmosphere.AerialPerspectiveLUT.DepthResolution:16.0]]
[2021.04.03-04.19.56:716][  0]LogConfig: Setting CVar [[r.SkyAtmosphere.FastSkyLUT:1]]
[2021.04.03-04.19.56:716][  0]LogConfig: Setting CVar [[r.SkyAtmosphere.FastSkyLUT.SampleCountMin:4.0]]
[2021.04.03-04.19.56:716][  0]LogConfig: Setting CVar [[r.SkyAtmosphere.FastSkyLUT.SampleCountMax:32.0]]
[2021.04.03-04.19.56:716][  0]LogConfig: Setting CVar [[r.SkyAtmosphere.SampleCountMin:4.0]]
[2021.04.03-04.19.56:716][  0]LogConfig: Setting CVar [[r.SkyAtmosphere.SampleCountMax:32.0]]
[2021.04.03-04.19.56:716][  0]LogConfig: Setting CVar [[r.SkyAtmosphere.TransmittanceLUT.UseSmallFormat:0]]
[2021.04.03-04.19.56:716][  0]LogConfig: Setting CVar [[r.SkyAtmosphere.TransmittanceLUT.SampleCount:10.0]]
[2021.04.03-04.19.56:716][  0]LogConfig: Setting CVar [[r.SkyAtmosphere.MultiScatteringLUT.SampleCount:15.0]]
[2021.04.03-04.19.56:716][  0]LogConfig: Applying CVar settings from Section [FoliageQuality@3] File [E:/GAMPRG2/TowerDefenseC/TowerDefenseC/Saved/Config/Windows/Scalability.ini]
[2021.04.03-04.19.56:716][  0]LogConfig: Setting CVar [[foliage.DensityScale:1.0]]
[2021.04.03-04.19.56:716][  0]LogConfig: Setting CVar [[grass.DensityScale:1.0]]
[2021.04.03-04.19.56:716][  0]LogConfig: Applying CVar settings from Section [ShadingQuality@3] File [E:/GAMPRG2/TowerDefenseC/TowerDefenseC/Saved/Config/Windows/Scalability.ini]
[2021.04.03-04.19.56:716][  0]LogConfig: Setting CVar [[r.HairStrands.SkyLighting.SampleCount:16]]
[2021.04.03-04.19.56:717][  0]LogConfig: Setting CVar [[r.HairStrands.SkyLighting.JitterIntegration:0]]
[2021.04.03-04.19.56:717][  0]LogConfig: Setting CVar [[r.HairStrands.SkyAO.SampleCount:16]]
[2021.04.03-04.19.56:717][  0]LogConfig: Setting CVar [[r.HairStrands.DeepShadow.SuperSampling:0]]
[2021.04.03-04.19.56:717][  0]LogConfig: Setting CVar [[r.HairStrands.VisibilityPPLL:0]]
[2021.04.03-04.19.56:717][  0]LogConfig: Setting CVar [[r.HairStrands.RasterizationScale:0.5]]
[2021.04.03-04.19.56:717][  0]LogConfig: Setting CVar [[r.HairStrands.VelocityRasterizationScale:1]]
[2021.04.03-04.19.56:717][  0]LogInit: Selected Device Profile: [Windows]
[2021.04.03-04.19.56:717][  0]LogInit: Applying CVar settings loaded from the selected device profile: [Windows]
[2021.04.03-04.19.56:717][  0]LogHAL: Display: Platform has ~ 24 GB [25701867520 / 34359738368 / 24], which maps to Larger [LargestMinGB=32, LargerMinGB=12, DefaultMinGB=8, SmallerMinGB=6, SmallestMinGB=0)
[2021.04.03-04.19.56:717][  0]LogInit: Going up to parent DeviceProfile []
[2021.04.03-04.19.56:717][  0]LogConfig: Applying CVar settings from Section [ViewDistanceQuality@3] File [E:/GAMPRG2/TowerDefenseC/TowerDefenseC/Saved/Config/Windows/Scalability.ini]
[2021.04.03-04.19.56:717][  0]LogConfig: Setting CVar [[r.SkeletalMeshLODBias:0]]
[2021.04.03-04.19.56:717][  0]LogConfig: Setting CVar [[r.ViewDistanceScale:1.0]]
[2021.04.03-04.19.56:717][  0]LogConfig: Applying CVar settings from Section [AntiAliasingQuality@3] File [E:/GAMPRG2/TowerDefenseC/TowerDefenseC/Saved/Config/Windows/Scalability.ini]
[2021.04.03-04.19.56:717][  0]LogConfig: Setting CVar [[r.PostProcessAAQuality:4]]
[2021.04.03-04.19.56:717][  0]LogConfig: Applying CVar settings from Section [ShadowQuality@3] File [E:/GAMPRG2/TowerDefenseC/TowerDefenseC/Saved/Config/Windows/Scalability.ini]
[2021.04.03-04.19.56:717][  0]LogConfig: Setting CVar [[r.LightFunctionQuality:1]]
[2021.04.03-04.19.56:717][  0]LogConfig: Setting CVar [[r.ShadowQuality:5]]
[2021.04.03-04.19.56:717][  0]LogConfig: Setting CVar [[r.Shadow.CSM.MaxCascades:10]]
[2021.04.03-04.19.56:717][  0]LogConfig: Setting CVar [[r.Shadow.MaxResolution:2048]]
[2021.04.03-04.19.56:717][  0]LogConfig: Setting CVar [[r.Shadow.MaxCSMResolution:2048]]
[2021.04.03-04.19.56:717][  0]LogConfig: Setting CVar [[r.Shadow.RadiusThreshold:0.01]]
[2021.04.03-04.19.56:717][  0]LogConfig: Setting CVar [[r.Shadow.DistanceScale:1.0]]
[2021.04.03-04.19.56:717][  0]LogConfig: Setting CVar [[r.Shadow.CSM.TransitionScale:1.0]]
[2021.04.03-04.19.56:717][  0]LogConfig: Setting CVar [[r.Shadow.PreShadowResolutionFactor:1.0]]
[2021.04.03-04.19.56:717][  0]LogConfig: Setting CVar [[r.DistanceFieldShadowing:1]]
[2021.04.03-04.19.56:717][  0]LogConfig: Setting CVar [[r.DistanceFieldAO:1]]
[2021.04.03-04.19.56:717][  0]LogConfig: Setting CVar [[r.AOQuality:2]]
[2021.04.03-04.19.56:717][  0]LogConfig: Setting CVar [[r.VolumetricFog:1]]
[2021.04.03-04.19.56:717][  0]LogConfig: Setting CVar [[r.VolumetricFog.GridPixelSize:8]]
[2021.04.03-04.19.56:717][  0]LogConfig: Setting CVar [[r.VolumetricFog.GridSizeZ:128]]
[2021.04.03-04.19.56:717][  0]LogConfig: Setting CVar [[r.VolumetricFog.HistoryMissSupersampleCount:4]]
[2021.04.03-04.19.56:717][  0]LogConfig: Setting CVar [[r.LightMaxDrawDistanceScale:1]]
[2021.04.03-04.19.56:717][  0]LogConfig: Setting CVar [[r.CapsuleShadows:1]]
[2021.04.03-04.19.56:717][  0]LogConfig: Applying CVar settings from Section [PostProcessQuality@3] File [E:/GAMPRG2/TowerDefenseC/TowerDefenseC/Saved/Config/Windows/Scalability.ini]
[2021.04.03-04.19.56:717][  0]LogConfig: Setting CVar [[r.MotionBlurQuality:4]]
[2021.04.03-04.19.56:717][  0]LogConfig: Setting CVar [[r.AmbientOcclusionMipLevelFactor:0.4]]
[2021.04.03-04.19.56:717][  0]LogConfig: Setting CVar [[r.AmbientOcclusionMaxQuality:100]]
[2021.04.03-04.19.56:717][  0]LogConfig: Setting CVar [[r.AmbientOcclusionLevels:-1]]
[2021.04.03-04.19.56:717][  0]LogConfig: Setting CVar [[r.AmbientOcclusionRadiusScale:1.0]]
[2021.04.03-04.19.56:717][  0]LogConfig: Setting CVar [[r.DepthOfFieldQuality:2]]
[2021.04.03-04.19.56:717][  0]LogConfig: Setting CVar [[r.RenderTargetPoolMin:400]]
[2021.04.03-04.19.56:717][  0]LogConfig: Setting CVar [[r.LensFlareQuality:2]]
[2021.04.03-04.19.56:717][  0]LogConfig: Setting CVar [[r.SceneColorFringeQuality:1]]
[2021.04.03-04.19.56:717][  0]LogConfig: Setting CVar [[r.EyeAdaptationQuality:2]]
[2021.04.03-04.19.56:717][  0]LogConfig: Setting CVar [[r.BloomQuality:5]]
[2021.04.03-04.19.56:717][  0]LogConfig: Setting CVar [[r.FastBlurThreshold:100]]
[2021.04.03-04.19.56:717][  0]LogConfig: Setting CVar [[r.Upscale.Quality:3]]
[2021.04.03-04.19.56:717][  0]LogConfig: Setting CVar [[r.Tonemapper.GrainQuantization:1]]
[2021.04.03-04.19.56:717][  0]LogConfig: Setting CVar [[r.LightShaftQuality:1]]
[2021.04.03-04.19.56:717][  0]LogConfig: Setting CVar [[r.Filter.SizeScale:1]]
[2021.04.03-04.19.56:717][  0]LogConfig: Setting CVar [[r.Tonemapper.Quality:5]]
[2021.04.03-04.19.56:717][  0]LogConfig: Setting CVar [[r.DOF.Gather.AccumulatorQuality:1        ; higher gathering accumulator quality]]
[2021.04.03-04.19.56:717][  0]LogConfig: Setting CVar [[r.DOF.Gather.PostfilterMethod:1          ; Median3x3 postfilering method]]
[2021.04.03-04.19.56:717][  0]LogConfig: Setting CVar [[r.DOF.Gather.EnableBokehSettings:0       ; no bokeh simulation when gathering]]
[2021.04.03-04.19.56:717][  0]LogConfig: Setting CVar [[r.DOF.Gather.RingCount:4                 ; medium number of samples when gathering]]
[2021.04.03-04.19.56:717][  0]LogConfig: Setting CVar [[r.DOF.Scatter.ForegroundCompositing:1    ; additive foreground scattering]]
[2021.04.03-04.19.56:717][  0]LogConfig: Setting CVar [[r.DOF.Scatter.BackgroundCompositing:2    ; additive background scattering]]
[2021.04.03-04.19.56:717][  0]LogConfig: Setting CVar [[r.DOF.Scatter.EnableBokehSettings:1      ; bokeh simulation when scattering]]
[2021.04.03-04.19.56:717][  0]LogConfig: Setting CVar [[r.DOF.Scatter.MaxSpriteRatio:0.1         ; only a maximum of 10% of scattered bokeh]]
[2021.04.03-04.19.56:717][  0]LogConfig: Setting CVar [[r.DOF.Recombine.Quality:1                ; cheap slight out of focus]]
[2021.04.03-04.19.56:717][  0]LogConfig: Setting CVar [[r.DOF.Recombine.EnableBokehSettings:0    ; no bokeh simulation on slight out of focus]]
[2021.04.03-04.19.56:717][  0]LogConfig: Setting CVar [[r.DOF.TemporalAAQuality:1                ; more stable temporal accumulation]]
[2021.04.03-04.19.56:717][  0]LogConfig: Setting CVar [[r.DOF.Kernel.MaxForegroundRadius:0.025]]
[2021.04.03-04.19.56:717][  0]LogConfig: Setting CVar [[r.DOF.Kernel.MaxBackgroundRadius:0.025]]
[2021.04.03-04.19.56:717][  0]LogConfig: Applying CVar settings from Section [TextureQuality@3] File [E:/GAMPRG2/TowerDefenseC/TowerDefenseC/Saved/Config/Windows/Scalability.ini]
[2021.04.03-04.19.56:717][  0]LogConfig: Setting CVar [[r.Streaming.MipBias:0]]
[2021.04.03-04.19.56:717][  0]LogConfig: Setting CVar [[r.Streaming.AmortizeCPUToGPUCopy:0]]
[2021.04.03-04.19.56:717][  0]LogConfig: Setting CVar [[r.Streaming.MaxNumTexturesToStreamPerFrame:0]]
[2021.04.03-04.19.56:717][  0]LogConfig: Setting CVar [[r.Streaming.Boost:1]]
[2021.04.03-04.19.56:717][  0]LogConfig: Setting CVar [[r.MaxAnisotropy:8]]
[2021.04.03-04.19.56:717][  0]LogConfig: Setting CVar [[r.VT.MaxAnisotropy:8]]
[2021.04.03-04.19.56:717][  0]LogConfig: Setting CVar [[r.Streaming.LimitPoolSizeToVRAM:0]]
[2021.04.03-04.19.56:717][  0]LogConfig: Setting CVar [[r.Streaming.PoolSize:1000]]
[2021.04.03-04.19.56:718][  0]LogConfig: Setting CVar [[r.Streaming.MaxEffectiveScreenSize:0]]
[2021.04.03-04.19.56:718][  0]LogConfig: Applying CVar settings from Section [EffectsQuality@3] File [E:/GAMPRG2/TowerDefenseC/TowerDefenseC/Saved/Config/Windows/Scalability.ini]
[2021.04.03-04.19.56:718][  0]LogConfig: Setting CVar [[r.TranslucencyLightingVolumeDim:64]]
[2021.04.03-04.19.56:718][  0]LogConfig: Setting CVar [[r.RefractionQuality:2]]
[2021.04.03-04.19.56:718][  0]LogConfig: Setting CVar [[r.SSR.Quality:3]]
[2021.04.03-04.19.56:718][  0]LogConfig: Setting CVar [[r.SSR.HalfResSceneColor:0]]
[2021.04.03-04.19.56:718][  0]LogConfig: Setting CVar [[r.SceneColorFormat:4]]
[2021.04.03-04.19.56:718][  0]LogConfig: Setting CVar [[r.DetailMode:2]]
[2021.04.03-04.19.56:718][  0]LogConfig: Setting CVar [[r.TranslucencyVolumeBlur:1]]
[2021.04.03-04.19.56:718][  0]LogConfig: Setting CVar [[r.MaterialQualityLevel:1 ; High quality]]
[2021.04.03-04.19.56:718][  0]LogConfig: Setting CVar [[r.SSS.Scale:1]]
[2021.04.03-04.19.56:718][  0]LogConfig: Setting CVar [[r.SSS.SampleSet:2]]
[2021.04.03-04.19.56:718][  0]LogConfig: Setting CVar [[r.SSS.Quality:1]]
[2021.04.03-04.19.56:718][  0]LogConfig: Setting CVar [[r.SSS.HalfRes:0]]
[2021.04.03-04.19.56:718][  0]LogConfig: Setting CVar [[r.SSGI.Quality:3]]
[2021.04.03-04.19.56:718][  0]LogConfig: Setting CVar [[r.EmitterSpawnRateScale:1.0]]
[2021.04.03-04.19.56:718][  0]LogConfig: Setting CVar [[r.ParticleLightQuality:2]]
[2021.04.03-04.19.56:718][  0]LogConfig: Setting CVar [[r.SkyAtmosphere.AerialPerspectiveLUT.FastApplyOnOpaque:1 ; Always have FastSkyLUT 1 in this case to avoid wrong sky]]
[2021.04.03-04.19.56:718][  0]LogConfig: Setting CVar [[r.SkyAtmosphere.AerialPerspectiveLUT.SampleCountPerSlice:1]]
[2021.04.03-04.19.56:718][  0]LogConfig: Setting CVar [[r.SkyAtmosphere.AerialPerspectiveLUT.DepthResolution:16.0]]
[2021.04.03-04.19.56:718][  0]LogConfig: Setting CVar [[r.SkyAtmosphere.FastSkyLUT:1]]
[2021.04.03-04.19.56:718][  0]LogConfig: Setting CVar [[r.SkyAtmosphere.FastSkyLUT.SampleCountMin:4.0]]
[2021.04.03-04.19.56:718][  0]LogConfig: Setting CVar [[r.SkyAtmosphere.FastSkyLUT.SampleCountMax:32.0]]
[2021.04.03-04.19.56:718][  0]LogConfig: Setting CVar [[r.SkyAtmosphere.SampleCountMin:4.0]]
[2021.04.03-04.19.56:718][  0]LogConfig: Setting CVar [[r.SkyAtmosphere.SampleCountMax:32.0]]
[2021.04.03-04.19.56:718][  0]LogConfig: Setting CVar [[r.SkyAtmosphere.TransmittanceLUT.UseSmallFormat:0]]
[2021.04.03-04.19.56:718][  0]LogConfig: Setting CVar [[r.SkyAtmosphere.TransmittanceLUT.SampleCount:10.0]]
[2021.04.03-04.19.56:718][  0]LogConfig: Setting CVar [[r.SkyAtmosphere.MultiScatteringLUT.SampleCount:15.0]]
[2021.04.03-04.19.56:718][  0]LogConfig: Applying CVar settings from Section [FoliageQuality@3] File [E:/GAMPRG2/TowerDefenseC/TowerDefenseC/Saved/Config/Windows/Scalability.ini]
[2021.04.03-04.19.56:718][  0]LogConfig: Setting CVar [[foliage.DensityScale:1.0]]
[2021.04.03-04.19.56:718][  0]LogConfig: Setting CVar [[grass.DensityScale:1.0]]
[2021.04.03-04.19.56:718][  0]LogConfig: Applying CVar settings from Section [ShadingQuality@3] File [E:/GAMPRG2/TowerDefenseC/TowerDefenseC/Saved/Config/Windows/Scalability.ini]
[2021.04.03-04.19.56:718][  0]LogConfig: Setting CVar [[r.HairStrands.SkyLighting.SampleCount:16]]
[2021.04.03-04.19.56:718][  0]LogConfig: Setting CVar [[r.HairStrands.SkyLighting.JitterIntegration:0]]
[2021.04.03-04.19.56:718][  0]LogConfig: Setting CVar [[r.HairStrands.SkyAO.SampleCount:16]]
[2021.04.03-04.19.56:718][  0]LogConfig: Setting CVar [[r.HairStrands.DeepShadow.SuperSampling:0]]
[2021.04.03-04.19.56:718][  0]LogConfig: Setting CVar [[r.HairStrands.VisibilityPPLL:0]]
[2021.04.03-04.19.56:718][  0]LogConfig: Setting CVar [[r.HairStrands.RasterizationScale:0.5]]
[2021.04.03-04.19.56:718][  0]LogConfig: Setting CVar [[r.HairStrands.VelocityRasterizationScale:1]]
[2021.04.03-04.19.56:718][  0]LogConfig: Applying CVar settings from Section [Startup] File [../../../Engine/Config/ConsoleVariables.ini]
[2021.04.03-04.19.56:718][  0]LogConfig: Setting CVar [[net.UseAdaptiveNetUpdateFrequency:0]]
[2021.04.03-04.19.56:718][  0]LogConfig: Setting CVar [[p.chaos.AllowCreatePhysxBodies:1]]
[2021.04.03-04.19.56:718][  0]LogConfig: Setting CVar [[fx.SkipVectorVMBackendOptimizations:1]]
[2021.04.03-04.19.56:718][  0]LogConfig: Applying CVar settings from Section [ConsoleVariables] File [E:/GAMPRG2/TowerDefenseC/TowerDefenseC/Saved/Config/Windows/Engine.ini]
[2021.04.03-04.19.56:718][  0]LogInit: Computer: PS2019RJJZOVQQ
[2021.04.03-04.19.56:718][  0]LogInit: User: Admin
[2021.04.03-04.19.56:718][  0]LogInit: CPU Page size=4096, Cores=6
[2021.04.03-04.19.56:718][  0]LogInit: High frequency timer resolution =10.000000 MHz
[2021.04.03-04.19.56:719][  0]LogMemory: Memory total: Physical=23.9GB (24GB approx)
[2021.04.03-04.19.56:719][  0]LogMemory: Platform Memory Stats for Windows
[2021.04.03-04.19.56:719][  0]LogMemory: Process Physical Memory: 114.40 MB used, 114.41 MB peak
[2021.04.03-04.19.56:719][  0]LogMemory: Process Virtual Memory: 95.59 MB used, 95.59 MB peak
[2021.04.03-04.19.56:719][  0]LogMemory: Physical Memory: 6371.18 MB used,  18140.03 MB free, 24511.21 MB total
[2021.04.03-04.19.56:719][  0]LogMemory: Virtual Memory: 5137.28 MB used,  134212592.00 MB free, 134217728.00 MB total
[2021.04.03-04.19.56:724][  0]LogWindows: WindowsPlatformFeatures enabled
[2021.04.03-04.19.56:774][  0]LogInit: Physics initialised using underlying interface: PhysX
[2021.04.03-04.19.56:775][  0]LogInit: Using OS detected language (en-US).
[2021.04.03-04.19.56:775][  0]LogInit: Using OS detected locale (en-US).
[2021.04.03-04.19.56:777][  0]LogTextLocalizationManager: No specific localization for 'en-US' exists, so the 'en' localization will be used.
[2021.04.03-04.19.56:937][  0]LogInit: Setting process to per monitor DPI aware
[2021.04.03-04.19.56:966][  0]LogSlate: New Slate User Created.  User Index 0, Is Virtual User: 0
[2021.04.03-04.19.56:966][  0]LogSlate: Slate User Registered.  User Index 0, Is Virtual User: 0
[2021.04.03-04.19.57:070][  0]LogHMD: Failed to initialize OpenVR with code 110
[2021.04.03-04.19.57:070][  0]LogD3D11RHI: D3D11 min allowed feature level: 11_0
[2021.04.03-04.19.57:070][  0]LogD3D11RHI: D3D11 max allowed feature level: 11_0
[2021.04.03-04.19.57:070][  0]LogD3D11RHI: D3D11 adapters:
[2021.04.03-04.19.57:161][  0]LogD3D11RHI:    0. 'NVIDIA GeForce GTX 1660' (Feature Level 11_0)
[2021.04.03-04.19.57:161][  0]LogD3D11RHI:       5991/0/12255 MB DedicatedVideo/DedicatedSystem/SharedSystem, Outputs:2, VendorId:0x10de
[2021.04.03-04.19.57:164][  0]LogD3D11RHI:    1. 'Microsoft Basic Render Driver' (Feature Level 11_0)
[2021.04.03-04.19.57:164][  0]LogD3D11RHI:       0/0/12255 MB DedicatedVideo/DedicatedSystem/SharedSystem, Outputs:0, VendorId:0x1414
[2021.04.03-04.19.57:164][  0]LogD3D11RHI: Chosen D3D11 Adapter: 0
[2021.04.03-04.19.57:170][  0]LogD3D11RHI: Creating new Direct3DDevice
[2021.04.03-04.19.57:170][  0]LogD3D11RHI:     GPU DeviceId: 0x2184 (for the marketing name, search the web for "GPU Device Id")
[2021.04.03-04.19.57:170][  0]LogWindows: EnumDisplayDevices:
[2021.04.03-04.19.57:170][  0]LogWindows:    0. 'NVIDIA GeForce GTX 1660' (P:1 D:1)
[2021.04.03-04.19.57:170][  0]LogWindows:    1. 'NVIDIA GeForce GTX 1660' (P:0 D:1)
[2021.04.03-04.19.57:171][  0]LogWindows:    2. 'NVIDIA GeForce GTX 1660' (P:0 D:0)
[2021.04.03-04.19.57:171][  0]LogWindows:    3. 'NVIDIA GeForce GTX 1660' (P:0 D:0)
[2021.04.03-04.19.57:171][  0]LogWindows: DebugString: FoundDriverCount:4 
[2021.04.03-04.19.57:171][  0]LogD3D11RHI:     Adapter Name: NVIDIA GeForce GTX 1660
[2021.04.03-04.19.57:171][  0]LogD3D11RHI:   Driver Version: 461.40 (internal:27.21.14.6140, unified:461.40)
[2021.04.03-04.19.57:171][  0]LogD3D11RHI:      Driver Date: 1-22-2021
[2021.04.03-04.19.57:171][  0]LogRHI: Texture pool is 4193 MB (70% of 5991 MB)
[2021.04.03-04.19.57:230][  0]LogD3D11RHI: RHI has support for 64 bit atomics
[2021.04.03-04.19.57:231][  0]LogD3D11RHI: [Aftermath] Enabled and primed
[2021.04.03-04.19.57:231][  0]LogD3D11RHI: Async texture creation enabled
[2021.04.03-04.19.57:231][  0]LogD3D11RHI: Array index from any shader is supported
[2021.04.03-04.19.57:274][  0]LogD3D11RHI: GPU Timing Frequency: 1000.000000 (Debug: 2 2)
[2021.04.03-04.19.57:578][  0]LogTargetPlatformManager: Display: Loaded TargetPlatform 'AllDesktop'
[2021.04.03-04.19.57:598][  0]LogTargetPlatformManager: Display: Loaded TargetPlatform 'Android'
[2021.04.03-04.19.57:598][  0]LogTargetPlatformManager: Display: Loaded TargetPlatform 'Android_ASTC'
[2021.04.03-04.19.57:598][  0]LogTargetPlatformManager: Display: Loaded TargetPlatform 'Android_DXT'
[2021.04.03-04.19.57:598][  0]LogTargetPlatformManager: Display: Loaded TargetPlatform 'Android_ETC2'
[2021.04.03-04.19.57:598][  0]LogTargetPlatformManager: Display: Loaded TargetPlatform 'AndroidClient'
[2021.04.03-04.19.57:598][  0]LogTargetPlatformManager: Display: Loaded TargetPlatform 'Android_ASTCClient'
[2021.04.03-04.19.57:598][  0]LogTargetPlatformManager: Display: Loaded TargetPlatform 'Android_DXTClient'
[2021.04.03-04.19.57:598][  0]LogTargetPlatformManager: Display: Loaded TargetPlatform 'Android_ETC2Client'
[2021.04.03-04.19.57:598][  0]LogTargetPlatformManager: Display: Loaded TargetPlatform 'Android_Multi'
[2021.04.03-04.19.57:598][  0]LogTargetPlatformManager: Display: Loaded TargetPlatform 'Android_MultiClient'
[2021.04.03-04.19.57:627][  0]LogTargetPlatformManager: Display: Loaded TargetPlatform 'IOSClient'
[2021.04.03-04.19.57:627][  0]LogTargetPlatformManager: Display: Loaded TargetPlatform 'IOS'
[2021.04.03-04.19.57:636][  0]LogTargetPlatformManager: Display: Loaded TargetPlatform 'Linux'
[2021.04.03-04.19.57:644][  0]LogTargetPlatformManager: Display: Loaded TargetPlatform 'LinuxNoEditor'
[2021.04.03-04.19.57:652][  0]LogTargetPlatformManager: Display: Loaded TargetPlatform 'LinuxClient'
[2021.04.03-04.19.57:661][  0]LogTargetPlatformManager: Display: Loaded TargetPlatform 'LinuxServer'
[2021.04.03-04.19.57:669][  0]LogTargetPlatformManager: Display: Loaded TargetPlatform 'LinuxAArch64NoEditor'
[2021.04.03-04.19.57:677][  0]LogTargetPlatformManager: Display: Loaded TargetPlatform 'LinuxAArch64Client'
[2021.04.03-04.19.57:686][  0]LogTargetPlatformManager: Display: Loaded TargetPlatform 'LinuxAArch64Server'
[2021.04.03-04.19.57:708][  0]LogTargetPlatformManager: Display: Loaded TargetPlatform 'Lumin'
[2021.04.03-04.19.57:708][  0]LogTargetPlatformManager: Display: Loaded TargetPlatform 'LuminClient'
[2021.04.03-04.19.57:722][  0]LogTargetPlatformManager: Display: Loaded TargetPlatform 'TVOSClient'
[2021.04.03-04.19.57:722][  0]LogTargetPlatformManager: Display: Loaded TargetPlatform 'TVOS'
[2021.04.03-04.19.57:731][  0]LogTargetPlatformManager: Display: Loaded TargetPlatform 'WindowsNoEditor'
[2021.04.03-04.19.57:740][  0]LogTargetPlatformManager: Display: Loaded TargetPlatform 'Windows'
[2021.04.03-04.19.57:748][  0]LogTargetPlatformManager: Display: Loaded TargetPlatform 'WindowsClient'
[2021.04.03-04.19.57:757][  0]LogTargetPlatformManager: Display: Loaded TargetPlatform 'WindowsServer'
[2021.04.03-04.19.57:757][  0]LogTargetPlatformManager: Display: Building Assets For Windows
[2021.04.03-04.19.57:765][  0]LogAudioDebug: Display: Lib vorbis DLL was dynamically loaded.
[2021.04.03-04.19.57:824][  0]LogShaderCompilers: Guid format shader working directory is -5 characters bigger than the processId version (../../../../../GAMPRG2/TowerDefenseC/TowerDefenseC/Intermediate/Shaders/WorkingDirectory/11832/).
[2021.04.03-04.19.57:824][  0]LogShaderCompilers: Cleaned the shader compiler working directory 'C:/Users/Admin/AppData/Local/Temp/UnrealShaderWorkingDir/6B9590D446D10636E226BD9B7BE74FEC/'.
[2021.04.03-04.19.57:824][  0]LogXGEController: Cannot use XGE Controller as Incredibuild is not installed on this machine.
[2021.04.03-04.19.57:825][  0]LogShaderCompilers: Cannot use XGE Shader Compiler as Incredibuild is not installed on this machine.
[2021.04.03-04.19.57:825][  0]LogShaderCompilers: Display: Using Local Shader Compiler.
[2021.04.03-04.19.58:562][  0]LogDerivedDataCache: Display: Max Cache Size: 512 MB
[2021.04.03-04.19.58:611][  0]LogDerivedDataCache: Loaded boot cache 0.05s 79MB C:/Users/Admin/AppData/Local/UnrealEngine/4.25/DerivedDataCache/Boot.ddc.
[2021.04.03-04.19.58:611][  0]LogDerivedDataCache: Display: Loaded Boot cache: C:/Users/Admin/AppData/Local/UnrealEngine/4.25/DerivedDataCache/Boot.ddc
[2021.04.03-04.19.58:630][  0]LogDerivedDataCache: FDerivedDataBackendGraph:  Pak pak cache file ../../../../../GAMPRG2/TowerDefenseC/TowerDefenseC/DerivedDataCache/DDC.ddp not found, will not use a pak cache.
[2021.04.03-04.19.58:630][  0]LogDerivedDataCache: Unable to find inner node Pak for hierarchical cache Hierarchy.
[2021.04.03-04.19.58:630][  0]LogDerivedDataCache: FDerivedDataBackendGraph:  CompressedPak pak cache file ../../../../../GAMPRG2/TowerDefenseC/TowerDefenseC/DerivedDataCache/Compressed.ddp not found, will not use a pak cache.
[2021.04.03-04.19.58:630][  0]LogDerivedDataCache: Unable to find inner node CompressedPak for hierarchical cache Hierarchy.
[2021.04.03-04.19.58:639][  0]LogDerivedDataCache: Display: Pak cache opened for reading ../../../Engine/DerivedDataCache/Compressed.ddp.
[2021.04.03-04.19.58:639][  0]LogDerivedDataCache: FDerivedDataBackendGraph:  EnterprisePak pak cache file ../../../Enterprise/DerivedDataCache/Compressed.ddp not found, will not use a pak cache.
[2021.04.03-04.19.58:639][  0]LogDerivedDataCache: Unable to find inner node EnterprisePak for hierarchical cache Hierarchy.
[2021.04.03-04.19.58:640][  0]LogDerivedDataCache: Using Local data cache path C:/Users/Admin/AppData/Local/UnrealEngine/Common/DerivedDataCache: Writable
[2021.04.03-04.19.58:640][  0]LogDerivedDataCache: Shared data cache path not found in *engine.ini, will not use an Shared cache.
[2021.04.03-04.19.58:640][  0]LogDerivedDataCache: Unable to find inner node Shared for hierarchical cache Hierarchy.
[2021.04.03-04.19.58:686][  0]LogSlate: Using FreeType 2.10.0
[2021.04.03-04.19.58:686][  0]LogSlate: SlateFontServices - WITH_FREETYPE: 1, WITH_HARFBUZZ: 1
[2021.04.03-04.19.58:709][  0]LogAssetRegistry: FAssetRegistry took 0.0028 seconds to start up
[2021.04.03-04.19.58:944][  0]LogInit: Selected Device Profile: [Windows]
[2021.04.03-04.19.59:056][  0]LogMeshReduction: Using QuadricMeshReduction for automatic static mesh reduction
[2021.04.03-04.19.59:056][  0]LogMeshReduction: Using SimplygonMeshReduction for automatic skeletal mesh reduction
[2021.04.03-04.19.59:056][  0]LogMeshReduction: Using ProxyLODMeshReduction for automatic mesh merging
[2021.04.03-04.19.59:056][  0]LogMeshReduction: No distributed automatic mesh merging module available
[2021.04.03-04.19.59:056][  0]LogMeshMerging: No distributed automatic mesh merging module available
[2021.04.03-04.19.59:071][  0]LogNetVersion: TowerDefenseC 1.0.0, NetCL: 13144385, EngineNetVer: 14, GameNetVer: 0 (Checksum: 2203959320)
[2021.04.03-04.19.59:530][  0]LogAISub: UAISubsystem::UAISubsystem AISubsystem (00000243DD0A1B80), frame # 0
[2021.04.03-04.19.59:530][  0]LogAISub: UAISubsystem::UAISubsystem AIPerceptionSystem (00000243DCF7B9C0), frame # 0
[2021.04.03-04.19.59:531][  0]LogAISub: UAISubsystem::UAISubsystem EnvQueryManager (00000243DCFA3200), frame # 0
[2021.04.03-04.20.00:407][  0]LogPackageLocalizationCache: Processed 19 localized package path(s) for 1 prioritized culture(s) in 0.871431 seconds
[2021.04.03-04.20.00:412][  0]LogUObjectArray: 15917 objects as part of root set at end of initial load.
[2021.04.03-04.20.00:412][  0]LogUObjectAllocator: 3965568 out of 0 bytes used by permanent object pool.
[2021.04.03-04.20.00:412][  0]LogUObjectArray: CloseDisregardForGC: 0/0 objects in disregard for GC pool
[2021.04.03-04.20.00:865][  0]LogTcpMessaging: Initializing TcpMessaging bridge
[2021.04.03-04.20.00:870][  0]LogUdpMessaging: Initializing bridge on interface 0.0.0.0:0 to multicast group 230.0.0.1:6666.
[2021.04.03-04.20.02:913][  0]SourceControl: Source control is disabled
[2021.04.03-04.20.02:913][  0]SourceControl: Source control is disabled
[2021.04.03-04.20.02:916][  0]SourceControl: Source control is disabled
[2021.04.03-04.20.02:918][  0]SourceControl: Source control is disabled
[2021.04.03-04.20.02:925][  0]SourceControl: Source control is disabled
[2021.04.03-04.20.03:159][  0]LogAndroidPermission: UAndroidPermissionCallbackProxy::GetInstance
[2021.04.03-04.20.03:178][  0]LogAudioCaptureCore: Display: No Audio Capture implementations found. Audio input will be silent.
[2021.04.03-04.20.03:178][  0]LogAudioCaptureCore: Display: No Audio Capture implementations found. Audio input will be silent.
[2021.04.03-04.20.03:225][  0]LogOcInput: OculusInput pre-init called
[2021.04.03-04.20.03:234][  0]LogWindows: Failed to load 'OVRPlugin.dll' (GetLastError=126)
[2021.04.03-04.20.03:234][  0]LogWindows: File 'OVRPlugin.dll' does not exist
[2021.04.03-04.20.03:320][  0]LogEngine: Initializing Engine...
[2021.04.03-04.20.03:332][  0]LogHMD: Failed to initialize OpenVR with code 110
[2021.04.03-04.20.03:332][  0]LogMagicLeap: Warning: VR disabled because ZI is not enabled.  To enable, in the editor, Edit -> Project Settings -> Plugins -> Magic Leap Plugin -> Enable Zero Iteration
[2021.04.03-04.20.03:333][  0]LogStats: UGameplayTagsManager::InitializeManager -  0.000 s
[2021.04.03-04.20.03:437][  0]LogInit: Initializing FReadOnlyCVARCache
[2021.04.03-04.20.03:444][  0]LogAIModule: Creating AISystem for world Untitled
[2021.04.03-04.20.03:444][  0]LogAISub: UAISubsystem::UAISubsystem EnvQueryManager (00000243E4F4DC00), frame # 0
[2021.04.03-04.20.03:444][  0]LogAISub: UAISubsystem::UAISubsystem AIPerceptionSystem (00000243E4FA1300), frame # 0
[2021.04.03-04.20.03:459][  0]LogAudioMixer: Display: Audio Mixer Platform Settings:
[2021.04.03-04.20.03:459][  0]LogAudioMixer: Display: 	Sample Rate:						  48000
[2021.04.03-04.20.03:459][  0]LogAudioMixer: Display: 	Callback Buffer Frame Size Requested: 1024
[2021.04.03-04.20.03:459][  0]LogAudioMixer: Display: 	Callback Buffer Frame Size To Use:	  1024
[2021.04.03-04.20.03:459][  0]LogAudioMixer: Display: 	Number of buffers to queue:			  2
[2021.04.03-04.20.03:459][  0]LogAudioMixer: Display: 	Max Channels (voices):				  32
[2021.04.03-04.20.03:459][  0]LogAudioMixer: Display: 	Number of Async Source Workers:		  0
[2021.04.03-04.20.03:459][  0]LogAudio: Display: AudioDevice MaxSources: 32
[2021.04.03-04.20.03:459][  0]LogAudio: Display: Using built-in audio occlusion.
[2021.04.03-04.20.03:459][  0]LogAudioMixer: Display: Initializing audio mixer.
[2021.04.03-04.20.03:468][  0]LogAudioMixer: Display: 0: FrontLeft
[2021.04.03-04.20.03:468][  0]LogAudioMixer: Display: 1: FrontRight
[2021.04.03-04.20.03:511][  0]LogAudioMixer: Display: Using Audio Device Speakers (Realtek High Definition Audio)
[2021.04.03-04.20.03:513][  0]LogAudioMixer: Display: Initializing Sound Submixes...
[2021.04.03-04.20.03:514][  0]LogAudioMixer: Display: Creating Master Submix 'MasterSubmixDefault'
[2021.04.03-04.20.03:514][  0]LogAudioMixer: Display: Creating Master Submix 'MasterReverbSubmixDefault'
[2021.04.03-04.20.03:514][  0]LogAudioMixer: Display: Creating Master Submix 'MasterEQSubmixDefault'
[2021.04.03-04.20.03:516][  0]LogInit: FAudioDevice initialized.
[2021.04.03-04.20.03:516][  0]LogNetVersion: Set ProjectVersion to 1.0.0.0. Version Checksum will be recalculated on next use.
[2021.04.03-04.20.03:624][  0]LogDerivedDataCache: Saved boot cache 0.11s 79MB C:/Users/Admin/AppData/Local/UnrealEngine/4.25/DerivedDataCache/Boot.ddc.
[2021.04.03-04.20.03:628][  0]LogInit: Texture streaming: Enabled
[2021.04.03-04.20.03:642][  0]LogEngineSessionManager: EngineSessionManager initialized
[2021.04.03-04.20.03:642][  0]LogEditorSessionSummary: Verbose: Initializing EditorSessionSummaryWriter for editor session tracking
[2021.04.03-04.20.03:644][  0]LogEditorSessionSummary: EditorSessionSummaryWriter initialized
[2021.04.03-04.20.03:699][  0]LogInit: Transaction tracking system initialized
[2021.04.03-04.20.03:718][  0]BlueprintLog: New page: Editor Load
[2021.04.03-04.20.03:778][  0]LocalizationService: Localization service is disabled
[2021.04.03-04.20.04:483][  0]LogCook: Display: Max memory allowance for cook 16384mb min free memory 0mb
[2021.04.03-04.20.04:483][  0]LogCook: Display: Mobile HDR setting 1
[2021.04.03-04.20.04:785][  0]SourceControl: Source control is disabled
[2021.04.03-04.20.04:785][  0]LogUnrealEdMisc: Loading editor; pre map load, took 10.599
[2021.04.03-04.20.04:785][  0]Cmd: MAP LOAD FILE="../../../../../GAMPRG2/TowerDefenseC/TowerDefenseC/Content/TDLevel.umap" TEMPLATE=0 SHOWPROGRESS=1 FEATURELEVEL=3
[2021.04.03-04.20.05:074][  0]LogFileCache: Scanning file cache for directory 'E:/GAMPRG2/TowerDefenseC/TowerDefenseC/Content/' took 0.91s
[2021.04.03-04.20.05:074][  0]LightingResults: New page: Lighting Build
[2021.04.03-04.20.05:075][  0]LogWorld: UWorld::CleanupWorld for Untitled, bSessionEnded=true, bCleanupResources=true
[2021.04.03-04.20.05:075][  0]LogSlate: InvalidateAllWidgets triggered.  All widgets were invalidated
[2021.04.03-04.20.05:075][  0]MapCheck: New page: Map Check
[2021.04.03-04.20.05:075][  0]LightingResults: New page: Lighting Build
[2021.04.03-04.20.05:084][  0]LogAISub: UAISubsystem::~UAISubsystem EnvQueryManager (00000243E4F4DC00), frame # 0
[2021.04.03-04.20.05:084][  0]LogAISub: UAISubsystem::~UAISubsystem AIPerceptionSystem (00000243E4FA1300), frame # 0
[2021.04.03-04.20.05:084][  0]LogUObjectHash: Compacting FUObjectHashTables data took   0.62ms
[2021.04.03-04.20.08:530][  0]LogAIModule: Creating AISystem for world TDLevel
[2021.04.03-04.20.08:530][  0]LogAISub: UAISubsystem::UAISubsystem EnvQueryManager (00000243D3BD8800), frame # 0
[2021.04.03-04.20.08:530][  0]LogAISub: UAISubsystem::UAISubsystem AIPerceptionSystem (00000243D3BE2AC0), frame # 0
[2021.04.03-04.20.08:577][  0]LogPhysics: Warning: Scale for /Game/TDLevel.TDLevel:PersistentLevel.MyBuild_Node_2.StaticMesh has a component set to zero, which will result in a bad body instance. Scale:X=12.500 Y=12.500 Z=0.000
[2021.04.03-04.20.08:577][  0]LogPhysics: Warning: PopulatePhysXGeometryAndTransform(Convex): ConvexElem has invalid transform
[2021.04.03-04.20.08:577][  0]LogPhysics: Warning: ForeachShape(Convex): ScaledElem[0] invalid
[2021.04.03-04.20.08:579][  0]LogPhysics: Warning: Scale for /Game/TDLevel.TDLevel:PersistentLevel.MyBuild_Node_2.StaticMesh has a component set to zero, which will result in a bad body instance. Scale:X=12.500 Y=12.500 Z=0.000
[2021.04.03-04.20.08:579][  0]LogPhysics: Warning: PopulatePhysXGeometryAndTransform(Convex): ConvexElem has invalid transform
[2021.04.03-04.20.08:579][  0]LogPhysics: Warning: ForeachShape(Convex): ScaledElem[0] invalid
[2021.04.03-04.20.08:579][  0]LogPhysics: Warning: Scale for /Game/TDLevel.TDLevel:PersistentLevel.MyBuild_Node_2.StaticMesh has a component set to zero, which will result in a bad body instance. Scale:X=12.500 Y=12.500 Z=0.000
[2021.04.03-04.20.08:579][  0]LogPhysics: Warning: PopulatePhysXGeometryAndTransform(Convex): ConvexElem has invalid transform
[2021.04.03-04.20.08:579][  0]LogPhysics: Warning: ForeachShape(Convex): ScaledElem[0] invalid
[2021.04.03-04.20.08:579][  0]LogPhysics: Warning: Scale for /Game/TDLevel.TDLevel:PersistentLevel.MyBuild_Node_2.StaticMesh has a component set to zero, which will result in a bad body instance. Scale:X=12.500 Y=12.500 Z=0.000
[2021.04.03-04.20.08:579][  0]LogPhysics: Warning: PopulatePhysXGeometryAndTransform(Convex): ConvexElem has invalid transform
[2021.04.03-04.20.08:579][  0]LogPhysics: Warning: ForeachShape(Convex): ScaledElem[0] invalid
[2021.04.03-04.20.08:579][  0]LogEditorServer: Finished looking for orphan Actors (0.000 secs)
[2021.04.03-04.20.08:599][  0]LogUObjectHash: Compacting FUObjectHashTables data took   0.79ms
[2021.04.03-04.20.08:599][  0]Cmd: MAP CHECKDEP NOCLEARLOG
[2021.04.03-04.20.08:599][  0]MapCheck: Map check complete: 0 Error(s), 0 Warning(s), took 0.089ms to complete.
[2021.04.03-04.20.08:599][  0]LogFileHelpers: Loading map 'TDLevel' took 3.815
[2021.04.03-04.20.08:928][  0]LogUnrealEdMisc: Total Editor Startup Time, took 14.742
[2021.04.03-04.20.09:397][  0]LogSlate: Updating window title bar state: overlay mode, drag disabled, window buttons hidden, title bar hidden
[2021.04.03-04.20.09:416][  0]LogSlate: Updating window title bar state: overlay mode, drag disabled, window buttons hidden, title bar hidden
[2021.04.03-04.20.09:423][  0]LogSlate: Updating window title bar state: overlay mode, drag disabled, window buttons hidden, title bar hidden
[2021.04.03-04.20.09:429][  0]LogSlate: Updating window title bar state: overlay mode, drag disabled, window buttons hidden, title bar hidden
[2021.04.03-04.20.09:472][  0]LogCollectionManager: Loaded 0 collections in 0.000671 seconds
[2021.04.03-04.20.09:586][  0]LogFileCache: Scanning file cache for directory 'E:/GAMPRG2/TowerDefenseC/TowerDefenseC/Saved/Collections/' took 0.00s
[2021.04.03-04.20.09:586][  0]LogFileCache: Scanning file cache for directory 'E:/GAMPRG2/TowerDefenseC/TowerDefenseC/Content/Developers/Admin/Collections/' took 0.00s
[2021.04.03-04.20.09:586][  0]LogFileCache: Scanning file cache for directory 'E:/GAMPRG2/TowerDefenseC/TowerDefenseC/Content/Collections/' took 0.00s
[2021.04.03-04.20.09:586][  0]LogContentBrowser: Native class hierarchy populated in 0.0084 seconds. Added 3445 classes and 823 folders.
[2021.04.03-04.20.09:659][  0]LogContentBrowser: Native class hierarchy updated for 'WidgetCarousel' in 0.0003 seconds. Added 0 classes and 0 folders.
[2021.04.03-04.20.11:127][  0]LogContentBrowser: Native class hierarchy updated for 'AddContentDialog' in 0.0003 seconds. Added 0 classes and 0 folders.
[2021.04.03-04.20.11:444][  0]LogContentBrowser: Native class hierarchy updated for 'SceneOutliner' in 0.0003 seconds. Added 2 classes and 0 folders.
[2021.04.03-04.20.11:916][  0]LogSlate: Took 0.000152 seconds to synchronously load lazily loaded font '../../../Engine/Content/Slate/Fonts/Roboto-Regular.ttf' (155K)
[2021.04.03-04.20.11:923][  0]LogSlate: Took 0.000125 seconds to synchronously load lazily loaded font '../../../Engine/Content/Slate/Fonts/Roboto-Bold.ttf' (160K)
[2021.04.03-04.20.11:958][  0]LogSlate: Took 0.017177 seconds to synchronously load lazily loaded font '../../../Engine/Content/Editor/Slate/Fonts/FontAwesome.ttf' (139K)
[2021.04.03-04.20.12:003][  0]LogSlate: Took 0.035063 seconds to synchronously load lazily loaded font '../../../Engine/Content/Slate/Fonts/DroidSansMono.ttf' (77K)
[2021.04.03-04.20.12:424][  0]LogRenderer: Reallocating scene render targets to support 1208x572 Format 10 NumSamples 1 (Frame:1).
[2021.04.03-04.20.12:609][  0]LogContentBrowser: Native class hierarchy updated for 'HierarchicalLODOutliner' in 0.0003 seconds. Added 0 classes and 0 folders.
[2021.04.03-04.20.12:609][  0]LogLoad: (Engine Initialization) Total time: 18.42 seconds
[2021.04.03-04.20.12:609][  0]LogLoad: (Engine Initialization) Total Blueprint compile time: 0.00 seconds
[2021.04.03-04.20.12:665][  0]LogAssetRegistry: Asset discovery search completed in 13.9574 seconds
[2021.04.03-04.20.12:670][  0]LogCollectionManager: Fixed up redirectors for 0 collections in 0.000002 seconds (updated 0 objects)
[2021.04.03-04.20.12:680][  0]LogContentStreaming: Texture pool size now 1000 MB
[2021.04.03-04.23.55:901][345]LogSlate: Took 0.020658 seconds to synchronously load lazily loaded font '../../../Engine/Content/Slate/Fonts/Roboto-Light.ttf' (167K)
[2021.04.03-04.23.55:925][346]LogActor: Warning: Turret_C /Engine/Transient.World_0:PersistentLevel.Turret_C_0 has natively added scene component(s), but none of them were set as the actor's RootComponent - picking one arbitrarily
[2021.04.03-04.23.59:394][697]LogSlate: Took 0.000130 seconds to synchronously load lazily loaded font '../../../Engine/Content/Slate/Fonts/Roboto-Light.ttf' (167K)
[2021.04.03-04.23.59:407][697]LogAssetEditorSubsystem: Opening Asset editor for Blueprint /Game/MyTDGameMode.MyTDGameMode
[2021.04.03-04.24.00:368][697]LogContentBrowser: Native class hierarchy updated for 'BlueprintGraph' in 0.0006 seconds. Added 125 classes and 0 folders.
[2021.04.03-04.24.01:688][697]LogSlate: Took 0.000169 seconds to synchronously load lazily loaded font '../../../Engine/Content/Slate/Fonts/Roboto-BoldCondensed.ttf' (158K)
[2021.04.03-04.24.02:015][698]LogSlate: Took 0.025177 seconds to synchronously load lazily loaded font '../../../Engine/Content/Slate/Fonts/Roboto-Italic.ttf' (157K)
[2021.04.03-04.24.16:392][ 85]LogAssetEditorSubsystem: Opening Asset editor for WidgetBlueprint /Game/TDHUD.TDHUD
[2021.04.03-04.24.56:871][631]LogAssetEditorSubsystem: Opening Asset editor for Class /Script/TowerDefenseC.TDGameMode
[2021.04.03-05.54.32:504][143]LogSlate: Window 'TDHUD' being destroyed
[2021.04.03-05.54.32:508][143]LogSlate: Window 'TDHUD' being destroyed
[2021.04.03-05.54.32:547][143]LogWorld: UWorld::CleanupWorld for World_3, bSessionEnded=true, bCleanupResources=true
[2021.04.03-05.54.32:547][143]LogSlate: InvalidateAllWidgets triggered.  All widgets were invalidated
[2021.04.03-05.54.32:708][143]LogWorld: UWorld::CleanupWorld for World_5, bSessionEnded=true, bCleanupResources=true
[2021.04.03-05.54.32:708][143]LogSlate: InvalidateAllWidgets triggered.  All widgets were invalidated
[2021.04.03-05.54.32:726][143]LogWorld: UWorld::CleanupWorld for World_4, bSessionEnded=true, bCleanupResources=true
[2021.04.03-05.54.32:726][143]LogSlate: InvalidateAllWidgets triggered.  All widgets were invalidated
[2021.04.03-06.05.46:827][681]LogActor: Warning: MyPlayerCore_C /Engine/Transient.World_6:PersistentLevel.MyPlayerCore_C_0 has natively added scene component(s), but none of them were set as the actor's RootComponent - picking one arbitrarily
[2021.04.03-06.05.49:224][933]LogAssetEditorSubsystem: Opening Asset editor for Blueprint /Game/Actors/Towers/Turret.Turret
[2021.04.03-06.05.49:695][933]LogActor: Warning: Turret_C /Engine/Transient.World_8:PersistentLevel.Turret_C_0 has natively added scene component(s), but none of them were set as the actor's RootComponent - picking one arbitrarily
[2021.04.03-06.05.54:547][279]Candidate modules for hot reload:
[2021.04.03-06.05.54:547][279]  TowerDefenseC
[2021.04.03-06.05.54:547][279]Launching UnrealBuildTool... [E:/Unreal/UE_4.25/Engine/Binaries/DotNET/UnrealBuildTool.exe  -ModuleWithSuffix=TowerDefenseC,4427 TowerDefenseCEditor Win64 Development -Project="E:/GAMPRG2/TowerDefenseC/TowerDefenseC/TowerDefenseC.uproject" "E:/GAMPRG2/TowerDefenseC/TowerDefenseC/TowerDefenseC.uproject"  -IgnoreJunk]
[2021.04.03-06.05.54:552][279]Warning: Starting HotReload took  1.4s.
[2021.04.03-06.11.50:672][914]CompilerResultsLog: New page: Compilation - Apr 3, 2021, 10:11:50 PM
[2021.04.03-06.11.50:673][914]CompilerResultsLog: Using 'git status' to determine working set for adaptive non-unity build (E:\GAMPRG2\TowerDefenseC).
[2021.04.03-06.11.50:673][914]CompilerResultsLog: Parsing headers for TowerDefenseCEditor
[2021.04.03-06.11.50:673][914]CompilerResultsLog:   Running UnrealHeaderTool "E:\GAMPRG2\TowerDefenseC\TowerDefenseC\TowerDefenseC.uproject" "E:\GAMPRG2\TowerDefenseC\TowerDefenseC\Intermediate\Build\Win64\TowerDefenseCEditor\Development\TowerDefenseCEditor.uhtmanifest" -LogCmds="loginit warning, logexit warning, logdatabase error" -Unattended -WarningsAsErrors -abslog="C:\Users\Admin\AppData\Local\UnrealBuildTool\Log_UHT.txt" -installed
[2021.04.03-06.11.50:673][914]CompilerResultsLog: LogCompile: Error: Circular dependency detected for filename E:\GAMPRG2\TowerDefenseC\TowerDefenseC\Source\TowerDefenseC\TDGameMode.h!
[2021.04.03-06.11.50:673][914]CompilerResultsLog: Reflection code generated for TowerDefenseCEditor in 43.4538269 seconds
[2021.04.03-06.11.50:673][914]CompilerResultsLog: Building TowerDefenseCEditor...
[2021.04.03-06.11.50:673][914]CompilerResultsLog: Using Visual Studio 2019 14.26.28806 toolchain (C:\Program Files (x86)\Microsoft Visual Studio\2019\Community\VC\Tools\MSVC\14.26.28801) and Windows 10.0.18362.0 SDK (C:\Program Files (x86)\Windows Kits\10).
[2021.04.03-06.11.50:673][914]CompilerResultsLog: Building 14 actions with 6 processes...
[2021.04.03-06.11.50:673][914]CompilerResultsLog:   [1/14] TowerDefenseC.init.gen.cpp
[2021.04.03-06.11.50:673][914]CompilerResultsLog:   [2/14] PlayerCore.gen.cpp
[2021.04.03-06.11.50:673][914]CompilerResultsLog:   E:\Unreal\UE_4.25\Engine\Source\Runtime\Core\Public\Containers/EnumAsByte.h(20): warning C4996: 'TEnumAsByte_EnumClass<true>': TEnumAsByte is not intended for use with enum classes - please derive your enum class from uint8 instead. Please update your code to the new API before upgrading to the next release, otherwise your project will no longer compile.
[2021.04.03-06.11.50:673][914]CompilerResultsLog:   E:\Unreal\UE_4.25\Engine\Source\Runtime\Core\Public\Containers/EnumAsByte.h(10): note: see declaration of 'TEnumAsByte_EnumClass'
[2021.04.03-06.11.50:673][914]CompilerResultsLog:   E:\GAMPRG2\TowerDefenseC\TowerDefenseC\Source\TowerDefenseC\Enemy.h(48): note: see reference to class template instantiation 'TEnumAsByte<EnemyType>' being compiled
[2021.04.03-06.11.50:673][914]CompilerResultsLog:   [3/14] Build_Node.gen.cpp
[2021.04.03-06.11.50:673][914]CompilerResultsLog:   [4/14] Spawner.gen.cpp
[2021.04.03-06.11.50:673][914]CompilerResultsLog:   E:\Unreal\UE_4.25\Engine\Source\Runtime\Core\Public\Containers/EnumAsByte.h(20): warning C4996: 'TEnumAsByte_EnumClass<true>': TEnumAsByte is not intended for use with enum classes - please derive your enum class from uint8 instead. Please update your code to the new API before upgrading to the next release, otherwise your project will no longer compile.
[2021.04.03-06.11.50:673][914]CompilerResultsLog:   E:\Unreal\UE_4.25\Engine\Source\Runtime\Core\Public\Containers/EnumAsByte.h(10): note: see declaration of 'TEnumAsByte_EnumClass'
[2021.04.03-06.11.50:673][914]CompilerResultsLog:   E:\GAMPRG2\TowerDefenseC\TowerDefenseC\Source\TowerDefenseC\Enemy.h(48): note: see reference to class template instantiation 'TEnumAsByte<EnemyType>' being compiled
[2021.04.03-06.11.50:673][914]CompilerResultsLog:   [5/14] Tower_Base.gen.cpp
[2021.04.03-06.11.50:673][914]CompilerResultsLog:   [6/14] TDGameMode.gen.cpp
[2021.04.03-06.11.50:673][914]CompilerResultsLog:   E:\Unreal\UE_4.25\Engine\Source\Runtime\Core\Public\Containers/EnumAsByte.h(20): warning C4996: 'TEnumAsByte_EnumClass<true>': TEnumAsByte is not intended for use with enum classes - please derive your enum class from uint8 instead. Please update your code to the new API before upgrading to the next release, otherwise your project will no longer compile.
[2021.04.03-06.11.50:673][914]CompilerResultsLog:   E:\Unreal\UE_4.25\Engine\Source\Runtime\Core\Public\Containers/EnumAsByte.h(10): note: see declaration of 'TEnumAsByte_EnumClass'
[2021.04.03-06.11.50:673][914]CompilerResultsLog:   E:\GAMPRG2\TowerDefenseC\TowerDefenseC\Source\TowerDefenseC\Enemy.h(48): note: see reference to class template instantiation 'TEnumAsByte<EnemyType>' being compiled
[2021.04.03-06.11.50:673][914]CompilerResultsLog:   [7/14] Build_Node.cpp
[2021.04.03-06.11.50:673][914]CompilerResultsLog:   [8/14] Tower_Base.cpp
[2021.04.03-06.11.50:673][914]CompilerResultsLog:   [9/14] PlayerCore.cpp
[2021.04.03-06.11.50:673][914]CompilerResultsLog:   E:\Unreal\UE_4.25\Engine\Source\Runtime\Core\Public\Containers/EnumAsByte.h(20): warning C4996: 'TEnumAsByte_EnumClass<true>': TEnumAsByte is not intended for use with enum classes - please derive your enum class from uint8 instead. Please update your code to the new API before upgrading to the next release, otherwise your project will no longer compile.
[2021.04.03-06.11.50:673][914]CompilerResultsLog:   E:\Unreal\UE_4.25\Engine\Source\Runtime\Core\Public\Containers/EnumAsByte.h(10): note: see declaration of 'TEnumAsByte_EnumClass'
[2021.04.03-06.11.50:673][914]CompilerResultsLog:   E:\GAMPRG2\TowerDefenseC\TowerDefenseC\Source\TowerDefenseC\Enemy.h(48): note: see reference to class template instantiation 'TEnumAsByte<EnemyType>' being compiled
[2021.04.03-06.11.50:673][914]CompilerResultsLog:   [10/14] TDGameMode.cpp
[2021.04.03-06.11.50:673][914]CompilerResultsLog:   E:\Unreal\UE_4.25\Engine\Source\Runtime\Core\Public\Containers/EnumAsByte.h(20): warning C4996: 'TEnumAsByte_EnumClass<true>': TEnumAsByte is not intended for use with enum classes - please derive your enum class from uint8 instead. Please update your code to the new API before upgrading to the next release, otherwise your project will no longer compile.
[2021.04.03-06.11.50:673][914]CompilerResultsLog:   E:\Unreal\UE_4.25\Engine\Source\Runtime\Core\Public\Containers/EnumAsByte.h(10): note: see declaration of 'TEnumAsByte_EnumClass'
[2021.04.03-06.11.50:673][914]CompilerResultsLog:   E:\GAMPRG2\TowerDefenseC\TowerDefenseC\Source\TowerDefenseC\Enemy.h(48): note: see reference to class template instantiation 'TEnumAsByte<EnemyType>' being compiled
[2021.04.03-06.11.50:673][914]CompilerResultsLog:   [11/14] Spawner.cpp
[2021.04.03-06.11.50:673][914]CompilerResultsLog:   E:\Unreal\UE_4.25\Engine\Source\Runtime\Core\Public\Containers/EnumAsByte.h(20): warning C4996: 'TEnumAsByte_EnumClass<true>': TEnumAsByte is not intended for use with enum classes - please derive your enum class from uint8 instead. Please update your code to the new API before upgrading to the next release, otherwise your project will no longer compile.
[2021.04.03-06.11.50:673][914]CompilerResultsLog:   E:\Unreal\UE_4.25\Engine\Source\Runtime\Core\Public\Containers/EnumAsByte.h(10): note: see declaration of 'TEnumAsByte_EnumClass'
[2021.04.03-06.11.50:673][914]CompilerResultsLog:   E:\GAMPRG2\TowerDefenseC\TowerDefenseC\Source\TowerDefenseC\Enemy.h(48): note: see reference to class template instantiation 'TEnumAsByte<EnemyType>' being compiled
[2021.04.03-06.11.50:673][914]CompilerResultsLog:   [12/14] UE4Editor-TowerDefenseC-4427.lib
[2021.04.03-06.11.50:673][914]CompilerResultsLog:      Creating library E:\GAMPRG2\TowerDefenseC\TowerDefenseC\Intermediate\Build\Win64\UE4Editor\Development\TowerDefenseC\UE4Editor-TowerDefenseC-4427.lib and object E:\GAMPRG2\TowerDefenseC\TowerDefenseC\Intermediate\Build\Win64\UE4Editor\Development\TowerDefenseC\UE4Editor-TowerDefenseC-4427.exp
[2021.04.03-06.11.50:673][914]CompilerResultsLog:   [13/14] UE4Editor-TowerDefenseC-4427.dll
[2021.04.03-06.11.50:673][914]CompilerResultsLog:      Creating library E:\GAMPRG2\TowerDefenseC\TowerDefenseC\Intermediate\Build\Win64\UE4Editor\Development\TowerDefenseC\UE4Editor-TowerDefenseC-4427.suppressed.lib and object E:\GAMPRG2\TowerDefenseC\TowerDefenseC\Intermediate\Build\Win64\UE4Editor\Development\TowerDefenseC\UE4Editor-TowerDefenseC-4427.suppressed.exp
[2021.04.03-06.11.50:673][914]CompilerResultsLog:   [14/14] TowerDefenseCEditor.target
[2021.04.03-06.11.50:673][914]CompilerResultsLog: Total time in Parallel executor: 303.06 seconds
[2021.04.03-06.11.50:674][914]CompilerResultsLog: Total execution time: 355.76 seconds
[2021.04.03-06.11.50:674][914]LogMainFrame: MainFrame: Module compiling took 356.151 seconds
[2021.04.03-06.11.50:739][914]LogClass: Could not find existing class TDGameMode in package /Script/TowerDefenseC for HotReload, assuming new class
[2021.04.03-06.11.50:748][914]LogClass: Could not find existing class Tower_Base in package /Script/TowerDefenseC for HotReload, assuming new class
[2021.04.03-06.11.50:748][914]LogClass: Function acquireTarget is new.
[2021.04.03-06.11.50:749][914]LogClass: Function ActivateTower is new.
[2021.04.03-06.11.50:749][914]LogClass: Function BuffingStats is new.
[2021.04.03-06.11.50:749][914]LogClass: Function OnOverlapBegin is new.
[2021.04.03-06.11.50:749][914]LogClass: Function OnOverlapEnd is new.
[2021.04.03-06.11.50:749][914]LogClass: Function removeTarget is new.
[2021.04.03-06.11.50:749][914]LogClass: Function RotateToTarget is new.
[2021.04.03-06.11.50:756][914]LogClass: EnemyType HotReload.
[2021.04.03-06.11.50:756][914]LogClass: StatLevels HotReload.
[2021.04.03-06.11.50:756][914]LogClass: TowerStats HotReload.
[2021.04.03-06.11.50:756][914]LogClass: SpawnDetails HotReload.
[2021.04.03-06.11.50:780][914]LogHotReload: Re-instancing TDGameMode after hot-reload.
[2021.04.03-06.11.50:879][914]LogHotReload: Re-instancing Tower_Base after hot-reload.
[2021.04.03-06.11.50:903][914]LogActor: Warning: Turret_C /Game/TDLevel.TDLevel:PersistentLevel.Turret_2 has natively added scene component(s), but none of them were set as the actor's RootComponent - picking one arbitrarily
[2021.04.03-06.11.50:905][914]LogActor: Warning: Turret_C /Engine/Transient.World_0:PersistentLevel.Turret_C_0 has natively added scene component(s), but none of them were set as the actor's RootComponent - picking one arbitrarily
[2021.04.03-06.11.50:906][914]LogActor: Warning: Turret_C /Engine/Transient.World_8:PersistentLevel.Turret_C_0 has natively added scene component(s), but none of them were set as the actor's RootComponent - picking one arbitrarily
[2021.04.03-06.11.50:972][914]LogActor: Warning: Turret_C /Engine/Transient.World_0:PersistentLevel.Turret_C_1 has natively added scene component(s), but none of them were set as the actor's RootComponent - picking one arbitrarily
[2021.04.03-06.11.51:002][914]LogContentBrowser: Native class hierarchy updated for 'TowerDefenseC' in 0.0016 seconds. Added 18 classes and 2 folders.
[2021.04.03-06.11.51:007][914]Display: HotReload successful (10 functions remapped  3 scriptstructs remapped)
[2021.04.03-06.11.51:294][914]LogContentBrowser: Native class hierarchy populated in 0.0130 seconds. Added 3445 classes and 823 folders.
[2021.04.03-06.11.51:294][914]Display: HotReload took 358.2s.
[2021.04.03-06.32.31:846][649]LogSlate: Took 0.023914 seconds to synchronously load lazily loaded font '../../../Engine/Content/Slate/Fonts/Roboto-BoldCondensedItalic.ttf' (160K)
[2021.04.03-06.32.41:419][681]BlueprintLog: New page: Compile Turret
[2021.04.03-06.32.41:423][681]LogActor: Warning: Turret_C /Game/TDLevel.TDLevel:PersistentLevel.Turret_2 has natively added scene component(s), but none of them were set as the actor's RootComponent - picking one arbitrarily
[2021.04.03-06.32.41:424][681]LogActor: Warning: Turret_C /Engine/Transient.World_8:PersistentLevel.Turret_C_0 has natively added scene component(s), but none of them were set as the actor's RootComponent - picking one arbitrarily
[2021.04.03-06.32.41:425][681]LogActor: Warning: Turret_C /Engine/Transient.World_0:PersistentLevel.Turret_C_1 has natively added scene component(s), but none of them were set as the actor's RootComponent - picking one arbitrarily
[2021.04.03-06.32.41:598][681]LogUObjectHash: Compacting FUObjectHashTables data took   5.47ms
[2021.04.03-06.32.41:610][681]LogActor: Warning: Turret_C /Engine/Transient.World_0:PersistentLevel.Turret_C_2 has natively added scene component(s), but none of them were set as the actor's RootComponent - picking one arbitrarily
[2021.04.03-06.32.42:455][747]Cmd: OBJ SAVEPACKAGE PACKAGE="/Game/Actors/Towers/Turret" FILE="../../../../../GAMPRG2/TowerDefenseC/TowerDefenseC/Content/Actors/Towers/Turret.uasset" SILENT=true
[2021.04.03-06.32.43:296][747]LogSavePackage: Moving '../../../../../GAMPRG2/TowerDefenseC/TowerDefenseC/Saved/Turret8FDE499A4F8F5F96AF72B5BBB3479C06.tmp' to '../../../../../GAMPRG2/TowerDefenseC/TowerDefenseC/Content/Actors/Towers/Turret.uasset'
[2021.04.03-06.32.43:470][747]AssetCheck: New page: Asset Save: Turret
[2021.04.03-06.32.43:470][747]LogContentValidation: Display: Validating Blueprint /Game/Actors/Towers/Turret.Turret
[2021.04.03-06.33.42:341][344]BlueprintLog: New page: Compile Turret
[2021.04.03-06.33.42:346][344]LogActor: Warning: Turret_C /Game/TDLevel.TDLevel:PersistentLevel.Turret_2 has natively added scene component(s), but none of them were set as the actor's RootComponent - picking one arbitrarily
[2021.04.03-06.33.42:346][344]LogActor: Warning: Turret_C /Engine/Transient.World_8:PersistentLevel.Turret_C_0 has natively added scene component(s), but none of them were set as the actor's RootComponent - picking one arbitrarily
[2021.04.03-06.33.42:347][344]LogActor: Warning: Turret_C /Engine/Transient.World_0:PersistentLevel.Turret_C_2 has natively added scene component(s), but none of them were set as the actor's RootComponent - picking one arbitrarily
[2021.04.03-06.33.42:417][344]LogUObjectHash: Compacting FUObjectHashTables data took   3.33ms
[2021.04.03-06.33.42:423][344]LogActor: Warning: Turret_C /Engine/Transient.World_0:PersistentLevel.Turret_C_3 has natively added scene component(s), but none of them were set as the actor's RootComponent - picking one arbitrarily
[2021.04.03-06.33.42:660][361]Cmd: OBJ SAVEPACKAGE PACKAGE="/Game/Actors/Towers/Turret" FILE="../../../../../GAMPRG2/TowerDefenseC/TowerDefenseC/Content/Actors/Towers/Turret.uasset" SILENT=true
[2021.04.03-06.33.42:683][361]LogSavePackage: Moving '../../../../../GAMPRG2/TowerDefenseC/TowerDefenseC/Saved/Turret2EC2C6334A8FBB91547FDEAE51B0AD60.tmp' to '../../../../../GAMPRG2/TowerDefenseC/TowerDefenseC/Content/Actors/Towers/Turret.uasset'
[2021.04.03-06.33.42:698][361]AssetCheck: New page: Asset Save: Turret
[2021.04.03-06.33.42:698][361]LogContentValidation: Display: Validating Blueprint /Game/Actors/Towers/Turret.Turret
[2021.04.03-06.34.12:672][ 97]LogUObjectHash: Compacting FUObjectHashTables data took   2.57ms
[2021.04.03-06.34.12:688][ 97]Cmd: OBJ SAVEPACKAGE PACKAGE="/Game/TDLevel" FILE="../../../../../GAMPRG2/TowerDefenseC/TowerDefenseC/Saved/Autosaves/Game/TDLevel_Auto1.umap" SILENT=true AUTOSAVING=true KEEPDIRTY=false
[2021.04.03-06.34.12:745][ 97]LogSavePackage: Moving '../../../../../GAMPRG2/TowerDefenseC/TowerDefenseC/Saved/TDLevel_Auto11A87995D4F14CB7DDE22D4989F141379.tmp' to '../../../../../GAMPRG2/TowerDefenseC/TowerDefenseC/Saved/Autosaves/Game/TDLevel_Auto1.umap'
[2021.04.03-06.34.12:750][ 97]LogFileHelpers: Editor autosave (incl. sublevels) for '/Game/TDLevel' took 0.101
[2021.04.03-06.34.12:750][ 97]LogFileHelpers: Editor autosave (incl. sublevels) for all levels took 0.101
[2021.04.03-06.34.14:972][219]Candidate modules for hot reload:
[2021.04.03-06.34.14:972][219]  TowerDefenseC
[2021.04.03-06.34.14:972][219]Launching UnrealBuildTool... [E:/Unreal/UE_4.25/Engine/Binaries/DotNET/UnrealBuildTool.exe  -ModuleWithSuffix=TowerDefenseC,8238 TowerDefenseCEditor Win64 Development -Project="E:/GAMPRG2/TowerDefenseC/TowerDefenseC/TowerDefenseC.uproject" "E:/GAMPRG2/TowerDefenseC/TowerDefenseC/TowerDefenseC.uproject"  -IgnoreJunk]
[2021.04.03-06.34.14:974][219]Warning: Starting HotReload took  0.0s.
[2021.04.03-06.34.23:021][928]LogSlate: Window 'Delete Variable' being destroyed
[2021.04.03-06.34.24:579][ 87]CompilerResultsLog: New page: Compilation - Apr 3, 2021, 10:34:24 PM
[2021.04.03-06.34.24:579][ 87]CompilerResultsLog: Using 'git status' to determine working set for adaptive non-unity build (E:\GAMPRG2\TowerDefenseC).
[2021.04.03-06.34.24:579][ 87]CompilerResultsLog: Parsing headers for TowerDefenseCEditor
[2021.04.03-06.34.24:579][ 87]CompilerResultsLog:   Running UnrealHeaderTool "E:\GAMPRG2\TowerDefenseC\TowerDefenseC\TowerDefenseC.uproject" "E:\GAMPRG2\TowerDefenseC\TowerDefenseC\Intermediate\Build\Win64\TowerDefenseCEditor\Development\TowerDefenseCEditor.uhtmanifest" -LogCmds="loginit warning, logexit warning, logdatabase error" -Unattended -WarningsAsErrors -abslog="C:\Users\Admin\AppData\Local\UnrealBuildTool\Log_UHT.txt" -installed
[2021.04.03-06.34.24:579][ 87]CompilerResultsLog: LogCompile: Error: Circular dependency detected for filename E:\GAMPRG2\TowerDefenseC\TowerDefenseC\Source\TowerDefenseC\TDGameMode.h!
[2021.04.03-06.34.24:579][ 87]CompilerResultsLog: Reflection code generated for TowerDefenseCEditor in 5.3647905 seconds
[2021.04.03-06.34.24:579][ 87]CompilerResultsLog: Building TowerDefenseCEditor...
[2021.04.03-06.34.24:579][ 87]CompilerResultsLog: Using Visual Studio 2019 14.26.28806 toolchain (C:\Program Files (x86)\Microsoft Visual Studio\2019\Community\VC\Tools\MSVC\14.26.28801) and Windows 10.0.18362.0 SDK (C:\Program Files (x86)\Windows Kits\10).
[2021.04.03-06.34.24:579][ 87]CompilerResultsLog: Building 8 actions with 6 processes...
[2021.04.03-06.34.24:579][ 87]CompilerResultsLog:   [1/8] TowerDefenseC.init.gen.cpp
[2021.04.03-06.34.24:579][ 87]CompilerResultsLog:   [2/8] Build_Node.cpp
[2021.04.03-06.34.24:579][ 87]CompilerResultsLog:   [3/8] Tower_Base.cpp
[2021.04.03-06.34.24:579][ 87]CompilerResultsLog:   [4/8] Build_Node.gen.cpp
[2021.04.03-06.34.24:579][ 87]CompilerResultsLog:   [5/8] Tower_Base.gen.cpp
[2021.04.03-06.34.24:579][ 87]CompilerResultsLog:   [6/8] UE4Editor-TowerDefenseC-8238.lib
[2021.04.03-06.34.24:579][ 87]CompilerResultsLog:      Creating library E:\GAMPRG2\TowerDefenseC\TowerDefenseC\Intermediate\Build\Win64\UE4Editor\Development\TowerDefenseC\UE4Editor-TowerDefenseC-8238.lib and object E:\GAMPRG2\TowerDefenseC\TowerDefenseC\Intermediate\Build\Win64\UE4Editor\Development\TowerDefenseC\UE4Editor-TowerDefenseC-8238.exp
[2021.04.03-06.34.24:579][ 87]CompilerResultsLog:   [7/8] UE4Editor-TowerDefenseC-8238.dll
[2021.04.03-06.34.24:579][ 87]CompilerResultsLog:      Creating library E:\GAMPRG2\TowerDefenseC\TowerDefenseC\Intermediate\Build\Win64\UE4Editor\Development\TowerDefenseC\UE4Editor-TowerDefenseC-8238.suppressed.lib and object E:\GAMPRG2\TowerDefenseC\TowerDefenseC\Intermediate\Build\Win64\UE4Editor\Development\TowerDefenseC\UE4Editor-TowerDefenseC-8238.suppressed.exp
[2021.04.03-06.34.24:579][ 87]CompilerResultsLog:   [8/8] TowerDefenseCEditor.target
[2021.04.03-06.34.24:579][ 87]CompilerResultsLog: Total time in Parallel executor: 3.40 seconds
[2021.04.03-06.34.24:579][ 87]CompilerResultsLog: Total execution time: 9.50 seconds
[2021.04.03-06.34.24:579][ 87]LogMainFrame: MainFrame: Module compiling took 9.613 seconds
[2021.04.03-06.34.24:628][ 87]LogClass: Could not find existing class Tower_Base in package /Script/TowerDefenseC for HotReload, assuming new class
[2021.04.03-06.34.24:628][ 87]LogClass: Function acquireTarget is new.
[2021.04.03-06.34.24:628][ 87]LogClass: Function ActivateTower is new.
[2021.04.03-06.34.24:628][ 87]LogClass: Function BuffingStats is new.
[2021.04.03-06.34.24:628][ 87]LogClass: Function OnOverlapBegin is new.
[2021.04.03-06.34.24:628][ 87]LogClass: Function OnOverlapEnd is new.
[2021.04.03-06.34.24:628][ 87]LogClass: Function removeTarget is new.
[2021.04.03-06.34.24:628][ 87]LogClass: Function RotateToTarget is new.
[2021.04.03-06.34.24:633][ 87]LogClass: EnemyType HotReload.
[2021.04.03-06.34.24:633][ 87]LogClass: StatLevels HotReload.
[2021.04.03-06.34.24:633][ 87]LogClass: TowerStats HotReload.
[2021.04.03-06.34.24:633][ 87]LogClass: SpawnDetails HotReload.
[2021.04.03-06.34.24:648][ 87]LogHotReload: Re-instancing Tower_Base after hot-reload.
[2021.04.03-06.34.24:654][ 87]LogActor: Warning: Turret_C /Game/TDLevel.TDLevel:PersistentLevel.Turret_2 has natively added scene component(s), but none of them were set as the actor's RootComponent - picking one arbitrarily
[2021.04.03-06.34.24:655][ 87]LogActor: Warning: Turret_C /Engine/Transient.World_8:PersistentLevel.Turret_C_0 has natively added scene component(s), but none of them were set as the actor's RootComponent - picking one arbitrarily
[2021.04.03-06.34.24:655][ 87]LogActor: Warning: Turret_C /Engine/Transient.World_0:PersistentLevel.Turret_C_3 has natively added scene component(s), but none of them were set as the actor's RootComponent - picking one arbitrarily
[2021.04.03-06.34.24:668][ 87]LogActor: Warning: Turret_C /Engine/Transient.World_0:PersistentLevel.Turret_C_4 has natively added scene component(s), but none of them were set as the actor's RootComponent - picking one arbitrarily
[2021.04.03-06.34.24:691][ 87]LogContentBrowser: Native class hierarchy updated for 'TowerDefenseC' in 0.0003 seconds. Added 18 classes and 2 folders.
[2021.04.03-06.34.24:694][ 87]Display: HotReload successful (10 functions remapped  3 scriptstructs remapped)
