{
  "name": "Hero",
  "fields": [
    {
      "fieldName": "heroName",
      "fieldType": "String",
      "fieldValidateRules": ["minlength", "maxlength", "required"],
      "fieldValidateRulesMinlength": "5",
      "fieldValidateRulesMaxlength": "15"
    },
    {
      "fieldName": "age",
      "fieldType": "Integer",
      "fieldValidateRules": ["required"]
    },
    {
      "fieldName": "gender",
      "fieldType": "Gender",
      "fieldValues": "MALE,FEMALE,BINARY",
      "fieldValidateRules": ["required"]
    },
    {
      "fieldName": "notes",
      "fieldType": "String",
      "fieldValidateRules": ["maxlength"],
      "fieldValidateRulesMaxlength": "35"
    },
    {
      "fieldName": "signs",
      "fieldType": "String",
      "fieldValidateRules": ["maxlength"],
      "fieldValidateRulesMaxlength": "10"
    }
  ],
  "relationships": [],
  "changelogDate": "20201105163352",
  "entityTableName": "hero",
  "dto": "no",
  "pagination": "no",
  "service": "no",
  "jpaMetamodelFiltering": false,
  "fluentMethods": true,
  "readOnly": false,
  "embedded": false,
  "clientRootFolder": "",
  "applications": ["lunaheroes"]
}
