{
    "name": "Video URL",
    "description": "A Storefront Page Type",
    "group": "commerce assets",
    "attribute_definition_groups": [
        {
            "id": "PlayYTVideo",
            "name": "YoutTube Video",
            "description": "Play yt videos",
            "attribute_definitions": [
                {
                    "id": "ytvideo",
                    "name": "Youtube url",
                    "description": "Play yt videos",
                    "type": "string",
                    "required": false
                }
            ]
        }
    ],
    
    "region_definitions": []
}