chain, residue_label, residue_name, score, zscore, probability, pocket
A,  459, LEU,  0.4880,  -0.2106,   0.0082, 0
A,  460, PRO,  0.3787,  -0.2664,   0.0050, 0
A,  461, ALA,  0.2710,  -0.3215,   0.0029, 0
A,  462, ASP,  0.3452,  -0.2836,   0.0042, 0
A,  463, PRO,  0.1163,  -0.4005,   0.0010, 0
A,  464, LYS,  0.3368,  -0.2879,   0.0041, 0
A,  465, TRP,  0.9637,   0.0325,   0.0368, 0
A,  466, GLU,  0.2121,  -0.3516,   0.0020, 0
A,  467, LEU,  0.1937,  -0.3610,   0.0018, 0
A,  468, SER,  0.2479,  -0.3333,   0.0025, 0
A,  469, ARG,  0.3075,  -0.3028,   0.0035, 0
A,  470, ALA,  0.2425,  -0.3361,   0.0024, 0
A,  471, ARG,  0.3206,  -0.2961,   0.0037, 0
A,  472, LEU,  0.0492,  -0.4348,   0.0007, 0
A,  473, THR,  0.0661,  -0.4262,   0.0008, 0
A,  474, LEU,  0.5691,  -0.1692,   0.0110, 0
A,  475, GLY,  0.2055,  -0.3550,   0.0019, 0
A,  476, LYS,  0.4138,  -0.2485,   0.0060, 0
A,  477, PRO,  0.0984,  -0.4097,   0.0009, 0
A,  478, LEU,  1.9862,   0.5550,   0.2046, 1
A,  479, GLY,  1.1511,   0.1282,   0.0571, 1
A,  480, GLU,  0.6958,  -0.1044,   0.0173, 1
A,  481, GLY,  1.0891,   0.0966,   0.0499, 1
A,  482, ALA,  1.0142,   0.0583,   0.0418, 0
A,  483, PHE,  2.4382,   0.7860,   0.2980, 1
A,  484, GLY,  2.5005,   0.8178,   0.3099, 1
A,  485, GLN,  1.4911,   0.3020,   0.1083, 0
A,  486, VAL,  2.1628,   0.6453,   0.2414, 1
A,  487, VAL,  0.3662,  -0.2729,   0.0047, 0
A,  488, MET,  0.4242,  -0.2432,   0.0063, 0
A,  489, ALA,  0.0549,  -0.4319,   0.0007, 0
A,  490, GLU,  0.0946,  -0.4117,   0.0009, 0
A,  491, ALA,  0.0000,  -0.4600,   0.0005, 0
A,  492, ILE,  0.3020,  -0.3057,   0.0034, 0
A,  493, GLY,  0.2307,  -0.3421,   0.0022, 0
A,  494, ILE,  0.2855,  -0.3141,   0.0031, 0
A,  495, ASP,  0.0953,  -0.4113,   0.0009, 0
A,  496, LYS,  0.0678,  -0.4254,   0.0008, 0
A,  497, ASP,  0.0284,  -0.4455,   0.0006, 0
A,  498, ARG,  0.1809,  -0.3676,   0.0016, 0
A,  499, ALA,  0.0273,  -0.4460,   0.0006, 0
A,  500, ALA,  0.0375,  -0.4408,   0.0006, 0
A,  501, LYS,  0.2527,  -0.3308,   0.0026, 0
A,  502, PRO,  0.1393,  -0.3888,   0.0012, 0
A,  503, VAL,  0.1408,  -0.3880,   0.0013, 0
A,  504, THR,  0.3437,  -0.2844,   0.0042, 0
A,  505, VAL,  0.0000,  -0.4600,   0.0005, 0
A,  506, ALA,  0.9168,   0.0085,   0.0322, 1
A,  507, VAL,  0.0000,  -0.4600,   0.0005, 0
A,  508, LYS,  5.2950,   2.2459,   0.6866, 1
A,  509, MET,  1.4585,   0.2853,   0.1025, 1
A,  510, LEU,  1.4240,   0.2677,   0.0966, 1
A,  511, LYS,  0.4350,  -0.2377,   0.0066, 0
A,  512, ASP,  0.2813,  -0.3163,   0.0031, 0
A,  513, ASP,  0.2069,  -0.3543,   0.0019, 0
A,  514, ALA,  0.0946,  -0.4117,   0.0009, 0
A,  515, THR,  0.3841,  -0.2637,   0.0052, 0
A,  516, ASP,  0.0856,  -0.4163,   0.0009, 0
A,  517, LYS,  1.3704,   0.2403,   0.0882, 0
A,  518, ASP,  0.9746,   0.0380,   0.0378, 1
A,  519, LEU,  0.7361,  -0.0838,   0.0198, 0
A,  520, SER,  0.4766,  -0.2164,   0.0078, 0
A,  521, ASP,  2.3062,   0.7185,   0.2706, 1
A,  522, LEU,  1.0435,   0.0733,   0.0449, 1
A,  523, VAL,  0.3767,  -0.2675,   0.0050, 0
A,  524, SER,  1.0628,   0.0832,   0.0470, 0
A,  525, GLU,  4.3496,   1.7628,   0.5920, 1
A,  526, MET,  0.2668,  -0.3236,   0.0028, 0
A,  527, GLU,  0.3789,  -0.2664,   0.0050, 0
A,  528, MET,  0.2514,  -0.3315,   0.0026, 0
A,  529, MET,  0.6013,  -0.1527,   0.0125, 1
A,  530, LYS,  0.9077,   0.0039,   0.0315, 0
A,  531, MET,  0.4700,  -0.2198,   0.0077, 0
A,  532, ILE,  0.5059,  -0.2014,   0.0087, 0
A,  533, GLY,  0.6004,  -0.1532,   0.0124, 0
A,  534, LYS,  1.0591,   0.0813,   0.0466, 0
A,  535, HIS,  0.7225,  -0.0908,   0.0189, 0
A,  536, LYS,  0.6961,  -0.1043,   0.0174, 0
A,  537, ASN,  0.4097,  -0.2506,   0.0059, 0
A,  538, ILE,  0.1355,  -0.3907,   0.0012, 0
A,  539, ILE,  0.6730,  -0.1161,   0.0161, 1
A,  540, ASN,  0.7544,  -0.0745,   0.0209, 0
A,  541, LEU,  0.6796,  -0.1127,   0.0164, 0
A,  542, LEU,  0.4977,  -0.2057,   0.0085, 0
A,  543, GLY,  0.1590,  -0.3787,   0.0014, 0
A,  544, ALA,  0.1084,  -0.4046,   0.0010, 0
A,  545, CYS,  0.0000,  -0.4600,   0.0005, 0
A,  546, THR,  0.3275,  -0.2926,   0.0039, 0
A,  547, GLN,  0.1542,  -0.3812,   0.0014, 0
A,  548, GLY,  0.0679,  -0.4253,   0.0008, 0
A,  549, GLY,  0.5969,  -0.1550,   0.0123, 0
A,  550, PRO,  0.9803,   0.0410,   0.0383, 0
A,  551, LEU,  0.7878,  -0.0574,   0.0230, 0
A,  552, TYR,  0.7453,  -0.0791,   0.0204, 0
A,  553, VAL,  0.1110,  -0.4033,   0.0010, 0
A,  554, LEU,  0.0000,  -0.4600,   0.0005, 0
A,  555, VAL,  0.6947,  -0.1050,   0.0173, 1
A,  556, GLU,  0.6530,  -0.1263,   0.0150, 0
A,  557, TYR,  0.8607,  -0.0201,   0.0279, 1
A,  558, ALA,  1.1898,   0.1480,   0.0619, 1
A,  559, ALA,  0.6891,  -0.1078,   0.0170, 1
A,  560, LYS,  1.6082,   0.3619,   0.1290, 0
A,  561, GLY,  1.0936,   0.0989,   0.0504, 1
A,  562, ASN,  1.3536,   0.2318,   0.0857, 1
A,  563, LEU,  0.1003,  -0.4088,   0.0009, 0
A,  564, ARG,  0.9570,   0.0291,   0.0362, 0
A,  565, GLU,  0.3162,  -0.2984,   0.0037, 0
A,  566, PHE,  1.0933,   0.0987,   0.0504, 3
A,  567, LEU,  0.0924,  -0.4128,   0.0009, 0
A,  568, ARG,  0.6573,  -0.1241,   0.0153, 0
A,  569, ALA,  0.1930,  -0.3614,   0.0017, 0
A,  570, ARG,  1.1830,   0.1446,   0.0610, 0
A,  571, ARG,  0.9895,   0.0457,   0.0392, 0
A,  572, PRO,  0.4493,  -0.2304,   0.0071, 0
A,  573, PRO,  0.2485,  -0.3330,   0.0025, 0
A,  574, GLY,  0.1407,  -0.3881,   0.0013, 0
A,  575, LEU,  0.1740,  -0.3711,   0.0016, 0
A,  576, ASP,  0.0761,  -0.4211,   0.0008, 0
A,  577, TYR,  0.2442,  -0.3352,   0.0025, 0
A,  578, SER,  0.0855,  -0.4163,   0.0009, 0
A,  579, PHE,  0.4067,  -0.2522,   0.0058, 0
A,  580, ASP,  0.1538,  -0.3814,   0.0014, 0
A,  581, THR,  0.1692,  -0.3735,   0.0015, 0
A,  582, SER,  0.1637,  -0.3763,   0.0015, 0
A,  587, GLU,  0.7026,  -0.1009,   0.0177, 0
A,  588, GLN,  0.3507,  -0.2808,   0.0043, 0
A,  589, LEU,  0.7024,  -0.1010,   0.0177, 3
A,  590, THR,  0.2907,  -0.3114,   0.0032, 0
A,  591, PHE,  0.5693,  -0.1691,   0.0110, 0
A,  592, LYS,  0.3840,  -0.2638,   0.0052, 0
A,  593, ASP,  0.4785,  -0.2154,   0.0079, 3
A,  594, LEU,  0.4437,  -0.2333,   0.0069, 0
A,  595, VAL,  0.0278,  -0.4458,   0.0006, 0
A,  596, SER,  0.8663,  -0.0173,   0.0283, 3
A,  597, CYS,  0.3271,  -0.2928,   0.0039, 3
A,  598, ALA,  0.0000,  -0.4600,   0.0005, 0
A,  599, TYR,  0.8502,  -0.0255,   0.0271, 0
A,  600, GLN,  0.7646,  -0.0692,   0.0216, 3
A,  601, VAL,  0.0000,  -0.4600,   0.0005, 0
A,  602, ALA,  0.0000,  -0.4600,   0.0005, 0
A,  603, ARG,  0.8790,  -0.0108,   0.0293, 0
A,  604, GLY,  0.0000,  -0.4600,   0.0005, 0
A,  605, MET,  0.1618,  -0.3773,   0.0015, 0
A,  606, GLU,  0.4618,  -0.2240,   0.0074, 2
A,  607, TYR,  0.5349,  -0.1866,   0.0097, 0
A,  608, LEU,  0.0000,  -0.4600,   0.0005, 0
A,  609, ALA,  0.5849,  -0.1611,   0.0117, 2
A,  610, SER,  0.2037,  -0.3559,   0.0019, 2
A,  611, GLN,  0.2387,  -0.3380,   0.0024, 0
A,  612, LYS,  0.2537,  -0.3304,   0.0026, 0
A,  613, CYS,  0.1408,  -0.3880,   0.0013, 0
A,  614, ILE,  0.0000,  -0.4600,   0.0005, 0
A,  615, HIS,  0.0000,  -0.4600,   0.0005, 0
A,  616, ARG,  0.9532,   0.0272,   0.0358, 0
A,  617, ASP,  2.7386,   0.9395,   0.3546, 1
A,  618, LEU,  0.0000,  -0.4600,   0.0005, 0
A,  619, ALA,  0.0000,  -0.4600,   0.0005, 0
A,  620, ALA,  0.0000,  -0.4600,   0.0005, 0
A,  621, ARG,  2.2573,   0.6936,   0.2602, 1
A,  622, ASN,  1.8270,   0.4737,   0.1717, 1
A,  623, VAL,  0.0000,  -0.4600,   0.0005, 0
A,  624, LEU,  2.4665,   0.8005,   0.3035, 1
A,  625, VAL,  0.0000,  -0.4600,   0.0005, 0
A,  626, THR,  0.4200,  -0.2454,   0.0062, 0
A,  627, GLU,  0.5278,  -0.1903,   0.0094, 0
A,  628, ASP,  0.4664,  -0.2217,   0.0076, 0
A,  629, ASN,  1.2384,   0.1729,   0.0686, 3
A,  630, VAL,  0.3506,  -0.2808,   0.0043, 0
A,  631, MET,  0.2811,  -0.3163,   0.0031, 3
A,  632, LYS,  0.4020,  -0.2545,   0.0057, 0
A,  633, ILE,  0.0000,  -0.4600,   0.0005, 0
A,  634, ALA,  1.5137,   0.3136,   0.1121, 1
A,  635, ASP,  5.1042,   2.1484,   0.6695, 1
A,  636, PHE,  1.4324,   0.2720,   0.0980, 0
A,  637, GLY,  3.9505,   1.5588,   0.5423, 1
A,  638, LEU,  2.2721,   0.7011,   0.2633, 1
A,  639, ALA,  0.4097,  -0.2506,   0.0059, 0
A,  640, ARG,  1.8189,   0.4695,   0.1699, 0
A,  641, ASP,  0.2733,  -0.3203,   0.0029, 0
A,  642, VAL,  0.1962,  -0.3597,   0.0018, 0
A,  643, HIS,  0.2963,  -0.3086,   0.0033, 0
A,  644, ASN,  0.2551,  -0.3297,   0.0026, 0
A,  645, LEU,  0.3307,  -0.2910,   0.0039, 0
A,  646, ASP,  0.3644,  -0.2738,   0.0047, 0
A,  647, TYR,  0.7719,  -0.0655,   0.0220, 0
A,  648, TYR,  0.8860,  -0.0072,   0.0299, 0
A,  649, LYS,  0.3359,  -0.2883,   0.0040, 0
A,  650, GLU,  1.0076,   0.0549,   0.0411, 0
A,  651, THR,  0.0754,  -0.4214,   0.0008, 0
A,  652, THR,  1.2046,   0.1556,   0.0640, 0
A,  653, ASN,  0.3857,  -0.2629,   0.0052, 0
A,  654, GLY,  0.5862,  -0.1604,   0.0118, 0
A,  655, ARG,  5.4989,   2.3501,   0.7050, 1
A,  656, LEU,  0.6674,  -0.1189,   0.0158, 0
A,  657, PRO,  0.7629,  -0.0701,   0.0215, 0
A,  658, VAL,  0.7638,  -0.0696,   0.0216, 4
A,  659, LYS,  1.1239,   0.1144,   0.0539, 0
A,  660, TRP,  1.7852,   0.4523,   0.1627, 0
A,  661, MET,  0.7613,  -0.0709,   0.0214, 0
A,  662, ALA,  0.5907,  -0.1581,   0.0120, 0
A,  663, PRO,  0.4684,  -0.2206,   0.0076, 0
A,  664, GLU,  0.4849,  -0.2122,   0.0081, 0
A,  665, ALA,  0.5784,  -0.1644,   0.0114, 0
A,  666, LEU,  0.9418,   0.0213,   0.0346, 4
A,  667, PHE,  1.1288,   0.1169,   0.0544, 4
A,  668, ASP,  0.2943,  -0.3096,   0.0033, 0
A,  669, ARG,  0.2055,  -0.3549,   0.0019, 0
A,  670, VAL,  0.4948,  -0.2071,   0.0084, 0
A,  671, TYR,  0.6645,  -0.1204,   0.0156, 0
A,  672, THR,  0.7051,  -0.0997,   0.0179, 0
A,  673, HIS,  0.7795,  -0.0616,   0.0225, 2
A,  674, GLN,  0.6559,  -0.1248,   0.0152, 2
A,  675, SER,  0.4333,  -0.2386,   0.0066, 0
A,  676, ASP,  0.4927,  -0.2082,   0.0083, 0
A,  677, VAL,  0.0000,  -0.4600,   0.0005, 0
A,  678, TRP,  1.0908,   0.0975,   0.0501, 0
A,  679, SER,  0.3815,  -0.2650,   0.0051, 0
A,  680, PHE,  0.0000,  -0.4600,   0.0005, 0
A,  681, GLY,  0.0000,  -0.4600,   0.0005, 0
A,  682, VAL,  0.0000,  -0.4600,   0.0005, 0
A,  683, LEU,  0.0000,  -0.4600,   0.0005, 0
A,  684, LEU,  0.0000,  -0.4600,   0.0005, 0
A,  685, TRP,  0.6567,  -0.1244,   0.0152, 0
A,  686, GLU,  0.0000,  -0.4600,   0.0005, 0
A,  687, ILE,  0.0000,  -0.4600,   0.0005, 0
A,  688, PHE,  0.1970,  -0.3593,   0.0018, 0
A,  689, THR,  0.7787,  -0.0620,   0.0224, 0
A,  690, LEU,  0.6989,  -0.1029,   0.0175, 0
A,  691, GLY,  0.5125,  -0.1981,   0.0089, 0
A,  692, GLY,  0.6309,  -0.1376,   0.0139, 0
A,  693, SER,  0.9828,   0.0422,   0.0386, 0
A,  694, PRO,  0.7324,  -0.0857,   0.0196, 0
A,  695, TYR,  0.9969,   0.0495,   0.0400, 0
A,  696, PRO,  0.7547,  -0.0743,   0.0210, 0
A,  697, GLY,  0.2374,  -0.3387,   0.0024, 0
A,  698, ILE,  1.1328,   0.1189,   0.0549, 0
A,  699, PRO,  0.2021,  -0.3567,   0.0019, 0
A,  700, VAL,  0.5281,  -0.1901,   0.0094, 4
A,  701, GLU,  0.1791,  -0.3685,   0.0016, 0
A,  702, GLU,  0.2157,  -0.3497,   0.0020, 0
A,  703, LEU,  0.0000,  -0.4600,   0.0005, 0
A,  704, PHE,  0.9528,   0.0269,   0.0358, 4
A,  705, LYS,  0.0682,  -0.4252,   0.0008, 0
A,  706, LEU,  0.8811,  -0.0097,   0.0295, 0
A,  707, LEU,  0.9077,   0.0039,   0.0315, 0
A,  708, LYS,  0.6045,  -0.1511,   0.0126, 0
A,  709, GLU,  0.1224,  -0.3975,   0.0011, 0
A,  710, GLY,  0.3895,  -0.2609,   0.0053, 0
A,  711, HIS,  1.5228,   0.3182,   0.1137, 0
A,  712, ARG,  1.3680,   0.2391,   0.0879, 0
A,  713, MET,  0.6817,  -0.1116,   0.0165, 0
A,  714, ASP,  0.3877,  -0.2619,   0.0053, 0
A,  715, LYS,  0.3974,  -0.2569,   0.0055, 0
A,  716, PRO,  0.2617,  -0.3262,   0.0028, 0
A,  717, ALA,  0.2168,  -0.3492,   0.0021, 0
A,  718, ASN,  0.6576,  -0.1239,   0.0153, 0
A,  719, CYS,  0.2199,  -0.3476,   0.0021, 0
A,  720, THR,  0.4719,  -0.2188,   0.0077, 0
A,  721, HIS,  0.3791,  -0.2662,   0.0050, 0
A,  722, ASP,  0.3272,  -0.2928,   0.0039, 0
A,  723, LEU,  0.0000,  -0.4600,   0.0005, 0
A,  724, TYR,  0.2780,  -0.3179,   0.0030, 0
A,  725, MET,  0.7064,  -0.0990,   0.0180, 0
A,  726, ILE,  0.3583,  -0.2769,   0.0045, 0
A,  727, MET,  0.0000,  -0.4600,   0.0005, 0
A,  728, ARG,  0.4893,  -0.2099,   0.0082, 0
A,  729, GLU,  0.4641,  -0.2228,   0.0075, 0
A,  730, CYS,  0.0000,  -0.4600,   0.0005, 0
A,  731, TRP,  0.9699,   0.0357,   0.0373, 0
A,  732, HIS,  0.6582,  -0.1236,   0.0153, 0
A,  733, ALA,  0.7763,  -0.0633,   0.0223, 0
A,  734, ALA,  0.5744,  -0.1665,   0.0112, 0
A,  735, PRO,  0.3504,  -0.2809,   0.0043, 0
A,  736, SER,  0.1109,  -0.4033,   0.0010, 0
A,  737, GLN,  0.1186,  -0.3994,   0.0010, 0
A,  738, ARG,  0.1382,  -0.3894,   0.0012, 0
A,  739, PRO,  0.3617,  -0.2752,   0.0046, 0
A,  740, THR,  0.4457,  -0.2322,   0.0069, 2
A,  741, PHE,  0.4932,  -0.2079,   0.0083, 2
A,  742, LYS,  0.2600,  -0.3271,   0.0027, 2
A,  743, GLN,  0.1713,  -0.3724,   0.0015, 0
A,  744, LEU,  0.0000,  -0.4600,   0.0005, 0
A,  745, VAL,  0.0867,  -0.4157,   0.0009, 0
A,  746, GLU,  0.0597,  -0.4295,   0.0007, 0
A,  747, ASP,  0.4053,  -0.2528,   0.0058, 0
A,  748, LEU,  0.0000,  -0.4600,   0.0005, 0
A,  749, ASP,  0.3411,  -0.2857,   0.0041, 0
A,  750, ARG,  0.2584,  -0.3280,   0.0027, 0
A,  751, VAL,  0.1867,  -0.3646,   0.0017, 0
A,  752, LEU,  0.7304,  -0.0867,   0.0194, 0
A,  753, THR,  0.0571,  -0.4308,   0.0007, 0
A,  754, VAL,  0.1627,  -0.3769,   0.0015, 0
A,  755, THR,  0.2770,  -0.3185,   0.0030, 0
