chain, residue_label, residue_name, score, zscore, probability, pocket
A,  464, GLU,  0.1986,  -0.3585,   0.0018, 0
A,  465, LEU,  0.7537,  -0.0748,   0.0209, 0
A,  466, PRO,  0.8527,  -0.0242,   0.0273, 0
A,  467, GLU,  0.6154,  -0.1455,   0.0132, 0
A,  468, ASP,  0.5576,  -0.1751,   0.0105, 0
A,  469, PRO,  0.0481,  -0.4354,   0.0007, 0
A,  470, ARG,  0.2803,  -0.3168,   0.0031, 0
A,  471, TRP,  0.9337,   0.0171,   0.0338, 0
A,  472, GLU,  0.6209,  -0.1427,   0.0134, 0
A,  473, LEU,  0.2329,  -0.3410,   0.0023, 0
A,  474, PRO,  0.2184,  -0.3484,   0.0021, 0
A,  475, ARG,  0.1538,  -0.3814,   0.0014, 0
A,  476, ASP,  0.0509,  -0.4340,   0.0007, 0
A,  477, ARG,  0.2358,  -0.3395,   0.0023, 0
A,  478, LEU,  0.0826,  -0.4178,   0.0009, 0
A,  479, VAL,  0.0943,  -0.4118,   0.0009, 0
A,  480, LEU,  0.6943,  -0.1052,   0.0173, 0
A,  481, GLY,  0.3550,  -0.2786,   0.0044, 0
A,  482, LYS,  0.3990,  -0.2561,   0.0056, 0
A,  483, PRO,  0.1552,  -0.3807,   0.0014, 0
A,  484, LEU,  0.8712,  -0.0148,   0.0287, 3
A,  485, GLY,  0.3863,  -0.2626,   0.0052, 1
A,  486, GLU,  0.3148,  -0.2991,   0.0036, 1
A,  487, GLY,  0.3655,  -0.2732,   0.0047, 1
A,  488, ALA,  0.3363,  -0.2881,   0.0040, 1
A,  489, PHE,  1.6947,   0.4060,   0.1450, 1
A,  490, GLY,  1.0928,   0.0985,   0.0503, 1
A,  491, GLN,  0.7906,  -0.0559,   0.0231, 1
A,  492, VAL,  0.9451,   0.0230,   0.0350, 1
A,  493, VAL,  0.4564,  -0.2267,   0.0073, 0
A,  494, LEU,  0.3436,  -0.2844,   0.0042, 0
A,  495, ALA,  0.0000,  -0.4600,   0.0005, 0
A,  496, GLU,  0.0635,  -0.4276,   0.0008, 0
A,  497, ALA,  0.0000,  -0.4600,   0.0005, 0
A,  498, ILE,  0.0813,  -0.4184,   0.0009, 0
A,  499, GLY,  0.1333,  -0.3919,   0.0012, 0
A,  500, LEU,  0.2949,  -0.3093,   0.0033, 0
A,  501, ASP,  0.1515,  -0.3826,   0.0014, 0
A,  502, LYS,  0.2621,  -0.3260,   0.0028, 0
A,  503, ASP,  0.0568,  -0.4309,   0.0007, 0
A,  504, LYS,  0.2528,  -0.3308,   0.0026, 0
A,  505, PRO,  0.1183,  -0.3995,   0.0010, 0
A,  506, ASN,  0.1383,  -0.3893,   0.0012, 0
A,  507, ARG,  0.6477,  -0.1290,   0.0148, 0
A,  508, VAL,  0.1127,  -0.4024,   0.0010, 0
A,  509, THR,  0.1770,  -0.3695,   0.0016, 0
A,  510, LYS,  0.3871,  -0.2622,   0.0052, 0
A,  511, VAL,  0.0000,  -0.4600,   0.0005, 0
A,  512, ALA,  0.5450,  -0.1815,   0.0100, 3
A,  513, VAL,  0.0000,  -0.4600,   0.0005, 0
A,  514, LYS,  3.7055,   1.4337,   0.5054, 1
A,  515, MET,  1.1299,   0.1174,   0.0545, 1
A,  516, LEU,  1.2496,   0.1786,   0.0701, 1
A,  517, LYS,  0.4507,  -0.2297,   0.0071, 0
A,  518, SER,  0.1041,  -0.4068,   0.0010, 0
A,  519, ASP,  0.1150,  -0.4012,   0.0010, 0
A,  520, ALA,  0.1238,  -0.3967,   0.0011, 0
A,  521, THR,  0.1983,  -0.3587,   0.0018, 0
A,  522, GLU,  0.0418,  -0.4386,   0.0007, 0
A,  523, LYS,  0.4080,  -0.2515,   0.0058, 1
A,  524, ASP,  0.7643,  -0.0694,   0.0216, 1
A,  525, LEU,  1.2018,   0.1542,   0.0636, 0
A,  526, SER,  0.2862,  -0.3137,   0.0032, 0
A,  527, ASP,  1.8314,   0.4759,   0.1727, 1
A,  528, LEU,  1.0288,   0.0658,   0.0434, 1
A,  529, ILE,  0.6142,  -0.1461,   0.0131, 0
A,  530, SER,  0.3764,  -0.2677,   0.0050, 0
A,  531, GLU,  3.2399,   1.1957,   0.4409, 1
A,  532, MET,  0.7349,  -0.0844,   0.0197, 0
A,  533, GLU,  0.7231,  -0.0905,   0.0190, 0
A,  534, MET,  0.2709,  -0.3216,   0.0029, 0
A,  535, MET,  0.4715,  -0.2190,   0.0077, 3
A,  536, LYS,  0.9887,   0.0453,   0.0391, 0
A,  537, MET,  0.7652,  -0.0689,   0.0217, 0
A,  538, ILE,  0.3718,  -0.2700,   0.0048, 0
A,  539, GLY,  0.4127,  -0.2491,   0.0060, 0
A,  540, LYS,  0.5820,  -0.1625,   0.0116, 0
A,  541, HIS,  0.8304,  -0.0356,   0.0257, 0
A,  542, LYS,  1.5580,   0.3362,   0.1200, 13
A,  543, ASN,  0.0000,  -0.4600,   0.0005, 0
A,  544, ILE,  0.1631,  -0.3767,   0.0015, 0
A,  545, ILE,  0.6050,  -0.1508,   0.0127, 0
A,  546, ASN,  0.6237,  -0.1413,   0.0136, 0
A,  547, LEU,  0.6113,  -0.1476,   0.0130, 0
A,  548, LEU,  0.4058,  -0.2526,   0.0058, 0
A,  549, GLY,  0.5170,  -0.1958,   0.0091, 0
A,  550, ALA,  0.4982,  -0.2054,   0.0085, 0
A,  551, CYS,  0.5301,  -0.1891,   0.0095, 0
A,  552, THR,  0.8929,  -0.0037,   0.0304, 0
A,  553, GLN,  0.2506,  -0.3319,   0.0026, 0
A,  554, ASP,  0.0770,  -0.4206,   0.0008, 0
A,  555, GLY,  0.8572,  -0.0219,   0.0276, 0
A,  556, PRO,  1.4210,   0.2662,   0.0961, 0
A,  557, LEU,  1.4734,   0.2929,   0.1051, 0
A,  558, TYR,  0.9540,   0.0275,   0.0359, 0
A,  559, VAL,  0.0000,  -0.4600,   0.0005, 0
A,  560, ILE,  0.0000,  -0.4600,   0.0005, 0
A,  561, VAL,  0.5401,  -0.1840,   0.0099, 3
A,  562, GLU,  1.2995,   0.2041,   0.0766, 3
A,  563, TYR,  0.9356,   0.0181,   0.0340, 3
A,  564, ALA,  0.7474,  -0.0781,   0.0205, 3
A,  565, SER,  0.6359,  -0.1350,   0.0142, 0
A,  566, LYS,  0.5948,  -0.1560,   0.0122, 0
A,  567, GLY,  0.5492,  -0.1793,   0.0102, 3
A,  568, ASN,  0.6696,  -0.1178,   0.0159, 3
A,  569, LEU,  0.1379,  -0.3895,   0.0012, 0
A,  570, ARG,  1.1056,   0.1050,   0.0517, 0
A,  571, GLU,  0.3723,  -0.2697,   0.0049, 3
A,  572, TYR,  1.1462,   0.1258,   0.0565, 0
A,  573, LEU,  0.0000,  -0.4600,   0.0005, 0
A,  574, GLN,  0.4360,  -0.2372,   0.0067, 0
A,  575, ALA,  0.4404,  -0.2349,   0.0068, 0
A,  576, ARG,  0.6877,  -0.1085,   0.0169, 0
A,  577, ARG,  1.1956,   0.1510,   0.0627, 0
A,  578, PRO,  1.1511,   0.1283,   0.0571, 0
A,  579, PRO,  0.5131,  -0.1978,   0.0089, 0
A,  580, GLY,  0.3624,  -0.2748,   0.0046, 0
A,  581, LEU,  0.1968,  -0.3594,   0.0018, 0
A,  582, GLU,  0.0970,  -0.4104,   0.0009, 0
A,  583, PHE,  0.6575,  -0.1240,   0.0153, 0
A,  584, SER,  0.2458,  -0.3344,   0.0025, 0
A,  585, PHE,  0.5502,  -0.1788,   0.0102, 0
A,  586, ASN,  0.1774,  -0.3694,   0.0016, 0
A,  587, PRO,  0.1112,  -0.4032,   0.0010, 0
A,  588, SER,  0.0949,  -0.4115,   0.0009, 0
A,  589, HIS,  0.4833,  -0.2130,   0.0080, 0
A,  590, ASN,  0.1944,  -0.3607,   0.0018, 0
A,  591, PRO,  0.0918,  -0.4131,   0.0009, 0
A,  592, GLU,  0.1547,  -0.3809,   0.0014, 4
A,  593, GLU,  0.3666,  -0.2727,   0.0047, 4
A,  594, GLN,  0.2755,  -0.3192,   0.0030, 0
A,  595, LEU,  1.0038,   0.0530,   0.0407, 4
A,  596, SER,  0.4370,  -0.2367,   0.0067, 0
A,  597, SER,  0.6719,  -0.1166,   0.0160, 12
A,  598, LYS,  1.1093,   0.1069,   0.0522, 4
A,  599, ASP,  1.4450,   0.2784,   0.1002, 4
A,  600, LEU,  0.9454,   0.0232,   0.0350, 0
A,  601, VAL,  0.3090,  -0.3021,   0.0035, 12
A,  602, SER,  0.8286,  -0.0366,   0.0255, 4
A,  603, CYS,  0.4927,  -0.2082,   0.0083, 4
A,  604, ALA,  0.0000,  -0.4600,   0.0005, 0
A,  605, TYR,  1.2686,   0.1883,   0.0726, 0
A,  606, GLN,  0.5868,  -0.1601,   0.0118, 4
A,  607, VAL,  0.1379,  -0.3895,   0.0012, 0
A,  608, ALA,  0.0000,  -0.4600,   0.0005, 0
A,  609, ARG,  1.7360,   0.4272,   0.1526, 2
A,  610, GLY,  0.0000,  -0.4600,   0.0005, 0
A,  611, MET,  0.0000,  -0.4600,   0.0005, 0
A,  612, GLU,  1.2400,   0.1737,   0.0688, 2
A,  613, TYR,  0.4734,  -0.2181,   0.0078, 0
A,  614, LEU,  0.0000,  -0.4600,   0.0005, 0
A,  615, ALA,  0.6026,  -0.1520,   0.0125, 7
A,  616, SER,  0.9060,   0.0030,   0.0314, 7
A,  617, LYS,  0.7005,  -0.1020,   0.0176, 0
A,  618, LYS,  0.5863,  -0.1604,   0.0118, 0
A,  619, CYS,  0.0000,  -0.4600,   0.0005, 0
A,  620, ILE,  0.3038,  -0.3047,   0.0035, 5
A,  621, HIS,  0.0000,  -0.4600,   0.0005, 0
A,  622, ARG,  0.9622,   0.0317,   0.0366, 5
A,  623, ASP,  2.6218,   0.8799,   0.3322, 1
A,  624, LEU,  0.0000,  -0.4600,   0.0005, 0
A,  625, ALA,  0.0000,  -0.4600,   0.0005, 0
A,  626, ALA,  0.0000,  -0.4600,   0.0005, 0
A,  627, ARG,  2.0469,   0.5860,   0.2169, 1
A,  628, ASN,  1.7031,   0.4103,   0.1464, 1
A,  629, VAL,  0.1391,  -0.3889,   0.0012, 0
A,  630, LEU,  1.1043,   0.1043,   0.0516, 3
A,  631, VAL,  0.0000,  -0.4600,   0.0005, 0
A,  632, THR,  0.7494,  -0.0770,   0.0206, 0
A,  633, GLU,  0.2246,  -0.3452,   0.0022, 0
A,  634, ASP,  1.7006,   0.4091,   0.1460, 4
A,  635, ASN,  1.4693,   0.2909,   0.1044, 4
A,  636, VAL,  1.0878,   0.0959,   0.0498, 13
A,  637, MET,  0.3935,  -0.2589,   0.0054, 0
A,  638, LYS,  0.9592,   0.0302,   0.0364, 0
A,  639, ILE,  0.0000,  -0.4600,   0.0005, 0
A,  640, ALA,  0.5764,  -0.1655,   0.0113, 1
A,  641, ASP,  3.9659,   1.5667,   0.5443, 1
A,  642, PHE,  0.0000,  -0.4600,   0.0005, 0
A,  643, GLY,  2.8760,   1.0097,   0.3815, 1
A,  644, LEU,  2.3459,   0.7389,   0.2789, 1
A,  645, ALA,  0.2425,  -0.3360,   0.0024, 0
A,  646, ARG,  1.0115,   0.0569,   0.0415, 5
A,  647, ASP,  0.4681,  -0.2208,   0.0076, 0
A,  648, ILE,  0.3440,  -0.2842,   0.0042, 5
A,  649, HIS,  0.7587,  -0.0723,   0.0212, 0
A,  650, HIS,  0.1727,  -0.3717,   0.0016, 0
A,  651, ILE,  0.2485,  -0.3330,   0.0025, 0
A,  652, ASP,  0.2562,  -0.3291,   0.0027, 0
A,  655, LYS,  0.5185,  -0.1950,   0.0091, 5
A,  656, LYS,  0.7892,  -0.0567,   0.0230, 5
A,  657, THR,  0.3156,  -0.2987,   0.0037, 5
A,  658, THR,  0.5090,  -0.1999,   0.0088, 5
A,  659, ASN,  0.1836,  -0.3662,   0.0017, 0
A,  660, GLY,  0.3211,  -0.2959,   0.0038, 0
A,  661, ARG,  0.6004,  -0.1532,   0.0124, 1
A,  662, LEU,  1.3286,   0.2190,   0.0816, 5
A,  663, PRO,  0.7730,  -0.0650,   0.0221, 1
A,  664, VAL,  1.2574,   0.1826,   0.0711, 0
A,  665, LYS,  0.7955,  -0.0535,   0.0234, 0
A,  666, TRP,  1.3315,   0.2204,   0.0822, 0
A,  667, MET,  0.9811,   0.0414,   0.0384, 0
A,  668, ALA,  0.3414,  -0.2855,   0.0041, 0
A,  669, PRO,  0.4262,  -0.2422,   0.0064, 0
A,  670, GLU,  0.3963,  -0.2575,   0.0055, 0
A,  671, ALA,  0.7406,  -0.0815,   0.0201, 0
A,  672, LEU,  1.4920,   0.3025,   0.1084, 0
A,  673, PHE,  1.1622,   0.1339,   0.0584, 0
A,  674, ASP,  0.2441,  -0.3352,   0.0025, 0
A,  675, ARG,  0.5427,  -0.1826,   0.0099, 0
A,  676, ILE,  0.2803,  -0.3168,   0.0031, 0
A,  677, TYR,  1.0387,   0.0708,   0.0444, 5
A,  678, THR,  0.3342,  -0.2892,   0.0040, 0
A,  679, HIS,  0.6531,  -0.1263,   0.0150, 7
A,  680, GLN,  0.5664,  -0.1706,   0.0109, 7
A,  681, SER,  0.2650,  -0.3246,   0.0028, 0
A,  682, ASP,  0.2408,  -0.3369,   0.0024, 0
A,  683, VAL,  0.3133,  -0.2999,   0.0036, 0
A,  684, TRP,  1.0551,   0.0792,   0.0462, 0
A,  685, SER,  0.2408,  -0.3369,   0.0024, 0
A,  686, PHE,  0.0000,  -0.4600,   0.0005, 0
A,  687, GLY,  0.0000,  -0.4600,   0.0005, 0
A,  688, VAL,  0.0000,  -0.4600,   0.0005, 0
A,  689, LEU,  0.0000,  -0.4600,   0.0005, 0
A,  690, LEU,  0.0000,  -0.4600,   0.0005, 0
A,  691, TRP,  0.8635,  -0.0187,   0.0281, 0
A,  692, GLU,  0.4790,  -0.2152,   0.0079, 0
A,  693, ILE,  0.4306,  -0.2399,   0.0065, 0
A,  694, PHE,  0.8520,  -0.0246,   0.0272, 12
A,  695, THR,  1.1105,   0.1075,   0.0523, 0
A,  696, LEU,  1.2271,   0.1671,   0.0672, 0
A,  697, GLY,  0.5439,  -0.1821,   0.0100, 0
A,  698, GLY,  0.8888,  -0.0058,   0.0301, 0
A,  699, SER,  1.4557,   0.2839,   0.1020, 0
A,  700, PRO,  0.7677,  -0.0677,   0.0218, 0
A,  701, TYR,  1.1550,   0.1302,   0.0576, 0
A,  702, PRO,  0.8263,  -0.0377,   0.0254, 0
A,  703, GLY,  0.1812,  -0.3674,   0.0016, 0
A,  704, VAL,  0.4777,  -0.2159,   0.0079, 0
A,  705, PRO,  0.1313,  -0.3929,   0.0012, 0
A,  706, VAL,  0.6634,  -0.1210,   0.0156, 0
A,  707, GLU,  0.3639,  -0.2740,   0.0047, 0
A,  708, GLU,  0.1583,  -0.3791,   0.0014, 0
A,  709, LEU,  0.1121,  -0.4027,   0.0010, 0
A,  710, PHE,  1.3104,   0.2097,   0.0784, 0
A,  711, LYS,  0.0468,  -0.4361,   0.0007, 0
A,  712, LEU,  0.4336,  -0.2384,   0.0066, 0
A,  713, LEU,  1.1011,   0.1027,   0.0512, 0
A,  714, LYS,  0.7123,  -0.0960,   0.0183, 0
A,  715, GLU,  0.2304,  -0.3422,   0.0022, 0
A,  716, GLY,  0.6246,  -0.1408,   0.0136, 0
A,  717, HIS,  1.4435,   0.2777,   0.0999, 0
A,  718, ARG,  2.0696,   0.5976,   0.2215, 0
A,  719, MET,  0.9723,   0.0369,   0.0376, 0
A,  720, ASP,  0.5494,  -0.1792,   0.0102, 0
A,  721, LYS,  0.4677,  -0.2210,   0.0076, 0
A,  722, PRO,  0.4234,  -0.2436,   0.0063, 0
A,  723, SER,  0.5694,  -0.1690,   0.0110, 0
A,  724, ASN,  1.1272,   0.1160,   0.0542, 12
A,  725, CYS,  0.3985,  -0.2564,   0.0056, 12
A,  726, THR,  0.4897,  -0.2097,   0.0082, 12
A,  727, ASN,  0.1935,  -0.3611,   0.0018, 0
A,  728, GLU,  0.2292,  -0.3429,   0.0022, 11
A,  729, LEU,  0.2468,  -0.3339,   0.0025, 12
A,  730, TYR,  0.2217,  -0.3467,   0.0021, 0
A,  731, MET,  0.5041,  -0.2024,   0.0087, 0
A,  732, MET,  0.2808,  -0.3165,   0.0031, 11
A,  733, MET,  0.0000,  -0.4600,   0.0005, 0
A,  734, ARG,  0.8141,  -0.0439,   0.0246, 0
A,  735, ASP,  0.4156,  -0.2476,   0.0061, 11
A,  736, CYS,  0.0000,  -0.4600,   0.0005, 0
A,  737, TRP,  1.2515,   0.1796,   0.0703, 0
A,  738, HIS,  0.7927,  -0.0549,   0.0232, 0
A,  739, ALA,  0.9787,   0.0401,   0.0382, 0
A,  740, VAL,  0.4194,  -0.2457,   0.0062, 0
A,  741, PRO,  0.2170,  -0.3491,   0.0021, 0
A,  742, SER,  0.0933,  -0.4123,   0.0009, 0
A,  743, GLN,  0.0841,  -0.4170,   0.0009, 0
A,  744, ARG,  0.1504,  -0.3832,   0.0013, 0
A,  745, PRO,  0.5131,  -0.1978,   0.0089, 11
A,  746, THR,  0.6185,  -0.1439,   0.0133, 7
A,  747, PHE,  0.5575,  -0.1751,   0.0105, 7
A,  748, LYS,  0.4745,  -0.2175,   0.0078, 7
A,  749, GLN,  0.2854,  -0.3141,   0.0031, 11
A,  750, LEU,  0.0000,  -0.4600,   0.0005, 0
A,  751, VAL,  1.2912,   0.1999,   0.0755, 2
A,  752, GLU,  0.8068,  -0.0477,   0.0241, 2
A,  753, ASP,  0.2906,  -0.3115,   0.0032, 11
A,  754, LEU,  0.0000,  -0.4600,   0.0005, 0
A,  755, ASP,  1.5856,   0.3503,   0.1249, 2
A,  756, ARG,  0.1881,  -0.3639,   0.0017, 0
A,  757, ILE,  0.1721,  -0.3720,   0.0015, 0
A,  758, VAL,  0.0000,  -0.4600,   0.0005, 0
A,  759, ALA,  0.2635,  -0.3253,   0.0028, 2
A,  760, LEU,  0.1221,  -0.3976,   0.0011, 0
A,  761, THR,  0.3869,  -0.2623,   0.0052, 12
A,  762, SER,  0.2588,  -0.3278,   0.0027, 0
A,  763, ASN,  0.1610,  -0.3777,   0.0014, 0
A,  764, GLN,  0.7146,  -0.0948,   0.0185, 2
A,  765, GLU,  0.5399,  -0.1841,   0.0098, 2
A,  767, LEU,  0.5842,  -0.1615,   0.0117, 2
A,  768, ASP,  0.1637,  -0.3763,   0.0015, 0
A,  769, LEU,  0.3810,  -0.2653,   0.0051, 14
A,  770, SER,  0.0545,  -0.4321,   0.0007, 0
B,  545, HIS,  0.3193,  -0.2968,   0.0037, 0
B,  546, SER,  0.3216,  -0.2957,   0.0038, 10
B,  547, SER,  0.0948,  -0.4115,   0.0009, 0
B,  548, GLU,  0.6087,  -0.1489,   0.0129, 0
B,  549, LYS,  2.0876,   0.6069,   0.2252, 0
B,  550, TRP,  1.4353,   0.2735,   0.0985, 0
B,  551, PHE,  0.4025,  -0.2543,   0.0057, 0
B,  552, HIS,  0.9391,   0.0199,   0.0344, 0
B,  553, GLY,  0.3311,  -0.2908,   0.0039, 0
B,  554, LYS,  1.2993,   0.2040,   0.0766, 13
B,  555, LEU,  0.8085,  -0.0468,   0.0242, 0
B,  556, GLY,  0.6533,  -0.1261,   0.0151, 0
B,  557, ALA,  0.4260,  -0.2423,   0.0064, 0
B,  558, GLY,  0.5489,  -0.1795,   0.0102, 4
B,  559, ARG,  0.1642,  -0.3761,   0.0015, 0
B,  560, ASP,  0.1738,  -0.3712,   0.0016, 0
B,  561, GLY,  0.1218,  -0.3977,   0.0011, 0
B,  562, ARG,  0.5780,  -0.1646,   0.0114, 2
B,  563, HIS,  0.3689,  -0.2715,   0.0048, 0
B,  564, ILE,  0.5396,  -0.1842,   0.0098, 0
B,  565, ALA,  0.0000,  -0.4600,   0.0005, 0
B,  566, GLU,  0.1546,  -0.3810,   0.0014, 0
B,  567, ARG,  0.4520,  -0.2290,   0.0071, 0
B,  568, LEU,  0.4243,  -0.2432,   0.0063, 0
B,  569, LEU,  0.0000,  -0.4600,   0.0005, 0
B,  570, THR,  0.1456,  -0.3856,   0.0013, 0
B,  571, GLU,  0.3122,  -0.3005,   0.0036, 6
B,  572, TYR,  0.5155,  -0.1965,   0.0090, 0
B,  573, CYS,  0.5248,  -0.1918,   0.0093, 0
B,  574, ILE,  0.5193,  -0.1946,   0.0091, 0
B,  575, GLU,  0.3709,  -0.2704,   0.0048, 0
B,  576, THR,  0.2362,  -0.3393,   0.0023, 0
B,  577, GLY,  0.1917,  -0.3620,   0.0017, 0
B,  578, ALA,  0.5143,  -0.1972,   0.0090, 0
B,  579, PRO,  0.2828,  -0.3155,   0.0031, 0
B,  580, ASP,  0.4082,  -0.2514,   0.0058, 0
B,  581, GLY,  0.0000,  -0.4600,   0.0005, 0
B,  582, SER,  0.0297,  -0.4448,   0.0006, 0
B,  583, PHE,  0.0000,  -0.4600,   0.0005, 0
B,  584, LEU,  0.0000,  -0.4600,   0.0005, 0
B,  585, VAL,  0.0000,  -0.4600,   0.0005, 0
B,  586, ARG,  0.3335,  -0.2896,   0.0040, 2
B,  587, GLU,  0.5095,  -0.1996,   0.0088, 13
B,  588, SER,  0.7384,  -0.0826,   0.0199, 2
B,  589, GLU,  1.1293,   0.1171,   0.0545, 2
B,  590, THR,  0.7636,  -0.0697,   0.0216, 2
B,  591, PHE,  0.8343,  -0.0336,   0.0259, 2
B,  592, VAL,  1.0376,   0.0703,   0.0443, 4
B,  593, GLY,  0.6517,  -0.1269,   0.0150, 10
B,  594, ASP,  1.3535,   0.2317,   0.0856, 2
B,  595, TYR,  0.7133,  -0.0955,   0.0184, 10
B,  596, THR,  0.4084,  -0.2513,   0.0058, 2
B,  597, LEU,  0.0000,  -0.4600,   0.0005, 0
B,  598, SER,  0.0000,  -0.4600,   0.0005, 0
B,  599, PHE,  0.1504,  -0.3831,   0.0013, 14
B,  600, TRP,  0.6762,  -0.1144,   0.0162, 0
B,  601, ARG,  0.4202,  -0.2453,   0.0062, 14
B,  602, ASN,  0.4805,  -0.2144,   0.0080, 0
B,  603, GLY,  0.6499,  -0.1279,   0.0149, 0
B,  604, LYS,  0.4274,  -0.2416,   0.0064, 0
B,  605, VAL,  0.0918,  -0.4131,   0.0009, 0
B,  606, GLN,  0.2700,  -0.3220,   0.0029, 14
B,  607, HIS,  0.4556,  -0.2272,   0.0073, 2
B,  608, CYS,  0.5853,  -0.1609,   0.0117, 2
B,  609, ARG,  1.9600,   0.5416,   0.1996, 2
B,  610, ILE,  0.0000,  -0.4600,   0.0005, 0
B,  611, HIS,  1.3193,   0.2142,   0.0800, 2
B,  612, SER,  1.8306,   0.4755,   0.1725, 2
B,  613, ARG,  2.0625,   0.5940,   0.2200, 2
B,  614, GLN,  1.1357,   0.1204,   0.0552, 2
B,  615, ASP,  0.6843,  -0.1103,   0.0167, 2
B,  616, ALA,  0.1161,  -0.4006,   0.0010, 0
B,  617, GLY,  0.1841,  -0.3659,   0.0017, 0
B,  618, THR,  0.1914,  -0.3622,   0.0017, 0
B,  619, PRO,  0.3594,  -0.2763,   0.0045, 10
B,  620, LYS,  0.4980,  -0.2055,   0.0085, 0
B,  621, PHE,  0.4637,  -0.2230,   0.0075, 10
B,  622, PHE,  0.7295,  -0.0872,   0.0194, 2
B,  623, LEU,  0.2159,  -0.3496,   0.0020, 2
B,  624, THR,  0.5928,  -0.1571,   0.0121, 2
B,  625, ASP,  0.2153,  -0.3500,   0.0020, 2
B,  626, ASN,  0.6257,  -0.1402,   0.0137, 0
B,  627, LEU,  0.7404,  -0.0816,   0.0201, 0
B,  628, VAL,  0.5111,  -0.1988,   0.0089, 0
B,  629, PHE,  0.3044,  -0.3045,   0.0035, 0
B,  630, ASP,  0.1716,  -0.3723,   0.0015, 0
B,  631, SER,  0.2016,  -0.3570,   0.0019, 0
B,  632, LEU,  0.3633,  -0.2743,   0.0046, 10
B,  633, TYR,  1.8764,   0.4989,   0.1824, 0
B,  634, ASP,  0.3780,  -0.2668,   0.0050, 0
B,  635, LEU,  0.0000,  -0.4600,   0.0005, 0
B,  636, ILE,  0.8037,  -0.0493,   0.0239, 0
B,  637, THR,  1.0905,   0.0973,   0.0500, 0
B,  638, HIS,  0.7492,  -0.0771,   0.0206, 0
B,  639, TYR,  0.4926,  -0.2083,   0.0083, 0
B,  640, GLN,  1.1790,   0.1425,   0.0605, 0
B,  641, GLN,  0.1447,  -0.3860,   0.0013, 0
B,  642, VAL,  0.6627,  -0.1213,   0.0155, 0
B,  643, PRO,  0.5843,  -0.1614,   0.0117, 0
B,  644, LEU,  0.4879,  -0.2106,   0.0082, 14
B,  645, ARG,  0.8174,  -0.0423,   0.0248, 0
B,  646, CYS,  0.3494,  -0.2814,   0.0043, 14
B,  647, ASN,  0.0738,  -0.4223,   0.0008, 0
B,  648, GLU,  0.1170,  -0.4002,   0.0010, 0
B,  649, PHE,  0.1895,  -0.3631,   0.0017, 0
B,  650, GLU,  0.1626,  -0.3769,   0.0015, 0
B,  651, MET,  0.2452,  -0.3347,   0.0025, 14
B,  652, ARG,  0.1813,  -0.3674,   0.0016, 0
B,  653, LEU,  0.1356,  -0.3907,   0.0012, 0
B,  654, SER,  0.1337,  -0.3916,   0.0012, 0
B,  655, GLU,  0.2425,  -0.3361,   0.0024, 0
B,  656, PRO,  1.1870,   0.1466,   0.0615, 0
B,  657, VAL,  0.4349,  -0.2377,   0.0066, 0
B,  658, PRO,  0.7847,  -0.0590,   0.0228, 0
B,  659, GLN,  1.1111,   0.1078,   0.0524, 0
B,  660, THR,  0.8654,  -0.0177,   0.0283, 6
B,  661, ASN,  0.8190,  -0.0415,   0.0249, 6
B,  662, ALA,  1.0771,   0.0905,   0.0486, 0
B,  663, HIS,  0.7910,  -0.0557,   0.0231, 6
B,  664, GLU,  0.5222,  -0.1931,   0.0092, 6
B,  665, SER,  0.5151,  -0.1968,   0.0090, 0
B,  666, LYS,  1.4314,   0.2715,   0.0978, 0
B,  667, GLU,  0.4474,  -0.2314,   0.0070, 0
B,  668, TRP,  0.8445,  -0.0284,   0.0267, 0
B,  669, TYR,  0.6356,  -0.1352,   0.0142, 6
B,  670, HIS,  0.5507,  -0.1785,   0.0103, 0
B,  671, ALA,  0.2907,  -0.3114,   0.0032, 0
B,  672, SER,  0.4174,  -0.2467,   0.0061, 0
B,  673, LEU,  0.6100,  -0.1482,   0.0129, 0
B,  674, THR,  0.4231,  -0.2438,   0.0063, 0
B,  675, ARG,  0.5896,  -0.1587,   0.0119, 8
B,  676, ALA,  0.3051,  -0.3041,   0.0035, 0
B,  677, GLN,  0.5526,  -0.1776,   0.0103, 0
B,  678, ALA,  0.0000,  -0.4600,   0.0005, 0
B,  679, GLU,  0.3594,  -0.2763,   0.0045, 0
B,  680, HIS,  0.4928,  -0.2082,   0.0083, 0
B,  681, MET,  0.7543,  -0.0745,   0.0209, 0
B,  682, LEU,  0.4032,  -0.2539,   0.0057, 0
B,  683, MET,  0.4740,  -0.2178,   0.0078, 0
B,  684, ARG,  0.6078,  -0.1494,   0.0128, 0
B,  685, VAL,  0.4844,  -0.2124,   0.0081, 0
B,  686, PRO,  0.2239,  -0.3456,   0.0021, 0
B,  687, ARG,  0.5844,  -0.1614,   0.0117, 0
B,  688, ASP,  0.1037,  -0.4070,   0.0010, 0
B,  689, GLY,  0.0578,  -0.4304,   0.0007, 0
B,  690, ALA,  0.1971,  -0.3593,   0.0018, 0
B,  691, PHE,  0.3933,  -0.2590,   0.0054, 0
B,  692, LEU,  0.0000,  -0.4600,   0.0005, 0
B,  693, VAL,  0.0000,  -0.4600,   0.0005, 0
B,  694, ARG,  0.3998,  -0.2557,   0.0056, 8
B,  695, LYS,  0.3273,  -0.2927,   0.0039, 6
B,  696, ARG,  0.4346,  -0.2379,   0.0066, 8
B,  697, ASN,  0.1648,  -0.3758,   0.0015, 0
B,  698, GLU,  0.0621,  -0.4282,   0.0008, 8
B,  699, PRO,  0.0346,  -0.4423,   0.0006, 0
B,  700, ASN,  0.3282,  -0.2923,   0.0039, 6
B,  701, SER,  0.0000,  -0.4600,   0.0005, 0
B,  702, TYR,  0.5758,  -0.1657,   0.0113, 6
B,  703, ALA,  0.3263,  -0.2933,   0.0039, 8
B,  704, ILE,  0.0000,  -0.4600,   0.0005, 0
B,  705, SER,  0.0000,  -0.4600,   0.0005, 0
B,  706, PHE,  0.5992,  -0.1538,   0.0124, 9
B,  707, ARG,  0.3169,  -0.2981,   0.0037, 0
B,  708, ALA,  0.0963,  -0.4108,   0.0009, 0
B,  709, GLU,  0.0576,  -0.4306,   0.0007, 0
B,  710, GLY,  0.3091,  -0.3020,   0.0035, 0
B,  711, LYS,  0.3537,  -0.2792,   0.0044, 0
B,  712, ILE,  0.3747,  -0.2685,   0.0049, 0
B,  713, LYS,  0.5322,  -0.1880,   0.0096, 9
B,  714, HIS,  0.9234,   0.0119,   0.0329, 8
B,  715, CYS,  1.1923,   0.1493,   0.0623, 8
B,  716, ARG,  0.6688,  -0.1182,   0.0159, 8
B,  717, VAL,  0.0000,  -0.4600,   0.0005, 0
B,  718, GLN,  0.1291,  -0.3940,   0.0011, 0
B,  719, GLN,  0.5213,  -0.1936,   0.0092, 6
B,  720, GLU,  0.1054,  -0.4061,   0.0010, 0
B,  721, GLY,  0.2882,  -0.3127,   0.0032, 0
B,  722, GLN,  0.5178,  -0.1954,   0.0091, 0
B,  723, THR,  0.1513,  -0.3827,   0.0014, 0
B,  724, VAL,  0.0745,  -0.4219,   0.0008, 0
B,  725, MET,  0.1235,  -0.3969,   0.0011, 0
B,  726, LEU,  0.6678,  -0.1187,   0.0158, 0
B,  727, GLY,  0.2670,  -0.3235,   0.0028, 0
B,  728, ASN,  0.2411,  -0.3368,   0.0024, 0
B,  729, SER,  0.4890,  -0.2101,   0.0082, 0
B,  730, GLU,  0.3365,  -0.2880,   0.0040, 0
B,  731, PHE,  0.9110,   0.0055,   0.0318, 0
B,  732, ASP,  0.5361,  -0.1860,   0.0097, 6
B,  733, SER,  0.1880,  -0.3639,   0.0017, 6
B,  734, LEU,  0.2635,  -0.3254,   0.0028, 0
B,  735, VAL,  0.8477,  -0.0268,   0.0269, 0
B,  736, ASP,  0.9239,   0.0122,   0.0329, 0
B,  737, LEU,  0.0000,  -0.4600,   0.0005, 0
B,  738, ILE,  0.6169,  -0.1447,   0.0132, 0
B,  739, SER,  0.6432,  -0.1313,   0.0145, 0
B,  740, TYR,  1.0833,   0.0936,   0.0493, 0
B,  741, TYR,  0.6459,  -0.1299,   0.0147, 0
B,  742, GLU,  0.9673,   0.0343,   0.0371, 0
B,  743, LYS,  0.0973,  -0.4102,   0.0009, 0
B,  744, HIS,  0.1572,  -0.3797,   0.0014, 0
B,  745, PRO,  0.1918,  -0.3620,   0.0017, 0
B,  746, LEU,  1.0387,   0.0708,   0.0444, 9
B,  747, TYR,  1.0173,   0.0599,   0.0421, 9
B,  748, ARG,  0.4231,  -0.2438,   0.0063, 0
B,  749, LYS,  0.1714,  -0.3724,   0.0015, 0
B,  750, MET,  0.0661,  -0.4262,   0.0008, 0
B,  751, LYS,  0.0659,  -0.4263,   0.0008, 0
B,  752, LEU,  0.2493,  -0.3326,   0.0025, 0
B,  753, ARG,  0.6894,  -0.1077,   0.0170, 0
B,  754, TYR,  0.9254,   0.0129,   0.0331, 0
B,  755, PRO,  0.6560,  -0.1248,   0.0152, 0
B,  756, ILE,  0.3178,  -0.2976,   0.0037, 0
B,  757, ASN,  0.3964,  -0.2574,   0.0055, 0
B,  758, GLU,  0.3544,  -0.2789,   0.0044, 0
B,  759, GLU,  0.0288,  -0.4453,   0.0006, 0
B,  760, ALA,  0.2847,  -0.3145,   0.0031, 0
B,  761, LEU,  0.5434,  -0.1823,   0.0100, 0
B,  762, GLU,  0.0141,  -0.4528,   0.0005, 0
B,  763, LYS,  0.1147,  -0.4014,   0.0010, 0
B,  764, ILE,  0.3720,  -0.2699,   0.0049, 0
B,  765, GLY,  0.0721,  -0.4232,   0.0008, 0
B,  766, THR,  0.1096,  -0.4040,   0.0010, 0
B,  767, ALA,  0.0394,  -0.4399,   0.0006, 0
B,  768, GLU,  0.0703,  -0.4241,   0.0008, 0
B,  769, PRO,  0.1886,  -0.3636,   0.0017, 0
B,  770, ASP,  0.1181,  -0.3996,   0.0010, 0
