chain, residue_label, residue_name, score, zscore, probability, pocket
A, 1093, ASN,  0.2470,  -0.3337,   0.0025, 0
A, 1094, PRO,  0.4286,  -0.2410,   0.0064, 0
A, 1095, ASN,  0.5501,  -0.1789,   0.0102, 0
A, 1096, TYR,  1.6084,   0.3620,   0.1290, 0
A, 1097, CYS,  1.7636,   0.4413,   0.1582, 3
A, 1098, PHE,  1.1582,   0.1319,   0.0579, 3
A, 1099, ALA,  0.7883,  -0.0571,   0.0230, 0
A, 1100, GLY,  0.2325,  -0.3412,   0.0023, 0
A, 1101, LYS,  0.2199,  -0.3476,   0.0021, 0
A, 1102, THR,  0.3244,  -0.2942,   0.0038, 0
A, 1103, SER,  0.0832,  -0.4175,   0.0009, 0
A, 1104, SER,  0.0225,  -0.4485,   0.0006, 0
A, 1105, ILE,  0.2643,  -0.3249,   0.0028, 0
A, 1106, SER,  0.0597,  -0.4295,   0.0007, 0
A, 1107, ASP,  0.2384,  -0.3382,   0.0024, 0
A, 1108, LEU,  0.1982,  -0.3587,   0.0018, 0
A, 1109, LYS,  0.3802,  -0.2657,   0.0051, 0
A, 1110, GLU,  0.1080,  -0.4048,   0.0010, 0
A, 1111, VAL,  0.3064,  -0.3034,   0.0035, 0
A, 1112, PRO,  0.2688,  -0.3226,   0.0029, 0
A, 1113, ARG,  0.6412,  -0.1323,   0.0144, 0
A, 1114, LYS,  0.2401,  -0.3373,   0.0024, 0
A, 1115, ASN,  0.2537,  -0.3303,   0.0026, 0
A, 1116, ILE,  0.2278,  -0.3436,   0.0022, 0
A, 1117, THR,  0.1569,  -0.3798,   0.0014, 0
A, 1118, LEU,  1.0586,   0.0810,   0.0466, 0
A, 1119, ILE,  0.1715,  -0.3724,   0.0015, 0
A, 1120, ARG,  0.3637,  -0.2741,   0.0046, 0
A, 1121, GLY,  0.4092,  -0.2509,   0.0059, 0
A, 1122, LEU,  2.0086,   0.5665,   0.2091, 1
A, 1123, GLY,  0.7761,  -0.0634,   0.0223, 1
A, 1124, HIS,  0.4593,  -0.2253,   0.0074, 0
A, 1125, GLY,  0.2014,  -0.3571,   0.0019, 1
A, 1126, ALA,  0.1968,  -0.3594,   0.0018, 0
A, 1127, PHE,  2.7214,   0.9307,   0.3514, 1
A, 1128, GLY,  0.6885,  -0.1081,   0.0169, 1
A, 1129, GLU,  1.0437,   0.0734,   0.0450, 1
A, 1130, VAL,  4.3679,   1.7722,   0.5942, 1
A, 1131, TYR,  1.5061,   0.3097,   0.1108, 0
A, 1132, GLU,  0.1530,  -0.3818,   0.0014, 0
A, 1133, GLY,  0.0000,  -0.4600,   0.0005, 0
A, 1134, GLN,  0.1368,  -0.3901,   0.0012, 0
A, 1135, VAL,  0.2972,  -0.3081,   0.0033, 0
A, 1136, SER,  0.2609,  -0.3266,   0.0027, 0
A, 1137, GLY,  0.1801,  -0.3680,   0.0016, 0
A, 1143, SER,  0.1052,  -0.4062,   0.0010, 0
A, 1144, PRO,  0.1211,  -0.3981,   0.0011, 0
A, 1145, LEU,  0.2916,  -0.3110,   0.0032, 0
A, 1146, GLN,  0.1346,  -0.3912,   0.0012, 0
A, 1147, VAL,  0.0000,  -0.4600,   0.0005, 0
A, 1148, ALA,  2.9495,   1.0473,   0.3939, 1
A, 1149, VAL,  0.0000,  -0.4600,   0.0005, 0
A, 1150, LYS,  2.7148,   0.9273,   0.3501, 1
A, 1151, THR,  1.3770,   0.2437,   0.0893, 0
A, 1152, LEU,  0.7679,  -0.0675,   0.0218, 0
A, 1153, PRO,  0.6546,  -0.1255,   0.0151, 1
A, 1154, GLU,  0.2309,  -0.3420,   0.0022, 0
A, 1155, VAL,  0.5220,  -0.1932,   0.0092, 0
A, 1156, CYS,  0.4828,  -0.2133,   0.0080, 0
A, 1157, SER,  0.3638,  -0.2741,   0.0047, 0
A, 1158, GLU,  0.0278,  -0.4458,   0.0006, 0
A, 1159, GLN,  0.3073,  -0.3029,   0.0035, 0
A, 1160, ASP,  1.0829,   0.0934,   0.0492, 1
A, 1161, GLU,  0.2753,  -0.3193,   0.0030, 0
A, 1162, LEU,  0.4471,  -0.2315,   0.0070, 0
A, 1163, ASP,  2.2223,   0.6757,   0.2539, 1
A, 1164, PHE,  1.7523,   0.4355,   0.1559, 1
A, 1165, LEU,  0.2174,  -0.3489,   0.0021, 0
A, 1166, MET,  0.3485,  -0.2819,   0.0043, 0
A, 1167, GLU,  4.2818,   1.7282,   0.5842, 1
A, 1168, ALA,  0.0000,  -0.4600,   0.0005, 0
A, 1169, LEU,  0.0000,  -0.4600,   0.0005, 0
A, 1170, ILE,  0.0000,  -0.4600,   0.0005, 0
A, 1171, ILE,  0.4034,  -0.2539,   0.0057, 0
A, 1172, SER,  0.3378,  -0.2874,   0.0041, 0
A, 1173, LYS,  0.4340,  -0.2382,   0.0066, 0
A, 1174, PHE,  0.2069,  -0.3543,   0.0019, 0
A, 1175, ASN,  0.5757,  -0.1658,   0.0113, 0
A, 1176, HIS,  0.9138,   0.0070,   0.0320, 4
A, 1177, GLN,  1.1588,   0.1322,   0.0580, 4
A, 1178, ASN,  0.7645,  -0.0693,   0.0216, 4
A, 1179, ILE,  0.0000,  -0.4600,   0.0005, 0
A, 1180, VAL,  0.6818,  -0.1116,   0.0166, 0
A, 1181, ARG,  0.3379,  -0.2873,   0.0041, 0
A, 1182, CYS,  0.3549,  -0.2786,   0.0044, 0
A, 1183, ILE,  0.5095,  -0.1996,   0.0088, 0
A, 1184, GLY,  0.2577,  -0.3283,   0.0027, 0
A, 1185, VAL,  0.0000,  -0.4600,   0.0005, 0
A, 1186, SER,  0.0000,  -0.4600,   0.0005, 0
A, 1187, LEU,  0.1933,  -0.3612,   0.0018, 0
A, 1188, GLN,  0.0868,  -0.4156,   0.0009, 0
A, 1189, SER,  0.1704,  -0.3729,   0.0015, 0
A, 1190, LEU,  0.2271,  -0.3440,   0.0022, 0
A, 1191, PRO,  0.9542,   0.0276,   0.0359, 0
A, 1192, ARG,  0.2318,  -0.3415,   0.0023, 0
A, 1193, PHE,  0.9102,   0.0051,   0.0317, 0
A, 1194, ILE,  0.0000,  -0.4600,   0.0005, 0
A, 1195, LEU,  0.0000,  -0.4600,   0.0005, 0
A, 1196, LEU,  2.7992,   0.9705,   0.3663, 1
A, 1197, GLU,  1.4822,   0.2975,   0.1066, 1
A, 1198, LEU,  1.1726,   0.1393,   0.0597, 0
A, 1199, MET,  2.4587,   0.7965,   0.3021, 1
A, 1200, ALA,  0.7887,  -0.0569,   0.0230, 1
A, 1201, GLY,  0.6544,  -0.1256,   0.0151, 0
A, 1202, GLY,  1.3994,   0.2551,   0.0927, 1
A, 1203, ASP,  1.2715,   0.1898,   0.0729, 1
A, 1204, LEU,  0.0000,  -0.4600,   0.0005, 0
A, 1205, LYS,  1.0594,   0.0814,   0.0467, 0
A, 1206, SER,  0.4482,  -0.2309,   0.0070, 0
A, 1207, PHE,  0.5332,  -0.1875,   0.0096, 0
A, 1208, LEU,  0.2133,  -0.3510,   0.0020, 0
A, 1209, ARG,  0.6969,  -0.1039,   0.0174, 0
A, 1210, GLU,  0.4579,  -0.2260,   0.0073, 0
A, 1211, THR,  0.1434,  -0.3867,   0.0013, 0
A, 1212, ARG,  0.7384,  -0.0826,   0.0199, 0
A, 1213, PRO,  0.0520,  -0.4334,   0.0007, 0
A, 1214, ARG,  0.0645,  -0.4270,   0.0008, 0
A, 1215, PRO,  0.0279,  -0.4458,   0.0006, 0
A, 1216, SER,  0.0274,  -0.4460,   0.0006, 0
A, 1217, GLN,  0.0174,  -0.4511,   0.0006, 0
A, 1218, PRO,  0.0498,  -0.4345,   0.0007, 0
A, 1219, SER,  0.1134,  -0.4020,   0.0010, 0
A, 1220, SER,  0.1137,  -0.4019,   0.0010, 0
A, 1221, LEU,  0.3221,  -0.2954,   0.0038, 0
A, 1222, ALA,  0.1070,  -0.4053,   0.0010, 0
A, 1223, MET,  0.0943,  -0.4118,   0.0009, 0
A, 1224, LEU,  0.5915,  -0.1577,   0.0120, 0
A, 1225, ASP,  0.5785,  -0.1643,   0.0114, 0
A, 1226, LEU,  0.3610,  -0.2755,   0.0046, 0
A, 1227, LEU,  0.4119,  -0.2495,   0.0059, 0
A, 1228, HIS,  0.7992,  -0.0516,   0.0236, 0
A, 1229, VAL,  0.3469,  -0.2827,   0.0043, 0
A, 1230, ALA,  0.0000,  -0.4600,   0.0005, 0
A, 1231, ARG,  0.8102,  -0.0460,   0.0243, 4
A, 1232, ASP,  0.6059,  -0.1504,   0.0127, 0
A, 1233, ILE,  0.0000,  -0.4600,   0.0005, 0
A, 1234, ALA,  0.0000,  -0.4600,   0.0005, 0
A, 1235, CYS,  0.7870,  -0.0578,   0.0229, 4
A, 1236, GLY,  0.0000,  -0.4600,   0.0005, 0
A, 1237, CYS,  0.0181,  -0.4507,   0.0006, 0
A, 1238, GLN,  0.5221,  -0.1932,   0.0092, 4
A, 1239, TYR,  0.9490,   0.0250,   0.0354, 4
A, 1240, LEU,  0.0316,  -0.4439,   0.0006, 0
A, 1241, GLU,  0.7291,  -0.0874,   0.0194, 0
A, 1242, GLU,  0.4931,  -0.2080,   0.0083, 0
A, 1243, ASN,  0.9320,   0.0163,   0.0337, 3
A, 1244, HIS,  1.6638,   0.3902,   0.1391, 3
A, 1245, PHE,  1.4297,   0.2706,   0.0976, 3
A, 1246, ILE,  1.6385,   0.3774,   0.1343, 3
A, 1247, HIS,  0.3920,  -0.2597,   0.0054, 0
A, 1248, ARG,  1.5298,   0.3218,   0.1150, 2
A, 1249, ASP,  1.6751,   0.3961,   0.1414, 1
A, 1250, ILE,  0.2070,  -0.3542,   0.0019, 0
A, 1251, ALA,  0.4611,  -0.2243,   0.0074, 0
A, 1252, ALA,  0.0000,  -0.4600,   0.0005, 0
A, 1253, ARG,  1.9006,   0.5113,   0.1870, 1
A, 1254, ASN,  0.8619,  -0.0195,   0.0280, 1
A, 1255, CYS,  0.2083,  -0.3536,   0.0019, 0
A, 1256, LEU,  3.6103,   1.3850,   0.4914, 1
A, 1257, LEU,  0.0000,  -0.4600,   0.0005, 0
A, 1258, THR,  0.5483,  -0.1798,   0.0102, 0
A, 1259, CYS,  0.3716,  -0.2701,   0.0048, 0
A, 1260, PRO,  0.3360,  -0.2883,   0.0040, 0
A, 1261, GLY,  0.3812,  -0.2652,   0.0051, 0
A, 1262, PRO,  0.4525,  -0.2287,   0.0072, 0
A, 1263, GLY,  0.6506,  -0.1275,   0.0149, 0
A, 1264, ARG,  0.7666,  -0.0682,   0.0217, 0
A, 1265, VAL,  0.8182,  -0.0419,   0.0248, 0
A, 1266, ALA,  0.0000,  -0.4600,   0.0005, 0
A, 1267, LYS,  0.4256,  -0.2425,   0.0063, 0
A, 1268, ILE,  0.2070,  -0.3542,   0.0019, 0
A, 1269, GLY,  2.1152,   0.6209,   0.2310, 1
A, 1270, ASP,  4.2469,   1.7103,   0.5807, 1
A, 1271, PHE,  0.0000,  -0.4600,   0.0005, 0
A, 1272, GLY,  3.8722,   1.5189,   0.5304, 1
A, 1273, MET,  3.0881,   1.1182,   0.4180, 1
A, 1274, ALA,  0.8255,  -0.0381,   0.0253, 3
A, 1275, ARG,  4.6041,   1.8929,   0.6195, 1
A, 1276, ASP,  2.6132,   0.8754,   0.3305, 1
A, 1277, ILE,  1.0966,   0.1004,   0.0507, 2
A, 1278, TYR,  1.8377,   0.4791,   0.1741, 3
A, 1279, ARG,  0.5536,  -0.1771,   0.0104, 0
A, 1280, ALA,  0.2684,  -0.3228,   0.0029, 0
A, 1281, GLY,  0.3948,  -0.2583,   0.0055, 0
A, 1282, TYR,  0.9933,   0.0476,   0.0396, 2
A, 1283, TYR,  2.3392,   0.7354,   0.2776, 1
A, 1284, ARG,  0.4402,  -0.2351,   0.0068, 0
A, 1285, LYS,  2.7139,   0.9269,   0.3499, 1
A, 1286, GLY,  0.2121,  -0.3516,   0.0020, 0
A, 1287, GLY,  0.2302,  -0.3424,   0.0022, 2
A, 1288, CYS,  0.5555,  -0.1761,   0.0104, 5
A, 1289, ALA,  0.5075,  -0.2006,   0.0088, 0
A, 1290, MET,  0.8885,  -0.0059,   0.0300, 1
A, 1291, LEU,  2.4420,   0.7879,   0.2988, 2
A, 1292, PRO,  1.0094,   0.0558,   0.0413, 0
A, 1293, VAL,  0.6466,  -0.1296,   0.0147, 5
A, 1294, LYS,  1.3345,   0.2220,   0.0827, 0
A, 1295, TRP,  2.1755,   0.6518,   0.2442, 0
A, 1296, MET,  1.9713,   0.5474,   0.2017, 2
A, 1297, PRO,  0.2383,  -0.3382,   0.0024, 0
A, 1298, PRO,  0.4804,  -0.2145,   0.0080, 0
A, 1299, GLU,  0.4062,  -0.2524,   0.0058, 0
A, 1300, ALA,  1.0104,   0.0563,   0.0414, 2
A, 1301, PHE,  1.3548,   0.2324,   0.0858, 2
A, 1302, MET,  0.9163,   0.0083,   0.0322, 0
A, 1303, GLU,  0.3544,  -0.2789,   0.0044, 0
A, 1304, GLY,  0.9713,   0.0364,   0.0375, 2
A, 1305, ILE,  0.5703,  -0.1685,   0.0111, 0
A, 1306, PHE,  2.2408,   0.6851,   0.2571, 2
A, 1307, THR,  1.1328,   0.1189,   0.0549, 0
A, 1308, SER,  0.9258,   0.0131,   0.0331, 0
A, 1309, LYS,  1.0077,   0.0550,   0.0411, 0
A, 1310, THR,  0.2581,  -0.3281,   0.0027, 0
A, 1311, ASP,  0.2151,  -0.3500,   0.0020, 0
A, 1312, THR,  0.0000,  -0.4600,   0.0005, 0
A, 1313, TRP,  0.6278,  -0.1392,   0.0138, 0
A, 1314, SER,  0.1970,  -0.3593,   0.0018, 0
A, 1315, PHE,  0.0000,  -0.4600,   0.0005, 0
A, 1316, GLY,  0.0000,  -0.4600,   0.0005, 0
A, 1317, VAL,  0.6165,  -0.1449,   0.0132, 0
A, 1318, LEU,  0.0000,  -0.4600,   0.0005, 0
A, 1319, LEU,  0.3931,  -0.2591,   0.0054, 0
A, 1320, TRP,  0.5168,  -0.1959,   0.0091, 6
A, 1321, GLU,  0.4754,  -0.2170,   0.0078, 0
A, 1322, ILE,  0.0000,  -0.4600,   0.0005, 0
A, 1323, PHE,  0.5969,  -0.1550,   0.0123, 0
A, 1324, SER,  0.4451,  -0.2325,   0.0069, 6
A, 1325, LEU,  0.4004,  -0.2554,   0.0056, 0
A, 1326, GLY,  0.8651,  -0.0179,   0.0282, 0
A, 1327, TYR,  1.3368,   0.2231,   0.0831, 6
A, 1328, MET,  2.0244,   0.5745,   0.2125, 0
A, 1329, PRO,  0.0000,  -0.4600,   0.0005, 0
A, 1330, TYR,  1.6058,   0.3606,   0.1286, 0
A, 1331, PRO,  1.2796,   0.1940,   0.0740, 6
A, 1332, SER,  0.9797,   0.0407,   0.0383, 0
A, 1333, LYS,  1.2592,   0.1835,   0.0714, 0
A, 1334, SER,  0.2050,  -0.3552,   0.0019, 0
A, 1335, ASN,  0.9424,   0.0216,   0.0347, 5
A, 1336, GLN,  0.3384,  -0.2871,   0.0041, 5
A, 1337, GLU,  0.0719,  -0.4233,   0.0008, 0
A, 1338, VAL,  0.0000,  -0.4600,   0.0005, 0
A, 1339, LEU,  0.5646,  -0.1715,   0.0108, 5
A, 1340, GLU,  0.1195,  -0.3989,   0.0011, 0
A, 1341, PHE,  1.2023,   0.1544,   0.0637, 0
A, 1342, VAL,  0.0000,  -0.4600,   0.0005, 0
A, 1343, THR,  0.5803,  -0.1634,   0.0115, 0
A, 1344, SER,  0.2096,  -0.3529,   0.0020, 0
A, 1345, GLY,  0.3081,  -0.3026,   0.0035, 0
A, 1346, GLY,  0.9781,   0.0398,   0.0381, 0
A, 1347, ARG,  1.9347,   0.5287,   0.1943, 0
A, 1348, MET,  1.7655,   0.4422,   0.1586, 0
A, 1349, ASP,  1.1593,   0.1325,   0.0581, 0
A, 1350, PRO,  0.3934,  -0.2590,   0.0054, 6
A, 1351, PRO,  0.2402,  -0.3372,   0.0024, 6
A, 1352, LYS,  0.4303,  -0.2401,   0.0065, 6
A, 1353, ASN,  0.1575,  -0.3795,   0.0014, 0
A, 1354, CYS,  0.4446,  -0.2328,   0.0069, 0
A, 1355, PRO,  0.5703,  -0.1685,   0.0111, 0
A, 1356, GLY,  0.6669,  -0.1192,   0.0158, 0
A, 1357, PRO,  1.3956,   0.2532,   0.0921, 0
A, 1358, VAL,  0.5945,  -0.1562,   0.0122, 0
A, 1359, TYR,  0.4184,  -0.2462,   0.0061, 0
A, 1360, ARG,  1.2119,   0.1593,   0.0650, 0
A, 1361, ILE,  0.7275,  -0.0882,   0.0193, 0
A, 1362, MET,  0.0000,  -0.4600,   0.0005, 0
A, 1363, THR,  0.4231,  -0.2437,   0.0063, 0
A, 1364, GLN,  0.6432,  -0.1313,   0.0145, 0
A, 1365, CYS,  0.0000,  -0.4600,   0.0005, 0
A, 1366, TRP,  0.9448,   0.0228,   0.0349, 0
A, 1367, GLN,  0.4079,  -0.2515,   0.0058, 0
A, 1368, HIS,  0.6689,  -0.1182,   0.0159, 0
A, 1369, GLN,  0.2794,  -0.3172,   0.0030, 0
A, 1370, PRO,  0.3638,  -0.2741,   0.0047, 0
A, 1371, GLU,  0.1619,  -0.3773,   0.0015, 0
A, 1372, ASP,  0.1131,  -0.4022,   0.0010, 0
A, 1373, ARG,  0.1969,  -0.3594,   0.0018, 0
A, 1374, PRO,  0.2371,  -0.3388,   0.0023, 0
A, 1375, ASN,  0.5934,  -0.1568,   0.0121, 0
A, 1376, PHE,  0.1934,  -0.3611,   0.0018, 0
A, 1377, ALA,  0.1490,  -0.3838,   0.0013, 0
A, 1378, ILE,  0.3747,  -0.2685,   0.0049, 0
A, 1379, ILE,  0.1174,  -0.4000,   0.0010, 0
A, 1380, LEU,  0.4235,  -0.2436,   0.0063, 4
A, 1381, GLU,  0.1804,  -0.3678,   0.0016, 0
A, 1382, ARG,  1.4000,   0.2554,   0.0927, 0
A, 1383, ILE,  0.5235,  -0.1925,   0.0093, 0
A, 1384, GLU,  0.4066,  -0.2522,   0.0058, 4
A, 1385, TYR,  0.8686,  -0.0161,   0.0285, 0
A, 1386, CYS,  0.9427,   0.0218,   0.0347, 0
A, 1387, THR,  0.3543,  -0.2790,   0.0044, 0
A, 1388, GLN,  0.2295,  -0.3427,   0.0022, 0
A, 1389, ASP,  0.5009,  -0.2040,   0.0086, 0
A, 1390, PRO,  0.0889,  -0.4146,   0.0009, 0
A, 1391, ASP,  0.1117,  -0.4029,   0.0010, 0
A, 1392, VAL,  0.6120,  -0.1472,   0.0130, 0
A, 1393, ILE,  0.2782,  -0.3178,   0.0030, 0
A, 1394, ASN,  0.1308,  -0.3931,   0.0012, 0
A, 1395, THR,  0.1759,  -0.3701,   0.0016, 0
A, 1396, ALA,  0.1253,  -0.3960,   0.0011, 0
A, 1397, LEU,  0.1298,  -0.3936,   0.0012, 0
A, 1398, PRO,  0.2724,  -0.3208,   0.0029, 0
A, 1399, ILE,  0.1823,  -0.3668,   0.0016, 0
A, 1400, GLU,  0.3397,  -0.2864,   0.0041, 0
