name, rank, score, sas_points, surf_atoms, center_x, center_y, center_z, residue_ids, surf_atom_ids   
pocket1,1,21.6594,184,80,4.9063,-19.2,-17.8619,A_531 A_532 A_533 A_534 A_535 A_536 A_537 A_539 A_551 A_553 A_555 A_556 A_559 A_560 A_568 A_571 A_586 A_600 A_602 A_605 A_606 A_607 A_608 A_647 A_649 A_651 A_652 A_654 A_663 A_664 A_666 A_668 A_669 A_670 A_671 A_684,180 182 184 186 189 191 192 195 196 199 203 207 208 213 214 229 230 334 350 351 369 374 398 405 409 470 472 474 499 500 501 502 503 628 759 760 775 797 799 800 803 804 809 824 1156 1157 1159 1175 1176 1186 1187 1188 1196 1214 1215 1281 1282 1283 1288 1289 1290 1291 1304 1306 1318 1319 1323 1329 1333 1334 1335 1336 1337 1340 1341 1342 1436 1438 1440 1441
pocket2,2,7.3849,57,25,16.8268,-8.9595,-20.5429,A_513 A_516 A_517 A_518 A_527 A_538 A_540 A_554 A_556 A_596 A_597 A_599,25 54 61 68 70 71 150 221 223 240 241 358 359 360 361 362 377 716 719 728 730 731 749 750 751
pocket3,3,2.2157,29,17,5.6642,-7.0824,-32.6792,A_523 A_525 A_544 A_545 A_548 A_550 A_589 A_590 A_601,107 111 134 135 273 281 308 309 326 328 652 653 654 656 664 667 766
pocket4,4,2.1386,31,17,-13.6222,-8.9605,-17.3065,A_607 A_612 A_623 A_627 A_655 A_658,815 854 855 856 857 858 859 953 954 955 956 991 993 1222 1239 1240 1242
pocket5,5,2.1033,25,15,-11.033,-35.2829,-24.1413,A_636 A_639 A_713 A_714 A_781 A_782 A_783,1069 1071 1091 1092 1094 1586 1587 1595 1596 2143 2146 2148 2152 2161 2162
pocket6,6,1.8845,41,20,-24.3084,-17.578,-25.0084,A_622 A_625 A_626 A_629 A_791 A_792 A_793 A_794 A_795,937 940 942 945 972 974 977 978 981 982 1015 1017 2225 2231 2232 2240 2241 2253 2254 2260
pocket7,7,1.8144,29,15,-8.4823,-21.2787,-5.0776,A_610 A_614 A_682 A_683 A_688 A_689 A_726 A_732 A_735,839 876 1423 1427 1430 1434 1471 1480 1482 1694 1695 1743 1768 1769 1770
pocket8,8,1.5176,37,16,-0.7,-7.6815,-32.6957,A_548 A_549 A_550 A_587 A_589 A_603 A_604,305 308 309 313 326 328 634 652 653 654 656 657 658 781 784 785
