name, rank, score, sas_points, surf_atoms, center_x, center_y, center_z, residue_ids, surf_atom_ids   
pocket1,1,15.7341,90,45,7.4928,28.0882,7.3639,A_588 A_589 A_596 A_614 A_616 A_647 A_663 A_664 A_665 A_666 A_667 A_669 A_670 A_782 A_785 A_796 A_797 A_799 A_800 A_801,388 390 391 393 394 396 442 443 570 583 585 826 934 935 939 953 955 957 958 959 960 961 966 981 982 983 985 989 991 1332 1360 1361 1362 1436 1442 1446 1447 1448 1450 1460 1464 1467 1468 1476 1477
pocket2,2,5.5078,53,21,29.7871,26.0602,-6.1336,A_553 A_555 A_558 A_767 A_770 A_773 A_834 A_835 A_902 A_903 A_904,92 94 108 109 132 1220 1243 1244 1245 1262 1267 1733 1734 1735 1744 2285 2286 2287 2288 2299 2303
pocket3,3,3.9874,43,33,7.515,24.8768,-4.4285,A_546 A_547 A_548 A_549 A_593 A_633 A_778 A_783 A_796 A_797 A_798 A_799 A_801 A_803 A_809,20 24 26 32 39 45 50 52 53 417 419 421 714 715 1310 1346 1438 1439 1440 1443 1444 1452 1453 1454 1455 1456 1457 1463 1473 1474 1493 1495 1544
pocket4,4,2.7448,41,14,8.5358,39.1462,-3.16,A_672 A_676 A_782 A_806 A_808 A_821 A_847 A_852 A_854,1008 1043 1044 1333 1335 1519 1531 1532 1533 1632 1847 1885 1898 1901
pocket5,5,2.469,48,26,12.6136,24.9555,-13.29,A_547 A_548 A_549 A_777 A_812 A_815 A_817 A_818 A_822 A_830 A_832,36 37 41 51 52 53 1296 1297 1299 1300 1301 1566 1567 1568 1569 1578 1595 1596 1597 1604 1641 1642 1702 1718 1719 1720
pocket6,6,2.1013,13,22,13.3811,22.2159,1.9695,A_550 A_616 A_633 A_637 A_647 A_663 A_795 A_796 A_797,60 61 67 68 586 712 713 714 747 748 824 825 826 934 935 1430 1433 1436 1437 1440 1448 1450
pocket7,7,1.9784,35,23,32.648,39.7181,-4.3109,A_887 A_888 A_891 A_901 A_905 A_906 A_909,2164 2165 2168 2172 2193 2196 2275 2278 2279 2280 2310 2311 2312 2317 2318 2322 2341 2342 2343 2344 2345 2346 2347
pocket8,8,1.9555,26,14,10.754,32.6883,-17.6584,A_810 A_811 A_812 A_817 A_819 A_826 A_827 A_866,1549 1552 1557 1566 1568 1594 1596 1610 1611 1667 1673 1676 1997 1999
pocket9,9,1.3146,23,19,1.952,25.7934,-7.5157,A_544 A_545 A_546 A_592 A_593 A_798 A_803 A_804 A_816,5 11 20 408 412 419 421 1455 1488 1492 1493 1494 1495 1501 1502 1579 1582 1583 1584
pocket10,10,1.1326,24,14,13.3005,14.3333,-8.0073,A_548 A_550 A_551 A_567 A_628 A_629 A_632 A_636,42 44 59 75 76 77 206 207 208 678 681 705 706 740
pocket11,11,1.1273,7,13,19.6473,42.3373,-12.3439,A_839 A_843 A_856 A_873 A_874 A_875 A_893,1777 1778 1809 1917 1919 2049 2059 2067 2206 2207 2210 2212 2213
pocket12,12,0.8375,14,14,29.5683,46.2741,3.1474,A_756 A_882 A_884 A_885 A_913,1141 2121 2122 2137 2138 2140 2141 2146 2148 2378 2379 2380 2381 2382
