chain, residue_label, residue_name, score, zscore, probability, pocket
A,  -27, SER,  1.8562,   0.4886,   0.1780, 1
A,  -26, TYR,  1.7877,   0.4536,   0.1632, 1
A,  -25, TYR,  1.5502,   0.3322,   0.1186, 15
A,  -24, HIS,  0.9083,   0.0042,   0.0316, 15
A,  -23, HIS,  3.5233,   1.3406,   0.4795, 1
A,  -22, HIS,  1.8443,   0.4825,   0.1755, 15
A,  -21, HIS,  2.6954,   0.9174,   0.3458, 1
A,  -20, HIS,  1.7602,   0.4395,   0.1575, 8
A,  -19, HIS,  1.8066,   0.4632,   0.1673, 8
A,  -18, ASP,  1.1313,   0.1182,   0.0547, 8
A,  -17, TYR,  2.0673,   0.5965,   0.2210, 8
A,  -16, ASP,  0.9517,   0.0264,   0.0356, 8
A,  -15, ILE,  1.3447,   0.2272,   0.0843, 0
A,    8, GLY,  0.7703,  -0.0663,   0.0219, 37
A,    9, GLU,  1.5436,   0.3289,   0.1174, 18
A,   10, LEU,  0.7821,  -0.0603,   0.0226, 23
A,   11, TRP,  1.8205,   0.4704,   0.1703, 21
A,   12, GLY,  0.5824,  -0.1624,   0.0116, 21
A,   13, ILE,  0.8922,  -0.0040,   0.0303, 21
A,   14, HIS,  1.0423,   0.0726,   0.0448, 0
A,   15, LEU,  1.4179,   0.2646,   0.0956, 37
A,   16, MET,  0.0000,  -0.4600,   0.0005, 0
A,   17, PRO,  0.7795,  -0.0617,   0.0225, 0
A,   18, PRO,  0.5081,  -0.2003,   0.0088, 0
A,   19, ARG,  0.1161,  -0.4007,   0.0010, 0
A,   20, ILE,  0.4556,  -0.2272,   0.0073, 0
A,   21, LEU,  0.2636,  -0.3253,   0.0028, 0
A,   22, VAL,  0.0000,  -0.4600,   0.0005, 0
A,   23, GLU,  0.2150,  -0.3501,   0.0020, 0
A,   24, CYS,  0.0000,  -0.4600,   0.0005, 0
A,   25, LEU,  0.0000,  -0.4600,   0.0005, 0
A,   26, LEU,  0.6219,  -0.1422,   0.0135, 0
A,   27, PRO,  0.6003,  -0.1532,   0.0124, 0
A,   28, ASN,  0.7933,  -0.0546,   0.0233, 0
A,   29, GLY,  0.0000,  -0.4600,   0.0005, 0
A,   30, MET,  1.2619,   0.1849,   0.0717, 0
A,   31, ILE,  0.8861,  -0.0072,   0.0299, 0
A,   32, VAL,  0.6651,  -0.1201,   0.0157, 0
A,   33, THR,  0.8396,  -0.0309,   0.0263, 0
A,   34, LEU,  0.5595,  -0.1740,   0.0106, 0
A,   35, GLU,  0.8100,  -0.0460,   0.0243, 0
A,   36, CYS,  0.7577,  -0.0728,   0.0212, 0
A,   37, LEU,  0.8258,  -0.0380,   0.0254, 0
A,   38, ARG,  0.0000,  -0.4600,   0.0005, 0
A,   39, GLU,  0.1695,  -0.3734,   0.0015, 0
A,   40, ALA,  0.6974,  -0.1036,   0.0174, 0
A,   41, THR,  0.4823,  -0.2135,   0.0080, 0
A,   42, LEU,  0.0000,  -0.4600,   0.0005, 0
A,   43, ILE,  0.1191,  -0.3991,   0.0011, 0
A,   44, THR,  0.7366,  -0.0836,   0.0198, 0
A,   45, ILE,  0.7205,  -0.0918,   0.0188, 0
A,   46, LYS,  0.4826,  -0.2134,   0.0080, 0
A,   47, HIS,  0.0849,  -0.4166,   0.0009, 0
A,   48, GLU,  0.7936,  -0.0545,   0.0233, 0
A,   49, LEU,  0.4849,  -0.2122,   0.0081, 0
A,   50, PHE,  0.6517,  -0.1270,   0.0150, 0
A,   51, LYS,  0.1962,  -0.3597,   0.0018, 0
A,   52, GLU,  0.3496,  -0.2813,   0.0043, 0
A,   53, ALA,  0.6012,  -0.1528,   0.0125, 0
A,   54, ARG,  0.5437,  -0.1821,   0.0100, 0
A,   55, LYS,  0.7540,  -0.0747,   0.0209, 0
A,   56, TYR,  2.1756,   0.6518,   0.2442, 0
A,   57, PRO,  1.3190,   0.2141,   0.0799, 0
A,   58, LEU,  1.0089,   0.0556,   0.0412, 0
A,   59, HIS,  0.5813,  -0.1629,   0.0115, 0
A,   60, GLN,  0.5396,  -0.1843,   0.0098, 0
A,   61, LEU,  0.4678,  -0.2209,   0.0076, 0
A,   62, LEU,  0.7064,  -0.0990,   0.0180, 0
A,   63, GLN,  0.5011,  -0.2039,   0.0086, 0
A,   64, ASP,  0.0904,  -0.4138,   0.0009, 0
A,   65, GLU,  0.3731,  -0.2693,   0.0049, 0
A,   66, SER,  0.1519,  -0.3824,   0.0014, 0
A,   67, SER,  0.1564,  -0.3801,   0.0014, 0
A,   68, TYR,  0.7136,  -0.0953,   0.0184, 0
A,   69, ILE,  0.5332,  -0.1875,   0.0096, 0
A,   70, PHE,  0.1794,  -0.3683,   0.0016, 0
A,   71, VAL,  0.5192,  -0.1947,   0.0091, 0
A,   72, SER,  0.0000,  -0.4600,   0.0005, 0
A,   73, VAL,  0.0000,  -0.4600,   0.0005, 0
A,   74, THR,  0.4391,  -0.2356,   0.0067, 3
A,   75, GLN,  1.4137,   0.2625,   0.0949, 18
A,   76, GLU,  1.9577,   0.5405,   0.1991, 3
A,   77, ALA,  0.6212,  -0.1425,   0.0134, 0
A,   78, GLU,  0.9590,   0.0301,   0.0363, 3
A,   79, ARG,  0.8358,  -0.0329,   0.0260, 3
A,   80, GLU,  1.5824,   0.3487,   0.1244, 3
A,   81, GLU,  0.7769,  -0.0630,   0.0223, 3
A,   82, PHE,  0.2828,  -0.3155,   0.0031, 0
A,   83, PHE,  0.7964,  -0.0530,   0.0235, 3
A,   84, ASP,  1.3230,   0.2161,   0.0806, 3
A,   85, GLU,  0.4192,  -0.2458,   0.0062, 0
A,   86, THR,  0.2385,  -0.3381,   0.0024, 3
A,   87, ARG,  2.0718,   0.5988,   0.2219, 3
A,   88, ARG,  0.4586,  -0.2256,   0.0074, 3
A,   89, LEU,  0.0000,  -0.4600,   0.0005, 0
A,   90, CYS,  0.7104,  -0.0969,   0.0182, 0
A,   91, ASP,  1.2888,   0.1986,   0.0752, 3
A,   92, LEU,  0.0000,  -0.4600,   0.0005, 0
A,   93, ARG,  2.0570,   0.5912,   0.2189, 3
A,   94, LEU,  0.0000,  -0.4600,   0.0005, 0
A,   95, PHE,  1.0187,   0.0606,   0.0423, 0
A,   96, GLN,  0.6231,  -0.1416,   0.0135, 21
A,   97, PRO,  0.4761,  -0.2167,   0.0078, 0
A,   98, PHE,  0.0000,  -0.4600,   0.0005, 0
A,   99, LEU,  0.0000,  -0.4600,   0.0005, 0
A,  100, LYS,  0.6168,  -0.1448,   0.0132, 0
A,  101, VAL,  0.5870,  -0.1600,   0.0118, 0
A,  102, ILE,  1.1525,   0.1290,   0.0573, 0
A,  103, GLU,  0.2782,  -0.3178,   0.0030, 0
A,  104, PRO,  0.3302,  -0.2912,   0.0039, 0
A,  105, VAL,  0.4488,  -0.2306,   0.0070, 0
A,  106, GLY,  0.2863,  -0.3137,   0.0032, 0
A,  107, ASN,  0.0852,  -0.4164,   0.0009, 0
A,  108, ARG,  0.3356,  -0.2885,   0.0040, 0
A,  109, GLU,  0.3462,  -0.2830,   0.0042, 0
A,  110, GLU,  0.4731,  -0.2182,   0.0077, 0
A,  111, LYS,  0.8014,  -0.0504,   0.0238, 0
A,  112, ILE,  0.8005,  -0.0509,   0.0237, 3
A,  113, LEU,  0.6868,  -0.1090,   0.0168, 3
A,  114, ASN,  2.6276,   0.8828,   0.3333, 0
A,  115, ARG,  1.9969,   0.5605,   0.2068, 3
A,  116, GLU,  2.6757,   0.9074,   0.3415, 3
A,  117, ILE,  0.0000,  -0.4600,   0.0005, 0
A,  118, GLY,  0.5811,  -0.1630,   0.0115, 3
A,  119, PHE,  2.5441,   0.8401,   0.3177, 3
A,  120, ALA,  0.0000,  -0.4600,   0.0005, 0
A,  121, ILE,  0.5329,  -0.1877,   0.0096, 0
A,  122, GLY,  1.3511,   0.2305,   0.0853, 3
A,  123, MET,  2.3235,   0.7274,   0.2743, 0
A,  124, PRO,  1.0485,   0.0758,   0.0455, 3
A,  125, VAL,  1.0565,   0.0799,   0.0463, 3
A,  126, CYS,  0.5029,  -0.2030,   0.0086, 3
A,  127, GLU,  2.2435,   0.6865,   0.2576, 0
A,  128, PHE,  1.1756,   0.1408,   0.0601, 0
A,  129, ASP,  0.9027,   0.0013,   0.0311, 0
A,  130, MET,  0.3150,  -0.2990,   0.0036, 0
A,  131, VAL,  0.9658,   0.0336,   0.0370, 0
A,  132, LYS,  0.1847,  -0.3656,   0.0017, 0
A,  133, ASP,  1.3157,   0.2124,   0.0793, 7
A,  134, PRO,  0.2807,  -0.3165,   0.0031, 0
A,  135, GLU,  1.2304,   0.1688,   0.0676, 7
A,  136, VAL,  0.3664,  -0.2727,   0.0047, 0
A,  137, GLN,  0.1565,  -0.3800,   0.0014, 0
A,  138, ASP,  0.5411,  -0.1835,   0.0099, 0
A,  139, PHE,  0.6029,  -0.1519,   0.0126, 0
A,  140, ARG,  1.0759,   0.0898,   0.0485, 0
A,  141, ARG,  0.4660,  -0.2218,   0.0076, 0
A,  142, ASN,  0.4641,  -0.2228,   0.0075, 0
A,  143, ILE,  0.2824,  -0.3157,   0.0031, 0
A,  144, LEU,  0.5544,  -0.1767,   0.0104, 0
A,  145, ASN,  0.1747,  -0.3707,   0.0016, 0
A,  146, VAL,  0.2721,  -0.3209,   0.0029, 0
A,  147, CYS,  0.0000,  -0.4600,   0.0005, 0
A,  148, LYS,  0.3458,  -0.2833,   0.0042, 0
A,  149, GLU,  0.2650,  -0.3246,   0.0028, 0
A,  150, ALA,  0.0000,  -0.4600,   0.0005, 0
A,  151, VAL,  0.5734,  -0.1670,   0.0112, 0
A,  152, ASP,  0.1939,  -0.3609,   0.0018, 0
A,  153, LEU,  0.6508,  -0.1274,   0.0149, 13
A,  154, ARG,  0.5408,  -0.1836,   0.0099, 0
A,  155, ASP,  0.3897,  -0.2608,   0.0053, 0
A,  156, LEU,  0.0905,  -0.4137,   0.0009, 0
A,  157, ASN,  0.1738,  -0.3712,   0.0016, 12
A,  158, SER,  0.0876,  -0.4152,   0.0009, 0
A,  159, PRO,  0.1512,  -0.3827,   0.0014, 12
A,  160, HIS,  1.1422,   0.1237,   0.0560, 12
A,  161, SER,  0.2986,  -0.3074,   0.0034, 13
A,  162, ARG,  0.4110,  -0.2500,   0.0059, 0
A,  163, ALA,  0.0000,  -0.4600,   0.0005, 0
A,  164, MET,  0.5354,  -0.1864,   0.0097, 13
A,  165, TYR,  0.7590,  -0.0721,   0.0213, 13
A,  166, VAL,  2.2016,   0.6651,   0.2497, 1
A,  167, TYR,  2.6931,   0.9163,   0.3453, 1
A,  168, PRO,  0.6002,  -0.1532,   0.0124, 1
A,  169, PRO,  0.8006,  -0.0508,   0.0237, 13
A,  170, ASN,  0.9873,   0.0446,   0.0390, 1
A,  171, VAL,  0.7878,  -0.0574,   0.0230, 13
A,  172, GLU,  1.9376,   0.5302,   0.1949, 1
A,  173, SER,  0.9710,   0.0362,   0.0374, 27
A,  174, SER,  0.4766,  -0.2164,   0.0078, 27
A,  175, PRO,  0.2894,  -0.3121,   0.0032, 0
A,  176, GLU,  0.1466,  -0.3851,   0.0013, 0
A,  177, LEU,  0.3048,  -0.3042,   0.0035, 0
A,  178, PRO,  0.3269,  -0.2929,   0.0039, 1
A,  179, LYS,  0.2241,  -0.3454,   0.0022, 0
A,  180, HIS,  0.2723,  -0.3208,   0.0029, 8
A,  181, ILE,  0.4984,  -0.2053,   0.0085, 1
A,  182, TYR,  0.7566,  -0.0733,   0.0211, 0
A,  183, ASN,  0.2286,  -0.3432,   0.0022, 0
A,  184, LYS,  2.8095,   0.9757,   0.3684, 8
A,  185, LEU,  1.2622,   0.1851,   0.0718, 0
A,  186, ASP,  0.2681,  -0.3230,   0.0029, 0
A,  187, LYS,  0.0974,  -0.4102,   0.0009, 0
A,  188, GLY,  0.1790,  -0.3685,   0.0016, 0
A,  189, GLN,  0.9263,   0.0134,   0.0331, 0
A,  190, ILE,  1.1339,   0.1195,   0.0550, 0
A,  191, ILE,  1.2568,   0.1823,   0.0711, 0
A,  192, VAL,  0.0000,  -0.4600,   0.0005, 0
A,  193, VAL,  0.8840,  -0.0082,   0.0297, 0
A,  194, ILE,  0.0433,  -0.4379,   0.0007, 0
A,  195, TRP,  1.2387,   0.1730,   0.0687, 0
A,  196, VAL,  0.6066,  -0.1500,   0.0127, 14
A,  197, ILE,  0.8948,  -0.0027,   0.0305, 11
A,  198, VAL,  0.2381,  -0.3383,   0.0024, 0
A,  199, SER,  0.1078,  -0.4049,   0.0010, 0
A,  200, PRO,  0.0382,  -0.4405,   0.0006, 0
A,  201, ASN,  0.0283,  -0.4455,   0.0006, 0
A,  202, ASN,  0.0554,  -0.4317,   0.0007, 0
A,  203, ASP,  0.0489,  -0.4350,   0.0007, 0
A,  204, LYS,  0.3044,  -0.3044,   0.0035, 0
A,  205, GLN,  0.1981,  -0.3588,   0.0018, 0
A,  206, LYS,  1.1673,   0.1365,   0.0590, 0
A,  207, TYR,  0.2301,  -0.3424,   0.0022, 0
A,  208, THR,  0.4954,  -0.2068,   0.0084, 0
A,  209, LEU,  0.1101,  -0.4037,   0.0010, 0
A,  210, LYS,  0.1631,  -0.3766,   0.0015, 0
A,  211, ILE,  0.1614,  -0.3775,   0.0014, 0
A,  212, ASN,  0.2451,  -0.3347,   0.0025, 0
A,  213, HIS,  0.4631,  -0.2234,   0.0075, 0
A,  214, ASP,  0.3514,  -0.2804,   0.0044, 0
A,  215, CYS,  0.1442,  -0.3863,   0.0013, 0
A,  216, VAL,  0.1560,  -0.3803,   0.0014, 0
A,  217, PRO,  0.1532,  -0.3817,   0.0014, 0
A,  218, GLU,  0.5723,  -0.1675,   0.0111, 12
A,  219, GLN,  0.2269,  -0.3440,   0.0022, 0
A,  220, VAL,  0.0000,  -0.4600,   0.0005, 0
A,  221, ILE,  0.2108,  -0.3523,   0.0020, 0
A,  222, ALA,  0.0862,  -0.4159,   0.0009, 0
A,  223, GLU,  0.1730,  -0.3716,   0.0016, 0
A,  224, ALA,  0.1002,  -0.4088,   0.0009, 0
A,  225, ILE,  0.4997,  -0.2046,   0.0085, 14
A,  226, ARG,  0.3025,  -0.3054,   0.0034, 0
A,  227, LYS,  0.1478,  -0.3845,   0.0013, 0
A,  228, LYS,  0.8581,  -0.0215,   0.0277, 14
A,  229, THR,  0.9654,   0.0334,   0.0369, 14
A,  230, ARG,  0.3633,  -0.2743,   0.0046, 0
A,  231, SER,  0.2092,  -0.3531,   0.0020, 0
A,  232, MET,  0.1031,  -0.4073,   0.0010, 0
A,  233, LEU,  0.0525,  -0.4332,   0.0007, 0
A,  234, LEU,  0.9211,   0.0107,   0.0326, 0
A,  235, SER,  0.1047,  -0.4065,   0.0010, 0
A,  236, SER,  0.2488,  -0.3328,   0.0025, 0
A,  237, GLU,  0.0360,  -0.4416,   0.0006, 0
A,  238, GLN,  0.3022,  -0.3055,   0.0034, 0
A,  239, LEU,  0.3781,  -0.2668,   0.0050, 0
A,  240, LYS,  0.1961,  -0.3598,   0.0018, 0
A,  241, LEU,  0.2947,  -0.3094,   0.0033, 0
A,  242, CYS,  1.1475,   0.1264,   0.0567, 0
A,  243, VAL,  0.2443,  -0.3351,   0.0025, 0
A,  244, LEU,  0.1609,  -0.3778,   0.0014, 0
A,  245, GLU,  0.3046,  -0.3043,   0.0035, 0
A,  246, TYR,  1.5615,   0.3380,   0.1207, 14
A,  247, GLN,  0.1453,  -0.3857,   0.0013, 0
A,  248, GLY,  0.5323,  -0.1880,   0.0096, 12
A,  249, LYS,  0.2665,  -0.3238,   0.0028, 14
A,  250, TYR,  1.3693,   0.2398,   0.0881, 12
A,  251, ILE,  1.0436,   0.0733,   0.0450, 12
A,  252, LEU,  0.0000,  -0.4600,   0.0005, 0
A,  253, LYS,  0.5613,  -0.1731,   0.0107, 11
A,  254, VAL,  0.3917,  -0.2598,   0.0054, 0
A,  255, CYS,  0.4359,  -0.2373,   0.0066, 0
A,  256, GLY,  0.2364,  -0.3392,   0.0023, 0
A,  257, CYS,  0.4430,  -0.2336,   0.0069, 0
A,  258, ASP,  1.4062,   0.2586,   0.0937, 1
A,  259, GLU,  0.6224,  -0.1419,   0.0135, 1
A,  260, TYR,  0.3961,  -0.2576,   0.0055, 0
A,  261, PHE,  0.1926,  -0.3615,   0.0017, 0
A,  262, LEU,  1.0075,   0.0549,   0.0411, 12
A,  263, GLU,  1.0255,   0.0641,   0.0430, 12
A,  264, LYS,  1.2617,   0.1848,   0.0717, 12
A,  265, TYR,  1.0499,   0.0765,   0.0456, 0
A,  266, PRO,  0.1372,  -0.3899,   0.0012, 0
A,  267, LEU,  0.0000,  -0.4600,   0.0005, 0
A,  268, SER,  0.0000,  -0.4600,   0.0005, 0
A,  269, GLN,  0.4834,  -0.2129,   0.0080, 0
A,  270, TYR,  0.0000,  -0.4600,   0.0005, 0
A,  271, LYS,  1.4267,   0.2691,   0.0971, 1
A,  272, TYR,  0.5124,  -0.1981,   0.0089, 0
A,  273, ILE,  0.0000,  -0.4600,   0.0005, 0
A,  274, ARG,  0.9257,   0.0131,   0.0331, 1
A,  275, SER,  2.0805,   0.6032,   0.2237, 1
A,  276, CYS,  1.3295,   0.2194,   0.0818, 20
A,  277, ILE,  1.1992,   0.1528,   0.0632, 0
A,  278, MET,  3.2467,   1.1992,   0.4420, 1
A,  279, LEU,  2.4269,   0.7802,   0.2955, 1
A,  280, GLY,  1.1006,   0.1024,   0.0512, 8
A,  281, ARG,  2.1902,   0.6593,   0.2473, 15
A,  282, MET,  2.3265,   0.7289,   0.2749, 20
A,  283, PRO,  1.3153,   0.2122,   0.0793, 0
A,  284, ASN,  1.5390,   0.3265,   0.1166, 20
A,  285, LEU,  0.0000,  -0.4600,   0.0005, 0
A,  286, MET,  0.5959,  -0.1555,   0.0122, 11
A,  287, LEU,  1.0892,   0.0966,   0.0499, 11
A,  288, MET,  0.9621,   0.0317,   0.0366, 11
A,  289, ALA,  0.7222,  -0.0909,   0.0189, 11
A,  290, LYS,  1.0367,   0.0698,   0.0442, 12
A,  291, GLU,  0.1337,  -0.3917,   0.0012, 0
A,  292, SER,  0.8558,  -0.0227,   0.0275, 11
A,  293, LEU,  0.0000,  -0.4600,   0.0005, 0
A,  294, TYR,  0.9414,   0.0211,   0.0346, 12
A,  295, SER,  0.0408,  -0.4391,   0.0007, 0
A,  296, GLN,  1.5834,   0.3492,   0.1245, 1
A,  297, LEU,  1.5234,   0.3185,   0.1138, 1
A,  298, PRO,  0.5435,  -0.1822,   0.0100, 1
A,  299, MET,  1.1743,   0.1401,   0.0599, 1
A,  300, ASP,  0.7099,  -0.0972,   0.0182, 0
A,  301, CYS,  2.5170,   0.8263,   0.3130, 0
A,  302, PHE,  1.6188,   0.3673,   0.1308, 0
A,  303, THR,  1.4856,   0.2992,   0.1073, 0
A,  304, MET,  1.1962,   0.1513,   0.0628, 0
A,  305, PRO,  1.4865,   0.2996,   0.1074, 0
A,  306, SER,  1.0595,   0.0815,   0.0467, 0
A,  325, LYS,  0.1736,  -0.3713,   0.0016, 0
A,  326, SER,  0.1939,  -0.3609,   0.0018, 0
A,  327, LEU,  0.9949,   0.0484,   0.0398, 0
A,  328, TRP,  1.6428,   0.3795,   0.1350, 28
A,  329, VAL,  0.4970,  -0.2060,   0.0084, 0
A,  330, ILE,  0.3802,  -0.2657,   0.0051, 0
A,  331, ASN,  0.3510,  -0.2806,   0.0044, 0
A,  332, SER,  0.3133,  -0.2999,   0.0036, 0
A,  333, ALA,  0.2090,  -0.3532,   0.0020, 0
A,  334, LEU,  0.6243,  -0.1410,   0.0136, 0
A,  335, ARG,  0.9367,   0.0187,   0.0341, 0
A,  336, ILE,  0.0000,  -0.4600,   0.0005, 0
A,  337, LYS,  0.1931,  -0.3613,   0.0017, 0
A,  338, ILE,  0.0000,  -0.4600,   0.0005, 0
A,  339, LEU,  0.1090,  -0.4043,   0.0010, 0
A,  340, CYS,  0.3963,  -0.2575,   0.0055, 0
A,  341, ALA,  0.9607,   0.0310,   0.0365, 0
A,  342, THR,  0.7658,  -0.0687,   0.0217, 0
A,  343, TYR,  2.3719,   0.7521,   0.2843, 2
A,  344, VAL,  3.1333,   1.1413,   0.4248, 2
A,  345, ASN,  3.2452,   1.1984,   0.4417, 2
A,  346, VAL,  1.0343,   0.0686,   0.0440, 2
A,  347, ASN,  0.4016,  -0.2548,   0.0056, 0
A,  348, ILE,  0.3917,  -0.2598,   0.0054, 0
A,  349, ARG,  0.4360,  -0.2372,   0.0066, 0
A,  350, ASP,  0.3850,  -0.2632,   0.0052, 0
A,  351, ILE,  0.3895,  -0.2609,   0.0053, 0
A,  352, ASP,  0.6542,  -0.1257,   0.0151, 0
A,  353, LYS,  1.0461,   0.0746,   0.0452, 0
A,  354, ILE,  1.9891,   0.5565,   0.2052, 2
A,  355, TYR,  2.3342,   0.7329,   0.2765, 0
A,  356, VAL,  0.0000,  -0.4600,   0.0005, 0
A,  357, ARG,  1.3208,   0.2150,   0.0802, 0
A,  358, THR,  0.0000,  -0.4600,   0.0005, 0
A,  359, GLY,  0.0000,  -0.4600,   0.0005, 0
A,  360, ILE,  0.0000,  -0.4600,   0.0005, 0
A,  361, TYR,  0.6910,  -0.1069,   0.0171, 0
A,  362, HIS,  1.0853,   0.0947,   0.0495, 32
A,  363, GLY,  2.3875,   0.7601,   0.2873, 9
A,  364, GLY,  1.7344,   0.4263,   0.1523, 9
A,  365, GLU,  1.0477,   0.0754,   0.0454, 0
A,  366, PRO,  0.3976,  -0.2568,   0.0055, 0
A,  367, LEU,  0.3192,  -0.2969,   0.0037, 0
A,  368, CYS,  0.2889,  -0.3124,   0.0032, 0
A,  369, ASP,  0.3643,  -0.2738,   0.0047, 0
A,  370, ASN,  0.1130,  -0.4022,   0.0010, 0
A,  371, VAL,  1.0556,   0.0795,   0.0462, 0
A,  372, ASN,  0.0608,  -0.4289,   0.0008, 0
A,  373, THR,  0.0774,  -0.4205,   0.0008, 0
A,  374, GLN,  0.5934,  -0.1567,   0.0121, 0
A,  375, ARG,  0.1739,  -0.3711,   0.0016, 0
A,  376, VAL,  0.2782,  -0.3178,   0.0030, 0
A,  377, PRO,  0.3841,  -0.2637,   0.0052, 0
A,  378, CYS,  0.3889,  -0.2612,   0.0053, 0
A,  379, SER,  0.3086,  -0.3023,   0.0035, 0
A,  380, ASN,  0.2194,  -0.3479,   0.0021, 0
A,  381, PRO,  0.9429,   0.0219,   0.0347, 0
A,  382, ARG,  0.2491,  -0.3327,   0.0025, 0
A,  383, TRP,  0.8743,  -0.0132,   0.0290, 0
A,  384, ASN,  0.1351,  -0.3910,   0.0012, 0
A,  385, GLU,  0.1292,  -0.3940,   0.0011, 0
A,  386, TRP,  0.4001,  -0.2555,   0.0056, 0
A,  387, LEU,  0.1050,  -0.4063,   0.0010, 0
A,  388, ASN,  0.1877,  -0.3641,   0.0017, 0
A,  389, TYR,  0.0857,  -0.4162,   0.0009, 0
A,  390, ASP,  0.2701,  -0.3219,   0.0029, 0
A,  391, ILE,  0.3551,  -0.2785,   0.0044, 0
A,  392, TYR,  0.6827,  -0.1111,   0.0166, 0
A,  393, ILE,  1.0345,   0.0687,   0.0440, 28
A,  394, PRO,  0.9781,   0.0399,   0.0381, 0
A,  395, ASP,  0.3684,  -0.2717,   0.0048, 36
A,  396, LEU,  1.0186,   0.0605,   0.0423, 28
A,  397, PRO,  0.1226,  -0.3974,   0.0011, 36
A,  398, ARG,  0.9430,   0.0219,   0.0348, 16
A,  399, ALA,  0.4913,  -0.2089,   0.0083, 0
A,  400, ALA,  0.1569,  -0.3798,   0.0014, 0
A,  401, ARG,  1.5704,   0.3426,   0.1223, 9
A,  402, LEU,  0.0000,  -0.4600,   0.0005, 0
A,  403, CYS,  0.0000,  -0.4600,   0.0005, 0
A,  404, LEU,  0.0000,  -0.4600,   0.0005, 0
A,  405, SER,  2.0765,   0.6012,   0.2229, 0
A,  406, ILE,  4.0977,   1.6341,   0.5624, 2
A,  407, CYS,  4.3201,   1.7477,   0.5885, 2
A,  408, SER,  2.0064,   0.5654,   0.2087, 2
A,  409, VAL,  1.3242,   0.2167,   0.0809, 0
A,  410, LYS,  1.0417,   0.0723,   0.0448, 0
A,  411, GLY,  0.5927,  -0.1571,   0.0121, 0
A,  412, ARG,  0.3294,  -0.2917,   0.0039, 0
A,  413, LYS,  0.1660,  -0.3752,   0.0015, 0
A,  414, GLY,  0.0552,  -0.4318,   0.0007, 0
A,  424, TRP,  5.6614,   2.4332,   0.7179, 2
A,  425, GLY,  0.0000,  -0.4600,   0.0005, 0
A,  426, ASN,  0.2724,  -0.3208,   0.0029, 7
A,  427, ILE,  0.2250,  -0.3450,   0.0022, 7
A,  428, ASN,  1.1536,   0.1295,   0.0574, 7
A,  429, LEU,  0.5362,  -0.1860,   0.0097, 0
A,  430, PHE,  0.6746,  -0.1152,   0.0162, 7
A,  431, ASP,  0.8608,  -0.0201,   0.0279, 7
A,  432, TYR,  1.6613,   0.3890,   0.1386, 7
A,  433, THR,  0.5660,  -0.1707,   0.0109, 0
A,  434, ASP,  0.6165,  -0.1450,   0.0132, 16
A,  435, THR,  0.2843,  -0.3147,   0.0031, 0
A,  436, LEU,  1.1221,   0.1135,   0.0536, 0
A,  437, VAL,  1.1500,   0.1277,   0.0570, 7
A,  438, SER,  0.7501,  -0.0767,   0.0207, 0
A,  439, GLY,  0.2917,  -0.3109,   0.0032, 0
A,  440, LYS,  0.1999,  -0.3578,   0.0018, 0
A,  441, MET,  0.6247,  -0.1407,   0.0136, 7
A,  442, ALA,  0.3154,  -0.2988,   0.0037, 0
A,  443, LEU,  0.1824,  -0.3668,   0.0016, 7
A,  444, ASN,  0.2528,  -0.3308,   0.0026, 0
A,  445, LEU,  1.0009,   0.0515,   0.0404, 2
A,  446, TRP,  4.4762,   1.8275,   0.6059, 2
A,  447, PRO,  4.1141,   1.6425,   0.5644, 2
A,  448, VAL,  3.6830,   1.4221,   0.5020, 2
A,  449, PRO,  3.2679,   1.2100,   0.4448, 2
A,  450, HIS,  3.6617,   1.4113,   0.4989, 2
A,  451, GLY,  0.9555,   0.0283,   0.0360, 19
A,  452, LEU,  1.7103,   0.4140,   0.1477, 2
A,  453, GLU,  1.2522,   0.1799,   0.0704, 2
A,  454, ASP,  0.4765,  -0.2165,   0.0078, 0
A,  455, LEU,  1.3563,   0.2331,   0.0861, 9
A,  456, LEU,  1.1196,   0.1121,   0.0533, 0
A,  457, ASN,  2.8220,   0.9822,   0.3709, 2
A,  458, PRO,  2.0893,   0.6077,   0.2256, 9
A,  459, ILE,  3.2072,   1.1790,   0.4356, 2
A,  460, GLY,  3.4225,   1.2890,   0.4658, 2
A,  461, VAL,  4.0736,   1.6218,   0.5592, 2
A,  462, THR,  2.6356,   0.8869,   0.3349, 0
A,  463, GLY,  1.3204,   0.2148,   0.0802, 0
A,  464, SER,  2.4520,   0.7931,   0.3009, 7
A,  465, ASN,  1.2703,   0.1892,   0.0728, 7
A,  466, PRO,  1.5435,   0.3288,   0.1174, 7
A,  467, ASN,  1.3115,   0.2102,   0.0786, 2
A,  468, LYS,  0.8975,  -0.0013,   0.0307, 2
A,  469, GLU,  0.9525,   0.0268,   0.0357, 2
A,  470, THR,  1.3602,   0.2351,   0.0867, 2
A,  471, PRO,  1.4284,   0.2700,   0.0973, 2
A,  472, CYS,  0.3734,  -0.2692,   0.0049, 0
A,  473, LEU,  0.0000,  -0.4600,   0.0005, 0
A,  474, GLU,  0.2494,  -0.3325,   0.0025, 0
A,  475, LEU,  0.0642,  -0.4272,   0.0008, 0
A,  476, GLU,  0.1831,  -0.3664,   0.0016, 0
A,  477, PHE,  0.6885,  -0.1082,   0.0169, 0
A,  478, ASP,  0.3595,  -0.2763,   0.0046, 0
A,  479, TRP,  1.2328,   0.1700,   0.0679, 0
A,  480, PHE,  0.6464,  -0.1297,   0.0147, 0
A,  481, SER,  0.5074,  -0.2007,   0.0088, 0
A,  482, SER,  0.4608,  -0.2245,   0.0074, 0
A,  483, VAL,  0.6126,  -0.1470,   0.0130, 28
A,  484, VAL,  0.5891,  -0.1590,   0.0119, 0
A,  485, LYS,  1.2262,   0.1666,   0.0671, 36
A,  486, PHE,  1.2578,   0.1828,   0.0712, 28
A,  487, PRO,  0.5770,  -0.1651,   0.0113, 0
A,  488, ASP,  0.8484,  -0.0264,   0.0270, 0
A,  489, MET,  0.2897,  -0.3120,   0.0032, 0
A,  490, SER,  0.7005,  -0.1020,   0.0176, 0
A,  491, VAL,  0.8530,  -0.0241,   0.0273, 36
A,  492, ILE,  0.3928,  -0.2593,   0.0054, 0
A,  493, GLU,  0.2387,  -0.3380,   0.0024, 0
A,  494, GLU,  0.6051,  -0.1508,   0.0127, 0
A,  495, HIS,  0.6168,  -0.1448,   0.0132, 25
A,  496, ALA,  0.0628,  -0.4279,   0.0008, 0
A,  497, ASN,  0.2128,  -0.3513,   0.0020, 0
A,  498, TRP,  1.3661,   0.2381,   0.0876, 25
A,  499, SER,  0.4374,  -0.2365,   0.0067, 0
A,  500, VAL,  0.1320,  -0.3925,   0.0012, 0
A,  501, SER,  0.0700,  -0.4242,   0.0008, 0
A,  502, ARG,  0.0628,  -0.4279,   0.0008, 0
A,  503, GLU,  0.0290,  -0.4452,   0.0006, 0
A,  504, ALA,  0.0254,  -0.4470,   0.0006, 0
A,  505, GLY,  0.0100,  -0.4549,   0.0005, 0
A,  528, LYS,  0.1680,  -0.3741,   0.0015, 0
A,  529, GLU,  0.3601,  -0.2760,   0.0046, 0
A,  530, GLN,  0.0606,  -0.4290,   0.0008, 0
A,  531, LEU,  1.0896,   0.0968,   0.0499, 0
A,  532, LYS,  0.8093,  -0.0464,   0.0243, 0
A,  533, ALA,  0.1416,  -0.3876,   0.0013, 0
A,  534, ILE,  1.0461,   0.0746,   0.0452, 0
A,  535, SER,  1.1068,   0.1056,   0.0519, 0
A,  536, THR,  1.2547,   0.1812,   0.0708, 0
A,  537, ARG,  1.6275,   0.3717,   0.1323, 0
A,  538, ASP,  1.2984,   0.2035,   0.0765, 0
A,  539, PRO,  1.4725,   0.2925,   0.1049, 0
A,  540, LEU,  1.3051,   0.2070,   0.0775, 0
A,  541, SER,  0.7514,  -0.0760,   0.0208, 0
A,  542, GLU,  0.9058,   0.0029,   0.0314, 9
A,  543, ILE,  0.2058,  -0.3548,   0.0019, 0
A,  544, THR,  0.0247,  -0.4474,   0.0006, 0
A,  545, GLU,  0.1813,  -0.3673,   0.0016, 0
A,  546, GLN,  0.2633,  -0.3254,   0.0028, 0
A,  547, GLU,  0.3019,  -0.3057,   0.0034, 0
A,  548, LYS,  0.7943,  -0.0541,   0.0233, 0
A,  549, ASP,  0.2904,  -0.3116,   0.0032, 0
A,  550, PHE,  1.1381,   0.1216,   0.0555, 0
A,  551, LEU,  0.8567,  -0.0222,   0.0276, 0
A,  552, TRP,  0.9839,   0.0428,   0.0387, 0
A,  553, SER,  0.6327,  -0.1367,   0.0140, 0
A,  554, HIS,  0.9113,   0.0057,   0.0318, 0
A,  555, ARG,  1.0339,   0.0684,   0.0440, 0
A,  556, HIS,  1.1543,   0.1299,   0.0575, 25
A,  557, TYR,  0.7277,  -0.0881,   0.0193, 0
A,  558, CYS,  0.6943,  -0.1052,   0.0173, 0
A,  559, VAL,  0.1180,  -0.3997,   0.0010, 25
A,  560, THR,  0.0929,  -0.4125,   0.0009, 0
A,  561, ILE,  0.1485,  -0.3841,   0.0013, 0
A,  562, PRO,  0.1158,  -0.4008,   0.0010, 0
A,  563, GLU,  0.7843,  -0.0592,   0.0227, 0
A,  564, ILE,  0.8442,  -0.0286,   0.0266, 0
A,  565, LEU,  0.0000,  -0.4600,   0.0005, 0
A,  566, PRO,  0.3659,  -0.2730,   0.0047, 0
A,  567, LYS,  1.0226,   0.0626,   0.0427, 0
A,  568, LEU,  0.0000,  -0.4600,   0.0005, 0
A,  569, LEU,  0.3914,  -0.2600,   0.0054, 32
A,  570, LEU,  1.9729,   0.5482,   0.2020, 9
A,  571, SER,  0.3982,  -0.2565,   0.0055, 0
A,  572, VAL,  0.6511,  -0.1272,   0.0149, 0
A,  573, LYS,  0.6880,  -0.1084,   0.0169, 0
A,  574, TRP,  0.8902,  -0.0051,   0.0302, 32
A,  575, ASN,  0.4342,  -0.2381,   0.0066, 0
A,  576, SER,  0.1632,  -0.3766,   0.0015, 0
A,  577, ARG,  1.2043,   0.1554,   0.0639, 36
A,  578, ASP,  0.3996,  -0.2558,   0.0056, 0
A,  579, GLU,  0.4986,  -0.2052,   0.0085, 0
A,  580, VAL,  0.3915,  -0.2599,   0.0054, 36
A,  581, ALA,  0.3561,  -0.2780,   0.0045, 36
A,  582, GLN,  0.8792,  -0.0107,   0.0294, 0
A,  583, MET,  0.2982,  -0.3076,   0.0034, 40
A,  584, TYR,  1.0341,   0.0685,   0.0440, 40
A,  585, CYS,  0.4699,  -0.2199,   0.0077, 25
A,  586, LEU,  0.4566,  -0.2266,   0.0073, 25
A,  587, VAL,  0.4821,  -0.2136,   0.0080, 0
A,  588, LYS,  0.7152,  -0.0945,   0.0185, 0
A,  589, ASP,  0.4458,  -0.2322,   0.0069, 25
A,  590, TRP,  0.3974,  -0.2569,   0.0055, 0
A,  591, PRO,  0.4565,  -0.2267,   0.0073, 0
A,  592, PRO,  0.6879,  -0.1084,   0.0169, 0
A,  593, ILE,  0.5004,  -0.2043,   0.0086, 0
A,  594, LYS,  1.3210,   0.2151,   0.0803, 10
A,  595, PRO,  0.2897,  -0.3120,   0.0032, 10
A,  596, GLU,  1.2322,   0.1697,   0.0678, 10
A,  597, GLN,  0.8605,  -0.0202,   0.0279, 0
A,  598, ALA,  0.0000,  -0.4600,   0.0005, 0
A,  599, MET,  0.0370,  -0.4411,   0.0006, 0
A,  600, GLU,  0.9100,   0.0051,   0.0317, 0
A,  601, LEU,  0.0000,  -0.4600,   0.0005, 0
A,  602, LEU,  0.0000,  -0.4600,   0.0005, 0
A,  603, ASP,  0.7483,  -0.0776,   0.0206, 0
A,  604, CYS,  2.3825,   0.7575,   0.2863, 9
A,  605, ASN,  2.9968,   1.0715,   0.4019, 9
A,  606, TYR,  1.0009,   0.0515,   0.0404, 32
A,  607, PRO,  1.5134,   0.3134,   0.1120, 32
A,  608, ASP,  0.2221,  -0.3465,   0.0021, 32
A,  609, PRO,  1.0196,   0.0611,   0.0424, 16
A,  610, MET,  1.3117,   0.2103,   0.0787, 16
A,  611, VAL,  0.3663,  -0.2728,   0.0047, 40
A,  612, ARG,  0.4345,  -0.2379,   0.0066, 16
A,  613, GLY,  0.4856,  -0.2118,   0.0081, 0
A,  614, PHE,  0.8082,  -0.0470,   0.0242, 0
A,  615, ALA,  0.0000,  -0.4600,   0.0005, 0
A,  616, VAL,  0.1488,  -0.3840,   0.0013, 0
A,  617, ARG,  1.1525,   0.1290,   0.0573, 0
A,  618, CYS,  0.3472,  -0.2826,   0.0043, 0
A,  619, LEU,  0.1330,  -0.3920,   0.0012, 0
A,  620, GLU,  0.5205,  -0.1940,   0.0092, 0
A,  621, LYS,  0.6324,  -0.1368,   0.0140, 0
A,  622, TYR,  0.7662,  -0.0684,   0.0217, 0
A,  623, LEU,  0.2434,  -0.3356,   0.0024, 10
A,  624, THR,  0.9393,   0.0200,   0.0344, 0
A,  625, ASP,  1.0583,   0.0809,   0.0465, 13
A,  626, ASP,  0.9318,   0.0162,   0.0337, 1
A,  627, LYS,  1.0808,   0.0923,   0.0490, 10
A,  628, LEU,  0.1692,  -0.3735,   0.0015, 0
A,  629, SER,  2.8020,   0.9719,   0.3668, 1
A,  630, GLN,  1.8138,   0.4669,   0.1688, 1
A,  631, TYR,  0.7832,  -0.0597,   0.0227, 10
A,  632, LEU,  0.7977,  -0.0523,   0.0235, 0
A,  633, ILE,  2.2409,   0.6852,   0.2572, 1
A,  634, GLN,  0.0000,  -0.4600,   0.0005, 0
A,  635, LEU,  0.0326,  -0.4433,   0.0006, 0
A,  636, VAL,  0.0000,  -0.4600,   0.0005, 0
A,  637, GLN,  0.2503,  -0.3321,   0.0026, 29
A,  638, VAL,  0.0000,  -0.4600,   0.0005, 0
A,  639, LEU,  0.2746,  -0.3197,   0.0030, 0
A,  640, LYS,  1.0542,   0.0787,   0.0461, 2
A,  641, TYR,  1.6732,   0.3951,   0.1410, 0
A,  642, GLU,  0.6688,  -0.1182,   0.0159, 16
A,  643, GLN,  1.5400,   0.3270,   0.1168, 7
A,  644, TYR,  0.9751,   0.0383,   0.0378, 7
A,  645, LEU,  1.0950,   0.0996,   0.0505, 7
A,  646, ASP,  0.9704,   0.0359,   0.0374, 16
A,  647, ASN,  0.7567,  -0.0733,   0.0211, 16
A,  648, LEU,  0.6434,  -0.1312,   0.0145, 16
A,  649, LEU,  0.0970,  -0.4104,   0.0009, 0
A,  650, VAL,  0.3156,  -0.2987,   0.0037, 0
A,  651, ARG,  0.7374,  -0.0831,   0.0199, 0
A,  652, PHE,  0.4566,  -0.2267,   0.0073, 0
A,  653, LEU,  0.0940,  -0.4119,   0.0009, 0
A,  654, LEU,  0.1151,  -0.4012,   0.0010, 0
A,  655, LYS,  0.5494,  -0.1792,   0.0102, 0
A,  656, LYS,  0.5880,  -0.1595,   0.0118, 13
A,  657, ALA,  0.0165,  -0.4516,   0.0006, 0
A,  658, LEU,  0.0000,  -0.4600,   0.0005, 0
A,  659, THR,  0.8824,  -0.0090,   0.0296, 13
A,  660, ASN,  0.4810,  -0.2142,   0.0080, 13
A,  661, GLN,  2.1667,   0.6473,   0.2422, 1
A,  662, ARG,  1.5369,   0.3254,   0.1162, 1
A,  663, ILE,  0.1592,  -0.3786,   0.0014, 0
A,  664, GLY,  0.0000,  -0.4600,   0.0005, 0
A,  665, HIS,  0.0000,  -0.4600,   0.0005, 0
A,  666, PHE,  4.6308,   1.9065,   0.6220, 1
A,  667, PHE,  0.0000,  -0.4600,   0.0005, 0
A,  668, PHE,  0.0000,  -0.4600,   0.0005, 0
A,  669, TRP,  1.3205,   0.2149,   0.0802, 6
A,  670, HIS,  3.4939,   1.3255,   0.4754, 1
A,  671, LEU,  0.0000,  -0.4600,   0.0005, 0
A,  672, LYS,  2.3510,   0.7415,   0.2800, 6
A,  673, SER,  0.3741,  -0.2688,   0.0049, 26
A,  674, GLU,  0.4663,  -0.2217,   0.0076, 2
A,  675, MET,  1.2329,   0.1701,   0.0679, 6
A,  676, HIS,  1.0977,   0.1010,   0.0509, 2
A,  677, ASN,  1.9367,   0.5297,   0.1947, 2
A,  678, LYS,  1.8405,   0.4806,   0.1747, 2
A,  679, THR,  4.2322,   1.7028,   0.5793, 2
A,  680, VAL,  0.9408,   0.0208,   0.0345, 0
A,  681, SER,  1.6284,   0.3722,   0.1325, 0
A,  682, GLN,  2.8401,   0.9914,   0.3746, 7
A,  683, ARG,  1.2352,   0.1713,   0.0682, 7
A,  684, PHE,  0.0000,  -0.4600,   0.0005, 0
A,  685, GLY,  0.0000,  -0.4600,   0.0005, 0
A,  686, LEU,  0.2290,  -0.3429,   0.0022, 0
A,  687, LEU,  0.2437,  -0.3354,   0.0025, 0
A,  688, LEU,  0.0000,  -0.4600,   0.0005, 0
A,  689, GLU,  0.9585,   0.0298,   0.0363, 0
A,  690, SER,  0.1801,  -0.3680,   0.0016, 0
A,  691, TYR,  0.0000,  -0.4600,   0.0005, 0
A,  692, CYS,  1.2714,   0.1897,   0.0729, 0
A,  693, ARG,  2.7976,   0.9697,   0.3660, 0
A,  694, ALA,  1.1535,   0.1295,   0.0574, 0
A,  695, CYS,  0.0000,  -0.4600,   0.0005, 0
A,  696, GLY,  1.9267,   0.5246,   0.1925, 0
A,  697, MET,  2.2469,   0.6882,   0.2582, 1
A,  698, TYR,  1.6046,   0.3600,   0.1284, 1
A,  699, LEU,  1.4687,   0.2906,   0.1043, 0
A,  700, LYS,  1.2066,   0.1566,   0.0643, 3
A,  701, HIS,  2.5730,   0.8549,   0.3229, 1
A,  702, LEU,  0.0000,  -0.4600,   0.0005, 0
A,  703, ASN,  0.5513,  -0.1783,   0.0103, 0
A,  704, ARG,  0.9287,   0.0146,   0.0334, 1
A,  705, GLN,  0.5970,  -0.1549,   0.0123, 0
A,  706, VAL,  1.4587,   0.2854,   0.1025, 0
A,  707, GLU,  1.7246,   0.4214,   0.1504, 3
A,  708, ALA,  0.0000,  -0.4600,   0.0005, 0
A,  709, MET,  2.4835,   0.8092,   0.3067, 17
A,  710, GLU,  3.4853,   1.3211,   0.4742, 6
A,  711, LYS,  1.1085,   0.1065,   0.0521, 3
A,  712, LEU,  1.1957,   0.1510,   0.0627, 17
A,  713, ILE,  2.4324,   0.7831,   0.2967, 6
A,  714, ASN,  1.0676,   0.0856,   0.0476, 18
A,  715, LEU,  0.1219,  -0.3977,   0.0011, 37
A,  716, THR,  0.0000,  -0.4600,   0.0005, 0
A,  717, ASP,  0.8482,  -0.0266,   0.0269, 0
A,  718, ILE,  0.4829,  -0.2132,   0.0080, 37
A,  719, LEU,  0.0000,  -0.4600,   0.0005, 0
A,  720, LYS,  0.3077,  -0.3028,   0.0035, 0
A,  721, GLN,  0.7049,  -0.0997,   0.0179, 0
A,  722, GLU,  0.6342,  -0.1359,   0.0141, 0
A,  723, LYS,  0.0503,  -0.4343,   0.0007, 0
A,  724, LYS,  0.7927,  -0.0549,   0.0232, 0
A,  725, ASP,  0.0615,  -0.4285,   0.0008, 0
A,  726, GLU,  0.0838,  -0.4172,   0.0009, 0
A,  727, THR,  0.0338,  -0.4427,   0.0006, 0
A,  728, GLN,  0.1687,  -0.3738,   0.0015, 0
A,  729, LYS,  0.2248,  -0.3451,   0.0022, 0
A,  730, VAL,  0.1201,  -0.3986,   0.0011, 0
A,  731, GLN,  0.0825,  -0.4178,   0.0009, 0
A,  732, MET,  0.5216,  -0.1934,   0.0092, 0
A,  733, LYS,  0.4954,  -0.2068,   0.0084, 0
A,  734, PHE,  0.9717,   0.0366,   0.0375, 0
A,  735, LEU,  0.1025,  -0.4076,   0.0010, 0
A,  736, VAL,  0.4879,  -0.2107,   0.0082, 0
A,  737, GLU,  0.3190,  -0.2970,   0.0037, 0
A,  738, GLN,  1.0200,   0.0613,   0.0424, 0
A,  739, MET,  0.1140,  -0.4017,   0.0010, 0
A,  740, ARG,  0.3296,  -0.2915,   0.0039, 0
A,  741, ARG,  0.9059,   0.0030,   0.0314, 0
A,  742, PRO,  0.1591,  -0.3787,   0.0014, 0
A,  743, ASP,  0.2976,  -0.3079,   0.0033, 3
A,  744, PHE,  0.1305,  -0.3933,   0.0012, 37
A,  745, MET,  0.1672,  -0.3745,   0.0015, 0
A,  746, ASP,  0.4097,  -0.2506,   0.0059, 3
A,  747, ALA,  0.2959,  -0.3088,   0.0033, 3
A,  748, LEU,  0.0000,  -0.4600,   0.0005, 0
A,  749, GLN,  0.3042,  -0.3046,   0.0035, 0
A,  750, GLY,  0.4233,  -0.2437,   0.0063, 1
A,  751, PHE,  1.6507,   0.3836,   0.1365, 1
A,  752, LEU,  2.5990,   0.8682,   0.3277, 1
A,  753, SER,  0.8058,  -0.0482,   0.0240, 33
A,  754, PRO,  1.9196,   0.5210,   0.1910, 17
A,  755, LEU,  3.3238,   1.2386,   0.4530, 1
A,  756, ASN,  1.5060,   0.3096,   0.1108, 1
A,  757, PRO,  1.4002,   0.2556,   0.0928, 1
A,  758, ALA,  1.2082,   0.1575,   0.0645, 1
A,  759, HIS,  0.9433,   0.0221,   0.0348, 1
A,  760, GLN,  0.7969,  -0.0527,   0.0235, 1
A,  761, LEU,  1.4310,   0.2713,   0.0978, 17
A,  762, GLY,  0.1136,  -0.4019,   0.0010, 0
A,  763, ASN,  0.1784,  -0.3688,   0.0016, 0
A,  764, LEU,  0.1065,  -0.4056,   0.0010, 0
A,  765, ARG,  0.2444,  -0.3351,   0.0025, 0
A,  766, LEU,  0.2764,  -0.3187,   0.0030, 0
A,  767, GLU,  0.2315,  -0.3417,   0.0023, 0
A,  768, GLU,  0.5611,  -0.1733,   0.0107, 0
A,  769, CYS,  0.4107,  -0.2501,   0.0059, 0
A,  770, ARG,  0.8739,  -0.0134,   0.0289, 0
A,  771, ILE,  0.0858,  -0.4162,   0.0009, 0
A,  772, MET,  1.5359,   0.3249,   0.1160, 4
A,  773, SER,  0.1519,  -0.3824,   0.0014, 0
A,  774, SER,  0.2453,  -0.3347,   0.0025, 4
A,  775, ALA,  0.2739,  -0.3200,   0.0030, 4
A,  776, LYS,  0.6114,  -0.1476,   0.0130, 4
A,  777, ARG,  0.1228,  -0.3972,   0.0011, 0
A,  778, PRO,  0.4898,  -0.2097,   0.0082, 4
A,  779, LEU,  0.0000,  -0.4600,   0.0005, 0
A,  780, TRP,  2.3036,   0.7172,   0.2701, 4
A,  781, LEU,  0.9247,   0.0126,   0.0330, 0
A,  782, ASN,  0.4434,  -0.2334,   0.0069, 0
A,  783, TRP,  1.2751,   0.1916,   0.0734, 17
A,  784, GLU,  0.0656,  -0.4264,   0.0008, 0
A,  785, ASN,  0.0945,  -0.4117,   0.0009, 0
A,  786, PRO,  0.1895,  -0.3631,   0.0017, 0
A,  787, ASP,  0.2083,  -0.3536,   0.0019, 0
A,  788, ILE,  0.6478,  -0.1290,   0.0148, 11
A,  789, MET,  0.0000,  -0.4600,   0.0005, 0
A,  790, SER,  0.0846,  -0.4167,   0.0009, 0
A,  791, GLU,  0.3664,  -0.2727,   0.0047, 0
A,  792, LEU,  0.3583,  -0.2769,   0.0045, 0
A,  793, LEU,  1.5707,   0.3427,   0.1223, 20
A,  794, PHE,  0.9984,   0.0502,   0.0401, 15
A,  795, GLN,  0.5118,  -0.1984,   0.0089, 31
A,  796, ASN,  0.5124,  -0.1981,   0.0089, 0
A,  797, ASN,  0.4472,  -0.2315,   0.0070, 31
A,  798, GLU,  1.0633,   0.0834,   0.0471, 31
A,  799, ILE,  1.3080,   0.2085,   0.0780, 17
A,  800, ILE,  2.8689,   1.0061,   0.3804, 4
A,  801, PHE,  0.0000,  -0.4600,   0.0005, 0
A,  802, LYS,  1.5659,   0.3402,   0.1215, 4
A,  803, ASN,  0.5615,  -0.1731,   0.0107, 0
A,  804, GLY,  0.2740,  -0.3200,   0.0030, 0
A,  805, ASP,  1.3156,   0.2123,   0.0793, 4
A,  806, ASP,  0.8045,  -0.0489,   0.0240, 2
A,  807, LEU,  1.0141,   0.0582,   0.0418, 4
A,  808, ARG,  0.9813,   0.0415,   0.0384, 2
A,  809, GLN,  0.8429,  -0.0292,   0.0265, 0
A,  810, ASP,  1.4935,   0.3032,   0.1087, 4
A,  811, MET,  2.5824,   0.8597,   0.3246, 1
A,  812, LEU,  0.0000,  -0.4600,   0.0005, 0
A,  813, THR,  1.0492,   0.0762,   0.0456, 30
A,  814, LEU,  0.8671,  -0.0169,   0.0284, 0
A,  815, GLN,  0.6152,  -0.1456,   0.0132, 1
A,  816, ILE,  0.0000,  -0.4600,   0.0005, 0
A,  817, ILE,  0.5430,  -0.1825,   0.0100, 0
A,  818, ARG,  3.4506,   1.3034,   0.4695, 1
A,  819, ILE,  0.3292,  -0.2917,   0.0039, 10
A,  820, MET,  0.0000,  -0.4600,   0.0005, 0
A,  821, GLU,  2.7233,   0.9317,   0.3517, 1
A,  822, ASN,  1.6184,   0.3671,   0.1307, 1
A,  823, ILE,  0.5363,  -0.1859,   0.0097, 10
A,  824, TRP,  0.0000,  -0.4600,   0.0005, 0
A,  825, GLN,  1.4112,   0.2612,   0.0945, 1
A,  826, ASN,  0.4715,  -0.2190,   0.0077, 1
A,  827, GLN,  0.3266,  -0.2931,   0.0039, 0
A,  828, GLY,  0.2529,  -0.3307,   0.0026, 0
A,  829, LEU,  0.2965,  -0.3085,   0.0033, 0
A,  830, ASP,  0.6236,  -0.1413,   0.0136, 8
A,  831, LEU,  0.0000,  -0.4600,   0.0005, 0
A,  832, ARG,  3.2705,   1.2113,   0.4452, 1
A,  833, MET,  2.4059,   0.7695,   0.2909, 1
A,  834, LEU,  0.0000,  -0.4600,   0.0005, 0
A,  835, PRO,  1.6770,   0.3970,   0.1417, 1
A,  836, TYR,  2.1231,   0.6250,   0.2327, 1
A,  837, GLY,  1.9605,   0.5419,   0.1997, 1
A,  838, CYS,  3.8118,   1.4880,   0.5218, 1
A,  839, LEU,  2.4710,   0.8028,   0.3044, 1
A,  840, SER,  0.6355,  -0.1352,   0.0141, 0
A,  841, ILE,  1.9219,   0.5222,   0.1914, 6
A,  842, GLY,  1.7833,   0.4513,   0.1623, 6
A,  843, ASP,  1.1526,   0.1290,   0.0573, 2
A,  844, CYS,  0.5202,  -0.1942,   0.0092, 2
A,  845, VAL,  0.6891,  -0.1078,   0.0170, 0
A,  846, GLY,  0.0000,  -0.4600,   0.0005, 0
A,  847, LEU,  1.2743,   0.1912,   0.0733, 17
A,  848, ILE,  2.0767,   0.6013,   0.2229, 4
A,  849, GLU,  1.4673,   0.2899,   0.1040, 1
A,  850, VAL,  1.8184,   0.4693,   0.1698, 4
A,  851, VAL,  0.7771,  -0.0628,   0.0223, 4
A,  852, ARG,  1.4271,   0.2693,   0.0971, 15
A,  853, ASN,  0.7418,  -0.0809,   0.0201, 15
A,  854, SER,  1.0078,   0.0551,   0.0411, 4
A,  855, HIS,  0.5251,  -0.1916,   0.0093, 22
A,  856, THR,  0.5509,  -0.1785,   0.0103, 4
A,  857, ILE,  0.0000,  -0.4600,   0.0005, 0
A,  858, MET,  0.4952,  -0.2069,   0.0084, 0
A,  859, GLN,  0.5267,  -0.1908,   0.0094, 4
A,  860, ILE,  0.2078,  -0.3538,   0.0019, 22
A,  861, GLN,  0.6381,  -0.1339,   0.0143, 0
A,  862, CYS,  0.2583,  -0.3280,   0.0027, 0
A,  863, LYS,  0.8331,  -0.0342,   0.0259, 22
A,  864, GLY,  0.8972,  -0.0015,   0.0307, 0
A,  865, GLY,  0.7903,  -0.0561,   0.0231, 0
A,  866, LEU,  0.6560,  -0.1247,   0.0152, 0
A,  867, LYS,  0.2449,  -0.3348,   0.0025, 0
A,  868, GLY,  0.0910,  -0.4135,   0.0009, 0
A,  869, ALA,  0.2787,  -0.3175,   0.0030, 0
A,  870, LEU,  0.9490,   0.0250,   0.0354, 0
A,  871, GLN,  1.0503,   0.0767,   0.0457, 24
A,  872, PHE,  1.0391,   0.0710,   0.0445, 0
A,  873, ASN,  0.9163,   0.0083,   0.0322, 0
A,  874, SER,  0.8645,  -0.0182,   0.0282, 24
A,  875, HIS,  1.3012,   0.2050,   0.0769, 24
A,  876, THR,  1.0879,   0.0959,   0.0498, 0
A,  877, LEU,  0.0000,  -0.4600,   0.0005, 0
A,  878, HIS,  0.8835,  -0.0085,   0.0297, 0
A,  879, GLN,  0.7665,  -0.0683,   0.0217, 24
A,  880, TRP,  0.3632,  -0.2744,   0.0046, 22
A,  881, LEU,  0.0000,  -0.4600,   0.0005, 0
A,  882, LYS,  1.0895,   0.0968,   0.0499, 24
A,  883, ASP,  0.0732,  -0.4226,   0.0008, 0
A,  884, LYS,  1.1293,   0.1171,   0.0545, 22
A,  885, ASN,  0.7364,  -0.0837,   0.0198, 0
A,  886, LYS,  0.2010,  -0.3573,   0.0018, 0
A,  887, GLY,  0.1541,  -0.3812,   0.0014, 0
A,  888, GLU,  0.0891,  -0.4145,   0.0009, 0
A,  889, ILE,  0.5965,  -0.1552,   0.0123, 0
A,  890, TYR,  1.0116,   0.0570,   0.0415, 0
A,  891, ASP,  0.5721,  -0.1676,   0.0111, 0
A,  892, ALA,  1.4391,   0.2754,   0.0991, 8
A,  893, ALA,  0.0000,  -0.4600,   0.0005, 0
A,  894, ILE,  0.1645,  -0.3759,   0.0015, 0
A,  895, ASP,  1.2996,   0.2042,   0.0766, 8
A,  896, LEU,  1.0980,   0.1011,   0.0509, 8
A,  897, PHE,  0.0000,  -0.4600,   0.0005, 0
A,  898, THR,  0.0000,  -0.4600,   0.0005, 0
A,  899, ARG,  0.9359,   0.0183,   0.0341, 8
A,  900, SER,  0.0000,  -0.4600,   0.0005, 0
A,  901, CYS,  0.1015,  -0.4081,   0.0010, 41
A,  902, ALA,  0.0000,  -0.4600,   0.0005, 0
A,  903, GLY,  0.0000,  -0.4600,   0.0005, 0
A,  904, TYR,  0.5430,  -0.1825,   0.0100, 0
A,  905, CYS,  4.3074,   1.7413,   0.5871, 5
A,  906, VAL,  0.0000,  -0.4600,   0.0005, 0
A,  907, ALA,  0.5430,  -0.1825,   0.0100, 0
A,  908, THR,  1.0757,   0.0897,   0.0484, 0
A,  909, PHE,  1.7686,   0.4438,   0.1592, 5
A,  910, ILE,  0.0000,  -0.4600,   0.0005, 0
A,  911, LEU,  1.1312,   0.1181,   0.0547, 30
A,  912, GLY,  0.3025,  -0.3054,   0.0034, 0
A,  913, ILE,  1.2049,   0.1558,   0.0640, 0
A,  914, GLY,  0.1907,  -0.3625,   0.0017, 0
A,  915, ASP,  0.1866,  -0.3647,   0.0017, 0
A,  916, ARG,  0.2969,  -0.3083,   0.0033, 0
A,  917, HIS,  0.4451,  -0.2325,   0.0069, 0
A,  918, ASN,  0.7505,  -0.0765,   0.0207, 0
A,  919, SER,  0.4738,  -0.2178,   0.0078, 0
A,  920, ASN,  0.2745,  -0.3197,   0.0030, 0
A,  921, ILE,  0.0862,  -0.4159,   0.0009, 0
A,  922, MET,  2.2189,   0.6739,   0.2533, 4
A,  923, VAL,  0.0000,  -0.4600,   0.0005, 0
A,  924, LYS,  0.2753,  -0.3193,   0.0030, 0
A,  925, ASP,  0.9169,   0.0086,   0.0323, 22
A,  926, ASP,  0.8860,  -0.0072,   0.0299, 0
A,  927, GLY,  0.0000,  -0.4600,   0.0005, 0
A,  928, GLN,  1.1730,   0.1395,   0.0597, 1
A,  929, LEU,  0.0000,  -0.4600,   0.0005, 0
A,  930, PHE,  0.9252,   0.0128,   0.0330, 0
A,  931, HIS,  0.0000,  -0.4600,   0.0005, 0
A,  932, ILE,  2.1483,   0.6379,   0.2382, 4
A,  933, ASP,  2.4211,   0.7773,   0.2942, 4
A,  934, PHE,  1.3779,   0.2442,   0.0894, 0
A,  935, GLY,  0.8592,  -0.0209,   0.0278, 0
A,  936, HIS,  0.5514,  -0.1782,   0.0103, 0
A,  937, PHE,  0.6282,  -0.1389,   0.0138, 30
A,  938, LEU,  0.8105,  -0.0458,   0.0243, 0
A,  939, ASP,  0.6176,  -0.1444,   0.0133, 0
A,  940, HIS,  0.7392,  -0.0822,   0.0200, 0
A,  951, ARG,  0.6656,  -0.1198,   0.0157, 39
A,  952, VAL,  2.2052,   0.6670,   0.2504, 5
A,  953, PRO,  0.4218,  -0.2445,   0.0062, 0
A,  954, PHE,  2.7978,   0.9698,   0.3660, 5
A,  955, VAL,  0.4658,  -0.2220,   0.0075, 0
A,  956, LEU,  4.3648,   1.7706,   0.5938, 5
A,  957, THR,  0.6722,  -0.1165,   0.0160, 0
A,  958, GLN,  0.8873,  -0.0066,   0.0300, 0
A,  959, ASP,  0.6485,  -0.1286,   0.0148, 0
A,  960, PHE,  0.1994,  -0.3581,   0.0018, 41
A,  961, LEU,  0.8616,  -0.0197,   0.0280, 35
A,  962, ILE,  0.8949,  -0.0027,   0.0305, 24
A,  963, VAL,  0.0000,  -0.4600,   0.0005, 0
A,  964, ILE,  0.1141,  -0.4017,   0.0010, 41
A,  965, SER,  0.5935,  -0.1567,   0.0121, 0
A,  966, LYS,  0.8364,  -0.0326,   0.0261, 24
A,  967, GLY,  0.3154,  -0.2988,   0.0037, 0
A,  968, ALA,  0.3336,  -0.2895,   0.0040, 0
A,  969, GLN,  0.1394,  -0.3888,   0.0012, 0
A,  970, GLU,  0.3205,  -0.2962,   0.0037, 0
A,  971, CYS,  0.3610,  -0.2755,   0.0046, 0
A,  972, THR,  0.6948,  -0.1049,   0.0173, 35
A,  973, LYS,  0.1742,  -0.3710,   0.0016, 0
A,  974, THR,  0.0668,  -0.4259,   0.0008, 0
A,  975, ARG,  0.1353,  -0.3908,   0.0012, 0
A,  976, GLU,  0.2579,  -0.3282,   0.0027, 0
A,  977, PHE,  0.6979,  -0.1033,   0.0175, 35
A,  978, GLU,  0.1389,  -0.3890,   0.0012, 0
A,  979, ARG,  0.3263,  -0.2933,   0.0039, 0
A,  980, PHE,  3.0028,   1.0745,   0.4029, 5
A,  981, GLN,  1.1984,   0.1524,   0.0631, 5
A,  982, GLU,  0.4433,  -0.2335,   0.0069, 0
A,  983, MET,  0.3654,  -0.2733,   0.0047, 0
A,  984, CYS,  3.6863,   1.4238,   0.5025, 5
A,  985, TYR,  1.9425,   0.5327,   0.1960, 5
A,  986, LYS,  0.3163,  -0.2983,   0.0037, 0
A,  987, ALA,  0.0000,  -0.4600,   0.0005, 0
A,  988, TYR,  0.0341,  -0.4426,   0.0006, 0
A,  989, LEU,  0.3114,  -0.3009,   0.0036, 0
A,  990, ALA,  0.1137,  -0.4019,   0.0010, 0
A,  991, ILE,  0.0000,  -0.4600,   0.0005, 0
A,  992, ARG,  1.4115,   0.2613,   0.0946, 0
A,  993, GLN,  0.9079,   0.0040,   0.0315, 0
A,  994, HIS,  1.1940,   0.1502,   0.0625, 10
A,  995, ALA,  1.0684,   0.0860,   0.0477, 0
A,  996, ASN,  1.4411,   0.2765,   0.0995, 0
A,  997, LEU,  0.6284,  -0.1388,   0.0138, 10
A,  998, PHE,  0.0000,  -0.4600,   0.0005, 0
A,  999, ILE,  0.3617,  -0.2751,   0.0046, 0
A, 1000, ASN,  0.0000,  -0.4600,   0.0005, 0
A, 1001, LEU,  0.0000,  -0.4600,   0.0005, 0
A, 1002, PHE,  0.5026,  -0.2032,   0.0086, 30
A, 1003, SER,  0.0000,  -0.4600,   0.0005, 0
A, 1004, MET,  0.0000,  -0.4600,   0.0005, 0
A, 1005, MET,  0.1990,  -0.3583,   0.0018, 29
A, 1006, LEU,  1.0419,   0.0724,   0.0448, 2
A, 1007, GLY,  1.2594,   0.1836,   0.0714, 2
A, 1008, SER,  1.2249,   0.1660,   0.0669, 2
A, 1009, GLY,  1.9394,   0.5311,   0.1953, 2
A, 1010, MET,  0.8497,  -0.0258,   0.0270, 2
A, 1011, PRO,  1.3090,   0.2090,   0.0782, 2
A, 1012, GLU,  0.6949,  -0.1049,   0.0173, 0
A, 1013, LEU,  0.2536,  -0.3304,   0.0026, 0
A, 1014, GLN,  2.1678,   0.6478,   0.2424, 2
A, 1015, SER,  0.7318,  -0.0860,   0.0195, 9
A, 1016, PHE,  2.3811,   0.7569,   0.2861, 9
A, 1017, ASP,  0.7013,  -0.1016,   0.0177, 0
A, 1018, ASP,  0.6435,  -0.1311,   0.0146, 0
A, 1019, ILE,  0.0000,  -0.4600,   0.0005, 0
A, 1020, ALA,  0.3165,  -0.2983,   0.0037, 0
A, 1021, TYR,  0.5679,  -0.1698,   0.0110, 39
A, 1022, ILE,  0.0932,  -0.4124,   0.0009, 0
A, 1023, ARG,  0.4859,  -0.2117,   0.0081, 0
A, 1024, LYS,  0.6002,  -0.1533,   0.0124, 34
A, 1025, THR,  0.2432,  -0.3357,   0.0024, 39
A, 1026, LEU,  0.8474,  -0.0269,   0.0269, 0
A, 1027, ALA,  0.9193,   0.0098,   0.0325, 0
A, 1028, LEU,  1.0461,   0.0746,   0.0452, 34
A, 1029, ASP,  0.4993,  -0.2048,   0.0085, 0
A, 1030, LYS,  0.6796,  -0.1127,   0.0164, 34
A, 1031, THR,  0.0936,  -0.4122,   0.0009, 0
A, 1032, GLU,  0.1897,  -0.3630,   0.0017, 0
A, 1033, GLN,  0.1347,  -0.3912,   0.0012, 0
A, 1034, GLU,  0.0770,  -0.4206,   0.0008, 34
A, 1035, ALA,  0.0481,  -0.4354,   0.0007, 0
A, 1036, LEU,  0.4313,  -0.2396,   0.0065, 0
A, 1037, GLU,  0.1774,  -0.3693,   0.0016, 0
A, 1038, TYR,  0.5552,  -0.1763,   0.0104, 34
A, 1039, PHE,  4.3712,   1.7738,   0.5946, 5
A, 1040, MET,  0.7002,  -0.1021,   0.0176, 0
A, 1041, LYS,  0.2736,  -0.3202,   0.0029, 34
A, 1042, GLN,  1.7707,   0.4449,   0.1597, 5
A, 1043, MET,  4.8654,   2.0264,   0.6471, 5
A, 1044, ASN,  0.2237,  -0.3457,   0.0021, 0
A, 1045, ASP,  0.0915,  -0.4132,   0.0009, 0
A, 1046, ALA,  0.2574,  -0.3284,   0.0027, 0
A, 1047, HIS,  4.6781,   1.9307,   0.6276, 5
A, 1048, HIS,  0.2273,  -0.3438,   0.0022, 0
A, 1049, GLY,  0.6495,  -0.1281,   0.0149, 35
A, 1050, GLY,  0.5285,  -0.1899,   0.0094, 0
B,  442, ILE,  0.5576,  -0.1751,   0.0105, 0
B,  443, GLU,  0.5399,  -0.1841,   0.0098, 0
B,  444, ALA,  0.9172,   0.0087,   0.0323, 0
B,  445, VAL,  1.3648,   0.2375,   0.0874, 0
B,  446, GLY,  0.5149,  -0.1969,   0.0090, 0
B,  447, LYS,  0.7798,  -0.0615,   0.0225, 0
B,  448, LYS,  0.3143,  -0.2994,   0.0036, 0
B,  449, LEU,  2.0026,   0.5634,   0.2079, 0
B,  450, HIS,  1.1143,   0.1095,   0.0527, 0
B,  451, GLU,  0.2309,  -0.3420,   0.0022, 0
B,  452, TYR,  1.1042,   0.1043,   0.0516, 0
B,  453, ASN,  1.6486,   0.3825,   0.1361, 0
B,  454, THR,  0.0634,  -0.4276,   0.0008, 0
B,  455, GLN,  0.2598,  -0.3272,   0.0027, 0
B,  456, PHE,  0.7638,  -0.0697,   0.0216, 0
B,  457, GLN,  0.6199,  -0.1432,   0.0134, 0
B,  458, GLU,  0.0722,  -0.4231,   0.0008, 0
B,  459, LYS,  0.2655,  -0.3243,   0.0028, 0
B,  460, SER,  0.5256,  -0.1914,   0.0093, 19
B,  461, ARG,  0.1002,  -0.4088,   0.0009, 0
B,  462, GLU,  0.1488,  -0.3839,   0.0013, 0
B,  463, TYR,  0.7489,  -0.0773,   0.0206, 19
B,  464, ASP,  0.5410,  -0.1835,   0.0099, 19
B,  465, ARG,  0.1629,  -0.3768,   0.0015, 0
B,  466, LEU,  0.1924,  -0.3617,   0.0017, 0
B,  467, TYR,  1.5875,   0.3513,   0.1253, 2
B,  468, GLU,  0.3959,  -0.2577,   0.0055, 0
B,  469, GLU,  0.1001,  -0.4088,   0.0009, 0
B,  470, TYR,  1.1917,   0.1490,   0.0622, 2
B,  471, THR,  0.9190,   0.0096,   0.0324, 2
B,  472, ARG,  0.1636,  -0.3764,   0.0015, 0
B,  473, THR,  0.1412,  -0.3878,   0.0013, 0
B,  474, SER,  1.0614,   0.0824,   0.0469, 2
B,  475, GLN,  0.8313,  -0.0351,   0.0257, 2
B,  476, GLU,  0.1527,  -0.3819,   0.0014, 0
B,  477, ILE,  0.4644,  -0.2227,   0.0075, 2
B,  478, GLN,  0.9211,   0.0107,   0.0326, 2
B,  479, MET,  1.8230,   0.4716,   0.1708, 23
B,  480, LYS,  0.4333,  -0.2386,   0.0066, 23
B,  481, ARG,  0.6442,  -0.1308,   0.0146, 2
B,  482, THR,  1.3531,   0.2315,   0.0856, 0
B,  483, ALA,  0.7330,  -0.0854,   0.0196, 0
B,  484, ILE,  0.4527,  -0.2286,   0.0072, 0
B,  485, GLU,  0.3020,  -0.3057,   0.0034, 0
B,  486, ALA,  0.5417,  -0.1832,   0.0099, 0
B,  487, PHE,  0.3780,  -0.2668,   0.0050, 21
B,  488, ASN,  0.2611,  -0.3266,   0.0027, 0
B,  489, GLU,  0.1791,  -0.3685,   0.0016, 0
B,  490, THR,  0.0000,  -0.4600,   0.0005, 0
B,  491, ILE,  0.2185,  -0.3483,   0.0021, 0
B,  492, LYS,  0.0513,  -0.4338,   0.0007, 0
B,  493, ILE,  0.2735,  -0.3202,   0.0029, 0
B,  494, PHE,  0.0000,  -0.4600,   0.0005, 0
B,  495, GLU,  0.3026,  -0.3053,   0.0034, 0
B,  496, GLU,  0.4860,  -0.2116,   0.0081, 0
B,  497, GLN,  0.2053,  -0.3551,   0.0019, 0
B,  498, CYS,  0.9181,   0.0092,   0.0324, 0
B,  499, GLN,  0.3177,  -0.2976,   0.0037, 0
B,  500, THR,  0.4368,  -0.2368,   0.0067, 0
B,  501, GLN,  1.7986,   0.4591,   0.1655, 0
B,  502, GLU,  1.5073,   0.3103,   0.1110, 0
B,  503, ARG,  0.2519,  -0.3312,   0.0026, 0
B,  504, TYR,  0.6944,  -0.1051,   0.0173, 0
B,  505, SER,  1.7067,   0.4122,   0.1471, 0
B,  506, LYS,  0.7570,  -0.0732,   0.0211, 0
B,  507, GLU,  0.2727,  -0.3206,   0.0029, 0
B,  508, TYR,  0.6205,  -0.1429,   0.0134, 0
B,  509, ILE,  0.5147,  -0.1970,   0.0090, 0
B,  521, ILE,  0.5011,  -0.2039,   0.0086, 0
B,  522, GLN,  0.6753,  -0.1149,   0.0162, 0
B,  523, ARG,  1.0669,   0.0852,   0.0475, 0
B,  524, ILE,  2.4577,   0.7960,   0.3019, 0
B,  525, MET,  1.9862,   0.5550,   0.2046, 0
B,  526, HIS,  1.3386,   0.2241,   0.0834, 0
B,  527, ASN,  1.2252,   0.1661,   0.0669, 0
B,  528, TYR,  2.8042,   0.9731,   0.3673, 0
B,  529, ASP,  0.5327,  -0.1878,   0.0096, 0
B,  530, LYS,  0.9502,   0.0256,   0.0355, 0
B,  531, LEU,  0.0000,  -0.4600,   0.0005, 0
B,  532, LYS,  0.8455,  -0.0279,   0.0267, 0
B,  533, SER,  0.1160,  -0.4007,   0.0010, 0
B,  534, ARG,  0.4412,  -0.2345,   0.0068, 21
B,  535, ILE,  0.2763,  -0.3188,   0.0030, 0
B,  536, SER,  0.0560,  -0.4314,   0.0007, 0
B,  537, GLU,  0.1592,  -0.3786,   0.0014, 0
B,  538, ILE,  0.0341,  -0.4426,   0.0006, 0
B,  539, ILE,  0.2868,  -0.3134,   0.0032, 0
B,  540, ASP,  0.0272,  -0.4461,   0.0006, 0
B,  541, SER,  0.3950,  -0.2581,   0.0055, 21
B,  542, ARG,  0.3726,  -0.2696,   0.0049, 0
B,  543, ARG,  0.0145,  -0.4526,   0.0005, 0
B,  544, ARG,  0.1778,  -0.3691,   0.0016, 0
B,  545, LEU,  0.2873,  -0.3132,   0.0032, 21
B,  546, GLU,  0.2003,  -0.3576,   0.0018, 0
B,  547, GLU,  0.0157,  -0.4520,   0.0005, 0
B,  548, ASP,  0.2138,  -0.3507,   0.0020, 0
B,  549, LEU,  0.3523,  -0.2799,   0.0044, 0
B,  550, LYS,  0.6885,  -0.1081,   0.0169, 2
B,  551, LYS,  0.0388,  -0.4402,   0.0006, 0
B,  552, GLN,  0.2375,  -0.3386,   0.0024, 0
B,  553, ALA,  0.5440,  -0.1820,   0.0100, 2
B,  554, ALA,  0.1583,  -0.3791,   0.0014, 0
B,  555, GLU,  0.1131,  -0.4022,   0.0010, 0
B,  556, TYR,  1.3157,   0.2124,   0.0794, 2
B,  557, ARG,  1.1484,   0.1269,   0.0568, 2
B,  558, GLU,  0.1476,  -0.3846,   0.0013, 0
B,  559, ILE,  0.1364,  -0.3903,   0.0012, 0
B,  560, ASP,  1.6400,   0.3781,   0.1345, 2
B,  561, LYS,  0.2284,  -0.3433,   0.0022, 0
B,  562, ARG,  0.3380,  -0.2872,   0.0041, 0
B,  563, MET,  0.1967,  -0.3595,   0.0018, 0
B,  564, ASN,  3.5870,   1.3731,   0.4880, 2
B,  565, SER,  0.7992,  -0.0516,   0.0236, 0
B,  566, ILE,  0.3222,  -0.2953,   0.0038, 0
B,  567, LYS,  0.3270,  -0.2929,   0.0039, 19
B,  568, PRO,  0.5439,  -0.1820,   0.0100, 0
B,  569, ASP,  0.4488,  -0.2306,   0.0070, 0
B,  570, LEU,  0.2608,  -0.3267,   0.0027, 19
B,  571, ILE,  0.4387,  -0.2358,   0.0067, 19
B,  572, GLN,  0.4115,  -0.2497,   0.0059, 0
B,  573, LEU,  0.5808,  -0.1632,   0.0115, 0
B,  574, ARG,  1.0103,   0.0563,   0.0414, 19
B,  575, LYS,  0.2991,  -0.3072,   0.0034, 19
B,  576, THR,  0.7235,  -0.0903,   0.0190, 0
B,  577, ARG,  1.8004,   0.4601,   0.1659, 0
B,  578, ASP,  0.3163,  -0.2984,   0.0037, 0
B,  579, GLN,  0.3540,  -0.2791,   0.0044, 0
B,  580, TYR,  2.5203,   0.8280,   0.3136, 0
B,  581, LEU,  1.0947,   0.0995,   0.0505, 0
B,  582, MET,  1.2925,   0.2005,   0.0757, 0
B,  583, TRP,  2.6655,   0.9022,   0.3398, 0
B,  593, LYS,  0.0850,  -0.4166,   0.0009, 0
B,  594, LEU,  0.2161,  -0.3495,   0.0020, 0
B,  595, ASN,  0.2737,  -0.3201,   0.0030, 0
B,  596, GLU,  0.3731,  -0.2693,   0.0049, 0
B,  597, TRP,  2.3095,   0.7202,   0.2713, 0
B,  598, LEU,  1.2832,   0.1957,   0.0744, 0
B,  599, GLY,  0.2928,  -0.3104,   0.0033, 0
B,  600, ASN,  0.2282,  -0.3434,   0.0022, 0
