name, rank, score, sas_points, surf_atoms, center_x, center_y, center_z, residue_ids, surf_atom_ids   
pocket1,1,25.0207,149,81,8.0343,-6.1782,15.4417,A_130 A_132 A_134 A_135 A_137 A_147 A_148 A_149 A_15 A_150 A_151 A_16 A_17 A_170 A_18 A_19 A_20 A_23 A_36 A_38 A_40 A_44 A_48 A_51 A_52 A_55 A_59 A_68 A_84 A_85 A_86 A_87 A_90 A_91,110 111 112 114 115 116 117 118 120 122 129 130 135 136 137 138 139 142 145 147 148 167 168 169 266 282 296 323 345 346 365 366 367 370 371 372 375 378 401 402 432 433 505 506 651 652 656 663 668 674 677 691 701 1018 1020 1037 1038 1049 1050 1061 1062 1077 1078 1158 1159 1160 1162 1163 1164 1165 1166 1173 1175 1179 1180 1181 1186 1187 1188 1189 1352
pocket2,2,3.7691,43,23,-5.6617,-6.408,4.5525,A_133 A_134 A_173 A_200 A_204 A_205 A_206 A_93 A_96 A_98,714 718 719 720 721 744 747 748 759 763 1044 1054 1379 1593 1617 1618 1619 1620 1628 1632 1633 1634 1635
pocket3,3,3.361,37,20,12.9297,-7.6748,29.6631,A_11 A_37 A_39 A_7 A_74 A_76 A_81 A_83 A_9,41 58 59 61 82 83 84 272 273 290 560 561 562 583 620 621 622 623 624 644
pocket4,4,2.061,31,19,14.325,1.5129,28.6952,A_28 A_33 A_6 A_71 A_83 A_9,34 63 66 206 248 249 530 531 532 533 534 535 638 639 640 641 642 643 644
pocket5,5,2.0149,30,15,22.9134,-0.0942,8.8201,A_126 A_154 A_157 A_54 A_57 A_58 A_61,388 390 392 415 416 418 419 423 425 448 449 450 985 1208 1239
pocket6,6,1.6754,30,12,24.7451,-6.7159,19.6453,A_53 A_56 A_60 A_73 A_75 A_80,380 382 383 384 409 410 442 552 553 569 572 613
pocket7,7,1.3512,23,11,4.66,8.5583,21.1216,A_139 A_140 A_141 A_143 A_145 A_85 A_86,658 659 660 665 1093 1101 1102 1103 1111 1126 1144
pocket8,8,0.9893,22,13,14.4482,-1.0029,-11.6163,A_181 A_183 A_184 A_185 A_249 A_250 A_251,1439 1459 1466 1476 1483 1485 1999 2003 2004 2005 2006 2007 2013
pocket9,9,0.9421,19,16,-2.3681,1.9564,-14.1239,A_221 A_222 A_224 A_243 A_246 A_247,1754 1757 1759 1760 1762 1766 1768 1788 1790 1791 1941 1942 1945 1968 1974 1979
