chain, residue_label, residue_name, score, zscore, probability, pocket
A, 1050, THR,  0.3797,  -0.2660,   0.0050, 0
A, 1051, VAL,  0.4081,  -0.2514,   0.0058, 0
A, 1052, HIS,  0.1706,  -0.3728,   0.0015, 0
A, 1053, ILE,  0.1574,  -0.3796,   0.0014, 0
A, 1054, ASP,  0.1424,  -0.3872,   0.0013, 0
A, 1055, LEU,  0.3054,  -0.3039,   0.0035, 9
A, 1056, SER,  0.1733,  -0.3714,   0.0016, 0
A, 1057, ALA,  0.2615,  -0.3264,   0.0027, 0
A, 1058, LEU,  0.6004,  -0.1532,   0.0124, 9
A, 1059, ASN,  0.3827,  -0.2644,   0.0051, 0
A, 1060, PRO,  0.1163,  -0.4006,   0.0010, 0
A, 1061, GLU,  0.1893,  -0.3632,   0.0017, 0
A, 1062, LEU,  0.5695,  -0.1690,   0.0110, 0
A, 1063, VAL,  0.4737,  -0.2179,   0.0078, 9
A, 1064, GLN,  0.1910,  -0.3624,   0.0017, 0
A, 1065, ALA,  0.2476,  -0.3335,   0.0025, 0
A, 1066, VAL,  0.5333,  -0.1875,   0.0096, 9
A, 1067, GLN,  0.6678,  -0.1187,   0.0158, 9
A, 1068, HIS,  0.2902,  -0.3117,   0.0032, 0
A, 1069, VAL,  0.0000,  -0.4600,   0.0005, 0
A, 1070, VAL,  1.1231,   0.1140,   0.0538, 9
A, 1071, ILE,  1.0645,   0.0840,   0.0472, 9
A, 1072, GLY,  0.9488,   0.0249,   0.0353, 0
A, 1073, PRO,  0.9918,   0.0469,   0.0395, 0
A, 1074, SER,  0.3554,  -0.2784,   0.0045, 0
A, 1075, SER,  0.3873,  -0.2621,   0.0052, 0
A, 1076, LEU,  0.4244,  -0.2431,   0.0063, 0
A, 1077, ILE,  1.1574,   0.1315,   0.0578, 0
A, 1078, VAL,  0.5737,  -0.1668,   0.0112, 0
A, 1079, HIS,  1.0189,   0.0607,   0.0423, 12
A, 1080, PHE,  0.8089,  -0.0466,   0.0242, 13
A, 1081, ASN,  0.1777,  -0.3692,   0.0016, 0
A, 1082, GLU,  0.2254,  -0.3448,   0.0022, 12
A, 1083, VAL,  0.5515,  -0.1781,   0.0103, 0
A, 1084, ILE,  8.3305,   3.7972,   0.8563, 1
A, 1085, GLY,  3.2540,   1.2029,   0.4430, 1
A, 1086, ARG,  1.3828,   0.2467,   0.0901, 1
A, 1087, GLY,  0.4714,  -0.2191,   0.0077, 0
A, 1088, HIS,  0.5173,  -0.1956,   0.0091, 10
A, 1089, PHE,  2.1156,   0.6211,   0.2311, 1
A, 1090, GLY,  0.5849,  -0.1611,   0.0117, 0
A, 1091, CYS,  0.6791,  -0.1129,   0.0164, 0
A, 1092, VAL,  8.2534,   3.7578,   0.8529, 1
A, 1093, TYR,  0.6313,  -0.1374,   0.0139, 13
A, 1094, HIS,  0.4436,  -0.2333,   0.0069, 12
A, 1095, GLY,  0.2242,  -0.3454,   0.0022, 0
A, 1096, THR,  0.6144,  -0.1460,   0.0131, 12
A, 1097, LEU,  0.3898,  -0.2608,   0.0053, 0
A, 1098, LEU,  0.3827,  -0.2644,   0.0051, 0
A, 1099, ASP,  0.1506,  -0.3830,   0.0014, 0
A, 1104, LYS,  0.4281,  -0.2412,   0.0064, 0
A, 1105, ILE,  0.5408,  -0.1836,   0.0099, 8
A, 1106, HIS,  0.6938,  -0.1054,   0.0172, 12
A, 1107, CYS,  0.2191,  -0.3480,   0.0021, 0
A, 1108, ALA,  6.3650,   2.7927,   0.7650, 1
A, 1109, VAL,  0.0000,  -0.4600,   0.0005, 0
A, 1110, LYS,  2.3458,   0.7388,   0.2789, 1
A, 1111, SER,  0.5178,  -0.1954,   0.0091, 13
A, 1112, LEU,  0.9537,   0.0274,   0.0358, 7
A, 1113, ASN,  0.7000,  -0.1023,   0.0176, 7
A, 1114, ARG,  0.5984,  -0.1542,   0.0123, 7
A, 1115, ILE,  0.6618,  -0.1218,   0.0155, 7
A, 1116, THR,  0.3830,  -0.2643,   0.0051, 0
A, 1117, ASP,  0.2409,  -0.3369,   0.0024, 0
A, 1118, ILE,  0.4146,  -0.2481,   0.0060, 0
A, 1119, GLY,  0.3200,  -0.2965,   0.0037, 0
A, 1120, GLU,  0.2419,  -0.3364,   0.0024, 7
A, 1121, VAL,  0.0000,  -0.4600,   0.0005, 0
A, 1122, SER,  0.3598,  -0.2761,   0.0046, 0
A, 1123, GLN,  0.2408,  -0.3369,   0.0024, 7
A, 1124, PHE,  0.6850,  -0.1099,   0.0167, 7
A, 1125, LEU,  0.4621,  -0.2238,   0.0074, 9
A, 1126, THR,  0.4445,  -0.2328,   0.0069, 0
A, 1127, GLU,  3.2266,   1.1889,   0.4387, 2
A, 1128, GLY,  0.0000,  -0.4600,   0.0005, 0
A, 1129, ILE,  0.3366,  -0.2880,   0.0040, 0
A, 1130, ILE,  1.4906,   0.3018,   0.1082, 2
A, 1131, MET,  0.9362,   0.0184,   0.0341, 2
A, 1132, LYS,  0.3945,  -0.2584,   0.0054, 0
A, 1133, ASP,  0.5719,  -0.1677,   0.0111, 0
A, 1134, PHE,  1.6167,   0.3662,   0.1304, 2
A, 1135, SER,  0.7229,  -0.0906,   0.0190, 0
A, 1136, HIS,  1.5353,   0.3246,   0.1159, 8
A, 1137, PRO,  1.1885,   0.1474,   0.0617, 8
A, 1138, ASN,  0.7237,  -0.0901,   0.0190, 0
A, 1139, VAL,  0.3439,  -0.2842,   0.0042, 8
A, 1140, LEU,  0.0000,  -0.4600,   0.0005, 0
A, 1141, SER,  0.8731,  -0.0138,   0.0289, 8
A, 1142, LEU,  0.2608,  -0.3267,   0.0027, 0
A, 1143, LEU,  0.7276,  -0.0882,   0.0193, 8
A, 1144, GLY,  0.0000,  -0.4600,   0.0005, 0
A, 1145, ILE,  0.4569,  -0.2265,   0.0073, 9
A, 1146, CYS,  0.8191,  -0.0414,   0.0249, 0
A, 1147, LEU,  1.0297,   0.0662,   0.0435, 9
A, 1148, ARG,  1.0238,   0.0632,   0.0428, 13
A, 1149, SER,  0.2531,  -0.3307,   0.0026, 0
A, 1150, GLU,  0.0898,  -0.4141,   0.0009, 0
A, 1151, GLY,  0.0000,  -0.4600,   0.0005, 0
A, 1152, SER,  0.2421,  -0.3363,   0.0024, 13
A, 1153, PRO,  0.7582,  -0.0725,   0.0212, 0
A, 1154, LEU,  0.3574,  -0.2774,   0.0045, 13
A, 1155, VAL,  0.0000,  -0.4600,   0.0005, 0
A, 1156, VAL,  0.0769,  -0.4207,   0.0008, 0
A, 1157, LEU,  3.5792,   1.3691,   0.4870, 1
A, 1158, PRO,  4.2627,   1.7184,   0.5823, 1
A, 1159, TYR,  4.2367,   1.7051,   0.5797, 1
A, 1160, MET,  4.6524,   1.9175,   0.6245, 1
A, 1161, LYS,  1.1648,   0.1353,   0.0587, 1
A, 1162, HIS,  1.6060,   0.3607,   0.1286, 3
A, 1163, GLY,  2.9234,   1.0340,   0.3894, 1
A, 1164, ASP,  2.3392,   0.7354,   0.2776, 1
A, 1165, LEU,  0.0000,  -0.4600,   0.0005, 0
A, 1166, ARG,  2.2274,   0.6783,   0.2548, 4
A, 1167, ASN,  1.7652,   0.4421,   0.1585, 3
A, 1168, PHE,  1.3197,   0.2144,   0.0801, 3
A, 1169, ILE,  0.0000,  -0.4600,   0.0005, 0
A, 1170, ARG,  1.5533,   0.3338,   0.1191, 0
A, 1171, ASN,  0.5613,  -0.1731,   0.0107, 3
A, 1172, GLU,  0.5467,  -0.1806,   0.0101, 0
A, 1173, THR,  0.4388,  -0.2357,   0.0067, 3
A, 1174, HIS,  1.4713,   0.2919,   0.1047, 3
A, 1175, ASN,  0.7744,  -0.0642,   0.0222, 3
A, 1176, PRO,  0.3991,  -0.2560,   0.0056, 3
A, 1177, THR,  1.1996,   0.1530,   0.0633, 0
A, 1178, VAL,  1.3086,   0.2087,   0.0781, 0
A, 1179, LYS,  1.5097,   0.3115,   0.1114, 6
A, 1180, ASP,  1.3028,   0.2058,   0.0771, 3
A, 1181, LEU,  0.3096,  -0.3018,   0.0036, 0
A, 1182, ILE,  0.4340,  -0.2382,   0.0066, 0
A, 1183, GLY,  0.7629,  -0.0701,   0.0215, 6
A, 1184, PHE,  0.8952,  -0.0025,   0.0306, 3
A, 1185, GLY,  0.0000,  -0.4600,   0.0005, 0
A, 1186, LEU,  1.0186,   0.0606,   0.0423, 6
A, 1187, GLN,  0.9710,   0.0362,   0.0375, 6
A, 1188, VAL,  0.0000,  -0.4600,   0.0005, 0
A, 1189, ALA,  0.0000,  -0.4600,   0.0005, 0
A, 1190, LYS,  1.8461,   0.4834,   0.1759, 6
A, 1191, GLY,  0.0000,  -0.4600,   0.0005, 0
A, 1192, MET,  0.0000,  -0.4600,   0.0005, 0
A, 1193, LYS,  1.5843,   0.3497,   0.1247, 5
A, 1194, PHE,  1.3684,   0.2393,   0.0879, 0
A, 1195, LEU,  0.0000,  -0.4600,   0.0005, 0
A, 1196, ALA,  1.1459,   0.1256,   0.0565, 5
A, 1197, SER,  1.2809,   0.1946,   0.0741, 5
A, 1198, LYS,  0.8842,  -0.0081,   0.0297, 2
A, 1199, LYS,  0.3106,  -0.3013,   0.0036, 2
A, 1200, PHE,  2.8757,   1.0096,   0.3815, 2
A, 1201, VAL,  2.1454,   0.6364,   0.2375, 11
A, 1202, HIS,  1.3359,   0.2227,   0.0829, 2
A, 1203, ARG,  1.0809,   0.0924,   0.0490, 11
A, 1204, ASP,  1.6740,   0.3955,   0.1411, 2
A, 1205, LEU,  0.1603,  -0.3781,   0.0014, 0
A, 1206, ALA,  0.1834,  -0.3663,   0.0017, 0
A, 1207, ALA,  0.0000,  -0.4600,   0.0005, 0
A, 1208, ARG,  2.1946,   0.6615,   0.2482, 4
A, 1209, ASN,  0.8900,  -0.0052,   0.0302, 0
A, 1210, CYS,  0.0000,  -0.4600,   0.0005, 0
A, 1211, MET,  8.7029,   3.9875,   0.8698, 1
A, 1212, LEU,  0.0000,  -0.4600,   0.0005, 0
A, 1213, ASP,  0.7638,  -0.0697,   0.0216, 8
A, 1214, GLU,  0.4926,  -0.2083,   0.0083, 8
A, 1215, LYS,  0.4022,  -0.2545,   0.0057, 0
A, 1216, PHE,  1.4352,   0.2734,   0.0985, 3
A, 1217, THR,  0.5394,  -0.1843,   0.0098, 0
A, 1218, VAL,  0.0000,  -0.4600,   0.0005, 0
A, 1219, LYS,  0.6524,  -0.1266,   0.0150, 8
A, 1220, VAL,  0.0000,  -0.4600,   0.0005, 0
A, 1221, ALA,  0.0000,  -0.4600,   0.0005, 0
A, 1222, ASP,  1.5218,   0.3177,   0.1135, 2
A, 1223, PHE,  2.3091,   0.7201,   0.2712, 2
A, 1224, GLY,  2.9732,   1.0594,   0.3980, 2
A, 1225, LEU,  1.1721,   0.1390,   0.0596, 7
A, 1226, ALA,  0.9601,   0.0307,   0.0364, 1
A, 1227, ARG,  4.0615,   1.6156,   0.5575, 1
A, 1228, ASP,  2.2536,   0.6917,   0.2594, 7
A, 1229, MET,  8.0324,   3.6449,   0.8445, 1
A, 1230, TYR,  3.9075,   1.5369,   0.5365, 1
A, 1231, ASP,  1.0155,   0.0590,   0.0419, 1
A, 1232, LYS,  0.4261,  -0.2422,   0.0064, 0
A, 1233, GLU,  1.8006,   0.4602,   0.1660, 4
A, 1234, PHE,  2.0150,   0.5697,   0.2105, 4
A, 1235, ASP,  1.2081,   0.1574,   0.0645, 10
A, 1236, SER,  1.7223,   0.4202,   0.1499, 2
A, 1237, VAL,  1.6713,   0.3941,   0.1406, 15
A, 1238, HIS,  1.8159,   0.4680,   0.1693, 2
A, 1239, ASN,  0.4203,  -0.2452,   0.0062, 10
A, 1240, LYS,  0.2481,  -0.3332,   0.0025, 15
A, 1241, THR,  0.1090,  -0.4043,   0.0010, 0
A, 1242, GLY,  0.1262,  -0.3955,   0.0011, 0
A, 1243, ALA,  0.0988,  -0.4095,   0.0009, 0
A, 1244, LYS,  0.1218,  -0.3978,   0.0011, 0
A, 1245, LEU,  0.3637,  -0.2741,   0.0047, 4
A, 1246, PRO,  0.6518,  -0.1269,   0.0150, 4
A, 1247, VAL,  1.0191,   0.0608,   0.0423, 4
A, 1248, LYS,  1.2161,   0.1615,   0.0656, 4
A, 1249, TRP,  1.6367,   0.3764,   0.1339, 4
A, 1250, MET,  1.0263,   0.0645,   0.0431, 15
A, 1251, ALA,  0.7314,  -0.0862,   0.0195, 0
A, 1252, LEU,  0.6459,  -0.1299,   0.0147, 0
A, 1253, GLU,  0.2345,  -0.3402,   0.0023, 0
A, 1254, SER,  0.8593,  -0.0209,   0.0278, 15
A, 1255, LEU,  0.5193,  -0.1946,   0.0091, 15
A, 1256, GLN,  0.2608,  -0.3267,   0.0027, 0
A, 1257, THR,  0.0760,  -0.4211,   0.0008, 0
A, 1258, GLN,  0.2428,  -0.3359,   0.0024, 15
A, 1259, LYS,  0.7048,  -0.0998,   0.0179, 0
A, 1260, PHE,  1.4068,   0.2589,   0.0938, 11
A, 1261, THR,  1.4858,   0.2993,   0.1073, 0
A, 1262, THR,  2.0478,   0.5865,   0.2171, 5
A, 1263, LYS,  2.0471,   0.5861,   0.2169, 5
A, 1264, SER,  0.8744,  -0.0132,   0.0290, 0
A, 1265, ASP,  0.7052,  -0.0996,   0.0179, 0
A, 1266, VAL,  0.0000,  -0.4600,   0.0005, 0
A, 1267, TRP,  1.1984,   0.1524,   0.0631, 14
A, 1268, SER,  0.7148,  -0.0947,   0.0185, 0
A, 1269, PHE,  0.0000,  -0.4600,   0.0005, 0
A, 1270, GLY,  0.0000,  -0.4600,   0.0005, 0
A, 1271, VAL,  0.3885,  -0.2614,   0.0053, 14
A, 1272, LEU,  0.0000,  -0.4600,   0.0005, 0
A, 1273, LEU,  0.1891,  -0.3634,   0.0017, 0
A, 1274, TRP,  0.9000,  -0.0001,   0.0309, 0
A, 1275, GLU,  0.7658,  -0.0687,   0.0217, 4
A, 1276, LEU,  0.1891,  -0.3634,   0.0017, 0
A, 1277, MET,  0.3978,  -0.2567,   0.0055, 0
A, 1278, THR,  0.6681,  -0.1186,   0.0158, 0
A, 1279, ARG,  0.5086,  -0.2001,   0.0088, 0
A, 1280, GLY,  0.6198,  -0.1432,   0.0134, 0
A, 1281, ALA,  0.3956,  -0.2578,   0.0055, 0
A, 1282, PRO,  1.0463,   0.0747,   0.0452, 4
A, 1283, PRO,  1.1163,   0.1105,   0.0530, 4
A, 1284, TYR,  1.2314,   0.1693,   0.0677, 14
A, 1285, PRO,  0.7349,  -0.0844,   0.0197, 0
A, 1292, ILE,  1.2817,   0.1950,   0.0742, 0
A, 1293, THR,  1.1189,   0.1118,   0.0533, 0
A, 1294, VAL,  0.4552,  -0.2274,   0.0072, 0
A, 1295, TYR,  1.1570,   0.1313,   0.0578, 0
A, 1296, LEU,  1.0865,   0.0952,   0.0496, 0
A, 1297, LEU,  0.6894,  -0.1077,   0.0170, 0
A, 1298, GLN,  0.4129,  -0.2490,   0.0060, 0
A, 1299, GLY,  0.4593,  -0.2253,   0.0074, 0
A, 1300, ARG,  1.2027,   0.1546,   0.0637, 0
A, 1301, ARG,  2.0227,   0.5737,   0.2121, 0
A, 1302, LEU,  1.2729,   0.1905,   0.0731, 14
A, 1303, LEU,  1.7885,   0.4540,   0.1634, 0
A, 1304, GLN,  1.1768,   0.1414,   0.0602, 0
A, 1305, PRO,  0.7660,  -0.0685,   0.0217, 0
A, 1306, GLU,  1.1141,   0.1094,   0.0527, 0
A, 1307, TYR,  0.9425,   0.0217,   0.0347, 0
A, 1308, CYS,  0.2676,  -0.3232,   0.0029, 0
A, 1309, PRO,  0.9488,   0.0249,   0.0353, 0
A, 1310, ASP,  0.4123,  -0.2493,   0.0060, 0
A, 1311, PRO,  0.6199,  -0.1432,   0.0134, 0
A, 1312, LEU,  0.2651,  -0.3245,   0.0028, 0
A, 1313, TYR,  0.7318,  -0.0860,   0.0195, 0
A, 1314, GLU,  0.3946,  -0.2584,   0.0054, 0
A, 1315, VAL,  0.1924,  -0.3617,   0.0017, 0
A, 1316, MET,  0.0000,  -0.4600,   0.0005, 0
A, 1317, LEU,  1.4250,   0.2682,   0.0968, 0
A, 1318, LYS,  1.0804,   0.0921,   0.0489, 0
A, 1319, CYS,  0.0000,  -0.4600,   0.0005, 0
A, 1320, TRP,  1.0368,   0.0698,   0.0442, 14
A, 1321, HIS,  1.4710,   0.2917,   0.1047, 0
A, 1322, PRO,  1.2160,   0.1614,   0.0656, 0
A, 1323, LYS,  0.3926,  -0.2593,   0.0054, 0
A, 1324, ALA,  0.2907,  -0.3114,   0.0032, 0
A, 1325, GLU,  0.3359,  -0.2883,   0.0040, 0
A, 1326, MET,  0.9235,   0.0120,   0.0329, 0
A, 1327, ARG,  0.9487,   0.0249,   0.0353, 0
A, 1328, PRO,  1.1491,   0.1272,   0.0569, 0
A, 1329, SER,  1.2613,   0.1846,   0.0717, 5
A, 1330, PHE,  1.2691,   0.1886,   0.0726, 5
A, 1331, SER,  1.2483,   0.1779,   0.0699, 5
A, 1332, GLU,  0.4559,  -0.2270,   0.0073, 0
A, 1333, LEU,  0.0000,  -0.4600,   0.0005, 0
A, 1334, VAL,  0.8582,  -0.0214,   0.0277, 0
A, 1335, SER,  0.4848,  -0.2122,   0.0081, 0
A, 1336, ARG,  0.8672,  -0.0168,   0.0284, 0
A, 1337, ILE,  0.0000,  -0.4600,   0.0005, 0
A, 1338, SER,  0.7491,  -0.0772,   0.0206, 0
A, 1339, ALA,  0.5751,  -0.1661,   0.0113, 0
A, 1340, ILE,  0.7590,  -0.0721,   0.0213, 0
A, 1341, PHE,  1.0368,   0.0698,   0.0442, 6
A, 1342, SER,  0.4769,  -0.2163,   0.0079, 0
A, 1343, THR,  1.2746,   0.1914,   0.0733, 0
A, 1344, PHE,  2.2577,   0.6938,   0.2603, 0
A, 1345, ILE,  1.0858,   0.0949,   0.0495, 0
A, 1346, GLY,  1.1328,   0.1189,   0.0549, 0
A, 1347, GLU,  1.1313,   0.1181,   0.0547, 0
A, 1348, HIS,  1.8534,   0.4872,   0.1774, 0
A, 1349, TYR,  1.3252,   0.2172,   0.0810, 0
A, 1350, VAL,  0.3666,  -0.2726,   0.0047, 0
A, 1351, HIS,  0.8591,  -0.0210,   0.0278, 0
A, 1352, VAL,  0.8012,  -0.0505,   0.0238, 0
A, 1353, ASN,  1.2560,   0.1819,   0.0709, 0
A, 1354, ALA,  0.2012,  -0.3572,   0.0019, 0
A, 1355, THR,  0.5995,  -0.1536,   0.0124, 0
A, 1356, TYR,  1.7019,   0.4097,   0.1462, 0
A, 1357, VAL,  0.4206,  -0.2451,   0.0062, 0
A, 1358, ASN,  0.3014,  -0.3059,   0.0034, 0
A, 1359, VAL,  0.2484,  -0.3330,   0.0025, 0
A, 1360, LYS,  0.5963,  -0.1552,   0.0122, 4
