ligand,cas
3-Methyladenine,5142-23-4
A66,1166227-08-2
A-674563,552325-73-2
A-769662,844499-71-4
AEE788 (NVP-AEE788),497839-62-0
Afatinib (BIBW2992),439081-18-2
AG-1024,65678-07-1
AG-1478 (Tyrphostin AG-1478),153436-53-4
AG-490,133550-30-8
AMG 900,945595-80-2
AMG-208,1002304-34-8
AMG458,913376-83-7
Amuvatinib (MP-470),850879-09-3
Apatinib (YN968D1),811803-05-1
ARQ 197 (Tivantinib),905854-02-6
ARRY334543,845272-21-1
Arry-380,937265-83-3
AS-252424,900515-16-4
AS-604850,648449-76-7
AS-605240,648450-29-7
AS703026 (pimasertib),1236699-92-5
AST-1306,1050500-29-2
AT7519,844442-38-2
AT7867,857531-00-1
AT9283,896466-04-9
Aurora A Inhibitor I,1158838-45-9
Axitinib,319460-85-0
AZ 960,905586-69-8
AZ628,878739-06-1
AZD2014,1009298-59-2
AZD4547,1035270-39-3
AZD5438,602306-29-6
AZD6244 (Selumetinib),606143-52-6
AZD7762,860352-01-8
AZD8055,1009298-09-2
AZD8330,869357-68-6
AZD8931,848942-61-0
Barasertib (AZD1152-HQPA),722544-51-6
Baricitinib (LY3009104 - incb28050),1187594-09-7
BEZ235 (NVP-BEZ235),915019-65-7
BGJ398 (NVP-BGJ398),872511-34-7
BI 2536,755038-02-9
BI6727 (Volasertib),755038-65-4
BIBF1120 (Vargatef),656247-17-5
BIRB 796 (Doramapimod),285983-48-4
BIX 02188,1094614-84-2
BIX 02189,1094614-85-3
BKM120 (NVP-BKM120),944396-07-0
BMS 777607,1025720-94-8
BMS 794833,1174046-72-0
BMS-265246,582315-72-8
BMS-599626 (AC480),714971-09-2
Bosutinib (SKI-606),380843-75-4
Brivanib (BMS-540215),649735-46-6
Brivanib alaninate (BMS-582664) - prodrug,649735-63-7
BS-181 HCl,1397219-81-6
BX-795,702675-74-9
BX-912,702674-56-4
BYL719,1217486-61-7
CAL-101 (GS-1101),870281-82-6
CAY10505,1218777-13-9
CCT128930,885499-61-6
CCT129202,942947-93-5
CCT137690,1095382-05-0
Cediranib (AZD2171),288383-20-0
CEP33779,1257704-57-6
CH5424802,1256580-46-7
CHIR-124,405168-58-3
CHIR-98014,252935-94-7
CI-1033 (Canertinib),267243-28-7
CI-1040 (PD184352),212631-79-3
CP 673451,343787-29-1
CP-724714,537705-08-1
Crenolanib (CP-868596),670220-88-9
Crizotinib (PF-02341066),877399-52-5
CX-4945 (Silmitasertib),1009820-21-6
CYC116,693228-63-6
Cyt387,1056634-68-4
Dabrafenib (GSK2118436),1195765-45-7
Dacomitinib (PF299804 - PF-00299804),1110813-31-4
Danusertib (PHA-739358),827318-97-8
Dasatinib (BMS-354825),302962-49-8
DCC-2036 (Rebastinib),1020172-07-9
Deforolimus (Ridaforolimus),572924-54-0
Desmethyl Erlotinib (CP-473420),183320-51-6
Dinaciclib (SCH727965),779353-01-4
Dovitinib (TKI-258),405169-16-6
Dovitinib Dilactic acid (TKI258 Dilactic acid),852433-84-2
E7080 (Lenvatinib),417716-92-8
ENMD-2076,1291074-87-7
Enzastaurin (LY317615),170364-57-5
Erlotinib HCl,183319-69-9
Everolimus (RAD001),159351-69-6
Flavopiridol HCl,131740-09-5
Foretinib (GSK1363089 - XL880),849217-64-7
GDC-0068,1001264-89-6
GDC-0879,905281-76-7
GDC-0941,957054-30-7
GDC-0980 (RG7422),1032754-93-0
Gefitinib (Iressa),184475-35-2
Golvatinib (E7050),928037-13-2
GSK1059615,958852-01-2
GSK1070916,942918-07-2
GSK1120212 (Trametinib),871700-17-3
GSK1838705A,1116235-97-2
GSK1904529A,1089283-49-7
GSK2126458,1086062-66-9
GSK461364,929095-18-1
GSK690693,937174-76-0
Hesperadin,422513-13-1
HMN-214,173529-46-9
IC-87114,371242-69-2
Imatinib (Gleevec),152459-95-5
Imatinib Mesylate,220127-57-1
IMD 0354,978-62-1
INCB28060,1029712-80-8
Indirubin,479-41-4
INK 128 (MLN0128),1224844-38-5
JNJ-38877605,943540-75-8
JNJ-7706621,443797-96-4
Ki8751,228559-41-9
KRN 633,286370-15-8
Ku-0063794,938440-64-3
KU-55933,587871-26-9
KU-60019,925701-49-1
KW 2449,1000669-72-6
KX2-391,897016-82-9
Lapatinib Ditosylate (Tykerb),388082-77-7
LDN193189,1062368-24-4
Linifanib (ABT-869),796967-16-3
Linsitinib (OSI-906),867160-71-2
LY2228820,862507-23-1
LY2603618 (IC-83),911222-45-2
LY2784544,1229236-86-5
LY294002,154447-36-6
Masitinib (AB1010),790299-79-5
MGCD-265,875337-44-3
Milciclib (PHA-848125),802539-81-7
MK-2206 2HCl,1032350-13-2
MK-2461,917879-39-1
MK-5108 (VX-689),1010085-13-8
MLN8054,869363-13-3
MLN8237 (Alisertib),1028486-01-2
Motesanib Diphosphate (AMG-706),857876-30-3
Mubritinib (TAK 165),366017-09-6
Neratinib (HKI-272),698387-09-6
Nilotinib (AMN-107),641571-10-0
NU7441 (KU-57788),503468-95-9
NVP-ADW742,475488-23-4
NVP-BGT226,1245537-68-1
NVP-BHG712,940310-85-0
NVP-BSK805,1092499-93-8
NVP-BVU972,1185763-69-2
NVP-TAE226,761437-28-9
ON-01910,1225497-78-8
OSI-027,936890-98-1
OSI-930,728033-96-3
OSU-03012,742112-33-0
Palomid 529,914913-88-5
Pazopanib HCl,635702-64-6
PCI-32765 (Ibrutinib),936563-96-1
PD 0332991 (Palbociclib) HCl,827022-32-2
PD0325901,391210-10-9
PD153035 HCl,183322-45-4
PD173074,219580-11-7
PD318088,391210-00-7
PD98059,167869-21-8
Pelitinib (EKB-569),257933-82-7
PF-00562271,939791-38-5
PF-03814735,942487-16-3
PF-04217903,956905-27-4
PF-04691502,1013101-36-4
PF-05212384 (PKI-587),1197160-78-3
PH-797804,586379-66-0
PHA-665752,477575-56-7
PHA-680632,398493-79-3
PHA-767491,845714-00-3
PHA-793887,718630-59-2
Phenformin HCl,834-28-6
PHT-427,1191951-57-1
PI-103,371935-74-9
Piceatannol,10083-24-6
PIK-293,900185-01-5
PIK-294,900185-02-6
PIK-75,372196-77-5
PIK-90,677338-12-4
PIK-93,593960-11-3
PKI-402,1173204-81-3
PLX-4720,918505-84-7
Ponatinib (AP24534),943319-70-8
PP-121,1092788-83-4
PP242,1092351-67-1
Quercetin (Sophoretin),117-39-5
Quizartinib (AC220),950769-58-1
R406,841290-81-1
R406 (free base),841290-80-0
R788 (Fostamatinib) - prodrug,901119-35-5
R935788 (Fostamatinib disodium - R788 disodium),1025687-58-4
Rapamycin (Sirolimus),53123-88-9
Roscovitine (Seliciclib - CYC202),186692-46-6
Ruxolitinib (INCB018424),941678-49-5
SAR131675,1433953-83-3
Saracatinib (AZD0530),379231-04-6
SB 202190,152121-30-7
SB 203580,152121-47-6
SB 216763,280744-09-4
SB 415286,264218-23-7
SB 431542,301836-41-9
SB 525334,356559-20-1
SB590885,405554-55-4
Semaxanib (SU5416),194413-58-6
SGX-523,1022150-57-7
SNS-032 (BMS-387032),345627-80-7
SNS-314,1146618-41-8
Sotrastaurin (AEB071),425637-18-9
SP600125,129-56-6
Staurosporine,62996-74-1
SU11274,658084-23-2
Sunitinib Malate (Sutent),341031-54-7
TAE684 (NVP-TAE684),761439-42-3
TAK-285,871026-44-7
TAK-733,1035555-63-5
TAK-901,934541-31-8
Tandutinib (MLN518),387867-13-2
Temsirolimus (Torisel),162635-04-3
TG 100713,925705-73-3
TG100-115,677297-51-7
TG101209,936091-14-4
TG101348 (SAR302503),936091-26-8
TGX-221,663619-89-4
Thiazovivin,1226056-71-8
Tideglusib,865854-05-3
Tie2 kinase inhibitor,948557-43-5
Tivozanib (AV-951),475108-18-0
Tofacitinib (CP-690550 - Tasocitinib),477600-75-2
Tofacitinib citrate (CP-690550 citrate),540737-29-9
Torin 1,1222998-36-8
Torin 2,1223001-51-1
TPCA-1,507475-17-4
Triciribine (Triciribine phosphate),35943-35-2
TSU-68 (SU6668),252916-29-3
TWS119,601514-19-6
Tyrphostin AG 879 (AG 879),148741-30-4
U0126-EtOH,1173097-76-1
Vandetanib (Zactima),443913-73-3
Vatalanib 2HCl (PTK787),212141-51-0
Vemurafenib (PLX4032),918504-65-1
VX-680 (MK-0457 - Tozasertib),639089-54-6
VX-702,745833-23-2
WAY-600,1062159-35-6
WHI-P154,211555-04-3
Wortmannin,19545-26-7
WP1066,857064-38-1
WP1130,856243-80-6
WYE-125132,1144068-46-1
WYE-354,1062169-56-5
WYE-687,1062161-90-3
WZ3146,1214265-56-1
WZ4002,1213269-23-8
WZ8040,1214265-57-2
XL147,956958-53-5
XL-184 (Cabozantinib),849217-68-1
XL765,1349796-36-6
Y-27632 2HCl,129830-38-2
YM201636,371942-69-7
ZM 336372,208260-29-1
ZM-447439,331771-20-1
ZSTK474,475110-96-4
