name, rank, score, sas_points, surf_atoms, center_x, center_y, center_z, residue_ids, surf_atom_ids   
pocket1,1,20.6379,87,38,17.5533,11.0326,138.0282,A_1084 A_1085 A_1086 A_1089 A_1092 A_1108 A_1110 A_1157 A_1158 A_1159 A_1160 A_1161 A_1163 A_1164 A_1211 A_1226 A_1227 A_1229 A_1230 A_1231,263 266 269 272 275 306 307 322 323 324 419 433 791 796 801 806 808 810 812 815 823 839 840 843 849 1226 1227 1342 1347 1369 1370 1371 1372 1378 1379 1380 1381 1383
pocket2,2,9.6339,74,36,18.7421,25.9458,130.6702,A_1127 A_1130 A_1131 A_1134 A_1198 A_1199 A_1200 A_1202 A_1204 A_1222 A_1223 A_1224 A_1227 A_1236 A_1238,564 566 567 569 588 589 590 591 594 623 625 1115 1124 1131 1136 1138 1140 1151 1176 1311 1317 1322 1327 1328 1348 1350 1351 1352 1432 1433 1445 1446 1447 1448 1449 1450
pocket3,3,8.2648,105,46,19.2062,8.9613,154.2127,A_1161 A_1162 A_1167 A_1168 A_1171 A_1173 A_1174 A_1175 A_1176 A_1180 A_1184 A_1216,823 827 828 830 831 832 836 837 838 872 873 874 884 887 888 915 928 930 933 936 937 939 940 941 942 944 945 950 951 954 956 984 985 986 987 1016 1017 1018 1265 1266 1267 1268 1269 1270 1271 1272
pocket4,4,3.9859,58,26,3.8979,18.383,144.181,A_1166 A_1208 A_1233 A_1234 A_1245 A_1246 A_1247 A_1248 A_1249 A_1275 A_1282 A_1283 A_1360,865 866 867 1201 1407 1408 1417 1418 1419 1496 1502 1508 1514 1520 1521 1522 1523 1535 1536 1750 1796 1799 1805 1808 2391 2393
pocket5,5,3.9831,37,17,20.7363,38.2902,143.1987,A_1193 A_1196 A_1197 A_1262 A_1263 A_1329 A_1330 A_1331,1076 1104 1105 1106 1107 1638 1639 1640 1648 1649 2142 2145 2146 2147 2158 2162 2163
pocket6,6,3.8141,50,23,25.0449,22.9425,155.9636,A_1179 A_1180 A_1183 A_1184 A_1186 A_1187 A_1190 A_1216 A_1341,978 981 983 984 985 986 1005 1006 1007 1008 1017 1030 1036 1037 1039 1058 1060 1265 1266 2239 2240 2241 2242
pocket7,7,3.2546,42,25,17.706,16.9259,124.1737,A_1089 A_1110 A_1112 A_1113 A_1114 A_1115 A_1120 A_1123 A_1124 A_1127 A_1225 A_1227 A_1228,298 300 301 435 447 448 453 461 474 476 507 508 511 531 534 536 539 541 568 1338 1349 1350 1352 1361 1362
pocket8,8,3.1374,36,16,29.0437,16.1045,142.1971,A_1105 A_1136 A_1137 A_1139 A_1141 A_1143 A_1158 A_1159 A_1160 A_1213 A_1214 A_1219,398 635 643 646 660 676 677 693 797 798 803 819 1243 1251 1294 1295
pocket9,9,2.8693,32,18,29.7255,15.4192,118.5522,A_1055 A_1058 A_1063 A_1066 A_1067 A_1070 A_1071 A_1125 A_1145 A_1147,44 45 47 66 105 106 126 136 159 160 164 552 553 705 712 715 716 719
pocket10,10,2.3748,42,17,7.5997,19.2013,129.2734,A_1088 A_1227 A_1228 A_1231 A_1234 A_1235 A_1236 A_1239,291 292 294 1348 1350 1355 1356 1361 1386 1387 1412 1426 1427 1428 1432 1433 1458
pocket11,11,1.8398,26,9,13.7941,30.9322,129.6776,A_1200 A_1201 A_1203 A_1238 A_1260,1138 1141 1144 1145 1165 1166 1447 1449 1619
pocket12,12,1.7312,36,19,24.6606,0.8515,141.0183,A_1079 A_1082 A_1094 A_1096 A_1106 A_1159,221 223 249 250 251 342 343 344 345 346 356 403 404 405 406 407 408 809 810
pocket13,13,1.4204,26,12,20.909,3.9722,125.1469,A_1080 A_1093 A_1111 A_1148 A_1152 A_1154,232 234 235 333 335 441 726 728 753 754 768 770
pocket14,14,1.2841,5,9,3.3204,31.1313,148.4102,A_1248 A_1267 A_1271 A_1284 A_1302 A_1320,1518 1679 1712 1819 1919 2066 2068 2069 2070
pocket15,15,1.249,33,16,2.1343,29.5959,133.1607,A_1237 A_1239 A_1240 A_1245 A_1247 A_1250 A_1254 A_1255 A_1258 A_1260,1437 1454 1460 1462 1499 1513 1545 1571 1575 1576 1577 1581 1603 1604 1606 1626
