name, rank, score, sas_points, surf_atoms, center_x, center_y, center_z, residue_ids, surf_atom_ids   
pocket1,1,14.946,102,44,-17.1349,17.5979,-11.0108,X_134 X_135 X_137 X_147 X_148 X_17 X_18 X_19 X_25 X_37 X_38 X_39 X_54 X_58 X_67 X_80 X_82 X_83 X_85 X_88 X_89,144 145 146 148 149 150 151 157 203 204 205 299 300 303 309 310 313 315 432 461 462 537 538 645 659 660 664 682 685 687 708 711 715 1067 1070 1075 1091 1092 1156 1159 1160 1161 1164 1167
pocket2,2,11.7423,135,38,-20.3883,28.497,-11.3236,X_130 X_132 X_135 X_148 X_150 X_151 X_163 X_167 X_169 X_19 X_20 X_21 X_22 X_23 X_25 X_39 X_46 X_50 X_51 X_53 X_54,157 163 166 170 175 182 184 185 186 189 205 316 317 365 366 367 393 394 404 422 428 431 1036 1037 1038 1055 1075 1166 1167 1180 1181 1182 1188 1189 1190 1293 1317 1340
pocket3,3,2.9124,40,20,-32.7441,33.4777,-11.2347,X_127 X_129 X_153 X_154 X_159 X_161 X_162 X_163 X_183,1009 1026 1028 1200 1201 1202 1203 1204 1207 1210 1250 1251 1273 1275 1276 1280 1281 1291 1449 1451
pocket4,4,2.232,33,18,-7.2756,23.4981,-4.2114,X_13 X_24 X_26 X_40 X_77 X_79,110 111 112 113 194 211 212 213 214 215 217 322 323 324 616 617 635 637
pocket5,5,2.1311,32,16,-20.6181,21.4809,-24.2031,X_132 X_134 X_172 X_198 X_203 X_205 X_91,730 731 732 1053 1054 1055 1064 1065 1068 1369 1370 1575 1610 1623 1626 1628
pocket6,6,0.9564,19,11,-22.5516,26.5342,4.528,X_2 X_52 X_56 X_59 X_74,14 15 16 17 411 413 414 446 471 592 593
pocket7,7,0.7409,24,16,-21.4673,6.8698,-9.1937,X_139 X_140 X_143 X_145 X_64 X_83 X_84 X_85 X_86,514 515 669 673 688 689 696 1101 1104 1107 1108 1128 1129 1130 1145 1146
