chain, residue_label, residue_name, score, zscore, probability, pocket
X,    7, ASP,  0.1079,  -0.4049,   0.0010, 0
X,    8, ALA,  0.3362,  -0.2882,   0.0040, 0
X,    9, TRP,  1.0689,   0.0862,   0.0477, 0
X,   10, GLU,  0.3915,  -0.2599,   0.0054, 0
X,   11, ILE,  0.2903,  -0.3116,   0.0032, 0
X,   12, PRO,  0.2101,  -0.3526,   0.0020, 0
X,   13, ARG,  0.4526,  -0.2287,   0.0072, 0
X,   14, GLU,  0.1792,  -0.3684,   0.0016, 0
X,   15, SER,  0.0472,  -0.4359,   0.0007, 0
X,   16, ILE,  0.2482,  -0.3331,   0.0025, 0
X,   17, LYS,  0.4646,  -0.2226,   0.0075, 0
X,   18, LEU,  1.1513,   0.1284,   0.0571, 0
X,   19, VAL,  0.4686,  -0.2205,   0.0076, 0
X,   20, LYS,  0.4825,  -0.2134,   0.0080, 0
X,   21, ARG,  0.3347,  -0.2889,   0.0040, 0
X,   22, LEU,  2.5074,   0.8214,   0.3112, 1
X,   23, GLY,  0.6257,  -0.1402,   0.0137, 1
X,   24, ALA,  0.2902,  -0.3117,   0.0032, 1
X,   25, GLY,  0.3042,  -0.3045,   0.0035, 1
X,   26, GLN,  0.3049,  -0.3042,   0.0035, 0
X,   27, PHE,  3.3667,   1.2605,   0.4591, 1
X,   28, GLY,  0.2922,  -0.3107,   0.0033, 1
X,   29, GLU,  0.7425,  -0.0806,   0.0202, 1
X,   30, VAL,  3.2953,   1.2240,   0.4487, 1
X,   31, TRP,  1.1815,   0.1438,   0.0608, 0
X,   32, MET,  0.4221,  -0.2443,   0.0062, 0
X,   33, GLY,  0.0000,  -0.4600,   0.0005, 0
X,   34, TYR,  0.9084,   0.0042,   0.0316, 0
X,   35, TYR,  0.2995,  -0.3069,   0.0034, 3
X,   36, ASN,  0.1764,  -0.3698,   0.0016, 0
X,   37, ASN,  0.5737,  -0.1668,   0.0112, 0
X,   38, SER,  0.5692,  -0.1691,   0.0110, 0
X,   39, THR,  0.3063,  -0.3035,   0.0035, 3
X,   40, LYS,  0.3785,  -0.2666,   0.0050, 0
X,   41, VAL,  0.0000,  -0.4600,   0.0005, 0
X,   42, ALA,  2.2146,   0.6717,   0.2524, 1
X,   43, VAL,  0.1392,  -0.3889,   0.0012, 0
X,   44, LYS,  3.0724,   1.1101,   0.4154, 1
X,   45, THR,  0.8843,  -0.0081,   0.0297, 0
X,   46, LEU,  0.3624,  -0.2748,   0.0046, 0
X,   47, LYS,  0.2810,  -0.3164,   0.0031, 0
X,   48, PRO,  0.1100,  -0.4038,   0.0010, 0
X,   49, GLY,  0.0409,  -0.4391,   0.0007, 0
X,   50, THR,  0.1797,  -0.3682,   0.0016, 0
X,   51, MET,  2.4112,   0.7722,   0.2920, 1
X,   52, SER,  0.1027,  -0.4075,   0.0010, 0
X,   53, VAL,  0.2967,  -0.3083,   0.0033, 0
X,   54, GLN,  0.1093,  -0.4041,   0.0010, 0
X,   55, ALA,  0.9951,   0.0486,   0.0398, 1
X,   56, PHE,  0.9848,   0.0433,   0.0388, 0
X,   57, LEU,  0.8964,  -0.0019,   0.0306, 0
X,   58, GLU,  1.0626,   0.0830,   0.0470, 1
X,   59, GLU,  1.9191,   0.5207,   0.1908, 1
X,   60, ALA,  0.5065,  -0.2012,   0.0087, 0
X,   61, ASN,  1.0361,   0.0695,   0.0442, 0
X,   62, LEU,  0.2521,  -0.3312,   0.0026, 0
X,   63, MET,  0.4227,  -0.2440,   0.0063, 1
X,   64, LYS,  1.1960,   0.1512,   0.0628, 0
X,   65, THR,  0.2843,  -0.3147,   0.0031, 0
X,   66, LEU,  0.1299,  -0.3936,   0.0012, 0
X,   67, GLN,  0.4545,  -0.2277,   0.0072, 0
X,   68, HIS,  0.3751,  -0.2683,   0.0049, 0
X,   69, ASP,  0.2795,  -0.3171,   0.0030, 0
X,   70, LYS,  0.2222,  -0.3464,   0.0021, 0
X,   71, LEU,  0.0519,  -0.4335,   0.0007, 0
X,   72, VAL,  1.0721,   0.0879,   0.0481, 1
X,   73, ARG,  0.3899,  -0.2607,   0.0053, 0
X,   74, LEU,  0.4331,  -0.2386,   0.0066, 0
X,   75, TYR,  0.8797,  -0.0104,   0.0294, 3
X,   76, ALA,  0.2753,  -0.3193,   0.0030, 0
X,   77, VAL,  0.8266,  -0.0376,   0.0254, 0
X,   78, VAL,  0.1488,  -0.3839,   0.0013, 0
X,   79, THR,  0.8913,  -0.0045,   0.0303, 0
X,   80, ARG,  0.1749,  -0.3706,   0.0016, 0
X,   81, GLU,  0.1807,  -0.3677,   0.0016, 0
X,   82, GLU,  0.1228,  -0.3972,   0.0011, 0
X,   83, PRO,  0.9077,   0.0039,   0.0315, 0
X,   84, ILE,  0.1160,  -0.4007,   0.0010, 0
X,   85, TYR,  0.9803,   0.0410,   0.0383, 0
X,   86, ILE,  0.1482,  -0.3843,   0.0013, 1
X,   87, ILE,  0.0000,  -0.4600,   0.0005, 0
X,   88, THR,  0.9795,   0.0406,   0.0383, 1
X,   89, GLU,  1.7342,   0.4263,   0.1523, 1
X,   90, TYR,  1.7255,   0.4218,   0.1505, 1
X,   91, MET,  1.6410,   0.3786,   0.1347, 1
X,   92, ALA,  0.4546,  -0.2277,   0.0072, 1
X,   93, LYS,  0.3312,  -0.2907,   0.0039, 0
X,   94, GLY,  1.1989,   0.1527,   0.0632, 1
X,   95, SER,  1.3557,   0.2328,   0.0860, 1
X,   96, LEU,  0.2643,  -0.3249,   0.0028, 5
X,   97, LEU,  0.2685,  -0.3228,   0.0029, 4
X,   98, ASP,  0.4001,  -0.2555,   0.0056, 1
X,   99, PHE,  0.2087,  -0.3533,   0.0019, 0
X,  100, LEU,  0.3154,  -0.2988,   0.0037, 0
X,  101, LYS,  0.1674,  -0.3745,   0.0015, 0
X,  102, SER,  0.0687,  -0.4249,   0.0008, 0
X,  103, ASP,  0.0305,  -0.4444,   0.0006, 0
X,  104, GLU,  0.1442,  -0.3863,   0.0013, 0
X,  105, GLY,  0.0000,  -0.4600,   0.0005, 0
X,  106, GLY,  0.3451,  -0.2837,   0.0042, 0
X,  107, LYS,  0.2659,  -0.3241,   0.0028, 0
X,  108, VAL,  0.5582,  -0.1747,   0.0106, 0
X,  109, LEU,  0.7055,  -0.0995,   0.0179, 0
X,  110, LEU,  0.8598,  -0.0206,   0.0278, 0
X,  111, PRO,  0.3670,  -0.2724,   0.0047, 0
X,  112, LYS,  0.3340,  -0.2893,   0.0040, 0
X,  113, LEU,  0.4931,  -0.2080,   0.0083, 0
X,  114, ILE,  0.3363,  -0.2881,   0.0040, 0
X,  115, ASP,  0.5055,  -0.2016,   0.0087, 2
X,  116, PHE,  0.2076,  -0.3539,   0.0019, 5
X,  117, SER,  0.2702,  -0.3219,   0.0029, 5
X,  118, ALA,  0.1897,  -0.3630,   0.0017, 2
X,  119, GLN,  0.2344,  -0.3402,   0.0023, 2
X,  120, ILE,  0.2104,  -0.3525,   0.0020, 5
X,  121, ALA,  0.0657,  -0.4264,   0.0008, 0
X,  122, GLU,  0.3343,  -0.2891,   0.0040, 2
X,  123, GLY,  0.0000,  -0.4600,   0.0005, 0
X,  124, MET,  0.0000,  -0.4600,   0.0005, 0
X,  125, ALA,  0.1345,  -0.3913,   0.0012, 0
X,  126, TYR,  0.3133,  -0.2999,   0.0036, 0
X,  127, ILE,  0.0000,  -0.4600,   0.0005, 0
X,  128, GLU,  0.1573,  -0.3796,   0.0014, 0
X,  129, ARG,  0.3945,  -0.2584,   0.0054, 0
X,  130, LYS,  0.1113,  -0.4031,   0.0010, 0
X,  131, ASN,  0.0453,  -0.4368,   0.0007, 0
X,  132, TYR,  0.3033,  -0.3050,   0.0034, 0
X,  133, ILE,  0.4762,  -0.2166,   0.0078, 0
X,  134, HIS,  0.0000,  -0.4600,   0.0005, 0
X,  135, ARG,  1.1797,   0.1429,   0.0606, 0
X,  136, ASP,  1.0627,   0.0831,   0.0470, 1
X,  137, LEU,  0.1266,  -0.3953,   0.0011, 0
X,  138, ARG,  0.9766,   0.0391,   0.0380, 1
X,  139, ALA,  0.3223,  -0.2953,   0.0038, 0
X,  140, ALA,  0.8432,  -0.0291,   0.0266, 1
X,  141, ASN,  0.8775,  -0.0116,   0.0292, 1
X,  142, VAL,  0.2152,  -0.3500,   0.0020, 5
X,  143, LEU,  3.4227,   1.2891,   0.4658, 1
X,  144, VAL,  0.0000,  -0.4600,   0.0005, 0
X,  145, SER,  0.3562,  -0.2780,   0.0045, 0
X,  146, GLU,  0.3590,  -0.2765,   0.0045, 0
X,  147, SER,  0.2911,  -0.3112,   0.0032, 0
X,  148, LEU,  0.3009,  -0.3062,   0.0034, 0
X,  149, MET,  0.4519,  -0.2291,   0.0071, 0
X,  150, CYS,  0.2429,  -0.3359,   0.0024, 0
X,  151, LYS,  0.3342,  -0.2892,   0.0040, 0
X,  152, ILE,  0.0754,  -0.4215,   0.0008, 0
X,  153, ALA,  2.1059,   0.6162,   0.2291, 1
X,  154, ASP,  3.6058,   1.3827,   0.4907, 1
X,  155, PHE,  0.0000,  -0.4600,   0.0005, 0
X,  156, GLY,  2.8426,   0.9927,   0.3751, 1
X,  157, LEU,  2.6630,   0.9009,   0.3394, 1
X,  158, ALA,  0.1829,  -0.3665,   0.0016, 0
X,  159, ARG,  1.0279,   0.0653,   0.0433, 0
X,  160, VAL,  0.6615,  -0.1219,   0.0155, 0
X,  170, GLU,  0.8103,  -0.0459,   0.0243, 1
X,  171, GLY,  1.1163,   0.1105,   0.0530, 1
X,  172, ALA,  0.9658,   0.0336,   0.0370, 0
X,  173, LYS,  1.1143,   0.1095,   0.0527, 0
X,  174, PHE,  2.3180,   0.7246,   0.2731, 1
X,  175, PRO,  1.0919,   0.0980,   0.0502, 0
X,  176, ILE,  1.0549,   0.0791,   0.0462, 0
X,  177, LYS,  0.7510,  -0.0762,   0.0207, 0
X,  178, TRP,  1.0747,   0.0892,   0.0483, 4
X,  179, THR,  0.2575,  -0.3284,   0.0027, 0
X,  180, ALA,  0.0000,  -0.4600,   0.0005, 0
X,  181, PRO,  0.3090,  -0.3021,   0.0035, 0
X,  182, GLU,  0.7360,  -0.0839,   0.0198, 0
X,  183, ALA,  0.6599,  -0.1228,   0.0154, 0
X,  184, ILE,  0.5764,  -0.1654,   0.0113, 0
X,  185, ASN,  0.4402,  -0.2351,   0.0068, 0
X,  186, PHE,  0.9469,   0.0239,   0.0351, 0
X,  187, GLY,  0.7321,  -0.0859,   0.0195, 0
X,  188, CYS,  1.0105,   0.0564,   0.0414, 0
X,  189, PHE,  1.0404,   0.0717,   0.0446, 0
X,  190, THR,  0.6830,  -0.1110,   0.0166, 0
X,  191, ILE,  0.2239,  -0.3456,   0.0021, 0
X,  192, LYS,  0.4907,  -0.2092,   0.0083, 0
X,  193, SER,  0.2742,  -0.3199,   0.0030, 0
X,  194, ASP,  0.2393,  -0.3377,   0.0024, 0
X,  195, VAL,  0.0000,  -0.4600,   0.0005, 0
X,  196, TRP,  0.5627,  -0.1725,   0.0107, 0
X,  197, SER,  0.2078,  -0.3538,   0.0019, 0
X,  198, PHE,  0.0000,  -0.4600,   0.0005, 0
X,  199, GLY,  0.0000,  -0.4600,   0.0005, 0
X,  200, ILE,  0.4820,  -0.2137,   0.0080, 0
X,  201, LEU,  0.2900,  -0.3118,   0.0032, 5
X,  202, LEU,  0.0728,  -0.4228,   0.0008, 0
X,  203, TYR,  1.2453,   0.1764,   0.0695, 0
X,  204, GLU,  0.2182,  -0.3485,   0.0021, 4
X,  205, ILE,  0.4659,  -0.2219,   0.0075, 5
X,  206, VAL,  0.7060,  -0.0992,   0.0179, 0
X,  207, THR,  1.1649,   0.1353,   0.0588, 0
X,  208, TYR,  0.9598,   0.0305,   0.0364, 0
X,  209, GLY,  0.1637,  -0.3764,   0.0015, 4
X,  210, LYS,  0.9419,   0.0214,   0.0347, 0
X,  211, ILE,  1.4913,   0.3021,   0.1083, 4
X,  212, PRO,  0.0000,  -0.4600,   0.0005, 0
X,  213, TYR,  1.3316,   0.2205,   0.0822, 0
X,  214, PRO,  1.2783,   0.1932,   0.0738, 0
X,  215, GLY,  0.1633,  -0.3766,   0.0015, 0
X,  216, ARG,  0.6180,  -0.1442,   0.0133, 0
X,  217, THR,  0.0648,  -0.4269,   0.0008, 0
X,  218, ASN,  0.5254,  -0.1915,   0.0093, 0
X,  219, ALA,  0.0858,  -0.4161,   0.0009, 0
X,  220, ASP,  0.0843,  -0.4169,   0.0009, 0
X,  221, VAL,  0.0835,  -0.4173,   0.0009, 0
X,  222, MET,  0.5493,  -0.1793,   0.0102, 0
X,  223, THR,  0.0775,  -0.4204,   0.0008, 0
X,  224, ALA,  0.0963,  -0.4108,   0.0009, 0
X,  225, LEU,  0.5569,  -0.1754,   0.0105, 0
X,  226, SER,  0.1432,  -0.3868,   0.0013, 0
X,  227, GLN,  0.0374,  -0.4409,   0.0006, 0
X,  228, GLY,  0.0452,  -0.4369,   0.0007, 0
X,  229, TYR,  1.0331,   0.0679,   0.0439, 0
X,  230, ARG,  1.2092,   0.1580,   0.0646, 0
X,  231, MET,  1.9800,   0.5518,   0.2034, 0
X,  232, PRO,  1.1424,   0.1238,   0.0561, 0
X,  233, ARG,  0.8504,  -0.0254,   0.0271, 0
X,  234, VAL,  0.9819,   0.0418,   0.0385, 0
X,  235, GLU,  0.2764,  -0.3187,   0.0030, 0
X,  236, ASN,  0.6640,  -0.1207,   0.0156, 0
X,  237, CYS,  0.3578,  -0.2772,   0.0045, 0
X,  238, PRO,  0.4129,  -0.2490,   0.0060, 0
X,  239, ASP,  0.2677,  -0.3232,   0.0029, 0
X,  240, GLU,  0.5637,  -0.1719,   0.0108, 0
X,  241, LEU,  0.4476,  -0.2313,   0.0070, 0
X,  242, TYR,  0.7519,  -0.0758,   0.0208, 0
X,  243, ASP,  0.5501,  -0.1789,   0.0102, 0
X,  244, ILE,  0.6164,  -0.1450,   0.0132, 0
X,  245, MET,  0.5297,  -0.1893,   0.0095, 0
X,  246, LYS,  0.7161,  -0.0940,   0.0185, 0
X,  247, MET,  1.0443,   0.0737,   0.0450, 0
X,  248, CYS,  0.0000,  -0.4600,   0.0005, 0
X,  249, TRP,  1.0392,   0.0711,   0.0445, 0
X,  250, LYS,  0.2157,  -0.3498,   0.0020, 0
X,  251, GLU,  0.4081,  -0.2514,   0.0058, 0
X,  252, LYS,  0.1414,  -0.3877,   0.0013, 0
X,  253, ALA,  0.5519,  -0.1780,   0.0103, 0
X,  254, GLU,  0.3115,  -0.3008,   0.0036, 0
X,  255, GLU,  0.1379,  -0.3895,   0.0012, 0
X,  256, ARG,  0.2484,  -0.3330,   0.0025, 0
X,  257, PRO,  0.4256,  -0.2425,   0.0063, 0
X,  258, THR,  0.2182,  -0.3485,   0.0021, 0
X,  259, PHE,  0.0552,  -0.4318,   0.0007, 0
X,  260, ASP,  0.1636,  -0.3764,   0.0015, 0
X,  261, TYR,  1.3861,   0.2484,   0.0906, 0
X,  262, LEU,  0.0000,  -0.4600,   0.0005, 0
X,  263, GLN,  0.2034,  -0.3561,   0.0019, 2
X,  264, SER,  0.1482,  -0.3842,   0.0013, 0
X,  265, VAL,  0.9270,   0.0137,   0.0332, 0
X,  266, LEU,  0.1892,  -0.3633,   0.0017, 0
X,  267, ASP,  0.2161,  -0.3495,   0.0020, 2
X,  268, ASP,  0.2229,  -0.3461,   0.0021, 0
X,  269, PHE,  1.1518,   0.1286,   0.0572, 0
X,  270, TYR,  0.3882,  -0.2616,   0.0053, 2
X,  271, THR,  0.0581,  -0.4303,   0.0007, 0
X,  272, ALA,  0.0656,  -0.4264,   0.0008, 0
X,  273, THR,  0.2598,  -0.3272,   0.0027, 0
X,  274, GLU,  0.3142,  -0.2994,   0.0036, 0
