[
  {
    "doc_id": 1,
    "definition_id": 1,
    "start_char": 38,
    "end_char": 54
  },
  {
    "doc_id": 1,
    "definition_id": 1,
    "start_char": 172,
    "end_char": 187
  },
  {
    "doc_id": 2,
    "definition_id": 2,
    "start_char": 60,
    "end_char": 94
  }
]