<?xml version="1.0" encoding="UTF-8"?>
<svg viewBox="0 0 288.84125 640.70007" xmlns="http://www.w3.org/2000/svg" xmlns:xlink="http://www.w3.org/1999/xlink">
 <defs>
  <filter id="n">
   <feGaussianBlur stdDeviation="1.16354"/>
  </filter>
  <filter id="l">
   <feGaussianBlur stdDeviation=".88861"/>
  </filter>
  <filter id="k">
   <feGaussianBlur stdDeviation=".56726"/>
  </filter>
  <filter id="j">
   <feGaussianBlur stdDeviation=".92569"/>
  </filter>
  <filter id="i">
   <feGaussianBlur stdDeviation="1.89678"/>
  </filter>
  <filter id="v" x="-.1358" y="-.1708" width="1.2716" height="1.3416">
   <feGaussianBlur stdDeviation="9.34556"/>
  </filter>
  <filter id="w" x="-.29306" y="-.10677" width="1.5861" height="1.2136">
   <feGaussianBlur stdDeviation="2.8987"/>
  </filter>
  <filter id="u" x="-.16435" y="-.10812" width="1.3287" height="1.2162">
   <feGaussianBlur stdDeviation="3.45867"/>
  </filter>
  <filter id="t" x="-.14036" y="-.05426" width="1.2807" height="1.1085">
   <feGaussianBlur stdDeviation="2.71753"/>
  </filter>
  <filter id="s" x="-.20726" y="-.05226" width="1.4145" height="1.1045">
   <feGaussianBlur stdDeviation="1.26489"/>
  </filter>
  <filter id="q" x="-.13326" y="-.13813" width="1.2665" height="1.2763">
   <feGaussianBlur stdDeviation="4.76748"/>
  </filter>
  <filter id="r" x="-.23774" y="-.0949" width="1.4755" height="1.1898">
   <feGaussianBlur stdDeviation="4.85312"/>
  </filter>
  <filter id="p" x="-.09204" y="-.10741" width="1.1841" height="1.2148">
   <feGaussianBlur stdDeviation="1.22981"/>
  </filter>
  <filter id="o" x="-.08437" y="-.2077" width="1.1688" height="1.4154">
   <feGaussianBlur stdDeviation="1.85997"/>
  </filter>
  <filter id="m" x="-.11638" y="-.09457" width="1.2328" height="1.1891">
   <feGaussianBlur stdDeviation="2.01173"/>
  </filter>
  <linearGradient id="b">
   <stop stop-color="#ab855d" offset="0"/>
   <stop stop-color="#52300d" offset="1"/>
  </linearGradient>
  <linearGradient id="a">
   <stop stop-color="#d8cbb8" offset="0"/>
   <stop stop-color="#7a5e45" offset="1"/>
  </linearGradient>
  <linearGradient id="h" x1="293.11" x2="244.5" y1="647.58" y2="676.37" gradientUnits="userSpaceOnUse" xlink:href="#a"/>
  <linearGradient id="g" x1="294.46" x2="349.77" y1="689.76" y2="660.47" gradientUnits="userSpaceOnUse" xlink:href="#a"/>
  <linearGradient id="f" x1="222.32" x2="267.24" y1="554.06" y2="533.1" gradientUnits="userSpaceOnUse" xlink:href="#a"/>
  <linearGradient id="e" x1="232.36" x2="185.84" y1="277.58" y2="292.48" gradientUnits="userSpaceOnUse" xlink:href="#b"/>
  <radialGradient id="d" cx="246.29" cy="542.44" r="50.938" gradientTransform="matrix(1 0 0 .61868 0 206.84)" gradientUnits="userSpaceOnUse" xlink:href="#b"/>
  <radialGradient id="c" cx="337.14" cy="809.86" r="67.922" gradientTransform="matrix(1.4494 .01117 -.01741 1.1148 -137.41 -96.739)" gradientUnits="userSpaceOnUse" xlink:href="#b"/>
 </defs>
 <g transform="translate(-153.32 -223.1)">
  <path d="m275.71 822.72-87.857-264.29c-2.2822-6.7489-3.1397-13.976-2.5-21.071 0.66745-7.4036 2.7161-14.606 4.6429-21.786 2.4211-9.0217 5.1615-17.958 8.2143-26.786 1.3662-3.9509 2.7951-7.8801 4.2857-11.786l-1.4286-12.857-27.857-115.71 94.643-35.714c11.306 34.208 22.734 68.375 34.286 102.5 2.2572 6.6683 4.5191 13.335 6.7857 20l6.7857 8.2143 35.714 32.143c3.5306 3.1608 6.6588 6.7703 9.2857 10.714 2.307 3.4636 4.2274 7.1845 5.7143 11.071 8.5821 32.021 17.154 64.045 25.714 96.071 15.272 57.134 30.51 114.28 45.714 171.43 1.1543 5.0332 1.7543 10.193 1.7857 15.357 0.0418 6.8762-0.92756 13.757-2.8572 20.357-2.1157 7.2368-5.3865 14.134-9.6428 20.357-6.457 9.4409-15.113 17.246-24.643 23.571-9.0954 6.0374-19.082 10.807-29.643 13.571-8.2624 2.1627-16.817 3.0869-25.357 3.2143-10.105 0.15073-20.276-0.81791-30-3.5714-7.6208-2.158-14.963-5.4248-21.429-10-8.8811-6.2847-16.002-15.03-20.357-25" fill="#92c7d9" opacity=".48593" stroke="#5198a9" stroke-width="5"/>
  <path d="m306.46 850.33c27.367 6.1126 56.746 2.8131 82.075-9.2176 17.875-8.4899 33.713-21.23 45.836-36.871-3.3334 9.7207-8.5018 18.809-15.152 26.643-8.1725 9.6272-18.586 17.34-30.178 22.35l-38.638 8.5863-37.502-4.7982-6.4397-6.6923" fill="#6ab1c7"/>
  <path transform="matrix(1.2166 -.40986 .33573 1.0395 -322.76 98.106)" d="m400 809.86c0 23.867-28.142 43.214-62.857 43.214s-62.857-19.348-62.857-43.214 28.142-43.214 62.857-43.214 62.857 19.348 62.857 43.214z" fill="none" stroke="#5198a9" stroke-width="4.2223"/>
  <path transform="matrix(.75547 -.27434 .20848 .6958 -217.31 -184.14)" d="m400 809.86c0 23.867-28.142 43.214-62.857 43.214s-62.857-19.348-62.857-43.214 28.142-43.214 62.857-43.214 62.857 19.348 62.857 43.214z" fill="#92c7d9" opacity=".60177" stroke="#5198a9" stroke-width="6.5493"/>
  <path d="m203.04 459.91 5.5558 9.5964c-0.19631 1.6806-0.3647 3.3645-0.50508 5.0508-0.27975 3.3604-0.44823 6.73-0.50507 10.102-1.1105 3.8925-2.2892 7.7656-3.5355 11.617-1.8692 5.776-3.8905 11.503-6.0609 17.173-0.85386 4.4114-1.8649 8.7925-3.0305 13.132-0.77396 2.8815-1.6161 5.7446-2.5254 8.5863l-1.0102 10.607 2.0203 13.132 3.5355 9.0914 3.0304-21.213 6.566-8.5863 12.122-8.5863 14.142-6.566 12.627-4.5457 17.173-9.0914c2.8902-1.1086 5.7535-2.2876 8.5863-3.5355 2.895-1.2754 5.7583-2.6228 8.5863-4.0406l8.5863-1.5152 13.637-4.5457c3.3501-0.75532 6.7186-1.429 10.102-2.0203 3.3543-0.58629 6.7228-1.0916 10.102-1.5152l11.617-0.50508 13.637 2.5254 3.5355 2.0203 3.5355 4.0406 2.0203 6.566v-12.627l-6.566-9.0914-8.0812-9.5964-12.627-11.617-5.5558-6.566-4.0406-3.5355-5.0508 1.0102-5.5558 8.5863-9.0914 4.5457-16.668-6.566-5.0508-9.0914-1.0102-6.566-1.5152-6.0609-7.0711-2.5254-10.102-0.50507-14.647 5.5558-10.102 9.0914-5.5558 7.5761-7.5762 6.566c-1.0386 0.88628-2.2447 1.5755-3.5355 2.0203-2.8383 0.97804-6.0795 0.71825-8.7257-0.69938s-4.6582-3.972-5.4164-6.8768" fill="#5198a9" filter="url(#v)" opacity=".65929" stroke="#000"/>
  <path d="m200 557.36c-1.2334-2.8263-2.1701-5.845-2.1429-8.9286 0.0228-2.5786 0.77666-5.2246 2.5-7.1429 1.5136-1.6848 3.632-2.6806 5.7143-3.5714 7.8297-3.3496 16.262-5.9881 22.5-11.786 2.2855-2.1242 4.2303-4.6383 6.7857-6.4286 4.1122-2.881 9.3154-3.5739 14.286-4.2857 6.046-0.8659 12.107-1.8838 18.214-1.7857 4.9684 0.0798 10.061 0.95503 14.286 3.5714 3.0274 1.875 5.4804 4.5671 7.5 7.5 1.8815 2.7323 3.4288 5.7236 4.2857 8.9286 1.1186 4.1839 1.0261 8.6496 0 12.857-1.1547 4.735-3.4959 9.1874-6.8111 12.76-3.3457 3.6054-7.6265 6.2728-12.204 8.0726s-9.4528 2.7567-14.348 3.235c-9.7905 0.95659-19.672 0.0293-29.494 0.57527-3.7002 0.20567-7.3977 0.62054-11.102 0.50202s-7.4687-0.80197-10.684-2.6449c-4.3328-2.4835-7.2882-6.8514-9.2857-11.429" fill="url(#d)" stroke="#000" stroke-width="5"/>
  <path d="m363.21 785.22c-1.5838 2.817-3.6459 5.3643-6.0714 7.5-2.5391 2.2357-5.4662 4.0143-8.5714 5.3571-3.2972 1.4259-6.7986 2.3657-10.357 2.8571-3.8408 0.53045-7.8897 0.51275-11.429-1.0714-2.0975-0.93896-3.9312-2.3931-5.5458-4.0283s-3.0264-3.4566-4.4542-5.2574c-1.5248-1.9232-3.0726-3.8281-4.6428-5.7143-0.69129-3.1312-1.5258-6.2307-2.5-9.2857-0.65215-2.045-1.3669-4.0701-2.1429-6.0714 0.18941-2.6555-0.17794-5.3494-1.0714-7.8571-1.9586-5.4972-6.2543-9.7786-10.357-13.929-5.7388-5.8047-11.499-11.971-14.286-19.643-1.2839-3.5344-1.8933-7.3126-1.7857-11.071l-1.4286-3.2143c-4.0726-4.2269-7.6735-8.908-10.714-13.929-2.7046-4.4655-4.9607-9.1858-7.1428-13.929-0.68149-1.4812-1.3681-3.0136-1.4286-4.6429-0.0426-1.1489 0.23817-2.3081 0.80183-3.3101s1.4085-1.844 2.4125-2.4042c1.2978-1.4376 1.9614-3.4283 1.7857-5.3572-0.15261-1.6754-0.89838-3.2474-1.8338-4.6457s-2.0584-2.6596-3.1662-3.9257l-5-5.7143c-1.6105-3.6992-4.0735-7.0242-7.1428-9.6429-2.4912-2.1254-5.3488-3.7719-8.2143-5.3571-4.1318-2.2858-8.4337-4.5636-11.429-8.2143-2.2147-2.6996-3.5756-5.9946-4.6515-9.3165s-1.9009-6.7303-3.2056-9.9692c-2.3694-5.8818-5.9084-11.21-8.9286-16.786l-4.6429-8.5714 12.857 3.5714c-1.1493-2.1654-2.34-4.3088-3.5714-6.4286-2.0921-3.6014-4.3009-7.1337-6.4286-10.714-2.233-3.7578-4.3767-7.5688-6.4286-11.429l-2.8571-6.4286c1.5546 3.0498 4.0931 5.5882 7.1428 7.1428 3.9219 1.9992 8.4582 2.3342 12.857 2.5 5.6061 0.21136 11.252 0.20617 16.786-0.71428 5.0672-0.84279 9.9976-2.4501 14.643-4.6429 4.6118-2.177 8.9522-4.9342 12.857-8.2143 3.4577-2.9044 6.6196-6.2851 8.5714-10.357 1.2817-2.6739 2.0154-5.609 2.1429-8.5714l-1.0714-2.5 4.6429 9.6429 6.4286 7.5 0.71428 1.7857c30.63 76.679 56.645 155.2 77.857 235" fill="url(#h)" stroke="#000" stroke-linejoin="round" stroke-width="5"/>
  <path d="m382.86 812.72c-15.517-22.07-30.406-44.582-44.643-67.5-14.48-23.309-28.281-47.032-42.143-70.714-5.2292-8.9338-10.467-17.862-15.714-26.786-1.2789-3.626-2.3526-7.3243-3.2143-11.071-0.9785-4.2553-1.6826-8.568-2.5-12.857-0.46681-2.4496-0.97383-4.9034-1.8382-7.2426s-2.104-4.5744-3.8761-6.3289c-0.84862-0.84021-1.8129-1.5634-2.8571-2.1428-2.6983-7.4182-4.7328-15.078-6.0714-22.857-0.63119-3.6683-1.1079-7.3631-1.4286-11.071l18.571-14.643 13.929-14.286 2.1429-6.4286-1.0714-10-4.2857-6.4286 7.5 6.7857 5 8.5714 1.7857 6.4286c1.2599 2.0554 2.5699 4.08 3.9286 6.0714 1.4899 2.1838 3.0382 4.3277 4.6429 6.4286l4.6428 8.9286c-4e-3 2.0658 0.36039 4.1318 1.0714 6.0714 1.18 3.219 3.2674 6.009 5.2518 8.8048s3.9274 5.7236 4.7482 9.0524c0.402 1.6302 0.52335 3.3292 0.35714 5-0.56377 3.7782-0.68391 7.6225-0.35714 11.429 0.79745 9.2885 4.3126 18.327 10 25.714 4.0898 10.817 8.1375 21.651 12.143 32.5 2.9872 8.0912 5.9508 16.191 8.9286 24.286l2.5 6.7857c2.7538 2.8276 5.0539 6.0961 6.7857 9.6429 1.656 3.3914 2.7889 7.0222 3.5714 10.714 1.2989 6.1288 1.6417 12.426 2.8572 18.571 0.87089 4.4037 2.1894 8.7188 3.9286 12.857 2.516 4.6569 4.5539 9.572 6.0714 14.643 1.1191 3.7394 1.9556 7.5634 2.5 11.429 1.9158 4.5668 3.2398 9.3815 3.9286 14.286 0.59754 4.2546 0.71758 8.576 0.35714 12.857-0.3436 2.2435-1.0716 4.4276-2.1429 6.4286-1.2455 2.3264-2.9556 4.403-5 6.0714" fill="url(#g)" stroke="#000" stroke-linejoin="round" stroke-width="5"/>
  <path d="m233.93 564.86c-4.2374-0.41204-8.3181-1.9356-12.009-4.0569s-7.0144-4.8311-10.133-7.7288c-1.5414-1.432-3.0452-2.922-4.2748-4.6292s-2.1818-3.65-2.5109-5.728c-0.32059-2.0248-0.0319-4.1378 0.79242-6.0148s2.1784-3.5134 3.8504-4.6995c1.9369-1.3739 4.2465-2.1285 6.5671-2.6327s4.687-0.77736 7.0044-1.2958c3.7201-0.83233 7.2733-2.2879 10.714-3.9286 4.099-1.9544 8.1098-4.1965 12.5-5.3572 4.5385-1.1998 9.3867-1.1869 13.929 0 3.2783 0.8567 6.4381 2.3453 8.9286 4.6429 2.8028 2.5858 4.6763 6.2004 5 10 0.2607 3.0598-0.4672 6.1552-1.7857 8.9286-2.5222 5.3052-7.0603 9.3675-11.786 12.857-3.7869 2.7966-7.7949 5.3381-12.143 7.1429-4.6196 1.9175-9.6646 2.9841-14.643 2.5" fill="url(#f)" stroke="#000" stroke-width="5"/>
  <path d="m366.18 509.41-2.5254 18.183-3.0305 10.102-2.5254 6.566 2.0203 1.5152v3.5355l-2.0203 3.5355 4.0406 0.50507 0.50507 4.0406-0.50507 3.5355c2.0782 1.2572 4.1011 2.6058 6.0609 4.0406 0.67924 0.49727 1.3509 1.0048 2.0203 1.5152 1.5266 1.1639 3.0419 2.3424 4.5457 3.5355l4.0406 4.5457 3.0305-2.0203-5.0508-16.162-1.5152-9.0914-3.0305-5.0508v-4.0406l0.50508-6.0609-6.566-22.728" fill="#5198a9" filter="url(#w)" opacity=".69912"/>
  <path d="m196.98 541.73 4.5457-12.627 3.5355-7.5761 9.0914-9.0914 11.617-5.5558 10.607-6.0609 5.5558-5.0508 5.5558-6.0609c-2.0299 0.27511-4.0515 0.61203-6.0609 1.0102-1.5227 0.3017-3.0385 0.63853-4.5457 1.0102l0.50508-6.566-1.5152-7.5762-5.5558-4.5457 3.0305-8.0812c-2.1719 1.8716-4.3607 3.7237-6.566 5.5558-2.6697 2.218-5.3637 4.4068-8.0812 6.566l-6.0609 15.152c-2.1176 3.6497-4.1388 7.3553-6.0609 11.112-1.9555 3.8216-3.8083 7.6957-5.5558 11.617l-3.0305 14.142-1.0102 12.627" fill="#fff" filter="url(#u)" opacity=".67929"/>
  <path d="m177.28 353.84 3.5355 14.647 5.0508 6.0609 3.5355 12.122 2.5254 16.668 0.50508 13.132c1.4367 6.0802 2.9521 12.142 4.5457 18.183 1.6045 6.0825 3.2883 12.144 5.0508 18.183l7.0711 13.637 1.0102 7.5761 10.607-12.122 3.0305-18.183-6.566-20.203c-3.2466-3.4919-6.4458-7.0279-9.5964-10.607-3.0771-3.4952-6.1079-7.0311-9.0914-10.607l-6.566-18.688-0.50507-11.112-6.0609-13.132-8.0812-5.5558" fill="#5198a9" filter="url(#t)" opacity=".54867"/>
  <path d="m180.82 365.96 7.5761 15.152 1.5152 15.657 5.5558 9.0914-1.5152 18.183-13.132-58.084" fill="#fff" filter="url(#s)" opacity=".78319"/>
  <path d="m180.82 355.36 8.5863 13.132 4.0406 10.607 1.0102 10.607c0.60904 2.3748 1.2828 4.733 2.0203 7.0711 0.91319 2.8951 1.9241 5.7594 3.0305 8.5863l1.0102 1.5152 9.5964-6.0609 10.607-3.0305 8.5863-0.50507 6.0609-5.5558 4.5457-11.112-5.5558-7.5761-9.5964-2.5254-11.112 0.50508-3.5355-3.0305 5.0508-7.0711c2.6822-0.71838 5.3765-1.3919 8.0812-2.0203 7.175-1.6669 14.424-3.0155 21.718-4.0406l9.0914-4.0406 7.0711-7.5761 4.0406-10.102 1.5152-9.0914-21.213 18.183-19.698 9.0914-21.718 4.5457-15.152-1.0102-8.0812 0.50508" fill="#fff" filter="url(#q)" opacity=".67257"/>
  <path d="m266.18 327.07c-1.1979 4.2547-2.5459 8.4672-4.0406 12.627-1.0996 3.0603-2.2787 6.0922-3.5355 9.0914l9.0914 15.152c2.3116 7.2541 4.6687 14.494 7.0711 21.718 2.5704 7.7299 5.1931 15.444 7.5762 23.234 1.4343 4.6885 2.7815 9.4036 4.0406 14.142l5.5558 13.637 2.0203 11.112 3.5355-6.0609 2.0203-11.617-2.0203-10.607 10.102 23.234c-6.6784-22.513-13.751-44.909-21.213-67.175-5.6684-16.913-11.562-33.751-17.678-50.508l-2.5254 2.0203" fill="#5398a9" filter="url(#r)" opacity=".69469"/>
  <path d="m275.71 822.72-87.857-264.29c-2.2822-6.7489-3.1397-13.976-2.5-21.071 0.66745-7.4036 2.7161-14.606 4.6429-21.786 2.4211-9.0217 5.1615-17.958 8.2143-26.786 1.3662-3.9509 2.7951-7.8801 4.2857-11.786l-1.4286-12.857-27.352-115.21c7.3495 2.9508 15.237 4.5548 23.156 4.7085 9.6514 0.18735 19.243-1.762 28.459-4.6354 9.3532-2.9163 18.525-6.8624 26.186-12.969 7.4777-5.9604 13.35-13.916 16.842-22.818 11.054 34.066 22.314 68.065 33.781 101.99 2.2539 6.6694 4.5158 13.336 6.7857 20l6.7857 8.2143 35.714 32.143c3.5306 3.1608 6.6588 6.7703 9.2857 10.714 2.307 3.4636 4.2274 7.1845 5.7143 11.071 8.5821 32.021 17.154 64.045 25.714 96.071 15.272 57.134 30.51 114.28 45.714 171.43 1.1543 5.0332 1.7543 10.193 1.7857 15.357 0.0418 6.8762-0.92756 13.757-2.8572 20.357-2.1157 7.2368-5.3865 14.134-9.6428 20.357-6.457 9.4409-15.113 17.246-24.643 23.571-9.0954 6.0374-19.082 10.807-29.643 13.571-8.2624 2.1627-16.817 3.0869-25.357 3.2143-10.105 0.15073-20.276-0.81791-30-3.5714-7.6208-2.158-14.963-5.4248-21.429-10-8.8811-6.2847-16.002-15.03-20.357-25" fill="none" stroke="#5198a9" stroke-width="5"/>
  <path transform="matrix(.85593 -.29384 .2362 .74526 -263.63 -188.2)" d="m400 809.86c0 23.867-28.142 43.214-62.857 43.214s-62.857-19.348-62.857-43.214 28.142-43.214 62.857-43.214 62.857 19.348 62.857 43.214z" fill="#92c7d9" opacity=".56195" stroke="#5198a9" stroke-width="5.9452"/>
  <path transform="matrix(.85593 -.29384 .2362 .74526 -263.63 -188.2)" d="m400 809.86c0 23.867-28.142 43.214-62.857 43.214s-62.857-19.348-62.857-43.214 28.142-43.214 62.857-43.214 62.857 19.348 62.857 43.214z" fill="none" stroke="#5198a9" stroke-width="5.9452"/>
  <path transform="matrix(.50851 -.17039 .14033 .43216 -90.409 -43.558)" d="m400 809.86c0 23.867-28.142 43.214-62.857 43.214s-62.857-19.348-62.857-43.214 28.142-43.214 62.857-43.214 62.857 19.348 62.857 43.214z" fill="url(#c)" stroke="#6f4923" stroke-width="10.129"/>
  <path d="m163.14 260.66 22.223 71.216c11.612 7.0746 26.719 8.0493 39.143 2.5254 10.285-4.5726 18.583-13.43 22.476-23.991l-19.445-70.963c-3.2103 12.759-13.106 23.635-25.506 28.032-6.4844 2.2993-13.565 2.8926-20.342 1.7045s-13.233-4.1549-18.549-8.523" fill="url(#e)" stroke="#6f4923" stroke-linejoin="round" stroke-width="5"/>
  <path transform="matrix(.85593 -.29384 .2362 .74526 -263.63 -188.2)" d="m400 809.86c0 23.867-28.142 43.214-62.857 43.214s-62.857-19.348-62.857-43.214c0-5.9666 1.7589-11.651 4.9396-16.821s7.2642-9.0141 12.952-12.924-0.78528-0.77539 3.6392-3.505c3.407-2.1019-2.5152 18.811 3.0258 24.885 5.5193 6.0498 29.845 8.9352 34.185 8.9352s36.535-0.75128 41.89-11.998c0.95795-8.1148-1.1145-24.21 2.6455-23.117 7.5201 2.1868-1.6601 0.078 4.0273 3.9881 11.375 7.8202 18.41 18.624 18.41 30.557z" fill="#92c7d9" opacity=".5531"/>
  <path d="m166.04 278.59-7.5761 17.046 2.1466 11.364 8.8388 9.0914 23.234 5.0508 28.284-6.3135 23.36-17.678 9.2176-16.92-1.389-13.258-6.1872-7.0711-9.9753-4.0406h-1.7678c1.595 2.7003 2.633 5.7279 3.0305 8.8388 0.35935 2.813 0.19723 5.6833-0.37881 8.46-0.83247 4.0128-2.5257 7.8276-4.7982 11.238-2.6067 3.9119-5.9794 7.3062-9.849 9.9753-3.0504 2.104-6.417 3.7637-9.9753 4.7982-4.0066 1.1649-8.2034 1.5279-12.374 1.6415-4.2332 0.1153-8.5084-0.0248-12.627-1.0102-3.8131-0.91227-7.4409-2.5426-10.733-4.672-3.2808-2.1221-6.288-4.8042-8.2075-8.2075-1.429-2.5337-2.2176-5.4254-2.2728-8.3338" fill="#b4cdd7" opacity=".70796"/>
  <path transform="matrix(.75547 -.27434 .20848 .6958 -217.31 -184.14)" d="m383.68 780.82c23.334 17.671 21.413 45.001-4.2905 61.043s-65.456 14.721-88.79-2.9497c-21.6-16.358-21.775-41.282-0.40671-57.782" fill="none" stroke="#5198a9" stroke-linecap="round" stroke-width="6.5493"/>
  <path d="m166.55 318.87-2.6516 9.2176 1.6415 6.9448 3.1567 5.6821 4.4194 4.1669c3.706 1.3722 7.7591 1.7952 11.669 1.2179 4.061-0.59973 7.9575-2.2792 11.182-4.8196l-15.148-3.0906-8.3338-5.4296-4.0406-6.1872-1.894-7.7024" fill="#5198a9" filter="url(#p)" opacity=".54867"/>
  <path d="m167.18 319.24c0.0204 4.9121 1.9537 9.7915 5.3033 13.385 3.2065 3.4395 7.5799 5.6429 12.133 6.8168s9.3034 1.3746 14.004 1.2644c7.2196-0.1692 14.422-1.0589 21.466-2.6516-7.2574 0.2961-14.544-0.12754-21.718-1.2627-4.3181-0.68323-8.7031-1.667-12.374-4.0406-1.8879-1.2206-3.5545-2.7992-4.7982-4.672-0.9217-1.3878-1.6078-2.9316-2.0203-4.5457-1.9672-0.42799-3.9082-0.97652-5.8084-1.6415-2.1195-0.74172-4.1883-1.6284-6.1872-2.6516" fill="#fff" filter="url(#o)" opacity=".76991"/>
  <path d="m261.25 291.72c1.0434 5.243 0.60097 10.773-1.2627 15.784-1.8333 4.9289-4.9897 9.2915-8.7126 13.006-5.3522 5.3398-11.854 9.3909-18.562 12.879-4.3964 2.2865-8.9075 4.3524-13.511 6.1872 5.3757-0.81491 10.649-2.3033 15.657-4.4194 6.2849-2.6554 12.139-6.2931 17.425-10.607 3.417-2.7882 6.5966-5.8543 9.7227-8.9651 2.5529-2.5404 5.1623-5.26 6.1872-8.7126 0.75679-2.5494 0.56467-5.3423-0.37881-7.8287-1.1899-3.1358-3.5782-5.7997-6.566-7.3236" fill="#68a1b1" filter="url(#n)" opacity=".5177"/>
  <path d="m260.87 291.46c0.32726 3.0233 0.24205 6.0909-0.25254 9.0914-0.82049 4.9776-2.7786 9.7642-5.6821 13.89-3.6704 3.9442-7.4608 7.7767-11.364 11.49-4.8464 4.6109-10.157 9.1949-16.668 10.733-2.3919 0.56507-4.8862 0.69408-7.3236 0.37881 6.1249-1.7445 11.835-4.9266 16.541-9.2176 3.7281-3.3994 6.8263-7.4874 9.0914-11.996 1.3035-2.3061 2.205-4.8388 2.6516-7.4499 0.37747-2.2067 0.32895-4.4627 0.12627-6.6923l-0.25254-2.7779 4.9245-6.8185 2.3991-5.9346c0.37264 2.5918 0.37264 5.2369 0 7.8287-0.23423 1.6291-0.61507 3.2371-1.1364 4.7982l6.9448-7.3236" fill="#fff" filter="url(#m)" opacity=".70354"/>
  <path d="m166.55 283.64c-1.448 1.4717-2.6484 3.1865-3.5355 5.0508-0.87974 1.8488-1.4563 3.8964-1.2627 5.9346 0.16647 1.753 0.90666 3.4343 2.0203 4.7982 1.3632 1.6696 3.2382 2.8464 5.177 3.7881 3.6737 1.7843 7.6849 2.8238 11.743 3.283 4.365 0.49396 8.7959 0.32483 13.132-0.37881 4.4288-0.71867 8.7668-1.9946 12.879-3.7881-6.9847 0.48712-14.018 0.27528-20.961-0.63135-2.6224-0.34245-5.2439-0.78665-7.756-1.6133s-4.9227-2.0501-6.8912-3.8163c-2.184-1.9596-3.782-4.5857-4.4194-7.4499-0.37736-1.6956-0.42051-3.465-0.12627-5.177" fill="#6ba1b1" filter="url(#l)" opacity=".80531"/>
  <path d="m238.27 260.53c0.75578 0.60161 1.6666 0.97373 2.5809 1.2854s1.85 0.57257 2.7224 0.98743c1.3091 0.62254 2.4518 1.5903 3.283 2.7779 0.32643 0.46642 0.60965 0.97699 0.71633 1.5362 0.0533 0.27961 0.0613 0.56922 8e-3 0.84888s-0.16823 0.54913-0.34575 0.77164c-0.23107 0.28962-0.56261 0.49182-0.91906 0.5929s-0.73665 0.10433-1.1012 0.0384c-0.55234-0.0998-1.0663-0.35354-1.5385-0.65697s-0.90916-0.65794-1.3656-0.98453c-0.93675-0.67018-1.9574-1.223-3.0305-1.6415 0.5641 1.1452 1.2889 2.2111 2.1466 3.1567 0.8071 0.88985 1.7355 1.6758 2.7779 2.2728 0.71402 0.40897 1.504 0.74828 2.0203 1.389 0.28534 0.35404 0.47143 0.79186 0.50263 1.2455s-0.0973 0.92089-0.37636 1.2799c-0.32201 0.41419-0.82263 0.66321-1.3375 0.76384s-1.0469 0.065-1.5667-6e-3c-0.72935-0.0999-1.4492-0.26931-2.1466-0.50508-0.33964 1.3443-0.80533 2.6566-1.389 3.9143-1.0897 2.3482-2.5853 4.4943-4.2932 6.4397-2.5672 2.9244-5.6112 5.4025-8.8388 7.5761-2.848 1.9179-5.849 3.6086-8.9651 5.0508 4.2113-0.93235 8.2987-2.4226 12.122-4.4194 5.3864-2.8134 10.204-6.601 14.773-10.607 2.1465-1.8815 4.2946-3.8791 5.5558-6.4397 1.0888-2.2104 1.4484-4.7726 1.0102-7.1973-0.62151-2.3573-1.8504-4.5518-3.5355-6.3135-2.2911-2.3952-5.3391-3.9347-8.46-5.0508-0.91516-0.32725-1.8419-0.62213-2.7779-0.88388 0.26027 1.0872 0.89308 2.0817 1.7678 2.7779" fill="#6ea2b1" filter="url(#k)" opacity=".72566"/>
  <path d="m167.56 284.27c-0.68296 2.4013-0.50106 5.0388 0.50508 7.3236 0.99873 2.268 2.7629 4.1421 4.7982 5.5558 3.0205 2.0981 6.6146 3.2287 10.228 3.9144 4.9831 0.94567 10.08 1.0977 15.152 1.1364 2.5281 0.0193 5.0617 0.0109 7.5761-0.25254 4.6323-0.48524 9.1554-1.8367 13.385-3.7881 3.7-1.7073 7.1873-3.8753 10.354-6.4397 3.5055-2.8388 6.617-6.1634 9.2176-9.849l3.2199-5.4296c0.74342 0.0144 1.4887-0.0708 2.2097-0.25254 0.36546-0.0921 0.72797-0.21039 1.0529-0.40139s0.61214-0.45975 0.77802-0.79817c0.20304-0.41425 0.20939-0.90794 0.0764-1.3497s-0.3962-0.83549-0.7078-1.1757c-0.85472-0.93313-2.0493-1.4737-3.0304-2.2728-1.1643-0.94828-2.0173-2.2727-2.3991-3.7249 1.0216-0.0583 2.0609 0.3432 2.7779 1.0733 0.44593 0.45404 0.76535 1.0192 1.2072 1.4772 0.22092 0.22901 0.47444 0.43154 0.76531 0.56055s0.62179 0.18093 0.9317 0.10879c0.22156-0.0516 0.42704-0.16524 0.59545-0.31817s0.30023-0.34434 0.39255-0.55226c0.18463-0.41582 0.2096-0.88844 0.14842-1.3393-0.13984-1.0304-0.71279-1.9675-1.4569-2.6939s-1.6534-1.2609-2.5837-1.7255c-1.4692-0.73373-3.0109-1.3097-4.5457-1.894-0.82182-0.31288-1.6426-0.62856-2.4622-0.94702l1.5784 5.7452c0.089 1.7057 0.0255 3.4194-0.1894 5.1139-0.44259 3.4899-1.5289 6.8877-3.0936 10.038-2.148 4.3253-5.2041 8.195-8.902 11.301-3.6945 3.1032-8.0221 5.4413-12.627 6.8817-7.2552 2.2694-15.185 2.277-22.476 0.12627-5.8311-1.72-11.198-4.7617-16.162-8.2706-1.7843-1.2611-3.5484-2.6097-4.8614-4.3563-0.58493-0.77815-1.0738-1.6284-1.4521-2.5254" fill="#fff" filter="url(#j)" opacity=".69469"/>
  <path d="m203.55 580.12 74.751 228.8 9.0914 11.112 17.173 8.0812-16.668-19.193-12.122-29.294-15.657-48.487-6.0609-26.264 5.5558-4.0406 8.0812 2.5254h7.5762l-3.5355-8.0812-13.637-7.0711-13.132-16.162-14.647-33.84-14.647-43.437-7.5762-14.647h-4.5457" fill="#f6fdff" filter="url(#i)" opacity=".61947"/>
 </g>
</svg>
