     ||
     ||
    _;|
   /__3
  / /||
 / / // .--.
 \ \// / (OO)
  \//  |( _ )
  // \__/`-'\__
 // \__      _ \
.-'/    | ...|\ 
(.-'     |      \ \ 
.-._   /    o ) / /
/_ \ \ /   __/ / /
\ _/   / /  E_/
\     / /
`-._/-'dsss