<svg width="41" height="53" viewBox="0 0 41 53" fill="none" xmlns="http://www.w3.org/2000/svg">
<path d="M20.31 47.5V6M20.31 6L5.5 47.5M20.31 6L35.5 47.5" stroke="url(#paint0_linear_1_21)" stroke-width="11" stroke-linecap="round" stroke-linejoin="round"/>
<defs>
<linearGradient id="paint0_linear_1_21" x1="20.5" y1="6" x2="20.5" y2="47.5" gradientUnits="userSpaceOnUse">
<stop stop-color="#FF3700"/>
<stop offset="0.505208" stop-color="#D10000"/>
<stop offset="1" stop-color="#FF3700"/>
</linearGradient>
</defs>
</svg>
