('/Users/lucasaimaretti/Personal/personal/build/Extract_md_audios/Extract_md_audios.pkg',
 {'BINARY': True,
  'DATA': True,
  'EXECUTABLE': True,
  'EXTENSION': True,
  'PYMODULE': True,
  'PYSOURCE': True,
  'PYZ': False,
  'SPLASH': True},
 [('PYZ-00.pyz',
   '/Users/lucasaimaretti/Personal/personal/build/Extract_md_audios/PYZ-00.pyz',
   'PYZ'),
  ('struct',
   '/Users/lucasaimaretti/Personal/personal/build/Extract_md_audios/localpycs/struct.pyc',
   'PYMODULE'),
  ('pyimod01_archive',
   '/Users/lucasaimaretti/Personal/personal/build/Extract_md_audios/localpycs/pyimod01_archive.pyc',
   'PYMODULE'),
  ('pyimod02_importers',
   '/Users/lucasaimaretti/Personal/personal/build/Extract_md_audios/localpycs/pyimod02_importers.pyc',
   'PYMODULE'),
  ('pyimod03_ctypes',
   '/Users/lucasaimaretti/Personal/personal/build/Extract_md_audios/localpycs/pyimod03_ctypes.pyc',
   'PYMODULE'),
  ('pyiboot01_bootstrap',
   '/Users/lucasaimaretti/opt/anaconda3/lib/python3.9/site-packages/PyInstaller/loader/pyiboot01_bootstrap.py',
   'PYSOURCE'),
  ('pyi_rth_pkgutil',
   '/Users/lucasaimaretti/opt/anaconda3/lib/python3.9/site-packages/PyInstaller/hooks/rthooks/pyi_rth_pkgutil.py',
   'PYSOURCE'),
  ('pyi_rth_setuptools',
   '/Users/lucasaimaretti/opt/anaconda3/lib/python3.9/site-packages/PyInstaller/hooks/rthooks/pyi_rth_setuptools.py',
   'PYSOURCE'),
  ('pyi_rth_pkgres',
   '/Users/lucasaimaretti/opt/anaconda3/lib/python3.9/site-packages/PyInstaller/hooks/rthooks/pyi_rth_pkgres.py',
   'PYSOURCE'),
  ('pyi_rth_multiprocessing',
   '/Users/lucasaimaretti/opt/anaconda3/lib/python3.9/site-packages/PyInstaller/hooks/rthooks/pyi_rth_multiprocessing.py',
   'PYSOURCE'),
  ('pyi_rth_inspect',
   '/Users/lucasaimaretti/opt/anaconda3/lib/python3.9/site-packages/PyInstaller/hooks/rthooks/pyi_rth_inspect.py',
   'PYSOURCE'),
  ('Extract_md_audios',
   '/Users/lucasaimaretti/Personal/personal/Adhoc/Extract_audios/Extract_md_audios.py',
   'PYSOURCE'),
  ('lib-dynload/_datetime.cpython-39-darwin.so',
   '/Users/lucasaimaretti/opt/anaconda3/lib/python3.9/lib-dynload/_datetime.cpython-39-darwin.so',
   'EXTENSION'),
  ('lib-dynload/_statistics.cpython-39-darwin.so',
   '/Users/lucasaimaretti/opt/anaconda3/lib/python3.9/lib-dynload/_statistics.cpython-39-darwin.so',
   'EXTENSION'),
  ('lib-dynload/_contextvars.cpython-39-darwin.so',
   '/Users/lucasaimaretti/opt/anaconda3/lib/python3.9/lib-dynload/_contextvars.cpython-39-darwin.so',
   'EXTENSION'),
  ('lib-dynload/_decimal.cpython-39-darwin.so',
   '/Users/lucasaimaretti/opt/anaconda3/lib/python3.9/lib-dynload/_decimal.cpython-39-darwin.so',
   'EXTENSION'),
  ('lib-dynload/_pickle.cpython-39-darwin.so',
   '/Users/lucasaimaretti/opt/anaconda3/lib/python3.9/lib-dynload/_pickle.cpython-39-darwin.so',
   'EXTENSION'),
  ('lib-dynload/_struct.cpython-39-darwin.so',
   '/Users/lucasaimaretti/opt/anaconda3/lib/python3.9/lib-dynload/_struct.cpython-39-darwin.so',
   'EXTENSION'),
  ('lib-dynload/_hashlib.cpython-39-darwin.so',
   '/Users/lucasaimaretti/opt/anaconda3/lib/python3.9/lib-dynload/_hashlib.cpython-39-darwin.so',
   'EXTENSION'),
  ('lib-dynload/_sha3.cpython-39-darwin.so',
   '/Users/lucasaimaretti/opt/anaconda3/lib/python3.9/lib-dynload/_sha3.cpython-39-darwin.so',
   'EXTENSION'),
  ('lib-dynload/_blake2.cpython-39-darwin.so',
   '/Users/lucasaimaretti/opt/anaconda3/lib/python3.9/lib-dynload/_blake2.cpython-39-darwin.so',
   'EXTENSION'),
  ('lib-dynload/_sha256.cpython-39-darwin.so',
   '/Users/lucasaimaretti/opt/anaconda3/lib/python3.9/lib-dynload/_sha256.cpython-39-darwin.so',
   'EXTENSION'),
  ('lib-dynload/_md5.cpython-39-darwin.so',
   '/Users/lucasaimaretti/opt/anaconda3/lib/python3.9/lib-dynload/_md5.cpython-39-darwin.so',
   'EXTENSION'),
  ('lib-dynload/_sha1.cpython-39-darwin.so',
   '/Users/lucasaimaretti/opt/anaconda3/lib/python3.9/lib-dynload/_sha1.cpython-39-darwin.so',
   'EXTENSION'),
  ('lib-dynload/_sha512.cpython-39-darwin.so',
   '/Users/lucasaimaretti/opt/anaconda3/lib/python3.9/lib-dynload/_sha512.cpython-39-darwin.so',
   'EXTENSION'),
  ('lib-dynload/_random.cpython-39-darwin.so',
   '/Users/lucasaimaretti/opt/anaconda3/lib/python3.9/lib-dynload/_random.cpython-39-darwin.so',
   'EXTENSION'),
  ('lib-dynload/_bisect.cpython-39-darwin.so',
   '/Users/lucasaimaretti/opt/anaconda3/lib/python3.9/lib-dynload/_bisect.cpython-39-darwin.so',
   'EXTENSION'),
  ('lib-dynload/math.cpython-39-darwin.so',
   '/Users/lucasaimaretti/opt/anaconda3/lib/python3.9/lib-dynload/math.cpython-39-darwin.so',
   'EXTENSION'),
  ('lib-dynload/resource.cpython-39-darwin.so',
   '/Users/lucasaimaretti/opt/anaconda3/lib/python3.9/lib-dynload/resource.cpython-39-darwin.so',
   'EXTENSION'),
  ('lib-dynload/grp.cpython-39-darwin.so',
   '/Users/lucasaimaretti/opt/anaconda3/lib/python3.9/lib-dynload/grp.cpython-39-darwin.so',
   'EXTENSION'),
  ('lib-dynload/_lzma.cpython-39-darwin.so',
   '/Users/lucasaimaretti/opt/anaconda3/lib/python3.9/lib-dynload/_lzma.cpython-39-darwin.so',
   'EXTENSION'),
  ('lib-dynload/_bz2.cpython-39-darwin.so',
   '/Users/lucasaimaretti/opt/anaconda3/lib/python3.9/lib-dynload/_bz2.cpython-39-darwin.so',
   'EXTENSION'),
  ('lib-dynload/zlib.cpython-39-darwin.so',
   '/Users/lucasaimaretti/opt/anaconda3/lib/python3.9/lib-dynload/zlib.cpython-39-darwin.so',
   'EXTENSION'),
  ('lib-dynload/binascii.cpython-39-darwin.so',
   '/Users/lucasaimaretti/opt/anaconda3/lib/python3.9/lib-dynload/binascii.cpython-39-darwin.so',
   'EXTENSION'),
  ('lib-dynload/array.cpython-39-darwin.so',
   '/Users/lucasaimaretti/opt/anaconda3/lib/python3.9/lib-dynload/array.cpython-39-darwin.so',
   'EXTENSION'),
  ('lib-dynload/select.cpython-39-darwin.so',
   '/Users/lucasaimaretti/opt/anaconda3/lib/python3.9/lib-dynload/select.cpython-39-darwin.so',
   'EXTENSION'),
  ('lib-dynload/_socket.cpython-39-darwin.so',
   '/Users/lucasaimaretti/opt/anaconda3/lib/python3.9/lib-dynload/_socket.cpython-39-darwin.so',
   'EXTENSION'),
  ('lib-dynload/_csv.cpython-39-darwin.so',
   '/Users/lucasaimaretti/opt/anaconda3/lib/python3.9/lib-dynload/_csv.cpython-39-darwin.so',
   'EXTENSION'),
  ('lib-dynload/_opcode.cpython-39-darwin.so',
   '/Users/lucasaimaretti/opt/anaconda3/lib/python3.9/lib-dynload/_opcode.cpython-39-darwin.so',
   'EXTENSION'),
  ('lib-dynload/fcntl.cpython-39-darwin.so',
   '/Users/lucasaimaretti/opt/anaconda3/lib/python3.9/lib-dynload/fcntl.cpython-39-darwin.so',
   'EXTENSION'),
  ('lib-dynload/termios.cpython-39-darwin.so',
   '/Users/lucasaimaretti/opt/anaconda3/lib/python3.9/lib-dynload/termios.cpython-39-darwin.so',
   'EXTENSION'),
  ('lib-dynload/readline.cpython-39-darwin.so',
   '/Users/lucasaimaretti/opt/anaconda3/lib/python3.9/lib-dynload/readline.cpython-39-darwin.so',
   'EXTENSION'),
  ('lib-dynload/_ssl.cpython-39-darwin.so',
   '/Users/lucasaimaretti/opt/anaconda3/lib/python3.9/lib-dynload/_ssl.cpython-39-darwin.so',
   'EXTENSION'),
  ('lib-dynload/_queue.cpython-39-darwin.so',
   '/Users/lucasaimaretti/opt/anaconda3/lib/python3.9/lib-dynload/_queue.cpython-39-darwin.so',
   'EXTENSION'),
  ('lib-dynload/mmap.cpython-39-darwin.so',
   '/Users/lucasaimaretti/opt/anaconda3/lib/python3.9/lib-dynload/mmap.cpython-39-darwin.so',
   'EXTENSION'),
  ('lib-dynload/_posixshmem.cpython-39-darwin.so',
   '/Users/lucasaimaretti/opt/anaconda3/lib/python3.9/lib-dynload/_posixshmem.cpython-39-darwin.so',
   'EXTENSION'),
  ('lib-dynload/_asyncio.cpython-39-darwin.so',
   '/Users/lucasaimaretti/opt/anaconda3/lib/python3.9/lib-dynload/_asyncio.cpython-39-darwin.so',
   'EXTENSION'),
  ('lib-dynload/unicodedata.cpython-39-darwin.so',
   '/Users/lucasaimaretti/opt/anaconda3/lib/python3.9/lib-dynload/unicodedata.cpython-39-darwin.so',
   'EXTENSION'),
  ('markupsafe/_speedups.cpython-39-darwin.so',
   '/Users/lucasaimaretti/opt/anaconda3/lib/python3.9/site-packages/markupsafe/_speedups.cpython-39-darwin.so',
   'EXTENSION'),
  ('lib-dynload/_json.cpython-39-darwin.so',
   '/Users/lucasaimaretti/opt/anaconda3/lib/python3.9/lib-dynload/_json.cpython-39-darwin.so',
   'EXTENSION'),
  ('lib-dynload/_ctypes.cpython-39-darwin.so',
   '/Users/lucasaimaretti/opt/anaconda3/lib/python3.9/lib-dynload/_ctypes.cpython-39-darwin.so',
   'EXTENSION'),
  ('lib-dynload/_uuid.cpython-39-darwin.so',
   '/Users/lucasaimaretti/opt/anaconda3/lib/python3.9/lib-dynload/_uuid.cpython-39-darwin.so',
   'EXTENSION'),
  ('PIL/_imagingft.cpython-39-darwin.so',
   '/Users/lucasaimaretti/opt/anaconda3/lib/python3.9/site-packages/PIL/_imagingft.cpython-39-darwin.so',
   'EXTENSION'),
  ('PIL/_webp.cpython-39-darwin.so',
   '/Users/lucasaimaretti/opt/anaconda3/lib/python3.9/site-packages/PIL/_webp.cpython-39-darwin.so',
   'EXTENSION'),
  ('PIL/_imagingtk.cpython-39-darwin.so',
   '/Users/lucasaimaretti/opt/anaconda3/lib/python3.9/site-packages/PIL/_imagingtk.cpython-39-darwin.so',
   'EXTENSION'),
  ('mkl/_py_mkl_service.cpython-39-darwin.so',
   '/Users/lucasaimaretti/opt/anaconda3/lib/python3.9/site-packages/mkl/_py_mkl_service.cpython-39-darwin.so',
   'EXTENSION'),
  ('mkl/_mklinit.cpython-39-darwin.so',
   '/Users/lucasaimaretti/opt/anaconda3/lib/python3.9/site-packages/mkl/_mklinit.cpython-39-darwin.so',
   'EXTENSION'),
  ('numpy/core/_multiarray_tests.cpython-39-darwin.so',
   '/Users/lucasaimaretti/opt/anaconda3/lib/python3.9/site-packages/numpy/core/_multiarray_tests.cpython-39-darwin.so',
   'EXTENSION'),
  ('lib-dynload/_elementtree.cpython-39-darwin.so',
   '/Users/lucasaimaretti/opt/anaconda3/lib/python3.9/lib-dynload/_elementtree.cpython-39-darwin.so',
   'EXTENSION'),
  ('lib-dynload/pyexpat.cpython-39-darwin.so',
   '/Users/lucasaimaretti/opt/anaconda3/lib/python3.9/lib-dynload/pyexpat.cpython-39-darwin.so',
   'EXTENSION'),
  ('psutil/_psutil_osx.cpython-39-darwin.so',
   '/Users/lucasaimaretti/opt/anaconda3/lib/python3.9/site-packages/psutil/_psutil_osx.cpython-39-darwin.so',
   'EXTENSION'),
  ('psutil/_psutil_posix.cpython-39-darwin.so',
   '/Users/lucasaimaretti/opt/anaconda3/lib/python3.9/site-packages/psutil/_psutil_posix.cpython-39-darwin.so',
   'EXTENSION'),
  ('lib-dynload/_curses.cpython-39-darwin.so',
   '/Users/lucasaimaretti/opt/anaconda3/lib/python3.9/lib-dynload/_curses.cpython-39-darwin.so',
   'EXTENSION'),
  ('numpy/core/_multiarray_umath.cpython-39-darwin.so',
   '/Users/lucasaimaretti/opt/anaconda3/lib/python3.9/site-packages/numpy/core/_multiarray_umath.cpython-39-darwin.so',
   'EXTENSION'),
  ('numpy/linalg/lapack_lite.cpython-39-darwin.so',
   '/Users/lucasaimaretti/opt/anaconda3/lib/python3.9/site-packages/numpy/linalg/lapack_lite.cpython-39-darwin.so',
   'EXTENSION'),
  ('numpy/random/mtrand.cpython-39-darwin.so',
   '/Users/lucasaimaretti/opt/anaconda3/lib/python3.9/site-packages/numpy/random/mtrand.cpython-39-darwin.so',
   'EXTENSION'),
  ('numpy/random/_sfc64.cpython-39-darwin.so',
   '/Users/lucasaimaretti/opt/anaconda3/lib/python3.9/site-packages/numpy/random/_sfc64.cpython-39-darwin.so',
   'EXTENSION'),
  ('numpy/random/_philox.cpython-39-darwin.so',
   '/Users/lucasaimaretti/opt/anaconda3/lib/python3.9/site-packages/numpy/random/_philox.cpython-39-darwin.so',
   'EXTENSION'),
  ('numpy/random/_pcg64.cpython-39-darwin.so',
   '/Users/lucasaimaretti/opt/anaconda3/lib/python3.9/site-packages/numpy/random/_pcg64.cpython-39-darwin.so',
   'EXTENSION'),
  ('numpy/random/_mt19937.cpython-39-darwin.so',
   '/Users/lucasaimaretti/opt/anaconda3/lib/python3.9/site-packages/numpy/random/_mt19937.cpython-39-darwin.so',
   'EXTENSION'),
  ('numpy/random/bit_generator.cpython-39-darwin.so',
   '/Users/lucasaimaretti/opt/anaconda3/lib/python3.9/site-packages/numpy/random/bit_generator.cpython-39-darwin.so',
   'EXTENSION'),
  ('numpy/random/_generator.cpython-39-darwin.so',
   '/Users/lucasaimaretti/opt/anaconda3/lib/python3.9/site-packages/numpy/random/_generator.cpython-39-darwin.so',
   'EXTENSION'),
  ('numpy/random/_bounded_integers.cpython-39-darwin.so',
   '/Users/lucasaimaretti/opt/anaconda3/lib/python3.9/site-packages/numpy/random/_bounded_integers.cpython-39-darwin.so',
   'EXTENSION'),
  ('numpy/random/_common.cpython-39-darwin.so',
   '/Users/lucasaimaretti/opt/anaconda3/lib/python3.9/site-packages/numpy/random/_common.cpython-39-darwin.so',
   'EXTENSION'),
  ('numpy/fft/_pocketfft_internal.cpython-39-darwin.so',
   '/Users/lucasaimaretti/opt/anaconda3/lib/python3.9/site-packages/numpy/fft/_pocketfft_internal.cpython-39-darwin.so',
   'EXTENSION'),
  ('numpy/linalg/_umath_linalg.cpython-39-darwin.so',
   '/Users/lucasaimaretti/opt/anaconda3/lib/python3.9/site-packages/numpy/linalg/_umath_linalg.cpython-39-darwin.so',
   'EXTENSION'),
  ('_cffi_backend.cpython-39-darwin.so',
   '/Users/lucasaimaretti/opt/anaconda3/lib/python3.9/site-packages/_cffi_backend.cpython-39-darwin.so',
   'EXTENSION'),
  ('PIL/_imaging.cpython-39-darwin.so',
   '/Users/lucasaimaretti/opt/anaconda3/lib/python3.9/site-packages/PIL/_imaging.cpython-39-darwin.so',
   'EXTENSION'),
  ('lib-dynload/syslog.cpython-39-darwin.so',
   '/Users/lucasaimaretti/opt/anaconda3/lib/python3.9/lib-dynload/syslog.cpython-39-darwin.so',
   'EXTENSION'),
  ('lib-dynload/_multiprocessing.cpython-39-darwin.so',
   '/Users/lucasaimaretti/opt/anaconda3/lib/python3.9/lib-dynload/_multiprocessing.cpython-39-darwin.so',
   'EXTENSION'),
  ('lib-dynload/_posixsubprocess.cpython-39-darwin.so',
   '/Users/lucasaimaretti/opt/anaconda3/lib/python3.9/lib-dynload/_posixsubprocess.cpython-39-darwin.so',
   'EXTENSION'),
  ('lib-dynload/_multibytecodec.cpython-39-darwin.so',
   '/Users/lucasaimaretti/opt/anaconda3/lib/python3.9/lib-dynload/_multibytecodec.cpython-39-darwin.so',
   'EXTENSION'),
  ('lib-dynload/_codecs_jp.cpython-39-darwin.so',
   '/Users/lucasaimaretti/opt/anaconda3/lib/python3.9/lib-dynload/_codecs_jp.cpython-39-darwin.so',
   'EXTENSION'),
  ('lib-dynload/_codecs_kr.cpython-39-darwin.so',
   '/Users/lucasaimaretti/opt/anaconda3/lib/python3.9/lib-dynload/_codecs_kr.cpython-39-darwin.so',
   'EXTENSION'),
  ('lib-dynload/_codecs_iso2022.cpython-39-darwin.so',
   '/Users/lucasaimaretti/opt/anaconda3/lib/python3.9/lib-dynload/_codecs_iso2022.cpython-39-darwin.so',
   'EXTENSION'),
  ('lib-dynload/_codecs_cn.cpython-39-darwin.so',
   '/Users/lucasaimaretti/opt/anaconda3/lib/python3.9/lib-dynload/_codecs_cn.cpython-39-darwin.so',
   'EXTENSION'),
  ('lib-dynload/_codecs_tw.cpython-39-darwin.so',
   '/Users/lucasaimaretti/opt/anaconda3/lib/python3.9/lib-dynload/_codecs_tw.cpython-39-darwin.so',
   'EXTENSION'),
  ('lib-dynload/_codecs_hk.cpython-39-darwin.so',
   '/Users/lucasaimaretti/opt/anaconda3/lib/python3.9/lib-dynload/_codecs_hk.cpython-39-darwin.so',
   'EXTENSION'),
  ('lib-dynload/_heapq.cpython-39-darwin.so',
   '/Users/lucasaimaretti/opt/anaconda3/lib/python3.9/lib-dynload/_heapq.cpython-39-darwin.so',
   'EXTENSION'),
  ('lib-dynload/_scproxy.cpython-39-darwin.so',
   '/Users/lucasaimaretti/opt/anaconda3/lib/python3.9/lib-dynload/_scproxy.cpython-39-darwin.so',
   'EXTENSION'),
  ('lxml/etree.cpython-39-darwin.so',
   '/Users/lucasaimaretti/opt/anaconda3/lib/python3.9/site-packages/lxml/etree.cpython-39-darwin.so',
   'EXTENSION'),
  ('lxml/_elementpath.cpython-39-darwin.so',
   '/Users/lucasaimaretti/opt/anaconda3/lib/python3.9/site-packages/lxml/_elementpath.cpython-39-darwin.so',
   'EXTENSION'),
  ('lxml/sax.cpython-39-darwin.so',
   '/Users/lucasaimaretti/opt/anaconda3/lib/python3.9/site-packages/lxml/sax.cpython-39-darwin.so',
   'EXTENSION'),
  ('lxml/objectify.cpython-39-darwin.so',
   '/Users/lucasaimaretti/opt/anaconda3/lib/python3.9/site-packages/lxml/objectify.cpython-39-darwin.so',
   'EXTENSION'),
  ('lxml/html/diff.cpython-39-darwin.so',
   '/Users/lucasaimaretti/opt/anaconda3/lib/python3.9/site-packages/lxml/html/diff.cpython-39-darwin.so',
   'EXTENSION'),
  ('lxml/html/clean.cpython-39-darwin.so',
   '/Users/lucasaimaretti/opt/anaconda3/lib/python3.9/site-packages/lxml/html/clean.cpython-39-darwin.so',
   'EXTENSION'),
  ('lxml/builder.cpython-39-darwin.so',
   '/Users/lucasaimaretti/opt/anaconda3/lib/python3.9/site-packages/lxml/builder.cpython-39-darwin.so',
   'EXTENSION'),
  ('brotli/_brotli.abi3.so',
   '/Users/lucasaimaretti/opt/anaconda3/lib/python3.9/site-packages/brotli/_brotli.abi3.so',
   'EXTENSION'),
  ('cryptography/hazmat/bindings/_openssl.abi3.so',
   '/Users/lucasaimaretti/opt/anaconda3/lib/python3.9/site-packages/cryptography/hazmat/bindings/_openssl.abi3.so',
   'EXTENSION'),
  ('bcrypt/_bcrypt.abi3.so',
   '/Users/lucasaimaretti/opt/anaconda3/lib/python3.9/site-packages/bcrypt/_bcrypt.abi3.so',
   'EXTENSION'),
  ('libcrypto.1.1.dylib',
   '/Users/lucasaimaretti/opt/anaconda3/lib/libcrypto.1.1.dylib',
   'BINARY'),
  ('liblzma.5.dylib',
   '/Users/lucasaimaretti/opt/anaconda3/lib/liblzma.5.dylib',
   'BINARY'),
  ('libz.1.dylib',
   '/Users/lucasaimaretti/opt/anaconda3/lib/libz.1.dylib',
   'BINARY'),
  ('libreadline.8.dylib',
   '/Users/lucasaimaretti/opt/anaconda3/lib/libreadline.8.dylib',
   'BINARY'),
  ('libssl.1.1.dylib',
   '/Users/lucasaimaretti/opt/anaconda3/lib/libssl.1.1.dylib',
   'BINARY'),
  ('libffi.7.dylib',
   '/Users/lucasaimaretti/opt/anaconda3/lib/libffi.7.dylib',
   'BINARY'),
  ('libfreetype.6.dylib',
   '/Users/lucasaimaretti/opt/anaconda3/lib/libfreetype.6.dylib',
   'BINARY'),
  ('libwebpdemux.2.dylib',
   '/Users/lucasaimaretti/opt/anaconda3/lib/libwebpdemux.2.dylib',
   'BINARY'),
  ('libwebp.7.dylib',
   '/Users/lucasaimaretti/opt/anaconda3/lib/libwebp.7.dylib',
   'BINARY'),
  ('libwebpmux.3.dylib',
   '/Users/lucasaimaretti/opt/anaconda3/lib/libwebpmux.3.dylib',
   'BINARY'),
  ('libmkl_rt.1.dylib',
   '/Users/lucasaimaretti/opt/anaconda3/lib/libmkl_rt.1.dylib',
   'BINARY'),
  ('libncursesw.6.dylib',
   '/Users/lucasaimaretti/opt/anaconda3/lib/libncursesw.6.dylib',
   'BINARY'),
  ('libtiff.5.dylib',
   '/Users/lucasaimaretti/opt/anaconda3/lib/libtiff.5.dylib',
   'BINARY'),
  ('libjpeg.9.dylib',
   '/Users/lucasaimaretti/opt/anaconda3/lib/libjpeg.9.dylib',
   'BINARY'),
  ('libexslt.0.dylib',
   '/Users/lucasaimaretti/opt/anaconda3/lib/libexslt.0.dylib',
   'BINARY'),
  ('libxml2.2.dylib',
   '/Users/lucasaimaretti/opt/anaconda3/lib/libxml2.2.dylib',
   'BINARY'),
  ('libxslt.1.dylib',
   '/Users/lucasaimaretti/opt/anaconda3/lib/libxslt.1.dylib',
   'BINARY'),
  ('libpng16.16.dylib',
   '/Users/lucasaimaretti/opt/anaconda3/lib/libpng16.16.dylib',
   'BINARY'),
  ('libtinfow.6.dylib',
   '/Users/lucasaimaretti/opt/anaconda3/lib/libtinfow.6.dylib',
   'BINARY'),
  ('libzstd.1.dylib',
   '/Users/lucasaimaretti/opt/anaconda3/lib/libzstd.1.dylib',
   'BINARY'),
  ('libiconv.2.dylib',
   '/Users/lucasaimaretti/opt/anaconda3/lib/libiconv.2.dylib',
   'BINARY'),
  ('libicuuc.58.dylib',
   '/Users/lucasaimaretti/opt/anaconda3/lib/libicuuc.58.dylib',
   'BINARY'),
  ('libc++.1.dylib',
   '/Users/lucasaimaretti/opt/anaconda3/lib/libc++.1.dylib',
   'BINARY'),
  ('libicudata.58.dylib',
   '/Users/lucasaimaretti/opt/anaconda3/lib/libicudata.58.dylib',
   'BINARY'),
  ('libpython3.9.dylib',
   '/Users/lucasaimaretti/opt/anaconda3/lib/libpython3.9.dylib',
   'BINARY'),
  ('base_library.zip',
   '/Users/lucasaimaretti/Personal/personal/build/Extract_md_audios/base_library.zip',
   'DATA'),
  ('libmkl_scalapack_ilp64.1.dylib',
   '/Users/lucasaimaretti/opt/anaconda3/lib/libmkl_scalapack_ilp64.1.dylib',
   'DATA'),
  ('docutils/parsers/rst/include/isogrk4.txt',
   '/Users/lucasaimaretti/opt/anaconda3/lib/python3.9/site-packages/docutils/parsers/rst/include/isogrk4.txt',
   'DATA'),
  ('docutils/writers/s5_html/themes/default/outline.css',
   '/Users/lucasaimaretti/opt/anaconda3/lib/python3.9/site-packages/docutils/writers/s5_html/themes/default/outline.css',
   'DATA'),
  ('lxml/isoschematron/resources/xsl/iso-schematron-xslt1/iso_dsdl_include.xsl',
   '/Users/lucasaimaretti/opt/anaconda3/lib/python3.9/site-packages/lxml/isoschematron/resources/xsl/iso-schematron-xslt1/iso_dsdl_include.xsl',
   'DATA'),
  ('docutils/writers/s5_html/themes/default/s5-core.css',
   '/Users/lucasaimaretti/opt/anaconda3/lib/python3.9/site-packages/docutils/writers/s5_html/themes/default/s5-core.css',
   'DATA'),
  ('libffi.dylib',
   '/Users/lucasaimaretti/opt/anaconda3/lib/libffi.dylib',
   'DATA'),
  ('docutils/parsers/rst/include/s5defs.txt',
   '/Users/lucasaimaretti/opt/anaconda3/lib/python3.9/site-packages/docutils/parsers/rst/include/s5defs.txt',
   'DATA'),
  ('libmkl_avx512.1.dylib',
   '/Users/lucasaimaretti/opt/anaconda3/lib/libmkl_avx512.1.dylib',
   'DATA'),
  ('liblzma.dylib',
   '/Users/lucasaimaretti/opt/anaconda3/lib/liblzma.dylib',
   'DATA'),
  ('libmkl_blacs_mpich_ilp64.1.dylib',
   '/Users/lucasaimaretti/opt/anaconda3/lib/libmkl_blacs_mpich_ilp64.1.dylib',
   'DATA'),
  ('libmkl_cdft_core.dylib',
   '/Users/lucasaimaretti/opt/anaconda3/lib/libmkl_cdft_core.dylib',
   'DATA'),
  ('docutils/parsers/rst/include/isoamsn.txt',
   '/Users/lucasaimaretti/opt/anaconda3/lib/python3.9/site-packages/docutils/parsers/rst/include/isoamsn.txt',
   'DATA'),
  ('docutils/writers/s5_html/themes/big-white/framing.css',
   '/Users/lucasaimaretti/opt/anaconda3/lib/python3.9/site-packages/docutils/writers/s5_html/themes/big-white/framing.css',
   'DATA'),
  ('libmkl_tbb_thread.1.dylib',
   '/Users/lucasaimaretti/opt/anaconda3/lib/libmkl_tbb_thread.1.dylib',
   'DATA'),
  ('importlib_metadata-4.11.3.dist-info/RECORD',
   '/Users/lucasaimaretti/opt/anaconda3/lib/python3.9/site-packages/importlib_metadata-4.11.3.dist-info/RECORD',
   'DATA'),
  ('docutils/parsers/rst/include/isolat1.txt',
   '/Users/lucasaimaretti/opt/anaconda3/lib/python3.9/site-packages/docutils/parsers/rst/include/isolat1.txt',
   'DATA'),
  ('docutils/parsers/rst/include/isomopf-wide.txt',
   '/Users/lucasaimaretti/opt/anaconda3/lib/python3.9/site-packages/docutils/parsers/rst/include/isomopf-wide.txt',
   'DATA'),
  ('libpanel.6.dylib',
   '/Users/lucasaimaretti/opt/anaconda3/lib/libpanel.6.dylib',
   'DATA'),
  ('libpanelw.dylib',
   '/Users/lucasaimaretti/opt/anaconda3/lib/libpanelw.dylib',
   'DATA'),
  ('cryptography-3.4.8.dist-info/INSTALLER',
   '/Users/lucasaimaretti/opt/anaconda3/lib/python3.9/site-packages/cryptography-3.4.8.dist-info/INSTALLER',
   'DATA'),
  ('docutils/writers/latex2e/titlingpage.tex',
   '/Users/lucasaimaretti/opt/anaconda3/lib/python3.9/site-packages/docutils/writers/latex2e/titlingpage.tex',
   'DATA'),
  ('docutils/parsers/rst/include/isomfrk-wide.txt',
   '/Users/lucasaimaretti/opt/anaconda3/lib/python3.9/site-packages/docutils/parsers/rst/include/isomfrk-wide.txt',
   'DATA'),
  ('certifi/cacert.pem',
   '/Users/lucasaimaretti/opt/anaconda3/lib/python3.9/site-packages/certifi/cacert.pem',
   'DATA'),
  ('docutils/parsers/rst/include/mmlextra.txt',
   '/Users/lucasaimaretti/opt/anaconda3/lib/python3.9/site-packages/docutils/parsers/rst/include/mmlextra.txt',
   'DATA'),
  ('libmkl_blacs_mpich_lp64.1.dylib',
   '/Users/lucasaimaretti/opt/anaconda3/lib/libmkl_blacs_mpich_lp64.1.dylib',
   'DATA'),
  ('docutils/parsers/rst/include/isogrk4-wide.txt',
   '/Users/lucasaimaretti/opt/anaconda3/lib/python3.9/site-packages/docutils/parsers/rst/include/isogrk4-wide.txt',
   'DATA'),
  ('docutils/parsers/rst/include/isogrk2.txt',
   '/Users/lucasaimaretti/opt/anaconda3/lib/python3.9/site-packages/docutils/parsers/rst/include/isogrk2.txt',
   'DATA'),
  ('docutils/parsers/rst/include/isolat2.txt',
   '/Users/lucasaimaretti/opt/anaconda3/lib/python3.9/site-packages/docutils/parsers/rst/include/isolat2.txt',
   'DATA'),
  ('docutils/writers/latex2e/xelatex.tex',
   '/Users/lucasaimaretti/opt/anaconda3/lib/python3.9/site-packages/docutils/writers/latex2e/xelatex.tex',
   'DATA'),
  ('importlib_metadata-4.11.3.dist-info/METADATA',
   '/Users/lucasaimaretti/opt/anaconda3/lib/python3.9/site-packages/importlib_metadata-4.11.3.dist-info/METADATA',
   'DATA'),
  ('docutils/writers/html5_polyglot/math.css',
   '/Users/lucasaimaretti/opt/anaconda3/lib/python3.9/site-packages/docutils/writers/html5_polyglot/math.css',
   'DATA'),
  ('docutils/parsers/rst/include/mmlextra-wide.txt',
   '/Users/lucasaimaretti/opt/anaconda3/lib/python3.9/site-packages/docutils/parsers/rst/include/mmlextra-wide.txt',
   'DATA'),
  ('docutils/writers/html5_polyglot/tuftig.css',
   '/Users/lucasaimaretti/opt/anaconda3/lib/python3.9/site-packages/docutils/writers/html5_polyglot/tuftig.css',
   'DATA'),
  ('libmkl_core.dylib',
   '/Users/lucasaimaretti/opt/anaconda3/lib/libmkl_core.dylib',
   'DATA'),
  ('cryptography-3.4.8.dist-info/RECORD',
   '/Users/lucasaimaretti/opt/anaconda3/lib/python3.9/site-packages/cryptography-3.4.8.dist-info/RECORD',
   'DATA'),
  ('libmkl_scalapack_lp64.1.dylib',
   '/Users/lucasaimaretti/opt/anaconda3/lib/libmkl_scalapack_lp64.1.dylib',
   'DATA'),
  ('libmkl_intel_ilp64.dylib',
   '/Users/lucasaimaretti/opt/anaconda3/lib/libmkl_intel_ilp64.dylib',
   'DATA'),
  ('libreadline.8.1.dylib',
   '/Users/lucasaimaretti/opt/anaconda3/lib/libreadline.8.1.dylib',
   'DATA'),
  ('libmkl_vml_mc3.1.dylib',
   '/Users/lucasaimaretti/opt/anaconda3/lib/libmkl_vml_mc3.1.dylib',
   'DATA'),
  ('importlib_metadata-4.11.3.dist-info/INSTALLER',
   '/Users/lucasaimaretti/opt/anaconda3/lib/python3.9/site-packages/importlib_metadata-4.11.3.dist-info/INSTALLER',
   'DATA'),
  ('docutils/parsers/rst/include/isoamso.txt',
   '/Users/lucasaimaretti/opt/anaconda3/lib/python3.9/site-packages/docutils/parsers/rst/include/isoamso.txt',
   'DATA'),
  ('libmenu.6.dylib',
   '/Users/lucasaimaretti/opt/anaconda3/lib/libmenu.6.dylib',
   'DATA'),
  ('docutils/writers/s5_html/themes/default/blank.gif',
   '/Users/lucasaimaretti/opt/anaconda3/lib/python3.9/site-packages/docutils/writers/s5_html/themes/default/blank.gif',
   'DATA'),
  ('lxml/isoschematron/resources/xsl/iso-schematron-xslt1/iso_schematron_message.xsl',
   '/Users/lucasaimaretti/opt/anaconda3/lib/python3.9/site-packages/lxml/isoschematron/resources/xsl/iso-schematron-xslt1/iso_schematron_message.xsl',
   'DATA'),
  ('docutils/parsers/rst/include/isoamsb.txt',
   '/Users/lucasaimaretti/opt/anaconda3/lib/python3.9/site-packages/docutils/parsers/rst/include/isoamsb.txt',
   'DATA'),
  ('libmkl_core.1.dylib',
   '/Users/lucasaimaretti/opt/anaconda3/lib/libmkl_core.1.dylib',
   'DATA'),
  ('lxml/isoschematron/resources/xsl/iso-schematron-xslt1/iso_schematron_skeleton_for_xslt1.xsl',
   '/Users/lucasaimaretti/opt/anaconda3/lib/python3.9/site-packages/lxml/isoschematron/resources/xsl/iso-schematron-xslt1/iso_schematron_skeleton_for_xslt1.xsl',
   'DATA'),
  ('docutils/writers/html5_polyglot/plain.css',
   '/Users/lucasaimaretti/opt/anaconda3/lib/python3.9/site-packages/docutils/writers/html5_polyglot/plain.css',
   'DATA'),
  ('libpanel.dylib',
   '/Users/lucasaimaretti/opt/anaconda3/lib/libpanel.dylib',
   'DATA'),
  ('libmkl_rt.dylib',
   '/Users/lucasaimaretti/opt/anaconda3/lib/libmkl_rt.dylib',
   'DATA'),
  ('docutils/writers/s5_html/themes/medium-black/__base__',
   '/Users/lucasaimaretti/opt/anaconda3/lib/python3.9/site-packages/docutils/writers/s5_html/themes/medium-black/__base__',
   'DATA'),
  ('docutils/writers/html5_polyglot/minimal.css',
   '/Users/lucasaimaretti/opt/anaconda3/lib/python3.9/site-packages/docutils/writers/html5_polyglot/minimal.css',
   'DATA'),
  ('libmkl_mc3.1.dylib',
   '/Users/lucasaimaretti/opt/anaconda3/lib/libmkl_mc3.1.dylib',
   'DATA'),
  ('libncursesw.dylib',
   '/Users/lucasaimaretti/opt/anaconda3/lib/libncursesw.dylib',
   'DATA'),
  ('libmkl_avx.1.dylib',
   '/Users/lucasaimaretti/opt/anaconda3/lib/libmkl_avx.1.dylib',
   'DATA'),
  ('cryptography-3.4.8.dist-info/METADATA',
   '/Users/lucasaimaretti/opt/anaconda3/lib/python3.9/site-packages/cryptography-3.4.8.dist-info/METADATA',
   'DATA'),
  ('libc++.dylib',
   '/Users/lucasaimaretti/opt/anaconda3/lib/libc++.dylib',
   'DATA'),
  ('libform.6.dylib',
   '/Users/lucasaimaretti/opt/anaconda3/lib/libform.6.dylib',
   'DATA'),
  ('docutils/writers/s5_html/themes/default/framing.css',
   '/Users/lucasaimaretti/opt/anaconda3/lib/python3.9/site-packages/docutils/writers/s5_html/themes/default/framing.css',
   'DATA'),
  ('docutils/writers/s5_html/themes/medium-white/framing.css',
   '/Users/lucasaimaretti/opt/anaconda3/lib/python3.9/site-packages/docutils/writers/s5_html/themes/medium-white/framing.css',
   'DATA'),
  ('lxml/isoschematron/resources/xsl/XSD2Schtrn.xsl',
   '/Users/lucasaimaretti/opt/anaconda3/lib/python3.9/site-packages/lxml/isoschematron/resources/xsl/XSD2Schtrn.xsl',
   'DATA'),
  ('docutils/parsers/rst/include/mmlalias.txt',
   '/Users/lucasaimaretti/opt/anaconda3/lib/python3.9/site-packages/docutils/parsers/rst/include/mmlalias.txt',
   'DATA'),
  ('libssl.dylib',
   '/Users/lucasaimaretti/opt/anaconda3/lib/libssl.dylib',
   'DATA'),
  ('docutils/writers/s5_html/themes/small-white/framing.css',
   '/Users/lucasaimaretti/opt/anaconda3/lib/python3.9/site-packages/docutils/writers/s5_html/themes/small-white/framing.css',
   'DATA'),
  ('docutils/writers/s5_html/themes/big-black/__base__',
   '/Users/lucasaimaretti/opt/anaconda3/lib/python3.9/site-packages/docutils/writers/s5_html/themes/big-black/__base__',
   'DATA'),
  ('libmkl_blacs_mpich_ilp64.dylib',
   '/Users/lucasaimaretti/opt/anaconda3/lib/libmkl_blacs_mpich_ilp64.dylib',
   'DATA'),
  ('libmkl_tbb_thread.dylib',
   '/Users/lucasaimaretti/opt/anaconda3/lib/libmkl_tbb_thread.dylib',
   'DATA'),
  ('docutils/parsers/rst/include/isodia.txt',
   '/Users/lucasaimaretti/opt/anaconda3/lib/python3.9/site-packages/docutils/parsers/rst/include/isodia.txt',
   'DATA'),
  ('docutils/writers/s5_html/themes/default/pretty.css',
   '/Users/lucasaimaretti/opt/anaconda3/lib/python3.9/site-packages/docutils/writers/s5_html/themes/default/pretty.css',
   'DATA'),
  ('libtk8.6.dylib',
   '/Users/lucasaimaretti/opt/anaconda3/lib/libtk8.6.dylib',
   'DATA'),
  ('libsqlite3.0.dylib',
   '/Users/lucasaimaretti/opt/anaconda3/lib/libsqlite3.0.dylib',
   'DATA'),
  ('docutils/parsers/rst/include/isoamsc.txt',
   '/Users/lucasaimaretti/opt/anaconda3/lib/python3.9/site-packages/docutils/parsers/rst/include/isoamsc.txt',
   'DATA'),
  ('libmkl_intel_thread.dylib',
   '/Users/lucasaimaretti/opt/anaconda3/lib/libmkl_intel_thread.dylib',
   'DATA'),
  ('docutils/writers/odf_odt/styles.odt',
   '/Users/lucasaimaretti/opt/anaconda3/lib/python3.9/site-packages/docutils/writers/odf_odt/styles.odt',
   'DATA'),
  ('libhistory.8.1.dylib',
   '/Users/lucasaimaretti/opt/anaconda3/lib/libhistory.8.1.dylib',
   'DATA'),
  ('docutils/parsers/rst/include/isogrk3.txt',
   '/Users/lucasaimaretti/opt/anaconda3/lib/python3.9/site-packages/docutils/parsers/rst/include/isogrk3.txt',
   'DATA'),
  ('docutils/writers/s5_html/themes/big-black/framing.css',
   '/Users/lucasaimaretti/opt/anaconda3/lib/python3.9/site-packages/docutils/writers/s5_html/themes/big-black/framing.css',
   'DATA'),
  ('docutils/parsers/rst/include/isomfrk.txt',
   '/Users/lucasaimaretti/opt/anaconda3/lib/python3.9/site-packages/docutils/parsers/rst/include/isomfrk.txt',
   'DATA'),
  ('importlib_metadata-4.11.3.dist-info/LICENSE',
   '/Users/lucasaimaretti/opt/anaconda3/lib/python3.9/site-packages/importlib_metadata-4.11.3.dist-info/LICENSE',
   'DATA'),
  ('docutils/parsers/rst/include/xhtml1-lat1.txt',
   '/Users/lucasaimaretti/opt/anaconda3/lib/python3.9/site-packages/docutils/parsers/rst/include/xhtml1-lat1.txt',
   'DATA'),
  ('libiomp5.dylib',
   '/Users/lucasaimaretti/opt/anaconda3/lib/libiomp5.dylib',
   'DATA'),
  ('docutils/writers/s5_html/themes/big-black/pretty.css',
   '/Users/lucasaimaretti/opt/anaconda3/lib/python3.9/site-packages/docutils/writers/s5_html/themes/big-black/pretty.css',
   'DATA'),
  ('libmkl_vml_avx.1.dylib',
   '/Users/lucasaimaretti/opt/anaconda3/lib/libmkl_vml_avx.1.dylib',
   'DATA'),
  ('libmkl_vml_avx512.1.dylib',
   '/Users/lucasaimaretti/opt/anaconda3/lib/libmkl_vml_avx512.1.dylib',
   'DATA'),
  ('libmkl_intel_lp64.dylib',
   '/Users/lucasaimaretti/opt/anaconda3/lib/libmkl_intel_lp64.dylib',
   'DATA'),
  ('libreadline.dylib',
   '/Users/lucasaimaretti/opt/anaconda3/lib/libreadline.dylib',
   'DATA'),
  ('libmkl_vml_mc2.1.dylib',
   '/Users/lucasaimaretti/opt/anaconda3/lib/libmkl_vml_mc2.1.dylib',
   'DATA'),
  ('cryptography-3.4.8.dist-info/LICENSE',
   '/Users/lucasaimaretti/opt/anaconda3/lib/python3.9/site-packages/cryptography-3.4.8.dist-info/LICENSE',
   'DATA'),
  ('docutils/parsers/rst/include/isocyr1.txt',
   '/Users/lucasaimaretti/opt/anaconda3/lib/python3.9/site-packages/docutils/parsers/rst/include/isocyr1.txt',
   'DATA'),
  ('docutils/parsers/rst/include/isoamsr.txt',
   '/Users/lucasaimaretti/opt/anaconda3/lib/python3.9/site-packages/docutils/parsers/rst/include/isoamsr.txt',
   'DATA'),
  ('docutils/parsers/rst/include/isobox.txt',
   '/Users/lucasaimaretti/opt/anaconda3/lib/python3.9/site-packages/docutils/parsers/rst/include/isobox.txt',
   'DATA'),
  ('libpanelw.6.dylib',
   '/Users/lucasaimaretti/opt/anaconda3/lib/libpanelw.6.dylib',
   'DATA'),
  ('libhistory.8.dylib',
   '/Users/lucasaimaretti/opt/anaconda3/lib/libhistory.8.dylib',
   'DATA'),
  ('libformw.dylib',
   '/Users/lucasaimaretti/opt/anaconda3/lib/libformw.dylib',
   'DATA'),
  ('lxml/isoschematron/resources/rng/iso-schematron.rng',
   '/Users/lucasaimaretti/opt/anaconda3/lib/python3.9/site-packages/lxml/isoschematron/resources/rng/iso-schematron.rng',
   'DATA'),
  ('docutils/writers/html5_polyglot/responsive.css',
   '/Users/lucasaimaretti/opt/anaconda3/lib/python3.9/site-packages/docutils/writers/html5_polyglot/responsive.css',
   'DATA'),
  ('libmkl_blacs_mpich_lp64.dylib',
   '/Users/lucasaimaretti/opt/anaconda3/lib/libmkl_blacs_mpich_lp64.dylib',
   'DATA'),
  ('libiompstubs5.dylib',
   '/Users/lucasaimaretti/opt/anaconda3/lib/libiompstubs5.dylib',
   'DATA'),
  ('libhistory.dylib',
   '/Users/lucasaimaretti/opt/anaconda3/lib/libhistory.dylib',
   'DATA'),
  ('libmkl_scalapack_lp64.dylib',
   '/Users/lucasaimaretti/opt/anaconda3/lib/libmkl_scalapack_lp64.dylib',
   'DATA'),
  ('lxml/isoschematron/resources/xsl/iso-schematron-xslt1/iso_svrl_for_xslt1.xsl',
   '/Users/lucasaimaretti/opt/anaconda3/lib/python3.9/site-packages/lxml/isoschematron/resources/xsl/iso-schematron-xslt1/iso_svrl_for_xslt1.xsl',
   'DATA'),
  ('docutils/writers/s5_html/themes/default/slides.js',
   '/Users/lucasaimaretti/opt/anaconda3/lib/python3.9/site-packages/docutils/writers/s5_html/themes/default/slides.js',
   'DATA'),
  ('libtcl8.6.dylib',
   '/Users/lucasaimaretti/opt/anaconda3/lib/libtcl8.6.dylib',
   'DATA'),
  ('cryptography-3.4.8.dist-info/LICENSE.APACHE',
   '/Users/lucasaimaretti/opt/anaconda3/lib/python3.9/site-packages/cryptography-3.4.8.dist-info/LICENSE.APACHE',
   'DATA'),
  ('libmkl_intel_ilp64.1.dylib',
   '/Users/lucasaimaretti/opt/anaconda3/lib/libmkl_intel_ilp64.1.dylib',
   'DATA'),
  ('libtinfo.dylib',
   '/Users/lucasaimaretti/opt/anaconda3/lib/libtinfo.dylib',
   'DATA'),
  ('libtinfo.6.dylib',
   '/Users/lucasaimaretti/opt/anaconda3/lib/libtinfo.6.dylib',
   'DATA'),
  ('libffi.6.dylib',
   '/Users/lucasaimaretti/opt/anaconda3/lib/libffi.6.dylib',
   'DATA'),
  ('libmkl_sequential.dylib',
   '/Users/lucasaimaretti/opt/anaconda3/lib/libmkl_sequential.dylib',
   'DATA'),
  ('libmenuw.6.dylib',
   '/Users/lucasaimaretti/opt/anaconda3/lib/libmenuw.6.dylib',
   'DATA'),
  ('docutils/writers/s5_html/themes/small-black/__base__',
   '/Users/lucasaimaretti/opt/anaconda3/lib/python3.9/site-packages/docutils/writers/s5_html/themes/small-black/__base__',
   'DATA'),
  ('libmkl_intel_thread.1.dylib',
   '/Users/lucasaimaretti/opt/anaconda3/lib/libmkl_intel_thread.1.dylib',
   'DATA'),
  ('docutils/parsers/rst/include/isotech.txt',
   '/Users/lucasaimaretti/opt/anaconda3/lib/python3.9/site-packages/docutils/parsers/rst/include/isotech.txt',
   'DATA'),
  ('docutils/parsers/rst/include/isopub.txt',
   '/Users/lucasaimaretti/opt/anaconda3/lib/python3.9/site-packages/docutils/parsers/rst/include/isopub.txt',
   'DATA'),
  ('libmenu.dylib',
   '/Users/lucasaimaretti/opt/anaconda3/lib/libmenu.dylib',
   'DATA'),
  ('libformw.6.dylib',
   '/Users/lucasaimaretti/opt/anaconda3/lib/libformw.6.dylib',
   'DATA'),
  ('docutils/writers/html4css1/html4css1.css',
   '/Users/lucasaimaretti/opt/anaconda3/lib/python3.9/site-packages/docutils/writers/html4css1/html4css1.css',
   'DATA'),
  ('libcrypto.dylib',
   '/Users/lucasaimaretti/opt/anaconda3/lib/libcrypto.dylib',
   'DATA'),
  ('libmkl_intel_lp64.1.dylib',
   '/Users/lucasaimaretti/opt/anaconda3/lib/libmkl_intel_lp64.1.dylib',
   'DATA'),
  ('cryptography-3.4.8.dist-info/direct_url.json',
   '/Users/lucasaimaretti/opt/anaconda3/lib/python3.9/site-packages/cryptography-3.4.8.dist-info/direct_url.json',
   'DATA'),
  ('docutils/parsers/rst/include/isonum.txt',
   '/Users/lucasaimaretti/opt/anaconda3/lib/python3.9/site-packages/docutils/parsers/rst/include/isonum.txt',
   'DATA'),
  ('libsqlite3.dylib',
   '/Users/lucasaimaretti/opt/anaconda3/lib/libsqlite3.dylib',
   'DATA'),
  ('lxml/isoschematron/resources/xsl/iso-schematron-xslt1/readme.txt',
   '/Users/lucasaimaretti/opt/anaconda3/lib/python3.9/site-packages/lxml/isoschematron/resources/xsl/iso-schematron-xslt1/readme.txt',
   'DATA'),
  ('docutils/writers/s5_html/themes/small-black/pretty.css',
   '/Users/lucasaimaretti/opt/anaconda3/lib/python3.9/site-packages/docutils/writers/s5_html/themes/small-black/pretty.css',
   'DATA'),
  ('docutils/writers/s5_html/themes/README.txt',
   '/Users/lucasaimaretti/opt/anaconda3/lib/python3.9/site-packages/docutils/writers/s5_html/themes/README.txt',
   'DATA'),
  ('libform.dylib',
   '/Users/lucasaimaretti/opt/anaconda3/lib/libform.dylib',
   'DATA'),
  ('docutils/writers/pep_html/pep.css',
   '/Users/lucasaimaretti/opt/anaconda3/lib/python3.9/site-packages/docutils/writers/pep_html/pep.css',
   'DATA'),
  ('cryptography-3.4.8.dist-info/top_level.txt',
   '/Users/lucasaimaretti/opt/anaconda3/lib/python3.9/site-packages/cryptography-3.4.8.dist-info/top_level.txt',
   'DATA'),
  ('docutils/writers/latex2e/default.tex',
   '/Users/lucasaimaretti/opt/anaconda3/lib/python3.9/site-packages/docutils/writers/latex2e/default.tex',
   'DATA'),
  ('docutils/writers/s5_html/themes/default/opera.css',
   '/Users/lucasaimaretti/opt/anaconda3/lib/python3.9/site-packages/docutils/writers/s5_html/themes/default/opera.css',
   'DATA'),
  ('cryptography-3.4.8.dist-info/LICENSE.BSD',
   '/Users/lucasaimaretti/opt/anaconda3/lib/python3.9/site-packages/cryptography-3.4.8.dist-info/LICENSE.BSD',
   'DATA'),
  ('libmkl_sequential.1.dylib',
   '/Users/lucasaimaretti/opt/anaconda3/lib/libmkl_sequential.1.dylib',
   'DATA'),
  ('libz.dylib', '/Users/lucasaimaretti/opt/anaconda3/lib/libz.dylib', 'DATA'),
  ('docutils/writers/s5_html/themes/default/iepngfix.htc',
   '/Users/lucasaimaretti/opt/anaconda3/lib/python3.9/site-packages/docutils/writers/s5_html/themes/default/iepngfix.htc',
   'DATA'),
  ('libmkl_cdft_core.1.dylib',
   '/Users/lucasaimaretti/opt/anaconda3/lib/libmkl_cdft_core.1.dylib',
   'DATA'),
  ('docutils/parsers/rst/include/isoamsa.txt',
   '/Users/lucasaimaretti/opt/anaconda3/lib/python3.9/site-packages/docutils/parsers/rst/include/isoamsa.txt',
   'DATA'),
  ('docutils/writers/s5_html/themes/default/print.css',
   '/Users/lucasaimaretti/opt/anaconda3/lib/python3.9/site-packages/docutils/writers/s5_html/themes/default/print.css',
   'DATA'),
  ('libncurses.6.dylib',
   '/Users/lucasaimaretti/opt/anaconda3/lib/libncurses.6.dylib',
   'DATA'),
  ('cryptography-3.4.8.dist-info/LICENSE.PSF',
   '/Users/lucasaimaretti/opt/anaconda3/lib/python3.9/site-packages/cryptography-3.4.8.dist-info/LICENSE.PSF',
   'DATA'),
  ('lxml/isoschematron/resources/xsl/iso-schematron-xslt1/iso_abstract_expand.xsl',
   '/Users/lucasaimaretti/opt/anaconda3/lib/python3.9/site-packages/lxml/isoschematron/resources/xsl/iso-schematron-xslt1/iso_abstract_expand.xsl',
   'DATA'),
  ('docutils/writers/latex2e/docutils.sty',
   '/Users/lucasaimaretti/opt/anaconda3/lib/python3.9/site-packages/docutils/writers/latex2e/docutils.sty',
   'DATA'),
  ('importlib_metadata-4.11.3.dist-info/REQUESTED',
   '/Users/lucasaimaretti/opt/anaconda3/lib/python3.9/site-packages/importlib_metadata-4.11.3.dist-info/REQUESTED',
   'DATA'),
  ('docutils/parsers/rst/include/README.txt',
   '/Users/lucasaimaretti/opt/anaconda3/lib/python3.9/site-packages/docutils/parsers/rst/include/README.txt',
   'DATA'),
  ('docutils/parsers/rst/include/isomopf.txt',
   '/Users/lucasaimaretti/opt/anaconda3/lib/python3.9/site-packages/docutils/parsers/rst/include/isomopf.txt',
   'DATA'),
  ('libc++.1.0.dylib',
   '/Users/lucasaimaretti/opt/anaconda3/lib/libc++.1.0.dylib',
   'DATA'),
  ('docutils/writers/html4css1/template.txt',
   '/Users/lucasaimaretti/opt/anaconda3/lib/python3.9/site-packages/docutils/writers/html4css1/template.txt',
   'DATA'),
  ('importlib_metadata-4.11.3.dist-info/top_level.txt',
   '/Users/lucasaimaretti/opt/anaconda3/lib/python3.9/site-packages/importlib_metadata-4.11.3.dist-info/top_level.txt',
   'DATA'),
  ('libz.1.2.12.dylib',
   '/Users/lucasaimaretti/opt/anaconda3/lib/libz.1.2.12.dylib',
   'DATA'),
  ('libmenuw.dylib',
   '/Users/lucasaimaretti/opt/anaconda3/lib/libmenuw.dylib',
   'DATA'),
  ('libmkl_avx2.1.dylib',
   '/Users/lucasaimaretti/opt/anaconda3/lib/libmkl_avx2.1.dylib',
   'DATA'),
  ('importlib_metadata-4.11.3.dist-info/direct_url.json',
   '/Users/lucasaimaretti/opt/anaconda3/lib/python3.9/site-packages/importlib_metadata-4.11.3.dist-info/direct_url.json',
   'DATA'),
  ('lxml/isoschematron/resources/xsl/RNG2Schtrn.xsl',
   '/Users/lucasaimaretti/opt/anaconda3/lib/python3.9/site-packages/lxml/isoschematron/resources/xsl/RNG2Schtrn.xsl',
   'DATA'),
  ('docutils/writers/s5_html/themes/medium-white/pretty.css',
   '/Users/lucasaimaretti/opt/anaconda3/lib/python3.9/site-packages/docutils/writers/s5_html/themes/medium-white/pretty.css',
   'DATA'),
  ('docutils/parsers/rst/include/xhtml1-special.txt',
   '/Users/lucasaimaretti/opt/anaconda3/lib/python3.9/site-packages/docutils/parsers/rst/include/xhtml1-special.txt',
   'DATA'),
  ('libmkl_scalapack_ilp64.dylib',
   '/Users/lucasaimaretti/opt/anaconda3/lib/libmkl_scalapack_ilp64.dylib',
   'DATA'),
  ('docutils/parsers/rst/include/isogrk1.txt',
   '/Users/lucasaimaretti/opt/anaconda3/lib/python3.9/site-packages/docutils/parsers/rst/include/isogrk1.txt',
   'DATA'),
  ('docutils/writers/s5_html/themes/big-white/pretty.css',
   '/Users/lucasaimaretti/opt/anaconda3/lib/python3.9/site-packages/docutils/writers/s5_html/themes/big-white/pretty.css',
   'DATA'),
  ('libmkl_vml_avx2.1.dylib',
   '/Users/lucasaimaretti/opt/anaconda3/lib/libmkl_vml_avx2.1.dylib',
   'DATA'),
  ('docutils/parsers/rst/include/isocyr2.txt',
   '/Users/lucasaimaretti/opt/anaconda3/lib/python3.9/site-packages/docutils/parsers/rst/include/isocyr2.txt',
   'DATA'),
  ('libtinfow.dylib',
   '/Users/lucasaimaretti/opt/anaconda3/lib/libtinfow.dylib',
   'DATA'),
  ('docutils/writers/latex2e/titlepage.tex',
   '/Users/lucasaimaretti/opt/anaconda3/lib/python3.9/site-packages/docutils/writers/latex2e/titlepage.tex',
   'DATA'),
  ('docutils/writers/s5_html/themes/default/slides.css',
   '/Users/lucasaimaretti/opt/anaconda3/lib/python3.9/site-packages/docutils/writers/s5_html/themes/default/slides.css',
   'DATA'),
  ('cryptography-3.4.8.dist-info/REQUESTED',
   '/Users/lucasaimaretti/opt/anaconda3/lib/python3.9/site-packages/cryptography-3.4.8.dist-info/REQUESTED',
   'DATA'),
  ('docutils/writers/s5_html/themes/small-white/pretty.css',
   '/Users/lucasaimaretti/opt/anaconda3/lib/python3.9/site-packages/docutils/writers/s5_html/themes/small-white/pretty.css',
   'DATA'),
  ('libncurses.dylib',
   '/Users/lucasaimaretti/opt/anaconda3/lib/libncurses.dylib',
   'DATA'),
  ('cryptography-3.4.8.dist-info/WHEEL',
   '/Users/lucasaimaretti/opt/anaconda3/lib/python3.9/site-packages/cryptography-3.4.8.dist-info/WHEEL',
   'DATA'),
  ('importlib_metadata-4.11.3.dist-info/WHEEL',
   '/Users/lucasaimaretti/opt/anaconda3/lib/python3.9/site-packages/importlib_metadata-4.11.3.dist-info/WHEEL',
   'DATA'),
  ('docutils/parsers/rst/include/xhtml1-symbol.txt',
   '/Users/lucasaimaretti/opt/anaconda3/lib/python3.9/site-packages/docutils/parsers/rst/include/xhtml1-symbol.txt',
   'DATA'),
  ('docutils/writers/html5_polyglot/template.txt',
   '/Users/lucasaimaretti/opt/anaconda3/lib/python3.9/site-packages/docutils/writers/html5_polyglot/template.txt',
   'DATA'),
  ('docutils/parsers/rst/include/isomscr.txt',
   '/Users/lucasaimaretti/opt/anaconda3/lib/python3.9/site-packages/docutils/parsers/rst/include/isomscr.txt',
   'DATA'),
  ('docutils/parsers/rst/include/isomscr-wide.txt',
   '/Users/lucasaimaretti/opt/anaconda3/lib/python3.9/site-packages/docutils/parsers/rst/include/isomscr-wide.txt',
   'DATA'),
  ('libiomp5_db.dylib',
   '/Users/lucasaimaretti/opt/anaconda3/lib/libiomp5_db.dylib',
   'DATA'),
  ('docutils/writers/s5_html/themes/medium-black/pretty.css',
   '/Users/lucasaimaretti/opt/anaconda3/lib/python3.9/site-packages/docutils/writers/s5_html/themes/medium-black/pretty.css',
   'DATA'),
  ('docutils/writers/pep_html/template.txt',
   '/Users/lucasaimaretti/opt/anaconda3/lib/python3.9/site-packages/docutils/writers/pep_html/template.txt',
   'DATA'),
  ('wheel-0.37.1-py3.9.egg-info/top_level.txt',
   '/Users/lucasaimaretti/opt/anaconda3/lib/python3.9/site-packages/wheel-0.37.1-py3.9.egg-info/top_level.txt',
   'DATA'),
  ('setuptools-61.2.0-py3.9.egg-info/dependency_links.txt',
   '/Users/lucasaimaretti/opt/anaconda3/lib/python3.9/site-packages/setuptools-61.2.0-py3.9.egg-info/dependency_links.txt',
   'DATA'),
  ('wheel-0.37.1-py3.9.egg-info/requires.txt',
   '/Users/lucasaimaretti/opt/anaconda3/lib/python3.9/site-packages/wheel-0.37.1-py3.9.egg-info/requires.txt',
   'DATA'),
  ('wheel-0.37.1-py3.9.egg-info/SOURCES.txt',
   '/Users/lucasaimaretti/opt/anaconda3/lib/python3.9/site-packages/wheel-0.37.1-py3.9.egg-info/SOURCES.txt',
   'DATA'),
  ('wheel-0.37.1-py3.9.egg-info/PKG-INFO',
   '/Users/lucasaimaretti/opt/anaconda3/lib/python3.9/site-packages/wheel-0.37.1-py3.9.egg-info/PKG-INFO',
   'DATA'),
  ('wheel-0.37.1-py3.9.egg-info/entry_points.txt',
   '/Users/lucasaimaretti/opt/anaconda3/lib/python3.9/site-packages/wheel-0.37.1-py3.9.egg-info/entry_points.txt',
   'DATA'),
  ('wheel-0.37.1-py3.9.egg-info/dependency_links.txt',
   '/Users/lucasaimaretti/opt/anaconda3/lib/python3.9/site-packages/wheel-0.37.1-py3.9.egg-info/dependency_links.txt',
   'DATA'),
  ('setuptools-61.2.0-py3.9.egg-info/SOURCES.txt',
   '/Users/lucasaimaretti/opt/anaconda3/lib/python3.9/site-packages/setuptools-61.2.0-py3.9.egg-info/SOURCES.txt',
   'DATA'),
  ('setuptools-61.2.0-py3.9.egg-info/requires.txt',
   '/Users/lucasaimaretti/opt/anaconda3/lib/python3.9/site-packages/setuptools-61.2.0-py3.9.egg-info/requires.txt',
   'DATA'),
  ('setuptools-61.2.0-py3.9.egg-info/top_level.txt',
   '/Users/lucasaimaretti/opt/anaconda3/lib/python3.9/site-packages/setuptools-61.2.0-py3.9.egg-info/top_level.txt',
   'DATA'),
  ('setuptools-61.2.0-py3.9.egg-info/entry_points.txt',
   '/Users/lucasaimaretti/opt/anaconda3/lib/python3.9/site-packages/setuptools-61.2.0-py3.9.egg-info/entry_points.txt',
   'DATA'),
  ('setuptools-61.2.0-py3.9.egg-info/PKG-INFO',
   '/Users/lucasaimaretti/opt/anaconda3/lib/python3.9/site-packages/setuptools-61.2.0-py3.9.egg-info/PKG-INFO',
   'DATA'),
  ('wheel-0.37.1-py3.9.egg-info/not-zip-safe',
   '/Users/lucasaimaretti/opt/anaconda3/lib/python3.9/site-packages/wheel-0.37.1-py3.9.egg-info/not-zip-safe',
   'DATA')],
 False,
 False,
 False,
 [],
 'x86_64',
 None,
 None)
