<?xml version="1.0" encoding="utf-8"?>
<!-- Generator: Adobe Illustrator 16.0.0, SVG Export Plug-In . SVG Version: 6.00 Build 0)  -->
<!DOCTYPE svg PUBLIC "-//W3C//DTD SVG 1.1//EN" "http://www.w3.org/Graphics/SVG/1.1/DTD/svg11.dtd">
<svg version="1.1" id="Capa_1" xmlns="http://www.w3.org/2000/svg" xmlns:xlink="http://www.w3.org/1999/xlink" x="0px" y="0px"
	 width="520px" height="30px" viewBox="0 0 520 30" enable-background="new 0 0 520 30" xml:space="preserve">
<g>
	<g>
		<g>
			<path fill="#422917" d="M284.953,18.579c0.1-0.06,0.199-0.12,0.298-0.18c6.853,3.412,13.866,6.736,21.034,9.473
				c0.033,0.229,0.194,0.437,0.498,0.446c0.125,0.004,0.249,0.008,0.374,0.013c0.566,0.556,1.172,1.078,1.842,1.531
				c0.415,0.282,0.948-0.27,0.683-0.682c-0.098-0.15-0.199-0.296-0.299-0.446c0.07-0.071,0.1-0.184,0.005-0.26
				c-0.14-0.116-0.273-0.232-0.411-0.349c-1.871-2.724-3.979-5.242-5.578-8.173c-0.755-1.382-1.591-2.72-3.298-2.396
				c-0.308,0.056-0.369,0.54-0.088,0.674c0.937,0.454,1.484,1.674,1.926,2.576c0.377,0.771,0.77,1.534,1.203,2.276
				c-1.083-0.893-2.196-1.75-3.383-2.532c-1.288-0.853-2.087-2.393-3.288-3.345c0.346-0.222,0.675-0.483,0.957-0.684
				c0.065-0.046,0.131-0.099,0.197-0.146c0.047,0.433,0.347,0.838,0.929,0.87c29.943,1.668,60.128,0.746,90.109,0.683
				c20.108-0.044,40.278,0.153,60.422-0.076c0.482,0.924,1.75,1.438,2.677,0.89c0.379,1.2,1.774,2.148,2.496,3.108
				c0.851,1.132,1.776,2.198,2.636,3.32c1.286,1.681,3.093,5.051,5.727,4.143c0.757-0.26,1.22-1.33,0.511-1.935
				c-3.044-2.594-4.465-6.805-7.373-9.619c1.028-0.016,2.056-0.031,3.082-0.052c0.398,0.12,0.83,0.13,1.227,0.013
				c0.747,2.22,2.528,3.702,3.808,5.748c1.308,2.093,3.159,3.645,4.489,5.693c0.541,0.83,2.161,0.605,2.038-0.553
				c-0.272-2.542-2.503-4.646-3.836-6.715c-0.626-0.972-1.365-1.862-2.069-2.776c0.063,0.002,0.124,0.004,0.187,0.006
				c-0.31-0.536-0.662-1.05-1.062-1.516c0.492-0.013,0.984-0.024,1.477-0.034c0.148,1.036,0.832,1.61,1.658,2.356
				c1.185,1.072,2.383,2.056,3.405,3.3c1.563,1.904,3.417,3.709,5.478,5.113c0.061,0.076,0.134,0.144,0.225,0.191
				c0.106,0.055,0.211,0.11,0.314,0.17c0.763,0.429,1.889-0.283,1.563-1.201c-0.922-2.591-3.535-4.523-5.202-6.651
				c-0.601-0.768-1.383-1.762-2.282-2.643c-0.167-0.254-0.334-0.508-0.51-0.754c0.698-0.021,1.395-0.042,2.092-0.062
				c0.931,2.348,3.749,2.729,5.42,4.358c1.74,1.696,3.894,3.542,6.095,4.599c0.938,0.742,2.532-0.395,1.865-1.677
				c-1.267-2.437-4.122-4-6.025-5.948c-0.283-0.292-0.654-0.557-1.063-0.803c0.326-0.09,0.568-0.407,0.621-0.758
				c0.006,0,0.013,0,0.021,0c1.143-0.048,1.153-1.696,0.045-1.79c-0.177-0.094-0.344-0.266-0.504-0.452
				c0.11-0.16,0.206-0.33,0.312-0.492c-0.065-0.004-0.129-0.01-0.193-0.012c1.911-2.353,3.631-4.953,4.987-7.477
				c0.507-0.944-0.525-2.076-1.496-1.496c-1.928,1.155-3.103,3.09-4.557,4.744c-1.182,1.344-2.419,2.624-3.658,3.908
				c-0.012-0.002-0.023-0.002-0.035-0.004c-0.189,0.064-0.325,0.229-0.369,0.424c-0.208,0.217-0.415,0.431-0.622,0.648
				c-0.84-0.026-1.677-0.048-2.515-0.074c0.394-0.382,0.76-0.81,1.112-1.256c-0.263-0.032-0.522-0.068-0.784-0.1
				c0.492-0.715,0.988-1.423,1.509-2.113c1.169-1.548,2.612-3.098,3.202-4.97c0.264-0.83-0.731-1.581-1.463-1.124
				c-3.523,2.193-6.199,6.141-8.693,9.433c-0.824-0.018-1.648-0.04-2.474-0.058c0.169-0.376,0.336-0.757,0.503-1.135
				c-0.037,0.002-0.075,0.004-0.114,0.006c0.702-1.136,1.409-2.268,2.067-3.434c0.699-1.24,1.311-2.661,2.194-3.772
				c0.478-0.601,0.595-1.085,0.546-1.827c-0.061-0.912-1.233-1.29-1.737-0.47c-0.504,0.818-1.725,1.452-2.35,2.255
				c-0.693,0.888-1.405,1.766-2.081,2.67c-1.333,1.784-2.907,3.588-3.861,5.612c-0.791-0.014-1.582-0.029-2.372-0.042
				c0.112-0.195,0.201-0.403,0.299-0.607c-0.327,0.016-0.654,0.031-0.98,0.048c1.914-3.101,3.943-6.157,5.632-9.357
				c0.389-0.736-0.258-1.84-1.162-1.51c-2.527,0.92-4.011,3.48-5.388,5.654c-1.201,1.896-2.688,3.74-3.843,5.696
				c-20.423-0.248-40.876-0.046-61.265-0.09c-28.965-0.062-58.115-0.918-87.059,0.528c1.194-1.282,2.162-2.856,3.092-4.253
				c1.86-2.788,3.728-5.519,5.92-8.061c0.108-0.124,0.168-0.278,0.189-0.436c0.44-0.593,0.625-1.213,0.37-1.828
				c-0.121-0.297-0.549-0.269-0.567,0.075c-0.019,0.305-0.177,0.601-0.424,0.891c-0.037-0.004-0.069-0.015-0.11-0.013
				c-0.274,0.015-0.548,0.03-0.822,0.045c-0.638,0.035-0.829,0.67-0.595,1.086c-0.038,0.042-0.072,0.086-0.111,0.128
				c-0.062,0.034-0.127,0.067-0.188,0.102c-0.018,0.006-0.031,0.017-0.048,0.026c-1.399,0.764-3.049,1.38-3.756,1.714
				c-1.792,0.849-3.257,1.79-4.813,3.032c-2.097,1.677-4.191,3.019-6.406,4.345c-3.099,1.671-6.138,3.438-9.16,5.259
				C283.324,17.759,284.097,19.089,284.953,18.579z M302.091,11.354c0.03-0.132,0.054-0.266,0.067-0.402
				c0.412-0.5,0.834-0.988,1.281-1.446c0.091-0.094,0.169-0.193,0.258-0.286C303.183,9.938,302.638,10.645,302.091,11.354z
				 M287.465,17.859c0.094-0.092,0.198-0.166,0.33-0.192c0.153,0.026,0.32-0.018,0.47-0.168c2.579-2.614,6.279-3.813,9.229-5.935
				c0.457-0.328,0.899-0.674,1.338-1.024c0.823-0.424,1.651-0.84,2.484-1.234c0.544-0.256,1.201-0.527,1.898-0.821
				c-0.302,0.328-0.599,0.658-0.912,0.976c-1.415,1.437-3.119,2.977-3.954,4.851c-0.656,0.515-1.336,0.998-2.046,1.433
				c-0.39,0.24-0.861,0.441-1.231,0.729c-0.039-0.098-0.1-0.241-0.202-0.458c-0.154-0.326-0.706-0.326-0.861,0
				c-0.18,0.381-0.334,0.65-0.34,1.074c-0.006,0.32,0.236,0.683,0.565,0.744c1.715,0.322,2.859,2.532,4.108,3.597
				c1.015,0.866,2.117,1.729,3.249,2.442c1.02,0.645,1.999,1.304,2.96,1.996c-3.122-1.316-6.276-2.62-9.239-4.196
				C292.808,20.342,290.23,18.678,287.465,17.859z"/>
			<g>
				<path fill="#422917" d="M488.729,13.007c-0.499,0-1.004,0.166-1.484,0.288c-1.836,0.462-1.836,3.24,0,3.702
					c0.48,0.122,0.985,0.29,1.484,0.29c1.167,0,2.14-0.974,2.14-2.14C490.868,13.979,489.896,13.007,488.729,13.007z"/>
				<path fill="#422917" d="M501.832,14.383c-0.155-0.178-0.296-0.34-0.508-0.464c-0.481-0.282-1.436-0.354-1.895-0.006
					c-0.436,0.256-0.639,0.634-0.673,1.032c-0.081,0.411,0.021,0.848,0.384,1.212c0.068,0.068,0.15,0.12,0.234,0.172
					c0.02,0.016,0.034,0.036,0.055,0.05c0.4,0.304,1.082,0.269,1.555,0.138c0.363-0.1,0.611-0.336,0.848-0.605
					C502.239,15.445,502.239,14.849,501.832,14.383z"/>
				<path fill="#422917" d="M514.455,14.772c-0.024-0.17-0.05-0.338-0.076-0.508c-0.152-1.016-1.891-1.016-2.044,0
					c-0.025,0.17-0.051,0.338-0.076,0.508c-0.192,0.313-0.315,0.681-0.173,1.043c0.007,0.018,0.014,0.033,0.021,0.052
					c0.485,1.229,2.016,1.229,2.502,0c0.007-0.019,0.013-0.034,0.021-0.052C514.771,15.453,514.648,15.085,514.455,14.772z"/>
			</g>
		</g>
		<g>
			<path fill="#422917" d="M235.825,17.245c-3.022-1.82-6.062-3.588-9.16-5.259c-2.214-1.326-4.31-2.668-6.406-4.345
				c-1.556-1.242-3.021-2.184-4.813-3.032c-0.707-0.334-2.356-0.95-3.756-1.714c-0.016-0.01-0.03-0.021-0.047-0.026
				c-0.062-0.034-0.127-0.067-0.189-0.102c-0.039-0.042-0.073-0.086-0.111-0.128c0.234-0.416,0.043-1.051-0.595-1.086
				c-0.274-0.015-0.548-0.03-0.822-0.045c-0.041-0.002-0.073,0.009-0.11,0.013c-0.247-0.29-0.406-0.586-0.424-0.891
				c-0.019-0.344-0.446-0.372-0.567-0.075c-0.255,0.615-0.071,1.235,0.37,1.828c0.021,0.157,0.081,0.312,0.189,0.436
				c2.192,2.542,4.06,5.272,5.92,8.061c0.93,1.396,1.897,2.971,3.092,4.253c-28.944-1.446-58.094-0.59-87.059-0.528
				c-20.388,0.044-40.842-0.158-61.264,0.09c-1.154-1.956-2.643-3.8-3.844-5.696c-1.376-2.174-2.86-4.734-5.388-5.654
				c-0.904-0.33-1.55,0.773-1.162,1.51c1.689,3.2,3.719,6.257,5.633,9.357c-0.327-0.017-0.654-0.032-0.981-0.048
				c0.098,0.204,0.187,0.412,0.299,0.607c-0.79,0.013-1.581,0.028-2.372,0.042c-0.954-2.024-2.528-3.828-3.862-5.612
				c-0.675-0.904-1.387-1.782-2.08-2.67c-0.625-0.803-1.846-1.437-2.351-2.255c-0.504-0.82-1.676-0.442-1.737,0.47
				c-0.049,0.742,0.068,1.227,0.546,1.827c0.884,1.111,1.495,2.532,2.194,3.772c0.658,1.166,1.365,2.298,2.067,3.434
				c-0.039-0.002-0.077-0.004-0.114-0.006c0.167,0.378,0.334,0.759,0.503,1.135c-0.825,0.018-1.649,0.04-2.474,0.058
				c-2.493-3.292-5.169-7.239-8.693-9.433c-0.731-0.457-1.727,0.294-1.463,1.124c0.59,1.872,2.033,3.422,3.203,4.97
				c0.521,0.69,1.017,1.398,1.509,2.113c-0.262,0.031-0.522,0.067-0.784,0.1c0.352,0.446,0.718,0.874,1.112,1.256
				c-0.838,0.026-1.675,0.048-2.514,0.074c-0.207-0.218-0.414-0.432-0.622-0.648c-0.044-0.195-0.18-0.359-0.369-0.424
				c-0.012,0.002-0.024,0.002-0.036,0.004c-1.239-1.284-2.476-2.564-3.657-3.908c-1.454-1.654-2.629-3.589-4.558-4.744
				c-0.97-0.58-2.002,0.552-1.495,1.496c1.356,2.523,3.075,5.124,4.986,7.477c-0.064,0.002-0.128,0.008-0.193,0.012
				c0.105,0.162,0.201,0.332,0.311,0.492c-0.16,0.187-0.327,0.358-0.503,0.452c-1.109,0.094-1.098,1.742,0.045,1.79
				c0.007,0,0.014,0,0.02,0c0.053,0.351,0.295,0.668,0.621,0.758c-0.408,0.246-0.779,0.511-1.062,0.803
				c-1.903,1.948-4.76,3.512-6.026,5.948c-0.667,1.282,0.928,2.419,1.865,1.677c2.201-1.057,4.354-2.902,6.095-4.599
				c1.671-1.63,4.49-2.011,5.419-4.358c0.697,0.02,1.395,0.04,2.092,0.062c-0.176,0.246-0.343,0.5-0.51,0.754
				c-0.899,0.881-1.681,1.875-2.282,2.643c-1.667,2.128-4.281,4.061-5.202,6.651c-0.326,0.918,0.799,1.63,1.562,1.201
				c0.103-0.06,0.208-0.115,0.314-0.17c0.091-0.048,0.164-0.115,0.225-0.191c2.061-1.404,3.914-3.209,5.478-5.113
				c1.022-1.244,2.221-2.228,3.406-3.3c0.826-0.746,1.509-1.32,1.658-2.356c0.492,0.01,0.984,0.021,1.476,0.034
				c-0.399,0.466-0.752,0.979-1.061,1.516c0.062-0.002,0.124-0.004,0.186-0.006c-0.704,0.914-1.443,1.805-2.069,2.776
				c-1.333,2.068-3.563,4.173-3.835,6.715c-0.123,1.158,1.496,1.383,2.037,0.553c1.33-2.049,3.183-3.601,4.49-5.693
				c1.279-2.046,3.06-3.528,3.807-5.748c0.397,0.117,0.828,0.107,1.228-0.013c1.026,0.021,2.053,0.036,3.081,0.052
				c-2.908,2.814-4.329,7.025-7.373,9.619c-0.709,0.604-0.246,1.675,0.511,1.935c2.633,0.908,4.44-2.462,5.727-4.143
				c0.859-1.122,1.786-2.188,2.636-3.32c0.722-0.96,2.117-1.908,2.496-3.108c0.927,0.548,2.194,0.034,2.676-0.89
				c20.144,0.229,40.314,0.032,60.422,0.076c29.982,0.063,60.166,0.985,90.109-0.683c0.582-0.032,0.882-0.438,0.929-0.87
				c0.066,0.048,0.131,0.101,0.197,0.146c0.282,0.2,0.611,0.462,0.957,0.684c-1.201,0.952-2,2.492-3.288,3.345
				c-1.187,0.782-2.299,1.64-3.382,2.532c0.433-0.742,0.826-1.506,1.203-2.276c0.441-0.902,0.989-2.122,1.925-2.576
				c0.281-0.134,0.22-0.618-0.088-0.674c-1.706-0.324-2.542,1.014-3.297,2.396c-1.6,2.931-3.708,5.449-5.579,8.173
				c-0.137,0.116-0.271,0.232-0.411,0.349c-0.094,0.076-0.065,0.188,0.005,0.26c-0.099,0.15-0.201,0.296-0.299,0.446
				c-0.265,0.412,0.268,0.964,0.683,0.682c0.67-0.453,1.275-0.976,1.842-1.531c0.125-0.005,0.249-0.009,0.374-0.013
				c0.303-0.01,0.464-0.218,0.498-0.446c7.168-2.736,14.181-6.061,21.034-9.473c0.099,0.06,0.198,0.12,0.298,0.18
				C235.903,19.089,236.676,17.759,235.825,17.245z M216.303,9.22c0.089,0.093,0.167,0.192,0.258,0.286
				c0.447,0.458,0.869,0.946,1.281,1.446c0.014,0.137,0.037,0.271,0.067,0.402C217.363,10.645,216.818,9.938,216.303,9.22z
				 M224.688,21.672c-2.963,1.576-6.118,2.88-9.239,4.196c0.961-0.692,1.94-1.352,2.959-1.996c1.132-0.714,2.234-1.576,3.25-2.442
				c1.249-1.064,2.394-3.274,4.108-3.597c0.329-0.062,0.571-0.424,0.565-0.744c-0.006-0.424-0.16-0.693-0.34-1.074
				c-0.155-0.326-0.707-0.326-0.861,0c-0.102,0.217-0.163,0.36-0.202,0.458c-0.37-0.288-0.842-0.489-1.231-0.729
				c-0.71-0.435-1.39-0.918-2.046-1.433c-0.835-1.874-2.54-3.414-3.955-4.851c-0.313-0.317-0.61-0.647-0.912-0.976
				c0.698,0.294,1.355,0.565,1.899,0.821c0.833,0.395,1.661,0.811,2.484,1.234c0.438,0.351,0.88,0.696,1.337,1.024
				c2.95,2.122,6.651,3.32,9.23,5.935c0.149,0.15,0.316,0.194,0.469,0.168c0.132,0.026,0.237,0.101,0.331,0.192
				C229.769,18.678,227.192,20.342,224.688,21.672z"/>
			<g>
				<path fill="#422917" d="M31.272,13.007c0.499,0,1.003,0.166,1.484,0.288c1.836,0.462,1.836,3.24,0,3.702
					c-0.481,0.122-0.985,0.29-1.484,0.29c-1.167,0-2.141-0.974-2.141-2.14C29.131,13.979,30.104,13.007,31.272,13.007z"/>
				<path fill="#422917" d="M18.168,14.383c0.155-0.178,0.296-0.34,0.508-0.464c0.481-0.282,1.435-0.354,1.894-0.006
					c0.435,0.256,0.638,0.634,0.673,1.032c0.081,0.411-0.021,0.848-0.384,1.212c-0.068,0.068-0.151,0.12-0.234,0.172
					c-0.02,0.016-0.035,0.036-0.055,0.05c-0.4,0.304-1.082,0.269-1.555,0.138c-0.363-0.1-0.611-0.336-0.847-0.605
					C17.761,15.445,17.761,14.849,18.168,14.383z"/>
				<path fill="#422917" d="M5.544,14.772c0.025-0.17,0.05-0.338,0.076-0.508c0.153-1.016,1.891-1.016,2.044,0
					c0.026,0.17,0.051,0.338,0.076,0.508c0.193,0.313,0.316,0.681,0.173,1.043c-0.007,0.018-0.013,0.033-0.02,0.052
					c-0.486,1.229-2.017,1.229-2.502,0c-0.007-0.019-0.013-0.034-0.02-0.052C5.229,15.453,5.352,15.085,5.544,14.772z"/>
			</g>
		</g>
	</g>
	<path fill="#422917" d="M271.312,2.571c-1.713-2.926-4.751-0.378-6.162,1.398c-1.182,1.488-2.206,3.066-3.273,4.637
		c-0.167,0.246-0.309,0.565-0.438,0.914c-0.035,0.031-0.064,0.062-0.102,0.094c-0.472,0.388-0.987,1.074-1.336,1.75
		c-0.349-0.676-0.864-1.362-1.335-1.75c-0.037-0.032-0.067-0.063-0.101-0.094c-0.131-0.349-0.271-0.668-0.439-0.914
		c-1.067-1.57-2.09-3.148-3.273-4.637c-1.412-1.776-4.448-4.324-6.163-1.398c-1.758,3,0.569,7.697,1.669,10.508
		c1.404,3.586,2.312,7.524,4.713,10.482c0.099,0.173,0.199,0.341,0.292,0.521c0.388,0.744,0.956,1.336,1.545,1.91
		c0.379,0.931,0.963,2.011,1.771,2.582c0.33,0.398,0.846,0.551,1.321,0.45c0.476,0.101,0.992-0.052,1.321-0.45
		c0.809-0.571,1.393-1.651,1.772-2.582c0.588-0.574,1.156-1.166,1.544-1.91c0.094-0.18,0.194-0.348,0.292-0.521
		c2.401-2.958,3.31-6.896,4.714-10.482C270.743,10.269,273.07,5.571,271.312,2.571z M269.846,5.08
		c-0.524,5.92-3.689,11.937-6.673,17.2c-0.045,0.05-0.092,0.104-0.134,0.147c-0.564,0.582-1.311,1.246-1.755,1.931
		c-0.3,0.46-0.869,0.762-1.284,1.168c-0.416-0.406-0.984-0.708-1.284-1.168c-0.443-0.685-1.189-1.349-1.755-1.931
		c-0.042-0.044-0.088-0.098-0.132-0.147c-2.985-5.264-6.149-11.28-6.674-17.2c-0.284-3.203,2.458-0.79,3.36,0.226
		c1.022,1.154,1.853,2.477,2.749,3.729c0.814,1.136,1.296,2.99,2.342,3.973c0.012,0.12,0.04,0.242,0.101,0.368
		c0.266,0.554,0.747,0.786,1.348,0.696c0.323-0.049,0.596-0.314,0.771-0.623c0.004-0.002,0.009-0.002,0.013-0.004
		c0.104-0.052,0.192-0.13,0.287-0.195c0.008-0.006,0.017-0.013,0.024-0.017c1.229-0.899,1.711-2.972,2.589-4.198
		c0.896-1.252,1.727-2.574,2.748-3.729C267.388,4.29,270.129,1.877,269.846,5.08z"/>
</g>
</svg>
