%YAML 1.1
%TAG !u! tag:unity3d.com,2011:
--- !u!74 &7400000
AnimationClip:
  m_ObjectHideFlags: 0
  m_CorrespondingSourceObject: {fileID: 0}
  m_PrefabInstance: {fileID: 0}
  m_PrefabAsset: {fileID: 0}
  m_Name: Correr
  serializedVersion: 6
  m_Legacy: 0
  m_Compressed: 0
  m_UseHighQualityCurve: 1
  m_RotationCurves: []
  m_CompressedRotationCurves: []
  m_EulerCurves: []
  m_PositionCurves: []
  m_ScaleCurves: []
  m_FloatCurves: []
  m_PPtrCurves:
  - curve:
    - time: 0
      value: {fileID: 21300000, guid: 8afd73b29f8e34c70b0db80184b8cc7f, type: 3}
    - time: 0.06666667
      value: {fileID: 21300000, guid: 3f59d4fdf4fe04ab79f11dadde82fe8c, type: 3}
    - time: 0.13333334
      value: {fileID: 21300000, guid: af314424f59d946469a97f398e8de53f, type: 3}
    - time: 0.23333333
      value: {fileID: 21300000, guid: f58cc0961cc9146ca9780a0cb1327e5d, type: 3}
    - time: 0.28333333
      value: {fileID: 21300000, guid: af314424f59d946469a97f398e8de53f, type: 3}
    - time: 0.33333334
      value: {fileID: 21300000, guid: bc3fcf1d561104bea933686de6bade4b, type: 3}
    - time: 0.41666666
      value: {fileID: 21300000, guid: 3f59d4fdf4fe04ab79f11dadde82fe8c, type: 3}
    - time: 0.5
      value: {fileID: 21300000, guid: d094cf6ac3d8a4d0bbbef5d6d6ad3eed, type: 3}
    - time: 0.56666666
      value: {fileID: 21300000, guid: 8afd73b29f8e34c70b0db80184b8cc7f, type: 3}
    attribute: m_Sprite
    path: 
    classID: 212
    script: {fileID: 0}
  m_SampleRate: 60
  m_WrapMode: 0
  m_Bounds:
    m_Center: {x: 0, y: 0, z: 0}
    m_Extent: {x: 0, y: 0, z: 0}
  m_ClipBindingConstant:
    genericBindings:
    - serializedVersion: 2
      path: 0
      attribute: 0
      script: {fileID: 0}
      typeID: 212
      customType: 23
      isPPtrCurve: 1
    pptrCurveMapping:
    - {fileID: 21300000, guid: 8afd73b29f8e34c70b0db80184b8cc7f, type: 3}
    - {fileID: 21300000, guid: 3f59d4fdf4fe04ab79f11dadde82fe8c, type: 3}
    - {fileID: 21300000, guid: af314424f59d946469a97f398e8de53f, type: 3}
    - {fileID: 21300000, guid: f58cc0961cc9146ca9780a0cb1327e5d, type: 3}
    - {fileID: 21300000, guid: af314424f59d946469a97f398e8de53f, type: 3}
    - {fileID: 21300000, guid: bc3fcf1d561104bea933686de6bade4b, type: 3}
    - {fileID: 21300000, guid: 3f59d4fdf4fe04ab79f11dadde82fe8c, type: 3}
    - {fileID: 21300000, guid: d094cf6ac3d8a4d0bbbef5d6d6ad3eed, type: 3}
    - {fileID: 21300000, guid: 8afd73b29f8e34c70b0db80184b8cc7f, type: 3}
  m_AnimationClipSettings:
    serializedVersion: 2
    m_AdditiveReferencePoseClip: {fileID: 0}
    m_AdditiveReferencePoseTime: 0
    m_StartTime: 0
    m_StopTime: 0.5833333
    m_OrientationOffsetY: 0
    m_Level: 0
    m_CycleOffset: 0
    m_HasAdditiveReferencePose: 0
    m_LoopTime: 1
    m_LoopBlend: 0
    m_LoopBlendOrientation: 0
    m_LoopBlendPositionY: 0
    m_LoopBlendPositionXZ: 0
    m_KeepOriginalOrientation: 0
    m_KeepOriginalPositionY: 1
    m_KeepOriginalPositionXZ: 0
    m_HeightFromFeet: 0
    m_Mirror: 0
  m_EditorCurves: []
  m_EulerEditorCurves: []
  m_HasGenericRootTransform: 0
  m_HasMotionFloatCurves: 0
  m_Events: []
