{
  "Message_EmailValidator": "'{PropertyName}' is not a valid email address.",
  "Message_GreaterThanOrEqualValidator": "'{PropertyName}' must be greater than or equal to '{ComparisonValue}'.",
  "Message_GreaterThanValidator": "'{PropertyName}' must be greater than '{ComparisonValue}'.",
  "Message_LengthValidator": "'{PropertyName}' must be between {MinLength} and {MaxLength} characters. You entered {TotalLength} characters.",
  "Message_MinimumLengthValidator": "The length of '{PropertyName}' must be at least {MinLength} characters. You entered {TotalLength} characters.",
  "Message_MaximumLengthValidator": "The length of '{PropertyName}' must be {MaxLength} characters or fewer. You entered {TotalLength} characters.",
  "Message_LessThanOrEqualValidator": "'{PropertyName}' must be less than or equal to '{ComparisonValue}'.",
  "Message_LessThanValidator": "'{PropertyName}' must be less than '{ComparisonValue}'.",
  "Message_NotEmptyValidator": "'{PropertyName}' should not be empty.",
  "Message_NotEqualValidator": "'{PropertyName}' should not be equal to '{ComparisonValue}'.",
  "Message_NotNullValidator": "'{PropertyName}' must not be empty.",
  "Message_PredicateValidator": "The specified condition was not met for '{PropertyName}'.",
  "Message_AsyncPredicateValidator": "The specified condition was not met for '{PropertyName}'.",
  "Message_RegularExpressionValidator": "'{PropertyName}' is not in the correct format.",
  "Message_EqualValidator": "'{PropertyName}' should be equal to '{ComparisonValue}'.",
  "Message_ExactLengthValidator": "'{PropertyName}' must be {MaxLength} characters in length. You entered {TotalLength} characters.",
  "Message_InclusiveBetweenValidator": "'{PropertyName}' must be between {From} and {To}. You entered {Value}.",
  "Message_ExclusiveBetweenValidator": "'{PropertyName}' must be between {From} and {To} (exclusive). You entered {Value}.",
  "Message_CreditCardValidator": "'{PropertyName}' is not a valid credit card number.",
  "Message_ScalePrecisionValidator": "'{PropertyName}' may not be more than {expectedPrecision} digits in total, with allowance for {expectedScale} decimals. {digits} digits and {actualScale} decimals were found.",
  "Message_EmptyValidator": "'{PropertyName}' should be empty.",
  "Message_NullValidator": "'{PropertyName}' must be empty.",
  "Message_EnumValidator": "'{PropertyName}' has a range of values which does not include '{PropertyValue}'.",
  "Message_PasswordsShouldMatch": "'{PropertyName}' should be equal to '{ComparisonPropertyName}'."
}