{
  "Invalid_FriendlyMessage_Title": "Hata",
  "Invalid_FriendlyMessage_ButtonPositiveText": "Tamam",
  "ValidateMail_FriendlyMessage_Title": "Eposta adresinizi doğrulayınız",
  "ValidateMail_FriendlyMessage_Description": "Epostalarınızı kontrol ediniz ve doğrulama linkine tıklayınız.",
  "ValidateMail_FriendlyMessage_ButtonPositiveText": "Devam"
}