{
  "name": "jobs-ui",
  "$schema": "../../../node_modules/nx/schemas/project-schema.json",
  "projectType": "library",
  "sourceRoot": "modules/jobs/ui",
  "prefix": "cv-jobs",
  "targets": {
    "lint": {
      "executor": "@nx/eslint:lint",
      "outputs": ["{options.outputFile}"]
    },
    "test": {
      "executor": "@nx/jest:jest",
      "options": {
        "jestConfig": "modules/jobs/ui/jest.config.ts"
      },
      "outputs": ["{workspaceRoot}/coverage/modules/jobs/ui"]
    }
  }
}
