<svg width="20" height="14" viewBox="0 0 20 14" fill="none" xmlns="http://www.w3.org/2000/svg">
<path d="M1 7H19M1 1H19M1 13H19" stroke="#1A60FF" stroke-width="1.5" stroke-linecap="round" stroke-linejoin="round"/>
</svg>
