<svg width="17" height="18" viewBox="0 0 17 18" fill="none" xmlns="http://www.w3.org/2000/svg">
<path d="M14.4 18H1.8C0.805887 18 0 17.1941 0 16.2V3.6C0 2.60589 0.805887 1.8 1.8 1.8H3.6V0H5.4V1.8H10.8V0H12.6V1.8H14.4C15.3941 1.8 16.2 2.60589 16.2 3.6V16.2C16.2 17.1941 15.3941 18 14.4 18ZM1.8 7.2V16.2H14.4V7.2H1.8ZM1.8 3.6V5.4H14.4V3.6H1.8ZM12.6 14.4H10.8V12.6H12.6V14.4ZM9 14.4H7.2V12.6H9V14.4ZM5.4 14.4H3.6V12.6H5.4V14.4ZM12.6 10.8H10.8V9H12.6V10.8ZM9 10.8H7.2V9H9V10.8ZM5.4 10.8H3.6V9H5.4V10.8Z" fill="#1A60FF"/>
</svg>
