<svg width="14" height="14" viewBox="0 0 14 14" fill="none" xmlns="http://www.w3.org/2000/svg">
<path d="M8.77243 10.1719H9.86565V12.3594C9.86565 13.2641 9.13004 14 8.22588 14H1.63966C0.735611 14 0 13.2641 0 12.3594V1.64058C0 0.736021 0.735611 0 1.63966 0H8.22588C9.13004 0 9.86565 0.736021 9.86565 1.64058V3.82812H8.77243V1.64058C8.77243 1.33909 8.5273 1.09372 8.22588 1.09372H1.63966C1.33835 1.09372 1.09311 1.33909 1.09311 1.64058V12.3594C1.09311 12.6609 1.33835 12.9063 1.63966 12.9063H8.22588C8.5273 12.9063 8.77243 12.6609 8.77243 12.3594V10.1719ZM11.4234 4.4219L10.6504 5.19532L11.9075 6.45319H4.83717V7.54691H11.9075L10.6504 8.80468L11.4234 9.5781L14 7.00005L11.4234 4.4219Z" fill="#1A60FF"/>
</svg>
