<svg width="32" height="32" viewBox="0 0 32 32" fill="none" xmlns="http://www.w3.org/2000/svg">
<g clip-path="url(#clip0)">
<path d="M16.0187 7.42131C10.7964 7.42131 6.54787 11.6699 6.54787 16.8921C6.54787 22.1144 10.7965 26.363 16.0187 26.363C21.2409 26.363 25.4896 22.1144 25.4896 16.8921C25.4896 11.6699 21.2409 7.42131 16.0187 7.42131ZM16.0187 25.1129C11.4857 25.1129 7.79781 21.4251 7.79781 16.8921C7.79781 12.3591 11.4856 8.67125 16.0187 8.67125C20.5517 8.67125 24.2396 12.3591 24.2396 16.8921C24.2396 21.4251 20.5517 25.1129 16.0187 25.1129Z" fill="#171051"/>
<path d="M21.6251 13.8371C21.4596 13.5342 21.08 13.4227 20.777 13.5881C20.7669 13.5936 20.7575 13.6 20.7477 13.606C20.4674 13.7794 20.3681 14.1433 20.5279 14.4361C20.9364 15.1843 21.1523 16.0336 21.1523 16.8921C21.1523 19.7228 18.8494 22.0257 16.0187 22.0257C13.1879 22.0257 10.8851 19.7227 10.8851 16.8921C10.8851 14.0614 13.188 11.7585 16.0187 11.7585C16.2903 11.7585 16.5629 11.7799 16.8289 11.8221C17.1588 11.8744 17.4678 11.6584 17.5369 11.3362C17.5394 11.3251 17.5422 11.3141 17.544 11.3026C17.598 10.9616 17.3654 10.6414 17.0245 10.5874C16.694 10.5351 16.3556 10.5085 16.0186 10.5085C12.4988 10.5085 9.635 13.3722 9.635 16.8921C9.635 20.4121 12.4987 23.2758 16.0186 23.2758C19.5386 23.2758 22.4023 20.412 22.4023 16.8921C22.4023 15.8249 22.1336 14.7685 21.6251 13.8371Z" fill="#171051"/>
<path d="M20.0119 11.6695C19.9831 11.6407 19.9513 11.6145 19.9169 11.592C19.8831 11.5695 19.8469 11.5501 19.8087 11.5345C19.7712 11.5189 19.7319 11.507 19.6919 11.4989C19.6112 11.4826 19.5281 11.4826 19.4475 11.4989C19.4075 11.507 19.3687 11.5189 19.3306 11.5345C19.2931 11.5501 19.2569 11.5695 19.2231 11.592C19.1887 11.6145 19.1569 11.6407 19.1275 11.6695C19.0987 11.6982 19.0731 11.7301 19.05 11.7645C19.0275 11.7982 19.0081 11.8345 18.9925 11.8726C18.9826 11.8962 18.9748 11.9207 18.968 11.9456C18.964 11.9601 18.9599 11.9747 18.9569 11.9895C18.9489 12.0294 18.9451 12.0707 18.9451 12.1113C18.9451 12.1526 18.9488 12.1932 18.9569 12.2339C18.9651 12.2739 18.9769 12.3126 18.9926 12.3507C19.0082 12.3882 19.0276 12.4245 19.0501 12.4582C19.0732 12.4926 19.0988 12.5245 19.1276 12.5532C19.1569 12.582 19.1888 12.6082 19.2232 12.6314C19.2569 12.6539 19.2932 12.6732 19.3307 12.6889C19.3688 12.7045 19.4076 12.7164 19.4476 12.7245C19.4882 12.7326 19.5294 12.7363 19.5701 12.7363C19.6107 12.7363 19.6519 12.7326 19.6919 12.7245C19.7319 12.7164 19.7713 12.7045 19.8088 12.6889C19.8416 12.6754 19.8725 12.6588 19.9021 12.6402C19.9069 12.6372 19.9121 12.6346 19.9169 12.6314C19.9513 12.6082 19.9831 12.582 20.0119 12.5532C20.0406 12.5245 20.0669 12.4926 20.0894 12.4582C20.1119 12.4245 20.1313 12.3882 20.1469 12.3507C20.1625 12.3126 20.1744 12.2732 20.1825 12.2339C20.1906 12.1932 20.195 12.1526 20.195 12.1113C20.195 11.9469 20.1281 11.7857 20.0119 11.6695Z" fill="#171051"/>
<path d="M31.984 25.8429L29.9569 9.33387C29.8158 8.18487 29.455 7.09144 28.8844 6.08406C28.5341 5.46562 28.1086 4.89056 27.6197 4.37481L27.5652 4.31725C27.1487 3.87781 26.5257 3.76069 25.9778 4.01887C25.4301 4.277 25.1238 4.83219 25.1976 5.43319L27.7672 26.3607C27.7754 26.4279 27.7867 26.494 27.801 26.5589C28.0145 27.5316 28.8832 28.2264 29.8741 28.2262C29.96 28.2262 30.0471 28.2211 30.1344 28.2103C30.8247 28.1256 31.3976 27.7167 31.7193 27.1552C31.7532 27.0961 31.7842 27.0353 31.8124 26.973C31.8405 26.9107 31.8657 26.8469 31.8878 26.7818C31.9874 26.4889 32.0241 26.1699 31.984 25.8429ZM26.4384 5.28081C26.4353 5.25575 26.4271 5.18894 26.5108 5.1495C26.5337 5.13869 26.5539 5.1345 26.5714 5.1345C26.6177 5.1345 26.6455 5.16387 26.658 5.17712L26.7126 5.23469C27.1318 5.67694 27.4966 6.16994 27.7968 6.70006C28.286 7.56369 28.5954 8.50112 28.7163 9.48619L29.7967 18.2849L28.0612 18.498L26.4384 5.28081ZM30.6892 26.4214C30.5753 26.7099 30.3112 26.9292 29.9822 26.9696C29.5036 27.0287 29.0667 26.6869 29.0079 26.2084L28.2136 19.7387L29.949 19.5256L30.7434 25.9953C30.7617 26.1447 30.7409 26.2902 30.6892 26.4214Z" fill="#171051"/>
<path d="M7.70787 4.48313C7.36512 4.44088 7.05343 4.68475 7.01137 5.02731L6.44293 9.65681C6.3543 10.3783 5.77124 10.9226 5.04968 10.9666L4.63537 10.9158L5.38293 4.82744C5.42499 4.48488 5.18137 4.173 4.83874 4.13088C4.49605 4.08844 4.1843 4.3325 4.14224 4.67506L3.39468 10.7634L2.97999 10.7125C2.29062 10.4951 1.85668 9.826 1.94524 9.10456L2.51368 4.47513C2.55574 4.13256 2.31212 3.82069 1.96949 3.77856C1.62693 3.73606 1.31505 3.98019 1.27299 4.32275L0.704554 8.95219C0.562366 10.1105 1.15355 11.1965 2.1508 11.7174L0.0245537 25.4009C0.0243037 25.4024 0.0240537 25.4041 0.0238037 25.4056C-0.0625088 25.9906 0.0873038 26.5718 0.445616 27.0421C0.803929 27.5124 1.32449 27.8111 1.91087 27.8831L1.92224 27.8845C2.0128 27.8956 2.10318 27.9011 2.19287 27.9011C2.68718 27.9011 3.16237 27.734 3.55374 27.4183C4.01618 27.0452 4.30055 26.5139 4.35449 25.9222L5.61124 12.1424C6.70499 11.8783 7.54149 10.9676 7.68368 9.80919L8.25212 5.17969C8.29412 4.83713 8.05049 4.52525 7.70787 4.48313ZM3.10974 25.8088C3.08674 26.0606 2.96574 26.2866 2.76893 26.4454C2.57212 26.6043 2.32574 26.6751 2.07505 26.6439L2.06368 26.6426C1.81393 26.6119 1.59237 26.4848 1.43993 26.2846C1.2878 26.085 1.22399 25.8384 1.26012 25.5902L3.36893 12.0197L3.86212 12.0803C3.86237 12.0803 3.86255 12.0803 3.8628 12.0804C3.86299 12.0804 3.86318 12.0804 3.86337 12.0804L4.35618 12.1409L3.10974 25.8088Z" fill="#171051"/>
</g>
<defs>
<clipPath id="clip0">
<rect width="32" height="32" fill="white"/>
</clipPath>
</defs>
</svg>
