<svg width="16" height="16" viewBox="0 0 16 16" fill="none" xmlns="http://www.w3.org/2000/svg">
<path d="M16 11.6364V1.45455C16 0.654545 15.3455 0 14.5455 0H4.36364C3.56364 0 2.90909 0.654545 2.90909 1.45455V11.6364C2.90909 12.4364 3.56364 13.0909 4.36364 13.0909H14.5455C15.3455 13.0909 16 12.4364 16 11.6364ZM6.90909 7.63636L8.72727 9.81818L11.2727 6.54545L14.5455 10.9091H4.36364L6.90909 7.63636ZM0 2.90909V14.5455C0 15.3455 0.654545 16 1.45455 16H13.0909V14.5455H1.45455V2.90909H0Z" fill="#1A60FF"/>
</svg>
