2021-02-23 04:32:18,845 INFO Set uid to user 0 succeeded
2021-02-23 04:32:18,858 INFO supervisord started with pid 17
2021-02-23 04:32:19,864 INFO spawned: 'php' with pid 19
2021-02-23 04:32:20,868 INFO success: php entered RUNNING state, process has stayed up for > than 1 seconds (startsecs)
