<?xml version="1.0" standalone="no"?>
<!DOCTYPE svg PUBLIC "-//W3C//DTD SVG 20010904//EN"
 "http://www.w3.org/TR/2001/REC-SVG-20010904/DTD/svg10.dtd">
<svg version="1.0" xmlns="http://www.w3.org/2000/svg"
 width="14.000000pt" height="12.000000pt" viewBox="0 0 14.000000 12.000000"
 preserveAspectRatio="xMidYMid meet">

<g transform="translate(0.000000,12.000000) scale(0.100000,-0.100000)"
fill="#000000" stroke="none">
<path d="M85 70 c-36 -37 -40 -39 -57 -23 -27 24 -32 10 -5 -15 l23 -22 49 50
c27 28 45 50 39 50 -5 0 -27 -18 -49 -40z"/>
</g>
</svg>
