{
  "name": "card",
  "guardedBy": "project",
  "fields": [
    "priority", "attachments","projectSeq",
    "version", {
      "content": {"deps": ["masterTags"]},
      "status": {"deps": ["assigneeId", "priority", "content", "attachments", "effort", "deckId", "masterTags", "visibility"]},
      "createdAt": "card_created_at",
      "lastUpdatedAt": {"sql": "version_created_at", "type": "date", "deps": ["priority", "status", "content", "attachments", "effort", "deckId", "masterTags", "visibility"]},
      "tags": {"type":"array", "deps": ["content", "masterTags"]},
      "masterTags": {"type":"array", "deps": ["content"]},
      "mentionedUsers": {"type": "array", "deps": ["content"]},
      "title": {"deps": ["content"]},
      "effort": {"defaultValue": null},
      "checkboxStats": {"deps": ["content"], "type": "json", "defaultValue": {"total":0, "checked":0}},
      "checkboxInfo": {"deps": ["content"], "type": "array"},
      "visibility": {"deps": ["assigneeId", "priority", "content", "attachments", "effort", "deckId", "masterTags", "status"]}
    }
  ],
  "belongsTo": [
    "project", "deck", {
      "assignee": {"model":"user", "deps": ["status"]},
      "milestone": {"deps": ["deckId"]}
    }
  ],
  "hasMany": [
    "resolvables", "handCards",
    {
      "openBlockResolvables": {
        "model": "resolvable",
        "where": "not [table.]is_closed and [table.]context='block'",
        "deps": ["isClosed"]
      },
      "openReviewResolvables": {
        "model": "resolvable",
        "where": "not [table.]is_closed and [table.]context='review'",
        "deps": ["isClosed"]
      },
      "closedResolvables": {
        "model": "resolvable",
        "where": "is_closed",
        "deps": ["isClosed"],
        "order": "closedAt desc"
      },
      "openResolvables": {
        "model": "resolvable",
        "where": "not [table.]is_closed",
        "deps": ["isClosed"]
      },
      "resolvableEntries": {
        "model": "resolvableEntry",
        "via": {"table": "resolvables", "fk1": "id", "fk2": "resolvableId"},
        "order": "lastChangedAt"
      },
      "attachments": {
        "fkAsArray": true
      },
      "diffs": {
        "model": "cardHistory",
        "order": "version_created_at desc"
      }
    }
  ],
  "defaultScope": "is_current",
  "idProp": "cardId"
}