{
  "name": "unseenCardDiff",
  "table": "vw_unseen_card_diffs",
  "guardedBy": "project",
  "idProp": ["cardId","version","userId"],
  "fields": ["isOwner", "inSubDeck", "isSubCard", "wasInSubDeck", "isUnassigned", {
    "createdAt": {"sql": "version_created_at", "type": "date"},
    "diff": {"type": "json"},
    "version": {"type": "int"}
  }],
  "belongsTo": ["card", "project", {
    "changer": {
      "model": "user",
      "fk": "changer_id"
    }
  }]
}