{
  "jiraConfig": {
    "domain": "your jira subdomain",
    "token": "jira token"
  },
  "codecksConfig": {
    "subdomain": "your codecks subdomain",
    "token": "codecks token",
    "adminId": 0,
    "accountId": 0
  },
  "users": [
    {
      "codecksId": 0,
      "jiraKey": "admin"
    },
    {
      "codecksId": 0,
      "jiraKey": "otherUser"
    }
  ],
  "status": {
    "Awaiting Validation": "review",
    "To Do": "unassigned",
    "Done": "done",
    "In Progress": "started"
  }
}