{
  "name": "subscription",
  "guardedBy": ["account"],
  "idProp": ["accountId"],
  "fields": ["status", {
    "currentPeriodStart": {"type": "date"},
    "currentPeriodEnd": {"type": "date"},
    "canceledAt": {"type": "date"},
    "quantity": {"type": "int"},
    "viaStripe": "stripe_id is not null"
  }],
  "belongsTo": ["account", {
    "canceledBy": {"model":"user", "fk": "canceledBy"}
  }],
  "defaultScope": "is_current"
}