{
  "name": "project",
  "guardedBy": "self",
  "fields": ["id", "name", "visibility", {
    "createdAt": {"type": "date"}
  }],
  "belongsTo": ["account", {
    "coverFile": {
      "model": "file"
    }
  }],
  "hasMany": [{
    "decks": {
      "where": "not [table.]is_deleted",
      "deps": ["isDeleted"]
    },
    "cards": {
      "where": "visibility = 'default'",
      "deps": ["visibility"]
    },
    "archivedCards": {
      "model": "card",
      "where": "visibility = 'archived'",
      "deps": ["visibility"]
    },
    "anyCards": {
      "model": "card"
    },
    "prioritySetting": {
      "model": "setting",
      "where": "key = 'priorities'",
      "isSingleton": true
    },
    "effortSetting": {
      "model": "setting",
      "where": "key = 'efforts'",
      "isSingleton": true
    },
    "cardAgeStepsSetting": {
      "model": "setting",
      "where": "key = 'cardAgeSteps'",
      "isSingleton": true
    },
    "masterTagsSetting": {
      "model": "setting",
      "where": "key = 'masterTags'",
      "isSingleton": true
    },
    "statusChangeDurationsSetting": {
      "model": "setting",
      "where": "key = 'statusChangeDurations'",
      "isSingleton": true
    },
    "projectMilestones": {
      "model": "milestone",
      "order": "date",
      "where": "not [table.]is_deleted",
      "deps": ["isDeleted"]
    },
    "users": {
      "model": "user",
      "via": {"table": "vw_all_project_users", "fk1": "user_id", "fk2": "id"}
    },
    "openResolvables": {
      "model": "resolvable",
      "where": "not [table.]is_closed",
      "deps": ["isClosed"],
      "via": {"table": "cards", "fk1": "cardId", "fk2":"cardId", "where": "is_current"}
    },
    "attachments": {
      "via": {"table": "cards", "fk1": "cardId", "fk2":"cardId", "where": "is_current"}
    },
    "cardDiffs": {
      "model": "cardHistory",
      "order": "versionCreatedAt"
    },
    "resolvableEntries": {
      "model": "resolvableEntry",
      "order": "createdAt",
      "via": [
        {"table": "cards", "fk1": "cardId", "fk2":"cardId", "where": "is_current"},
        {"table": "resolvables", "fk1": "id", "fk2":"resolvable_id"}
      ]
    }
  }]
}