{
  "cms": {
    "pageTitle": "Shipping policy",
    "pageDescription": "This is our shipping policy.",
    "markdownElements": {
      "policy": {
        "label": "Shipping policy",
        "markdown": "Here's our shipping policy..."
      }
    }
  }
}
