{
  "shell_port": 49297,
  "iopub_port": 44107,
  "stdin_port": 34989,
  "control_port": 55371,
  "hb_port": 52627,
  "ip": "127.0.0.1",
  "key": "adde2260-6edb989d6ad64d6115e77753",
  "transport": "tcp",
  "signature_scheme": "hmac-sha256",
  "kernel_name": ""
}