ALX 030
BLR 030
BRD 030
BSN 030
CMN 004
CMY 031
CNL 031
DSM 030
FAN 030
GUL 030
IBK 031
JRI 031
KEN 030
KRN 031
LAR 031
NCL 030
NSH 030
RMK 031
RSD 031
RYU 031
URN 031
VEG 031
Z20 031
Z21 031
Z22 031
Z23 030
Z24 030
Z25 030
Z26 030
Z27 032
Z28 031
Z29 030
Z30 031
Z31 030
Z32 000
ZGF 030