ALX 060
BLR 060
BRD 060
BSN 060
CMN 005
CMY 060
CNL 060
DSM 060
FAN 060
GUL 060
IBK 060
JRI 060
KEN 060
KRN 060
LAR 060
NCL 060
NSH 060
RMK 060
RSD 060
RYU 060
URN 060
VEG 060
Z20 060
Z21 060
Z22 060
Z23 060
Z24 060
Z25 060
Z26 060
Z27 060
Z28 060
Z29 060
Z30 060
Z31 060
Z32 060
Z33 060
Z34 060
Z35 060
Z36 060
Z37 060
Z38 060
Z39 060
Z40 060
Z41 060
Z42 060
ZGF 060