EESchema Schematic File Version 4
EELAYER 30 0
EELAYER END
$Descr A4 11693 8268
encoding utf-8
Sheet 3 20
Title "DL-1727"
Date "2020-04-26"
Rev ""
Comp ""
Comment1 ""
Comment2 "Licence: CC-BY"
Comment3 "Author: Loic *WydD* Petit"
Comment4 "Project: CPS2 Reverse Engineering: DL-1727"
$EndDescr
Connection ~ 5100 3750
Connection ~ 4500 5850
Connection ~ 4700 4450
Connection ~ 4800 4550
Connection ~ 4600 5150
Connection ~ 5300 3850
Connection ~ 4900 3050
Connection ~ 4800 3750
Connection ~ 4900 3550
Connection ~ 5000 3650
Connection ~ 4500 4250
Connection ~ 9300 3150
Connection ~ 4900 2850
Connection ~ 5000 2350
Connection ~ 5000 2950
Connection ~ 5100 3050
Connection ~ 5200 3150
Connection ~ 5100 2000
Connection ~ 5200 2100
Connection ~ 4600 4350
Connection ~ 4400 6550
Wire Wire Line
	2700 1650 5100 1650
Wire Wire Line
	2700 2350 5000 2350
Wire Wire Line
	2700 3050 4900 3050
Wire Wire Line
	2700 3750 4800 3750
Wire Wire Line
	2700 4450 4700 4450
Wire Wire Line
	2700 5150 4600 5150
Wire Wire Line
	2700 5850 4500 5850
Wire Wire Line
	2700 6550 4400 6550
Wire Wire Line
	2900 7250 2700 7250
Wire Wire Line
	3050 1350 3400 1350
Wire Wire Line
	3500 7250 4300 7250
Wire Wire Line
	4000 1350 5300 1350
Wire Wire Line
	4300 6450 6450 6450
Wire Wire Line
	4300 7250 4300 6450
Wire Wire Line
	4400 6550 4400 7050
Wire Wire Line
	4500 2450 4500 4250
Wire Wire Line
	4500 4250 4500 5850
Wire Wire Line
	4500 5850 4500 7050
Wire Wire Line
	4600 2550 4600 4350
Wire Wire Line
	4600 4350 4600 5150
Wire Wire Line
	4600 5150 4600 7050
Wire Wire Line
	4700 2650 6400 2650
Wire Wire Line
	4700 4450 4700 2650
Wire Wire Line
	4700 4450 4700 7050
Wire Wire Line
	4800 2750 4800 3750
Wire Wire Line
	4800 3750 4800 4550
Wire Wire Line
	4800 4550 4800 7050
Wire Wire Line
	4900 1800 4900 2850
Wire Wire Line
	4900 2850 4900 3050
Wire Wire Line
	4900 3050 4900 3550
Wire Wire Line
	4900 3550 4900 7050
Wire Wire Line
	5000 1900 5000 2350
Wire Wire Line
	5000 2350 5000 2950
Wire Wire Line
	5000 2950 5000 3650
Wire Wire Line
	5000 3650 5000 7050
Wire Wire Line
	5100 1650 5100 2000
Wire Wire Line
	5100 2000 5100 3050
Wire Wire Line
	5100 3050 5100 3750
Wire Wire Line
	5100 3750 5100 7050
Wire Wire Line
	5200 950  5200 2100
Wire Wire Line
	5200 2100 5200 3150
Wire Wire Line
	5200 3150 5200 7050
Wire Wire Line
	5300 3850 5300 7050
Wire Wire Line
	5600 1800 4900 1800
Wire Wire Line
	5600 1900 5000 1900
Wire Wire Line
	6150 1850 6250 1850
Wire Wire Line
	6250 1850 6250 1900
Wire Wire Line
	6250 1900 6400 1900
Wire Wire Line
	6400 2000 5100 2000
Wire Wire Line
	6400 2100 5200 2100
Wire Wire Line
	6400 2450 4500 2450
Wire Wire Line
	6400 2550 4600 2550
Wire Wire Line
	6400 2750 4800 2750
Wire Wire Line
	6400 2850 4900 2850
Wire Wire Line
	6400 2950 5000 2950
Wire Wire Line
	6400 3050 5100 3050
Wire Wire Line
	6400 3150 5200 3150
Wire Wire Line
	6400 3550 4900 3550
Wire Wire Line
	6400 3650 5000 3650
Wire Wire Line
	6400 3750 5100 3750
Wire Wire Line
	6400 3850 5300 3850
Wire Wire Line
	6400 4250 4500 4250
Wire Wire Line
	6400 4350 4600 4350
Wire Wire Line
	6400 4450 4700 4450
Wire Wire Line
	6400 4550 4800 4550
Wire Wire Line
	6450 6550 4400 6550
Wire Wire Line
	7000 6500 7550 6500
Wire Wire Line
	7450 2000 7000 2000
Wire Wire Line
	7450 2350 7450 2000
Wire Wire Line
	7450 2450 7450 2800
Wire Wire Line
	7450 2800 7000 2800
Wire Wire Line
	7550 3700 7000 3700
Wire Wire Line
	7550 4300 7550 3700
Wire Wire Line
	7550 4500 7550 6500
Wire Wire Line
	7650 2350 7450 2350
Wire Wire Line
	7650 2450 7450 2450
Wire Wire Line
	7650 4300 7550 4300
Wire Wire Line
	7650 4400 7000 4400
Wire Wire Line
	7650 4500 7550 4500
Wire Wire Line
	8450 2400 8200 2400
Wire Wire Line
	8450 2400 8450 3250
Wire Wire Line
	8450 3250 9600 3250
Wire Wire Line
	9300 3150 9300 4300
Wire Wire Line
	9300 4300 9600 4300
Wire Wire Line
	9600 3150 9300 3150
Wire Wire Line
	9600 4400 8200 4400
Text Notes 5550 1450 0    50   ~ 0
/ADDR23 & /ADDR22 & /(ADDR21 & ADDR20)\n= /ADDR23 & /ADDR22 & (/ADDR21 + /ADDR20)\n< 0x3x xx\nROM SPACE without 9 & 10??
Text Notes 7000 3100 0    50   ~ 0
1111 1111 xxxx xxxx\n0xFFxx
Text Notes 7900 4850 0    50   ~ 0
Low if\n1000 0000 01xx xxxx\n0x804x - 0x807x
$Comp
L CG24-cells:N2P U2R142
U 1 1 5F2C90C1
P 5850 1850
F 0 "U2R142" H 5875 2117 50  0000 C CNN
F 1 "N2P" H 5875 2026 50  0000 C CNN
F 2 "" H 5850 1850 50  0001 C CNN
F 3 "" H 5850 1850 50  0001 C CNN
	1    5850 1850
	1    0    0    -1  
$EndComp
$Comp
L CG24-cells:R2N U6R164
U 1 1 5F8F072F
P 6700 6500
F 0 "U6R164" H 6725 6767 50  0000 C CNN
F 1 "R2N" H 6725 6676 50  0000 C CNN
F 2 "" H 6700 6500 50  0001 C CNN
F 3 "" H 6700 6500 50  0001 C CNN
	1    6700 6500
	1    0    0    -1  
$EndComp
$Comp
L CG24-cells:R2N U7R140
U 1 1 5FC7B02B
P 7900 2400
F 0 "U7R140" H 7925 2667 50  0000 C CNN
F 1 "R2N" H 7925 2576 50  0000 C CNN
F 2 "" H 7900 2400 50  0001 C CNN
F 3 "" H 7900 2400 50  0001 C CNN
	1    7900 2400
	1    0    0    -1  
$EndComp
$Comp
L CG24-cells:R2N U16R143
U 1 1 601BE18E
P 9850 3200
F 0 "U16R143" H 9875 3467 50  0000 C CNN
F 1 "R2N" H 9875 3376 50  0000 C CNN
F 2 "" H 9850 3200 50  0001 C CNN
F 3 "" H 9850 3200 50  0001 C CNN
	1    9850 3200
	1    0    0    -1  
$EndComp
$Comp
L CG24-cells:R2P U8R112
U 1 1 5ECE1139
P 9850 4350
F 0 "U8R112" H 9875 4617 50  0000 C CNN
F 1 "R2P" H 9875 4526 50  0000 C CNN
F 2 "" H 9900 4350 50  0001 C CNN
F 3 "" H 9900 4350 50  0001 C CNN
	1    9850 4350
	1    0    0    -1  
$EndComp
$Comp
L CG24-cells:N3N U6R139
U 1 1 5FB5D95E
P 7900 4400
F 0 "U6R139" H 7925 4692 50  0000 C CNN
F 1 "N3N" H 7925 4601 50  0000 C CNN
F 2 "" H 7900 4400 50  0001 C CNN
F 3 "" H 7900 4400 50  0001 C CNN
	1    7900 4400
	1    0    0    -1  
$EndComp
$Comp
L CG24-cells:B1N U4R102
U 1 1 5EE2F58B
P 2400 950
F 0 "U4R102" H 2400 1267 50  0000 C CNN
F 1 "B1N" H 2400 1176 50  0000 C CNN
F 2 "" H 2400 950 50  0001 C CNN
F 3 "" H 2400 950 50  0001 C CNN
	1    2400 950 
	1    0    0    -1  
$EndComp
$Comp
L CG24-cells:B1N U5R102
U 1 1 5E9FCFFF
P 2400 1650
F 0 "U5R102" H 2400 1967 50  0000 C CNN
F 1 "B1N" H 2400 1876 50  0000 C CNN
F 2 "" H 2400 1650 50  0001 C CNN
F 3 "" H 2400 1650 50  0001 C CNN
	1    2400 1650
	1    0    0    -1  
$EndComp
$Comp
L CG24-cells:B1N U4R101
U 1 1 5EA1D362
P 2400 2350
F 0 "U4R101" H 2400 2667 50  0000 C CNN
F 1 "B1N" H 2400 2576 50  0000 C CNN
F 2 "" H 2400 2350 50  0001 C CNN
F 3 "" H 2400 2350 50  0001 C CNN
	1    2400 2350
	1    0    0    -1  
$EndComp
$Comp
L CG24-cells:B1N U2R102
U 1 1 5EA1DAAC
P 2400 3050
F 0 "U2R102" H 2400 3367 50  0000 C CNN
F 1 "B1N" H 2400 3276 50  0000 C CNN
F 2 "" H 2400 3050 50  0001 C CNN
F 3 "" H 2400 3050 50  0001 C CNN
	1    2400 3050
	1    0    0    -1  
$EndComp
$Comp
L CG24-cells:B1N U10R154
U 1 1 5EA2ED95
P 2400 3750
F 0 "U10R154" H 2400 4067 50  0000 C CNN
F 1 "B1N" H 2400 3976 50  0000 C CNN
F 2 "" H 2400 3750 50  0001 C CNN
F 3 "" H 2400 3750 50  0001 C CNN
	1    2400 3750
	1    0    0    -1  
$EndComp
$Comp
L CG24-cells:B1N U8R154
U 1 1 5EB4C039
P 2400 4450
F 0 "U8R154" H 2400 4767 50  0000 C CNN
F 1 "B1N" H 2400 4676 50  0000 C CNN
F 2 "" H 2400 4450 50  0001 C CNN
F 3 "" H 2400 4450 50  0001 C CNN
	1    2400 4450
	1    0    0    -1  
$EndComp
$Comp
L CG24-cells:B1N U9R154
U 1 1 5EB4C8A6
P 2400 5150
F 0 "U9R154" H 2400 5467 50  0000 C CNN
F 1 "B1N" H 2400 5376 50  0000 C CNN
F 2 "" H 2400 5150 50  0001 C CNN
F 3 "" H 2400 5150 50  0001 C CNN
	1    2400 5150
	1    0    0    -1  
$EndComp
$Comp
L CG24-cells:B1N U6R154
U 1 1 5EB4CD60
P 2400 5850
F 0 "U6R154" H 2400 6167 50  0000 C CNN
F 1 "B1N" H 2400 6076 50  0000 C CNN
F 2 "" H 2400 5850 50  0001 C CNN
F 3 "" H 2400 5850 50  0001 C CNN
	1    2400 5850
	1    0    0    -1  
$EndComp
$Comp
L CG24-cells:B1N U6R163
U 1 1 5EB4D2E6
P 2400 6550
F 0 "U6R163" H 2400 6867 50  0000 C CNN
F 1 "B1N" H 2400 6776 50  0000 C CNN
F 2 "" H 2400 6550 50  0001 C CNN
F 3 "" H 2400 6550 50  0001 C CNN
	1    2400 6550
	1    0    0    -1  
$EndComp
$Comp
L CG24-cells:B1N U4R174
U 1 1 5EB4D2EC
P 2400 7250
F 0 "U4R174" H 2400 7567 50  0000 C CNN
F 1 "B1N" H 2400 7476 50  0000 C CNN
F 2 "" H 2400 7250 50  0001 C CNN
F 3 "" H 2400 7250 50  0001 C CNN
	1    2400 7250
	1    0    0    -1  
$EndComp
$Comp
L CG24-cells:V1N U7R164
U 1 1 5F913AFA
P 3200 7250
F 0 "U7R164" H 3200 7567 50  0000 C CNN
F 1 "V1N" H 3200 7476 50  0000 C CNN
F 2 "" H 3200 7050 50  0001 C CNN
F 3 "" H 3200 7050 50  0001 C CNN
	1    3200 7250
	1    0    0    -1  
$EndComp
$Comp
L CG24-cells:V1N U2R123
U 1 1 5EE35747
P 3700 1350
F 0 "U2R123" H 3700 1667 50  0000 C CNN
F 1 "V1N" H 3700 1576 50  0000 C CNN
F 2 "" H 3700 1150 50  0001 C CNN
F 3 "" H 3700 1150 50  0001 C CNN
	1    3700 1350
	1    0    0    -1  
$EndComp
$Comp
L CG24-cells:R3N U4R142
U 1 1 5F03C2CD
P 6700 2000
F 0 "U4R142" H 6700 2317 50  0000 C CNN
F 1 "R3N" H 6700 2226 50  0000 C CNN
F 2 "" H 6700 2000 50  0001 C CNN
F 3 "" H 6700 2000 50  0001 C CNN
	1    6700 2000
	1    0    0    -1  
$EndComp
$Comp
L CG24-cells:R4N U4R132
U 1 1 5F0ABFF5
P 6700 3700
F 0 "U4R132" H 6700 4042 50  0000 C CNN
F 1 "R4N" H 6700 3951 50  0000 C CNN
F 2 "" H 6700 3700 50  0001 C CNN
F 3 "" H 6700 3700 50  0001 C CNN
	1    6700 3700
	1    0    0    -1  
$EndComp
$Comp
L CG24-cells:R4N U8R142
U 1 1 5F39CE38
P 6700 4400
F 0 "U8R142" H 6700 4742 50  0000 C CNN
F 1 "R4N" H 6700 4651 50  0000 C CNN
F 2 "" H 6700 4400 50  0001 C CNN
F 3 "" H 6700 4400 50  0001 C CNN
	1    6700 4400
	1    0    0    -1  
$EndComp
$Comp
L CG24-cells:N8P U6R141
U 1 1 5FF77EC0
P 6700 2800
F 0 "U6R141" H 6700 3350 50  0000 C CNN
F 1 "N8P" H 6700 3250 50  0000 C CNN
F 2 "" H 6600 3000 50  0001 C CNN
F 3 "" H 6600 3000 50  0001 C CNN
	1    6700 2800
	1    0    0    -1  
$EndComp
Wire Wire Line
	9300 1650 8850 1650
Wire Wire Line
	9300 1650 9300 3150
Text Label 2000 7250 2    50   ~ 0
ADDR14
Text Label 2000 6550 2    50   ~ 0
ADDR15
Text Label 2000 5850 2    50   ~ 0
ADDR16
Text Label 2000 5150 2    50   ~ 0
ADDR17
Text Label 2000 4450 2    50   ~ 0
ADDR18
Text Label 2000 3750 2    50   ~ 0
ADDR19
Text Label 2000 3050 2    50   ~ 0
ADDR20
Text Label 2000 2350 2    50   ~ 0
ADDR21
Text Label 2000 1650 2    50   ~ 0
ADDR22
Text Label 2000 950  2    50   ~ 0
ADDR23
Wire Wire Line
	1600 950  2100 950 
Wire Wire Line
	1600 1650 2100 1650
Wire Wire Line
	1600 2350 2100 2350
Wire Wire Line
	1600 3050 2100 3050
Wire Wire Line
	1600 3750 2100 3750
Wire Wire Line
	1600 4450 2100 4450
Wire Wire Line
	1600 5150 2100 5150
Wire Wire Line
	1600 5850 2100 5850
Wire Wire Line
	1600 6550 2100 6550
Wire Wire Line
	1600 7250 2100 7250
Wire Wire Line
	5300 1350 5300 3850
Wire Wire Line
	2700 950  3050 950 
Wire Wire Line
	3050 950  3050 1350
Connection ~ 3050 950 
Wire Wire Line
	3050 950  5200 950 
Entry Wire Line
	1500 3850 1600 3750
Entry Wire Line
	1500 3150 1600 3050
Entry Wire Line
	1500 2450 1600 2350
Entry Wire Line
	1500 1750 1600 1650
Entry Wire Line
	1500 1050 1600 950 
Entry Wire Line
	1500 4350 1600 4450
Entry Wire Line
	1500 5050 1600 5150
Entry Wire Line
	1500 5750 1600 5850
Entry Wire Line
	1500 6450 1600 6550
Entry Wire Line
	1500 7150 1600 7250
Wire Bus Line
	1500 4100 1100 4100
Connection ~ 1500 4100
Text HLabel 1100 4100 0    50   Input ~ 0
ADDR[14..23]
Text HLabel 8850 1650 0    50   Input ~ 0
~BUS-AS
Text HLabel 10150 3200 2    50   Output ~ 0
~EXPANSION-RANGE
Text HLabel 10150 4350 2    50   Output ~ 0
~REGISTER-RANGE-HI
Wire Bus Line
	1500 4100 1500 7150
Wire Bus Line
	1500 1050 1500 4100
$EndSCHEMATC
