EESchema Schematic File Version 4
EELAYER 30 0
EELAYER END
$Descr A3 16535 11693
encoding utf-8
Sheet 24 83
Title "CPS Reverse Engineering: DL-0311"
Date "2021-09-12"
Rev ""
Comp ""
Comment1 ""
Comment2 ""
Comment3 "Licence: CC-BY"
Comment4 "Author: Loïc *WydD* Petit"
$EndDescr
Connection ~ 11200 2900
Connection ~ 10100 6250
Connection ~ 10100 7050
Connection ~ 10000 6050
Connection ~ 10000 5250
Connection ~ 10000 4450
Connection ~ 11200 3300
Connection ~ 4550 5200
Connection ~ 4550 6000
Connection ~ 3550 2800
Connection ~ 3450 3950
Connection ~ 3550 3850
Connection ~ 3550 6850
Connection ~ 3450 8000
Connection ~ 4550 6800
Connection ~ 12650 4500
Connection ~ 12650 4900
Connection ~ 12800 4400
Connection ~ 12800 5000
Connection ~ 10100 5450
Connection ~ 11150 6300
Connection ~ 11150 7100
Connection ~ 11150 5500
Connection ~ 12350 6400
Connection ~ 12350 6700
Connection ~ 12350 6900
Connection ~ 12650 6200
Connection ~ 12800 6300
Connection ~ 12650 7000
Connection ~ 12550 6900
Connection ~ 12550 6100
Connection ~ 12450 6800
Connection ~ 12450 5700
Connection ~ 12650 5500
Connection ~ 12550 5400
Connection ~ 12800 5600
Connection ~ 12550 5300
Connection ~ 12450 6000
Connection ~ 12450 6100
Connection ~ 12550 5100
Connection ~ 6000 7100
Connection ~ 7900 4500
NoConn ~ 13650 6900
NoConn ~ 4150 5700
NoConn ~ 4150 4450
Entry Wire Line
	2750 2200 2850 2300
Entry Wire Line
	2750 2300 2850 2400
Entry Wire Line
	2750 2400 2850 2500
Entry Wire Line
	2750 2500 2850 2600
Entry Wire Line
	2750 3250 2850 3350
Entry Wire Line
	2750 3350 2850 3450
Entry Wire Line
	2750 3450 2850 3550
Entry Wire Line
	2750 3550 2850 3650
Entry Wire Line
	2750 4350 2850 4450
Entry Wire Line
	2750 5600 2850 5700
Entry Wire Line
	2750 6250 2850 6350
Entry Wire Line
	2750 6350 2850 6450
Entry Wire Line
	2750 6450 2850 6550
Entry Wire Line
	2750 6550 2850 6650
Entry Wire Line
	2750 7300 2850 7400
Entry Wire Line
	2750 7400 2850 7500
Entry Wire Line
	2750 7500 2850 7600
Entry Wire Line
	2750 7600 2850 7700
Entry Wire Line
	5900 5800 6000 5900
Entry Wire Line
	5900 6350 6000 6450
Entry Wire Line
	5900 6450 6000 6550
Entry Wire Line
	5900 6550 6000 6650
Entry Wire Line
	5900 6650 6000 6750
Entry Wire Line
	5900 7400 6000 7300
Entry Wire Line
	5900 7500 6000 7400
Entry Wire Line
	5900 7600 6000 7500
Entry Wire Line
	5900 7700 6000 7600
Entry Wire Line
	6050 3350 6150 3450
Entry Wire Line
	6050 3450 6150 3550
Entry Wire Line
	6050 3550 6150 3650
Entry Wire Line
	6050 3650 6150 3750
Entry Wire Line
	6050 4550 6150 4650
Entry Wire Line
	12700 7750 12800 7850
Entry Wire Line
	12700 7850 12800 7950
Entry Wire Line
	12700 7950 12800 8050
Entry Wire Line
	12700 8050 12800 8150
Wire Wire Line
	2650 2800 3550 2800
Wire Wire Line
	2650 6850 3550 6850
Wire Wire Line
	2850 2300 3650 2300
Wire Wire Line
	2850 2400 3650 2400
Wire Wire Line
	2850 2500 3650 2500
Wire Wire Line
	2850 2600 3650 2600
Wire Wire Line
	2850 3350 3650 3350
Wire Wire Line
	2850 3450 3650 3450
Wire Wire Line
	2850 3550 3650 3550
Wire Wire Line
	2850 3650 3650 3650
Wire Wire Line
	2850 4450 3650 4450
Wire Wire Line
	2850 5700 3650 5700
Wire Wire Line
	2850 6350 3650 6350
Wire Wire Line
	2850 6450 3650 6450
Wire Wire Line
	2850 6550 3650 6550
Wire Wire Line
	2850 6650 3650 6650
Wire Wire Line
	2850 7400 3650 7400
Wire Wire Line
	2850 7500 3650 7500
Wire Wire Line
	2850 7600 3650 7600
Wire Wire Line
	2850 7700 3650 7700
Wire Wire Line
	3350 3950 3450 3950
Wire Wire Line
	3350 8000 3450 8000
Wire Wire Line
	3450 2900 3450 3950
Wire Wire Line
	3450 3950 3650 3950
Wire Wire Line
	3450 6950 3450 8000
Wire Wire Line
	3450 8000 3650 8000
Wire Wire Line
	3550 3850 3550 2800
Wire Wire Line
	3550 4650 3550 3850
Wire Wire Line
	3550 5900 3550 6850
Wire Wire Line
	3550 7900 3550 6850
Wire Wire Line
	3650 2800 3550 2800
Wire Wire Line
	3650 2900 3450 2900
Wire Wire Line
	3650 3850 3550 3850
Wire Wire Line
	3650 4650 3550 4650
Wire Wire Line
	3650 5900 3550 5900
Wire Wire Line
	3650 6850 3550 6850
Wire Wire Line
	3650 6950 3450 6950
Wire Wire Line
	3650 7900 3550 7900
Wire Wire Line
	4450 2300 4900 2300
Wire Wire Line
	4450 2400 4900 2400
Wire Wire Line
	4450 2500 4900 2500
Wire Wire Line
	4450 2600 4900 2600
Wire Wire Line
	4450 3350 4650 3350
Wire Wire Line
	4450 3450 4650 3450
Wire Wire Line
	4450 3550 4650 3550
Wire Wire Line
	4450 3650 4650 3650
Wire Wire Line
	4450 6350 4650 6350
Wire Wire Line
	4450 6450 4650 6450
Wire Wire Line
	4450 6550 4650 6550
Wire Wire Line
	4450 6650 4650 6650
Wire Wire Line
	4450 7400 4650 7400
Wire Wire Line
	4450 7500 4650 7500
Wire Wire Line
	4450 7600 4650 7600
Wire Wire Line
	4450 7700 4650 7700
Wire Wire Line
	4550 3800 4650 3800
Wire Wire Line
	4550 5200 3300 5200
Wire Wire Line
	4550 5200 4550 3800
Wire Wire Line
	4550 5200 5150 5200
Wire Wire Line
	4550 6000 4550 5200
Wire Wire Line
	4550 6800 4550 6000
Wire Wire Line
	4550 6800 4650 6800
Wire Wire Line
	4550 7850 4550 6800
Wire Wire Line
	4650 7850 4550 7850
Wire Wire Line
	4750 4550 4150 4550
Wire Wire Line
	4750 5800 4150 5800
Wire Wire Line
	5050 4650 5150 4650
Wire Wire Line
	5050 5900 5150 5900
Wire Wire Line
	5150 4550 6050 4550
Wire Wire Line
	5150 5200 5150 4650
Wire Wire Line
	5150 5800 5900 5800
Wire Wire Line
	5150 5900 5150 6000
Wire Wire Line
	5150 6000 4550 6000
Wire Wire Line
	5650 3350 6050 3350
Wire Wire Line
	5650 3450 6050 3450
Wire Wire Line
	5650 3550 6050 3550
Wire Wire Line
	5650 3650 6050 3650
Wire Wire Line
	5650 6350 5900 6350
Wire Wire Line
	5650 6450 5900 6450
Wire Wire Line
	5650 6550 5900 6550
Wire Wire Line
	5650 6650 5900 6650
Wire Wire Line
	5650 7400 5900 7400
Wire Wire Line
	5650 7500 5900 7500
Wire Wire Line
	5650 7600 5900 7600
Wire Wire Line
	5650 7700 5900 7700
Wire Wire Line
	7900 4500 7700 4500
Wire Wire Line
	7900 7100 7900 4500
Wire Wire Line
	8500 7100 7900 7100
Wire Wire Line
	9050 4450 10000 4450
Wire Wire Line
	9050 7050 10100 7050
Wire Wire Line
	9200 3700 9200 6950
Wire Wire Line
	9200 6950 10200 6950
Wire Wire Line
	9300 3800 9300 6150
Wire Wire Line
	9300 6150 10200 6150
Wire Wire Line
	9400 3900 9400 5350
Wire Wire Line
	9400 5350 10200 5350
Wire Wire Line
	9500 4000 14300 4000
Wire Wire Line
	9500 4550 9500 4000
Wire Wire Line
	9550 5950 10200 5950
Wire Wire Line
	9550 5150 10200 5150
Wire Wire Line
	9600 4350 10250 4350
Wire Wire Line
	9550 6750 10200 6750
Wire Wire Line
	10000 4450 10250 4450
Wire Wire Line
	10000 5250 10000 4450
Wire Wire Line
	10000 6050 10000 5250
Wire Wire Line
	10000 6050 10000 6850
Wire Wire Line
	10100 4650 10250 4650
Wire Wire Line
	10100 5450 10100 4650
Wire Wire Line
	10100 6250 10100 5450
Wire Wire Line
	10100 7050 10100 6250
Wire Wire Line
	10200 5250 10000 5250
Wire Wire Line
	10200 5450 10100 5450
Wire Wire Line
	10200 6050 10000 6050
Wire Wire Line
	10200 6250 10100 6250
Wire Wire Line
	10200 6850 10000 6850
Wire Wire Line
	10200 7050 10100 7050
Wire Wire Line
	10250 4550 9500 4550
Wire Wire Line
	11050 5300 11250 5300
Wire Wire Line
	11050 6100 11250 6100
Wire Wire Line
	11050 6900 11250 6900
Wire Wire Line
	11100 4500 11300 4500
Wire Wire Line
	11150 4700 11300 4700
Wire Wire Line
	11150 5500 11150 4700
Wire Wire Line
	11150 6300 11150 5500
Wire Wire Line
	11150 6300 11250 6300
Wire Wire Line
	11150 7100 11150 6300
Wire Wire Line
	11150 7100 11150 7350
Wire Wire Line
	11150 7350 11050 7350
Wire Wire Line
	11200 2900 11300 2900
Wire Wire Line
	11200 3300 11200 2900
Wire Wire Line
	11200 3400 11200 3300
Wire Wire Line
	11200 3400 11300 3400
Wire Wire Line
	11250 5500 11150 5500
Wire Wire Line
	11250 7100 11150 7100
Wire Wire Line
	11300 3300 11200 3300
Wire Wire Line
	11750 6100 12450 6100
Wire Wire Line
	11750 6200 11950 6200
Wire Wire Line
	11750 6900 12350 6900
Wire Wire Line
	11800 4500 12650 4500
Wire Wire Line
	11800 4600 12150 4600
Wire Wire Line
	11850 7000 11750 7000
Wire Wire Line
	11850 8050 11850 7000
Wire Wire Line
	11900 2900 12850 2900
Wire Wire Line
	11950 7950 11950 6200
Wire Wire Line
	12050 5400 11750 5400
Wire Wire Line
	12050 5400 12050 7850
Wire Wire Line
	12150 7750 12150 4600
Wire Wire Line
	12350 4250 12350 6400
Wire Wire Line
	12350 6400 12350 6700
Wire Wire Line
	12350 6400 13650 6400
Wire Wire Line
	12350 6700 12350 6900
Wire Wire Line
	12350 6900 12350 7450
Wire Wire Line
	12450 4250 12450 5700
Wire Wire Line
	12450 5700 12450 6000
Wire Wire Line
	12450 5700 13650 5700
Wire Wire Line
	12450 6000 12450 6100
Wire Wire Line
	12450 6100 12450 6800
Wire Wire Line
	12450 6800 12450 7450
Wire Wire Line
	12550 4250 12550 5100
Wire Wire Line
	12550 5100 12550 5300
Wire Wire Line
	12550 5100 13650 5100
Wire Wire Line
	12550 5300 11750 5300
Wire Wire Line
	12550 5300 12550 5400
Wire Wire Line
	12550 5400 12550 6100
Wire Wire Line
	12550 6100 12550 6900
Wire Wire Line
	12550 6900 12550 7450
Wire Wire Line
	12650 4250 12650 4500
Wire Wire Line
	12650 4500 12650 4900
Wire Wire Line
	12650 4900 12650 5500
Wire Wire Line
	12650 5500 12650 6200
Wire Wire Line
	12650 6200 12650 7000
Wire Wire Line
	12650 7000 12650 7450
Wire Wire Line
	12800 3350 11850 3350
Wire Wire Line
	12800 3350 12800 4400
Wire Wire Line
	12800 4400 12800 5000
Wire Wire Line
	12800 4400 13650 4400
Wire Wire Line
	12800 5000 12800 5600
Wire Wire Line
	12800 5000 12900 5000
Wire Wire Line
	12800 5600 12800 6300
Wire Wire Line
	12800 5600 12900 5600
Wire Wire Line
	12800 6300 12800 7450
Wire Wire Line
	12800 6300 12900 6300
Wire Wire Line
	12850 2900 12850 7100
Wire Wire Line
	12850 7100 12900 7100
Wire Wire Line
	12900 4900 12650 4900
Wire Wire Line
	12900 5400 12550 5400
Wire Wire Line
	12900 5500 12650 5500
Wire Wire Line
	12900 6000 12450 6000
Wire Wire Line
	12900 6100 12550 6100
Wire Wire Line
	12900 6200 12650 6200
Wire Wire Line
	12900 6700 12350 6700
Wire Wire Line
	12900 6800 12450 6800
Wire Wire Line
	12900 6900 12550 6900
Wire Wire Line
	12900 7000 12650 7000
Wire Wire Line
	13450 4950 13450 5000
Wire Wire Line
	13450 5000 13650 5000
Wire Wire Line
	13500 5600 13500 5500
Wire Wire Line
	13500 6300 13500 6150
Wire Wire Line
	13650 4500 12650 4500
Wire Wire Line
	13650 5600 13500 5600
Wire Wire Line
	13650 6300 13500 6300
Wire Wire Line
	14200 5050 14400 5050
Wire Wire Line
	14200 5650 14500 5650
Wire Wire Line
	14200 6350 14600 6350
Wire Wire Line
	14300 4000 14300 4450
Wire Wire Line
	14300 4450 14200 4450
Wire Wire Line
	14400 3900 9400 3900
Wire Wire Line
	14400 5050 14400 3900
Wire Wire Line
	14500 3800 9300 3800
Wire Wire Line
	14500 5650 14500 3800
Wire Wire Line
	14600 3700 9200 3700
Wire Wire Line
	14600 3700 14600 6350
Wire Bus Line
	2750 2050 2650 2050
Wire Bus Line
	6000 7100 6150 7100
Wire Bus Line
	6150 4750 6250 4750
Wire Bus Line
	12800 8250 12900 8250
Text Notes 3300 5100 0    197  ~ 0
STAR2
Text Notes 8250 7500 0    197  ~ 0
STAR2[5..8] X
Text Notes 9350 2900 0    50   ~ 0
0 if 18-19 MOD32
Text Label 3350 2300 2    50   ~ 0
BUS-DATA8
Text Label 3350 2400 2    50   ~ 0
BUS-DATA7
Text Label 3350 2500 2    50   ~ 0
BUS-DATA6
Text Label 3350 2600 2    50   ~ 0
BUS-DATA5
Text Label 3350 3350 2    50   ~ 0
BUS-DATA4
Text Label 3350 3450 2    50   ~ 0
BUS-DATA3
Text Label 3350 3550 2    50   ~ 0
BUS-DATA2
Text Label 3350 3650 2    50   ~ 0
BUS-DATA1
Text Label 3350 4450 2    50   ~ 0
BUS-DATA0
Text Label 3350 5700 2    50   ~ 0
BUS-DATA8
Text Label 3350 6350 2    50   ~ 0
BUS-DATA7
Text Label 3350 6450 2    50   ~ 0
BUS-DATA6
Text Label 3350 6550 2    50   ~ 0
BUS-DATA5
Text Label 3350 6650 2    50   ~ 0
BUS-DATA4
Text Label 3350 7400 2    50   ~ 0
BUS-DATA3
Text Label 3350 7500 2    50   ~ 0
BUS-DATA2
Text Label 3350 7600 2    50   ~ 0
BUS-DATA1
Text Label 3350 7700 2    50   ~ 0
BUS-DATA0
Text Label 4500 2300 0    50   ~ 0
STAR-X8
Text Label 4500 2400 0    50   ~ 0
STAR-X7
Text Label 4500 2500 0    50   ~ 0
STAR-X6
Text Label 4500 2600 0    50   ~ 0
STAR-X5
Text Label 5700 3350 0    50   ~ 0
XSHIFT4
Text Label 5700 3450 0    50   ~ 0
XSHIFT3
Text Label 5700 3550 0    50   ~ 0
XSHIFT2
Text Label 5700 3650 0    50   ~ 0
XSHIFT1
Text Label 5700 4550 0    50   ~ 0
XSHIFT0
Text Label 5700 5800 0    50   ~ 0
Y8
Text Label 5700 6350 0    50   ~ 0
Y7
Text Label 5700 6450 0    50   ~ 0
Y6
Text Label 5700 6550 0    50   ~ 0
Y5
Text Label 5700 6650 0    50   ~ 0
Y4
Text Label 5700 7400 0    50   ~ 0
Y3
Text Label 5700 7500 0    50   ~ 0
Y2
Text Label 5700 7600 0    50   ~ 0
Y1
Text Label 5700 7700 0    50   ~ 0
Y0
Text Label 9550 5950 0    50   ~ 0
STAR-X7
Text Label 9550 5150 0    50   ~ 0
STAR-X6
Text Label 9600 4350 0    50   ~ 0
STAR-X5
Text Label 9550 6750 0    50   ~ 0
STAR-X8
Text HLabel 2100 2750 0    50   Input ~ 0
~STAR2-X
Text HLabel 2100 2850 0    50   Input ~ 0
~CLK4M
Text HLabel 2100 6800 0    50   Input ~ 0
~STAR2-Y
Text HLabel 2100 6900 0    50   Input ~ 0
~CLK4M
Text HLabel 2650 2050 0    50   Input ~ 0
BUS-DATA[0..8]
Text HLabel 3300 5200 0    50   Input ~ 0
~ELSE-T
Text HLabel 6150 7100 2    50   3State ~ 0
Y[0..8]
Text HLabel 6250 4750 2    50   3State ~ 0
XSHIFT[0..4]
Text HLabel 7700 4500 0    50   Input ~ 0
~LI
Text HLabel 10600 2900 0    50   Input ~ 0
~STAR2-T
Text HLabel 11050 7350 0    50   Input ~ 0
~CLK4M
Text HLabel 12900 8250 2    50   Output ~ 0
STAR2-X[0..3]
$Comp
L power:VCC #PWR0202
U 1 1 70AAB7ED
P 3350 3950
F 0 "#PWR0202" H 3350 3800 50  0001 C CNN
F 1 "VCC" H 3365 4123 50  0000 C CNN
F 2 "" H 3350 3950 50  0001 C CNN
F 3 "" H 3350 3950 50  0001 C CNN
	1    3350 3950
	1    0    0    -1  
$EndComp
$Comp
L power:VCC #PWR0203
U 1 1 711A3521
P 3350 8000
F 0 "#PWR0203" H 3350 7850 50  0001 C CNN
F 1 "VCC" H 3365 8173 50  0000 C CNN
F 2 "" H 3350 8000 50  0001 C CNN
F 3 "" H 3350 8000 50  0001 C CNN
	1    3350 8000
	1    0    0    -1  
$EndComp
$Comp
L power:VCC #PWR0204
U 1 1 65E918B0
P 8500 4400
F 0 "#PWR0204" H 8500 4250 50  0001 C CNN
F 1 "VCC" H 8515 4573 50  0000 C CNN
F 2 "" H 8500 4400 50  0001 C CNN
F 3 "" H 8500 4400 50  0001 C CNN
	1    8500 4400
	1    0    0    -1  
$EndComp
$Comp
L power:VCC #PWR0205
U 1 1 65E92025
P 8500 7000
F 0 "#PWR0205" H 8500 6850 50  0001 C CNN
F 1 "VCC" H 8515 7173 50  0000 C CNN
F 2 "" H 8500 7000 50  0001 C CNN
F 3 "" H 8500 7000 50  0001 C CNN
	1    8500 7000
	1    0    0    -1  
$EndComp
$Comp
L A5C:TINVBF UEG85
U 1 1 69C8B42A
P 4950 4550
AR Path="/611F07C1/69C8B42A" Ref="UEG85"  Part="1" 
AR Path="/612D3239/612D3CBC/69C8B42A" Ref="UEG85"  Part="1" 
F 0 "UEG85" H 4950 4815 50  0000 C CNN
F 1 "TINVBF" H 4950 4724 50  0000 C CNN
F 2 "" H 4450 4500 50  0001 C CNN
F 3 "" H 4450 4500 50  0001 C CNN
	1    4950 4550
	1    0    0    -1  
$EndComp
$Comp
L A5C:TINVBF UEJ79
U 1 1 6B24351B
P 4950 5800
AR Path="/611F07C1/6B24351B" Ref="UEJ79"  Part="1" 
AR Path="/612D3239/612D3CBC/6B24351B" Ref="UEJ79"  Part="1" 
F 0 "UEJ79" H 4950 6065 50  0000 C CNN
F 1 "TINVBF" H 4950 5974 50  0000 C CNN
F 2 "" H 4450 5750 50  0001 C CNN
F 3 "" H 4450 5750 50  0001 C CNN
	1    4950 5800
	1    0    0    -1  
$EndComp
$Comp
L A5C:OR02 UEA97
U 1 1 62C97FFB
P 2350 2800
AR Path="/611F07C1/62C97FFB" Ref="UEA97"  Part="1" 
AR Path="/612D3239/612D3CBC/62C97FFB" Ref="UEA97"  Part="1" 
F 0 "UEA97" H 2375 3067 50  0000 C CNN
F 1 "OR02" H 2375 2976 50  0000 C CNN
F 2 "" H 2400 2800 50  0001 C CNN
F 3 "" H 2400 2800 50  0001 C CNN
	1    2350 2800
	1    0    0    -1  
$EndComp
$Comp
L A5C:OR02 UEK78
U 1 1 6B2434DD
P 2350 6850
AR Path="/611F07C1/6B2434DD" Ref="UEK78"  Part="1" 
AR Path="/612D3239/612D3CBC/6B2434DD" Ref="UEK78"  Part="1" 
F 0 "UEK78" H 2375 7117 50  0000 C CNN
F 1 "OR02" H 2375 7026 50  0000 C CNN
F 2 "" H 2400 6850 50  0001 C CNN
F 3 "" H 2400 6850 50  0001 C CNN
	1    2350 6850
	1    0    0    -1  
$EndComp
$Comp
L A5C:AND02 UEA210
U 1 1 658E74EE
P 8750 4450
AR Path="/611F07C1/658E74EE" Ref="UEA210"  Part="1" 
AR Path="/612D3239/612D3CBC/658E74EE" Ref="UEA210"  Part="1" 
F 0 "UEA210" H 8775 4717 50  0000 C CNN
F 1 "AND02" H 8775 4626 50  0000 C CNN
F 2 "" H 8750 4450 50  0001 C CNN
F 3 "" H 8750 4450 50  0001 C CNN
	1    8750 4450
	1    0    0    -1  
$EndComp
$Comp
L A5C:AND02 UEB197
U 1 1 658E74F4
P 8750 7050
AR Path="/611F07C1/658E74F4" Ref="UEB197"  Part="1" 
AR Path="/612D3239/612D3CBC/658E74F4" Ref="UEB197"  Part="1" 
F 0 "UEB197" H 8775 7317 50  0000 C CNN
F 1 "AND02" H 8775 7226 50  0000 C CNN
F 2 "" H 8750 7050 50  0001 C CNN
F 3 "" H 8750 7050 50  0001 C CNN
	1    8750 7050
	1    0    0    -1  
$EndComp
$Comp
L A5C:NAND02 UEB209
U 1 1 61117B2F
P 11550 3350
AR Path="/611F07C1/61117B2F" Ref="UEB209"  Part="1" 
AR Path="/612D3239/612D3CBC/61117B2F" Ref="UEB209"  Part="1" 
F 0 "UEB209" H 11575 3617 50  0000 C CNN
F 1 "NAND02" H 11575 3526 50  0000 C CNN
F 2 "" H 11550 3350 50  0001 C CNN
F 3 "" H 11550 3350 50  0001 C CNN
	1    11550 3350
	1    0    0    -1  
$EndComp
$Comp
L A5C:NOR02 UEB219
U 1 1 61117B35
P 13150 4950
AR Path="/611F07C1/61117B35" Ref="UEB219"  Part="1" 
AR Path="/612D3239/612D3CBC/61117B35" Ref="UEB219"  Part="1" 
F 0 "UEB219" H 13175 5217 50  0000 C CNN
F 1 "NOR02" H 13175 5126 50  0000 C CNN
F 2 "" H 13150 4950 50  0001 C CNN
F 3 "" H 13150 4950 50  0001 C CNN
	1    13150 4950
	1    0    0    -1  
$EndComp
$Comp
L A5C:XOR02 UEC216
U 1 1 61117B3B
P 13900 4450
AR Path="/611F07C1/61117B3B" Ref="UEC216"  Part="1" 
AR Path="/612D3239/612D3CBC/61117B3B" Ref="UEC216"  Part="1" 
F 0 "UEC216" H 13925 4717 50  0000 C CNN
F 1 "XOR02" H 13925 4626 50  0000 C CNN
F 2 "" H 13900 4450 50  0001 C CNN
F 3 "" H 13900 4450 50  0001 C CNN
	1    13900 4450
	1    0    0    -1  
$EndComp
$Comp
L A5C:XNOR02 UEB211
U 1 1 61117B41
P 13900 5050
AR Path="/611F07C1/61117B41" Ref="UEB211"  Part="1" 
AR Path="/612D3239/612D3CBC/61117B41" Ref="UEB211"  Part="1" 
F 0 "UEB211" H 13925 5317 50  0000 C CNN
F 1 "XNOR02" H 13925 5226 50  0000 C CNN
F 2 "" H 13925 5050 50  0001 C CNN
F 3 "" H 13925 5050 50  0001 C CNN
	1    13900 5050
	1    0    0    -1  
$EndComp
$Comp
L A5C:XNOR02 UED212
U 1 1 61117B47
P 13900 5650
AR Path="/611F07C1/61117B47" Ref="UED212"  Part="1" 
AR Path="/612D3239/612D3CBC/61117B47" Ref="UED212"  Part="1" 
F 0 "UED212" H 13925 5917 50  0000 C CNN
F 1 "XNOR02" H 13925 5826 50  0000 C CNN
F 2 "" H 13925 5650 50  0001 C CNN
F 3 "" H 13925 5650 50  0001 C CNN
	1    13900 5650
	1    0    0    -1  
$EndComp
$Comp
L A5C:XNOR02 UEA212
U 1 1 64D82512
P 13900 6350
AR Path="/611F07C1/64D82512" Ref="UEA212"  Part="1" 
AR Path="/612D3239/612D3CBC/64D82512" Ref="UEA212"  Part="1" 
F 0 "UEA212" H 13925 6617 50  0000 C CNN
F 1 "XNOR02" H 13925 6526 50  0000 C CNN
F 2 "" H 13925 6350 50  0001 C CNN
F 3 "" H 13925 6350 50  0001 C CNN
	1    13900 6350
	1    0    0    -1  
$EndComp
$Comp
L A5C:INV01 UEA207
U 1 1 65E969DC
P 8200 4500
AR Path="/611F07C1/65E969DC" Ref="UEA207"  Part="1" 
AR Path="/612D3239/612D3CBC/65E969DC" Ref="UEA207"  Part="1" 
F 0 "UEA207" H 8200 4817 50  0000 C CNN
F 1 "INV01" H 8200 4726 50  0000 C CNN
F 2 "" H 8200 4300 50  0001 C CNN
F 3 "" H 8200 4300 50  0001 C CNN
	1    8200 4500
	1    0    0    -1  
$EndComp
$Comp
L A5C:INV01 UEB202
U 1 1 6415ADD9
P 10900 2900
AR Path="/611F07C1/6415ADD9" Ref="UEB202"  Part="1" 
AR Path="/612D3239/612D3CBC/6415ADD9" Ref="UEB202"  Part="1" 
F 0 "UEB202" H 10900 3217 50  0000 C CNN
F 1 "INV01" H 10900 3126 50  0000 C CNN
F 2 "" H 10900 2700 50  0001 C CNN
F 3 "" H 10900 2700 50  0001 C CNN
	1    10900 2900
	1    0    0    -1  
$EndComp
$Comp
L A5C:INV01 UEB208
U 1 1 61117B53
P 11600 2900
AR Path="/611F07C1/61117B53" Ref="UEB208"  Part="1" 
AR Path="/612D3239/612D3CBC/61117B53" Ref="UEB208"  Part="1" 
F 0 "UEB208" H 11600 3217 50  0000 C CNN
F 1 "INV01" H 11600 3126 50  0000 C CNN
F 2 "" H 11600 2700 50  0001 C CNN
F 3 "" H 11600 2700 50  0001 C CNN
	1    11600 2900
	1    0    0    -1  
$EndComp
$Comp
L A5C:NOR03 UEB217
U 1 1 61117B59
P 13200 5500
AR Path="/611F07C1/61117B59" Ref="UEB217"  Part="1" 
AR Path="/612D3239/612D3CBC/61117B59" Ref="UEB217"  Part="1" 
F 0 "UEB217" H 13200 5817 50  0000 C CNN
F 1 "NOR03" H 13200 5726 50  0000 C CNN
F 2 "" H 13200 5500 50  0001 C CNN
F 3 "" H 13200 5500 50  0001 C CNN
	1    13200 5500
	1    0    0    -1  
$EndComp
$Comp
L A5C:DFFCOO UEG81
U 1 1 653FE474
P 3900 4550
AR Path="/611F07C1/653FE474" Ref="UEG81"  Part="1" 
AR Path="/612D3239/612D3CBC/653FE474" Ref="UEG81"  Part="1" 
F 0 "UEG81" H 3900 4915 50  0000 C CNN
F 1 "DFFCOO" H 3900 4824 50  0000 C CNN
F 2 "" H 3900 4550 50  0001 C CNN
F 3 "" H 3900 4550 50  0001 C CNN
	1    3900 4550
	1    0    0    -1  
$EndComp
$Comp
L A5C:DFFCOO UEJ82
U 1 1 6B2434F4
P 3900 5800
AR Path="/611F07C1/6B2434F4" Ref="UEJ82"  Part="1" 
AR Path="/612D3239/612D3CBC/6B2434F4" Ref="UEJ82"  Part="1" 
F 0 "UEJ82" H 3900 6165 50  0000 C CNN
F 1 "DFFCOO" H 3900 6074 50  0000 C CNN
F 2 "" H 3900 5800 50  0001 C CNN
F 3 "" H 3900 5800 50  0001 C CNN
	1    3900 5800
	1    0    0    -1  
$EndComp
$Comp
L A5C:NOR04 UEA215
U 1 1 61117B77
P 13200 6150
AR Path="/611F07C1/61117B77" Ref="UEA215"  Part="1" 
AR Path="/612D3239/612D3CBC/61117B77" Ref="UEA215"  Part="1" 
F 0 "UEA215" H 13200 6492 50  0000 C CNN
F 1 "NOR04" H 13200 6401 50  0000 C CNN
F 2 "" H 13200 6150 50  0001 C CNN
F 3 "" H 13200 6150 50  0001 C CNN
	1    13200 6150
	1    0    0    -1  
$EndComp
$Comp
L A5C:NOR05 UEB214
U 1 1 61117B95
P 13200 6900
AR Path="/611F07C1/61117B95" Ref="UEB214"  Part="1" 
AR Path="/612D3239/612D3CBC/61117B95" Ref="UEB214"  Part="1" 
F 0 "UEB214" H 13275 7315 50  0000 C CNN
F 1 "NOR05" H 13275 7224 50  0000 C CNN
F 2 "" H 13200 6950 50  0001 C CNN
F 3 "" H 13200 6950 50  0001 C CNN
	1    13200 6900
	1    0    0    -1  
$EndComp
$Comp
L A5C:M175C UEE132
U 1 1 630CDB56
P 4050 2600
AR Path="/611F07C1/630CDB56" Ref="UEE132"  Part="1" 
AR Path="/612D3239/612D3CBC/630CDB56" Ref="UEE132"  Part="1" 
F 0 "UEE132" H 4050 3165 50  0000 C CNN
F 1 "M175C" H 4050 3074 50  0000 C CNN
F 2 "" H 4050 2400 50  0001 C CNN
F 3 "" H 4050 2400 50  0001 C CNN
	1    4050 2600
	1    0    0    -1  
$EndComp
$Comp
L A5C:M175CL UEK82
U 1 1 664E31AE
P 4050 3650
AR Path="/611F07C1/664E31AE" Ref="UEK82"  Part="1" 
AR Path="/612D3239/612D3CBC/664E31AE" Ref="UEK82"  Part="1" 
F 0 "UEK82" H 4050 4215 50  0000 C CNN
F 1 "M175CL" H 4050 4124 50  0000 C CNN
F 2 "" H 4050 3450 50  0001 C CNN
F 3 "" H 4050 3450 50  0001 C CNN
	1    4050 3650
	1    0    0    -1  
$EndComp
$Comp
L A5C:M175CL UEK9
U 1 1 6CFB2033
P 4050 6650
AR Path="/611F07C1/6CFB2033" Ref="UEK9"  Part="1" 
AR Path="/612D3239/612D3CBC/6CFB2033" Ref="UEK9"  Part="1" 
F 0 "UEK9" H 4050 7215 50  0000 C CNN
F 1 "M175CL" H 4050 7124 50  0000 C CNN
F 2 "" H 4050 6450 50  0001 C CNN
F 3 "" H 4050 6450 50  0001 C CNN
	1    4050 6650
	1    0    0    -1  
$EndComp
$Comp
L A5C:M175CL UEK33
U 1 1 6B243500
P 4050 7700
AR Path="/611F07C1/6B243500" Ref="UEK33"  Part="1" 
AR Path="/612D3239/612D3CBC/6B243500" Ref="UEK33"  Part="1" 
F 0 "UEK33" H 4050 8265 50  0000 C CNN
F 1 "M175CL" H 4050 8174 50  0000 C CNN
F 2 "" H 4050 7500 50  0001 C CNN
F 3 "" H 4050 7500 50  0001 C CNN
	1    4050 7700
	1    0    0    -1  
$EndComp
$Comp
L A5C:M368C UCC?
U 1 1 68D98830
P 5150 3600
AR Path="/604B5523/68D98830" Ref="UCC?"  Part="1" 
AR Path="/68D98830" Ref="UEJ88"  Part="1" 
AR Path="/60DE1519/68D98830" Ref="UEJ88"  Part="1" 
AR Path="/611F07C1/68D98830" Ref="UEJ88"  Part="1" 
AR Path="/612D3239/612D3CBC/68D98830" Ref="UEJ88"  Part="1" 
F 0 "UEJ88" H 5150 4110 50  0000 C CNN
F 1 "M368C" H 5150 4020 50  0000 C CNN
F 2 "" H 5450 3400 50  0001 C CNN
F 3 "" H 5450 3400 50  0001 C CNN
	1    5150 3600
	1    0    0    -1  
$EndComp
$Comp
L A5C:M368C UEJ?
U 1 1 6D8C1A8C
P 5150 6600
AR Path="/604B5523/6D8C1A8C" Ref="UEJ?"  Part="1" 
AR Path="/6D8C1A8C" Ref="UEJ0"  Part="1" 
AR Path="/60DE1519/6D8C1A8C" Ref="UEJ0"  Part="1" 
AR Path="/611F07C1/6D8C1A8C" Ref="UEJ0"  Part="1" 
AR Path="/612D3239/612D3CBC/6D8C1A8C" Ref="UEJ0"  Part="1" 
F 0 "UEJ0" H 5150 7110 50  0000 C CNN
F 1 "M368C" H 5150 7020 50  0000 C CNN
F 2 "" H 5450 6400 50  0001 C CNN
F 3 "" H 5450 6400 50  0001 C CNN
	1    5150 6600
	1    0    0    -1  
$EndComp
$Comp
L A5C:M368C UEJ?
U 1 1 6B243511
P 5150 7650
AR Path="/604B5523/6B243511" Ref="UEJ?"  Part="1" 
AR Path="/6B243511" Ref="UEJ28"  Part="1" 
AR Path="/60DE1519/6B243511" Ref="UEJ28"  Part="1" 
AR Path="/611F07C1/6B243511" Ref="UEJ28"  Part="1" 
AR Path="/612D3239/612D3CBC/6B243511" Ref="UEJ28"  Part="1" 
F 0 "UEJ28" H 5150 8160 50  0000 C CNN
F 1 "M368C" H 5150 8070 50  0000 C CNN
F 2 "" H 5450 7450 50  0001 C CNN
F 3 "" H 5450 7450 50  0001 C CNN
	1    5150 7650
	1    0    0    -1  
$EndComp
Wire Wire Line
	11950 7950 12700 7950
Wire Wire Line
	12050 7850 12700 7850
Wire Wire Line
	12150 7750 12700 7750
Text Label 12600 7750 2    50   ~ 0
STAR2-X0
Text Label 12600 7850 2    50   ~ 0
STAR2-X1
Text Label 12600 7950 2    50   ~ 0
STAR2-X2
Text Label 12600 8050 2    50   ~ 0
STAR2-X3
Wire Wire Line
	11850 8050 12700 8050
$Comp
L A5C:DFFCOO UED215
U 1 1 61117B6B
P 11550 4600
AR Path="/611F07C1/61117B6B" Ref="UED215"  Part="1" 
AR Path="/612D3239/612D3CBC/61117B6B" Ref="UED215"  Part="1" 
F 0 "UED215" H 11550 4965 50  0000 C CNN
F 1 "DFFCOO" H 11550 4874 50  0000 C CNN
F 2 "" H 11550 4600 50  0001 C CNN
F 3 "" H 11550 4600 50  0001 C CNN
	1    11550 4600
	1    0    0    -1  
$EndComp
$Comp
L A5C:DFFCOO UEA203
U 1 1 61117B71
P 11500 7000
AR Path="/611F07C1/61117B71" Ref="UEA203"  Part="1" 
AR Path="/612D3239/612D3CBC/61117B71" Ref="UEA203"  Part="1" 
F 0 "UEA203" H 11500 7365 50  0000 C CNN
F 1 "DFFCOO" H 11500 7274 50  0000 C CNN
F 2 "" H 11500 7000 50  0001 C CNN
F 3 "" H 11500 7000 50  0001 C CNN
	1    11500 7000
	1    0    0    -1  
$EndComp
$Comp
L A5C:DFFCOO UEF214
U 1 1 61117B65
P 11500 6200
AR Path="/611F07C1/61117B65" Ref="UEF214"  Part="1" 
AR Path="/612D3239/612D3CBC/61117B65" Ref="UEF214"  Part="1" 
F 0 "UEF214" H 11500 6565 50  0000 C CNN
F 1 "DFFCOO" H 11500 6474 50  0000 C CNN
F 2 "" H 11500 6200 50  0001 C CNN
F 3 "" H 11500 6200 50  0001 C CNN
	1    11500 6200
	1    0    0    -1  
$EndComp
$Comp
L A5C:DFFCOO UEC212
U 1 1 61117B5F
P 11500 5400
AR Path="/611F07C1/61117B5F" Ref="UEC212"  Part="1" 
AR Path="/612D3239/612D3CBC/61117B5F" Ref="UEC212"  Part="1" 
F 0 "UEC212" H 11500 5765 50  0000 C CNN
F 1 "DFFCOO" H 11500 5674 50  0000 C CNN
F 2 "" H 11500 5400 50  0001 C CNN
F 3 "" H 11500 5400 50  0001 C CNN
	1    11500 5400
	1    0    0    -1  
$EndComp
$Comp
L A5C:AOI22 UED210
U 1 1 61117B89
P 10650 4450
AR Path="/611F07C1/61117B89" Ref="UED210"  Part="1" 
AR Path="/612D3239/612D3CBC/61117B89" Ref="UED210"  Part="1" 
F 0 "UED210" H 10675 4767 50  0000 C CNN
F 1 "AOI22" H 10675 4676 50  0000 C CNN
F 2 "" H 10800 4450 50  0001 C CNN
F 3 "" H 10800 4450 50  0001 C CNN
	1    10650 4450
	1    0    0    -1  
$EndComp
$Comp
L A5C:AOI22 UEA200
U 1 1 61117B8F
P 10600 6850
AR Path="/611F07C1/61117B8F" Ref="UEA200"  Part="1" 
AR Path="/612D3239/612D3CBC/61117B8F" Ref="UEA200"  Part="1" 
F 0 "UEA200" H 10625 7167 50  0000 C CNN
F 1 "AOI22" H 10625 7076 50  0000 C CNN
F 2 "" H 10750 6850 50  0001 C CNN
F 3 "" H 10750 6850 50  0001 C CNN
	1    10600 6850
	1    0    0    -1  
$EndComp
$Comp
L A5C:AOI22 UED207
U 1 1 61117B83
P 10600 6050
AR Path="/611F07C1/61117B83" Ref="UED207"  Part="1" 
AR Path="/612D3239/612D3CBC/61117B83" Ref="UED207"  Part="1" 
F 0 "UED207" H 10625 6367 50  0000 C CNN
F 1 "AOI22" H 10625 6276 50  0000 C CNN
F 2 "" H 10750 6050 50  0001 C CNN
F 3 "" H 10750 6050 50  0001 C CNN
	1    10600 6050
	1    0    0    -1  
$EndComp
$Comp
L A5C:AOI22 UEC209
U 1 1 61117B7D
P 10600 5250
AR Path="/611F07C1/61117B7D" Ref="UEC209"  Part="1" 
AR Path="/612D3239/612D3CBC/61117B7D" Ref="UEC209"  Part="1" 
F 0 "UEC209" H 10625 5567 50  0000 C CNN
F 1 "AOI22" H 10625 5476 50  0000 C CNN
F 2 "" H 10750 5250 50  0001 C CNN
F 3 "" H 10750 5250 50  0001 C CNN
	1    10600 5250
	1    0    0    -1  
$EndComp
Wire Bus Line
	12800 7850 12800 8250
Wire Bus Line
	6150 3450 6150 4750
Wire Bus Line
	6000 7100 6000 7600
Wire Bus Line
	6000 5900 6000 7100
Wire Bus Line
	2750 2050 2750 7600
$EndSCHEMATC
