EESchema Schematic File Version 4
EELAYER 30 0
EELAYER END
$Descr A4 11693 8268
encoding utf-8
Sheet 31 83
Title "CPS Reverse Engineering: DL-0311"
Date "2021-09-12"
Rev ""
Comp ""
Comment1 ""
Comment2 ""
Comment3 "Licence: CC-BY"
Comment4 "Author: Loïc *WydD* Petit"
$EndDescr
Connection ~ 5300 4500
Connection ~ 3500 1600
Connection ~ 4000 1400
Connection ~ 3600 1500
Connection ~ 3700 1400
Connection ~ 3300 4550
Connection ~ 3400 4650
Connection ~ 3100 4350
Connection ~ 3200 4450
Connection ~ 5300 1950
Connection ~ 4000 3950
Connection ~ 5400 5100
Connection ~ 5400 3600
Connection ~ 5400 1050
Connection ~ 5400 2550
Entry Wire Line
	1550 5200 1650 5300
Entry Wire Line
	1650 4250 1750 4350
Entry Wire Line
	1650 4350 1750 4450
Entry Wire Line
	6950 1000 7050 900 
Entry Wire Line
	6950 1500 7050 1400
Entry Wire Line
	6950 2000 7050 1900
Entry Wire Line
	6950 2500 7050 2400
Entry Wire Line
	6950 3550 7050 3450
Entry Wire Line
	6950 4050 7050 3950
Entry Wire Line
	6950 4550 7050 4450
Entry Wire Line
	6950 5050 7050 4950
Wire Wire Line
	1100 7100 1550 7100
Wire Wire Line
	1550 1400 3700 1400
Wire Wire Line
	1550 1500 3600 1500
Wire Wire Line
	1550 1600 3500 1600
Wire Wire Line
	1550 4550 3300 4550
Wire Wire Line
	1550 4650 3400 4650
Wire Wire Line
	1550 5950 1100 5950
Wire Wire Line
	1650 5300 2000 5300
Wire Wire Line
	1750 4350 3100 4350
Wire Wire Line
	1750 4450 3200 4450
Wire Wire Line
	2400 6100 2400 5900
Wire Wire Line
	2400 6400 2400 6200
Wire Wire Line
	2400 7250 2400 7050
Wire Wire Line
	2400 7550 2400 7350
Wire Wire Line
	2950 6150 3150 6150
Wire Wire Line
	2950 7300 3150 7300
Wire Wire Line
	3000 2300 4000 2300
Wire Wire Line
	3000 4850 4000 4850
Wire Wire Line
	3100 1800 3100 4350
Wire Wire Line
	3100 1800 4000 1800
Wire Wire Line
	3100 4350 4000 4350
Wire Wire Line
	3200 4450 3200 1900
Wire Wire Line
	3200 4450 4000 4450
Wire Wire Line
	3300 2000 3300 4550
Wire Wire Line
	3300 2000 4000 2000
Wire Wire Line
	3300 4550 4000 4550
Wire Wire Line
	3400 4650 3400 2100
Wire Wire Line
	3400 4650 4000 4650
Wire Wire Line
	3500 1600 4000 1600
Wire Wire Line
	3500 4150 3500 1600
Wire Wire Line
	3600 1500 3600 4050
Wire Wire Line
	3600 4050 4000 4050
Wire Wire Line
	3700 1400 3700 3950
Wire Wire Line
	3700 1400 4000 1400
Wire Wire Line
	3700 6100 3950 6100
Wire Wire Line
	3700 7250 3950 7250
Wire Wire Line
	4000 1300 4000 1400
Wire Wire Line
	4000 1500 3600 1500
Wire Wire Line
	4000 1900 3200 1900
Wire Wire Line
	4000 2100 3400 2100
Wire Wire Line
	4000 3850 4000 3950
Wire Wire Line
	4000 3950 3700 3950
Wire Wire Line
	4000 4150 3500 4150
Wire Wire Line
	5000 1550 5200 1550
Wire Wire Line
	5000 1650 5300 1650
Wire Wire Line
	5000 1850 5200 1850
Wire Wire Line
	5000 4100 5200 4100
Wire Wire Line
	5000 4200 5300 4200
Wire Wire Line
	5000 4400 5200 4400
Wire Wire Line
	5150 1050 5400 1050
Wire Wire Line
	5150 2550 5400 2550
Wire Wire Line
	5150 3600 5400 3600
Wire Wire Line
	5150 5100 5400 5100
Wire Wire Line
	5200 950  5500 950 
Wire Wire Line
	5200 1550 5200 950 
Wire Wire Line
	5200 1850 5200 3000
Wire Wire Line
	5200 3000 5400 3000
Wire Wire Line
	5200 3500 5500 3500
Wire Wire Line
	5200 4100 5200 3500
Wire Wire Line
	5200 4400 5200 5550
Wire Wire Line
	5200 5550 5400 5550
Wire Wire Line
	5300 1450 5500 1450
Wire Wire Line
	5300 1650 5300 1450
Wire Wire Line
	5300 1750 5000 1750
Wire Wire Line
	5300 1750 5300 1950
Wire Wire Line
	5300 1950 5300 2450
Wire Wire Line
	5300 4000 5500 4000
Wire Wire Line
	5300 4200 5300 4000
Wire Wire Line
	5300 4300 5000 4300
Wire Wire Line
	5300 4300 5300 4500
Wire Wire Line
	5300 4500 5300 5000
Wire Wire Line
	5400 1050 5500 1050
Wire Wire Line
	5400 1550 5400 1050
Wire Wire Line
	5400 2050 5400 2550
Wire Wire Line
	5400 2550 5500 2550
Wire Wire Line
	5400 3600 5500 3600
Wire Wire Line
	5400 4100 5400 3600
Wire Wire Line
	5400 4600 5400 5100
Wire Wire Line
	5400 5100 5500 5100
Wire Wire Line
	5500 1550 5400 1550
Wire Wire Line
	5500 1950 5300 1950
Wire Wire Line
	5500 2050 5400 2050
Wire Wire Line
	5500 2450 5300 2450
Wire Wire Line
	5500 4100 5400 4100
Wire Wire Line
	5500 4500 5300 4500
Wire Wire Line
	5500 4600 5400 4600
Wire Wire Line
	5500 5000 5300 5000
Wire Wire Line
	6650 1500 6950 1500
Wire Wire Line
	6650 2500 6950 2500
Wire Wire Line
	6650 4050 6950 4050
Wire Wire Line
	6650 5050 6950 5050
Wire Wire Line
	6950 1000 6650 1000
Wire Wire Line
	6950 2000 6650 2000
Wire Wire Line
	6950 3550 6650 3550
Wire Wire Line
	6950 4550 6650 4550
Wire Bus Line
	1450 5200 1550 5200
Wire Bus Line
	1650 4150 1550 4150
Wire Bus Line
	7250 700  7050 700 
Wire Bus Line
	7250 1650 7050 1650
Wire Bus Line
	7250 3250 7050 3250
Wire Bus Line
	7250 4200 7050 4200
Text Notes 1050 4050 0    50   ~ 0
WRITE LINE
Text Notes 1150 1300 0    50   ~ 0
READ LINE
Text Label 1100 5950 0    50   ~ 0
COL4
Text Label 1100 7100 0    50   ~ 0
COL4
Text Label 1700 5300 0    50   ~ 0
COL4
Text Label 1750 1400 0    50   ~ 0
R-CAS
Text Label 1750 1500 0    50   ~ 0
R-SOE
Text Label 1750 4350 0    50   ~ 0
W-CAS0
Text Label 1750 4450 0    50   ~ 0
W-CAS1
Text Label 1750 4550 0    50   ~ 0
W-SOE
Text Label 6650 1000 0    50   ~ 0
~ACAS0
Text Label 6650 1500 0    50   ~ 0
~ACAS1
Text Label 6650 2000 0    50   ~ 0
~ASOE0
Text Label 6650 2500 0    50   ~ 0
~ASOE1
Text Label 6650 3550 0    50   ~ 0
~BCAS0
Text Label 6650 4050 0    50   ~ 0
~BCAS1
Text Label 6650 4550 0    50   ~ 0
~BSOE0
Text Label 6650 5050 0    50   ~ 0
~BSOE1
Text HLabel 1450 5200 0    50   Input ~ 0
COL[4..4]
Text HLabel 1550 1400 0    50   Input ~ 0
R-CAS
Text HLabel 1550 1500 0    50   Input ~ 0
R-SOE
Text HLabel 1550 4150 0    50   Input ~ 0
W-CAS[0..1]
Text HLabel 1550 4550 0    50   Input ~ 0
W-SOE
Text HLabel 1550 5750 0    50   Input ~ 0
SPRITE-X0
Text HLabel 1550 5850 0    50   Input ~ 0
FRAME
Text HLabel 1550 6050 0    50   Input ~ 0
FWE
Text HLabel 1550 6900 0    50   Input ~ 0
~FRAME
Text HLabel 1550 7000 0    50   Input ~ 0
SPRITE-X0
Text HLabel 1550 7200 0    50   Input ~ 0
FWE
Text HLabel 1850 6350 0    50   Input ~ 0
~FRAME
Text HLabel 1850 6450 0    50   Input ~ 0
~FLIP
Text HLabel 1850 7500 0    50   Input ~ 0
FRAME
Text HLabel 1850 7600 0    50   Input ~ 0
~FLIP
Text HLabel 3000 2300 0    50   Input ~ 0
A-WRITE
Text HLabel 3000 4850 0    50   Input ~ 0
B-WRITE
Text HLabel 3150 6050 0    50   Input ~ 0
CLK4M
Text HLabel 3150 7200 0    50   Input ~ 0
CLK4M
Text HLabel 3950 6200 0    50   Input ~ 0
CLK8M
Text HLabel 3950 7350 0    50   Input ~ 0
CLK8M
Text HLabel 5100 6150 2    50   Output ~ 0
~ASCK
Text HLabel 5100 7300 2    50   Output ~ 0
~BSCK
Text HLabel 5150 1050 0    50   Input ~ 0
CLK8M
Text HLabel 5150 2550 0    50   Input ~ 0
CLK4M
Text HLabel 5150 3600 0    50   Input ~ 0
CLK8M
Text HLabel 5150 5100 0    50   Input ~ 0
CLK4M
Text HLabel 7250 700  2    50   Output ~ 0
~ACAS[0..1]
Text HLabel 7250 1650 2    50   Output ~ 0
~ASOE[0..1]
Text HLabel 7250 3250 2    50   Output ~ 0
~BCAS[0..1]
Text HLabel 7250 4200 2    50   Output ~ 0
~BSOE[0..1]
Text HLabel 10200 3000 2    50   Output ~ 0
~ADTOE
Text HLabel 10200 5550 2    50   Output ~ 0
~BDTOE
$Comp
L power:GND #PWR0244
U 1 1 61810570
P 4000 2450
F 0 "#PWR0244" H 4000 2200 50  0001 C CNN
F 1 "GND" H 4005 2277 50  0001 C CNN
F 2 "" H 4000 2450 50  0001 C CNN
F 3 "" H 4000 2450 50  0001 C CNN
	1    4000 2450
	1    0    0    -1  
$EndComp
$Comp
L power:GND #PWR0245
U 1 1 63B42800
P 4000 5000
F 0 "#PWR0245" H 4000 4750 50  0001 C CNN
F 1 "GND" H 4005 4827 50  0001 C CNN
F 2 "" H 4000 5000 50  0001 C CNN
F 3 "" H 4000 5000 50  0001 C CNN
	1    4000 5000
	1    0    0    -1  
$EndComp
$Comp
L A5C:NAND02 UDJ80
U 1 1 61118E67
P 2100 6400
F 0 "UDJ80" H 2125 6667 50  0000 C CNN
F 1 "NAND02" H 2125 6576 50  0000 C CNN
F 2 "" H 2100 6400 50  0001 C CNN
F 3 "" H 2100 6400 50  0001 C CNN
	1    2100 6400
	1    0    0    -1  
$EndComp
$Comp
L A5C:NAND02 UDJ81
U 1 1 61118E6A
P 2100 7550
F 0 "UDJ81" H 2125 7817 50  0000 C CNN
F 1 "NAND02" H 2125 7726 50  0000 C CNN
F 2 "" H 2100 7550 50  0001 C CNN
F 3 "" H 2100 7550 50  0001 C CNN
	1    2100 7550
	1    0    0    -1  
$EndComp
$Comp
L A5C:XNOR02 UDJ75
U 1 1 61118E69
P 2650 6150
F 0 "UDJ75" H 2675 6417 50  0000 C CNN
F 1 "XNOR02" H 2675 6326 50  0000 C CNN
F 2 "" H 2675 6150 50  0001 C CNN
F 3 "" H 2675 6150 50  0001 C CNN
	1    2650 6150
	1    0    0    -1  
$EndComp
$Comp
L A5C:XNOR02 UDI82
U 1 1 61118E65
P 2650 7300
F 0 "UDI82" H 2675 7567 50  0000 C CNN
F 1 "XNOR02" H 2675 7476 50  0000 C CNN
F 2 "" H 2675 7300 50  0001 C CNN
F 3 "" H 2675 7300 50  0001 C CNN
	1    2650 7300
	1    0    0    -1  
$EndComp
$Comp
L A5C:XNOR02 UDJ35
U 1 1 61118E6C
P 3400 6100
F 0 "UDJ35" H 3425 6367 50  0000 C CNN
F 1 "XNOR02" H 3425 6276 50  0000 C CNN
F 2 "" H 3425 6100 50  0001 C CNN
F 3 "" H 3425 6100 50  0001 C CNN
	1    3400 6100
	1    0    0    -1  
$EndComp
$Comp
L A5C:XNOR02 UDE82
U 1 1 61118E66
P 3400 7250
F 0 "UDE82" H 3425 7517 50  0000 C CNN
F 1 "XNOR02" H 3425 7426 50  0000 C CNN
F 2 "" H 3425 7250 50  0001 C CNN
F 3 "" H 3425 7250 50  0001 C CNN
	1    3400 7250
	1    0    0    -1  
$EndComp
$Comp
L A5C:NAND02 UDJ29
U 1 1 61C190A7
P 4200 6150
F 0 "UDJ29" H 4225 6417 50  0000 C CNN
F 1 "NAND02" H 4225 6326 50  0000 C CNN
F 2 "" H 4200 6150 50  0001 C CNN
F 3 "" H 4200 6150 50  0001 C CNN
	1    4200 6150
	1    0    0    -1  
$EndComp
$Comp
L A5C:NAND02 UDE85
U 1 1 6D234C60
P 4200 7300
F 0 "UDE85" H 4225 7567 50  0000 C CNN
F 1 "NAND02" H 4225 7476 50  0000 C CNN
F 2 "" H 4200 7300 50  0001 C CNN
F 3 "" H 4200 7300 50  0001 C CNN
	1    4200 7300
	1    0    0    -1  
$EndComp
$Comp
L A5C:NAND02 UDI0
U 1 1 61844312
P 5750 1000
F 0 "UDI0" H 5775 1267 50  0000 C CNN
F 1 "NAND02" H 5775 1176 50  0000 C CNN
F 2 "" H 5750 1000 50  0001 C CNN
F 3 "" H 5750 1000 50  0001 C CNN
	1    5750 1000
	1    0    0    -1  
$EndComp
$Comp
L A5C:NAND02 UDI25
U 1 1 61844318
P 5750 1500
F 0 "UDI25" H 5775 1233 50  0000 C CNN
F 1 "NAND02" H 5775 1324 50  0000 C CNN
F 2 "" H 5750 1500 50  0001 C CNN
F 3 "" H 5750 1500 50  0001 C CNN
	1    5750 1500
	1    0    0    1   
$EndComp
$Comp
L A5C:XNOR02 UDG10
U 1 1 61915A5B
P 5750 2000
F 0 "UDG10" H 5775 2267 50  0000 C CNN
F 1 "XNOR02" H 5775 2176 50  0000 C CNN
F 2 "" H 5775 2000 50  0001 C CNN
F 3 "" H 5775 2000 50  0001 C CNN
	1    5750 2000
	1    0    0    -1  
$EndComp
$Comp
L A5C:XNOR02 UDG7
U 1 1 618F2515
P 5750 2500
F 0 "UDG7" H 5775 2767 50  0000 C CNN
F 1 "XNOR02" H 5775 2676 50  0000 C CNN
F 2 "" H 5775 2500 50  0001 C CNN
F 3 "" H 5775 2500 50  0001 C CNN
	1    5750 2500
	1    0    0    -1  
$EndComp
$Comp
L A5C:NAND02 UDK15
U 1 1 63B42815
P 5750 3550
F 0 "UDK15" H 5775 3817 50  0000 C CNN
F 1 "NAND02" H 5775 3726 50  0000 C CNN
F 2 "" H 5750 3550 50  0001 C CNN
F 3 "" H 5750 3550 50  0001 C CNN
	1    5750 3550
	1    0    0    -1  
$EndComp
$Comp
L A5C:NAND02 UDI4
U 1 1 63B4281B
P 5750 4050
F 0 "UDI4" H 5775 3783 50  0000 C CNN
F 1 "NAND02" H 5775 3874 50  0000 C CNN
F 2 "" H 5750 4050 50  0001 C CNN
F 3 "" H 5750 4050 50  0001 C CNN
	1    5750 4050
	1    0    0    1   
$EndComp
$Comp
L A5C:XNOR02 UDK40
U 1 1 63B4280C
P 5750 4550
F 0 "UDK40" H 5775 4817 50  0000 C CNN
F 1 "XNOR02" H 5775 4726 50  0000 C CNN
F 2 "" H 5775 4550 50  0001 C CNN
F 3 "" H 5775 4550 50  0001 C CNN
	1    5750 4550
	1    0    0    -1  
$EndComp
$Comp
L A5C:XNOR02 UDL132
U 1 1 63B42806
P 5750 5050
F 0 "UDL132" H 5775 5317 50  0000 C CNN
F 1 "XNOR02" H 5775 5226 50  0000 C CNN
F 2 "" H 5775 5050 50  0001 C CNN
F 3 "" H 5775 5050 50  0001 C CNN
	1    5750 5050
	1    0    0    -1  
$EndComp
$Comp
L A5C:BUF12 UDJ26
U 1 1 61369E1C
P 4800 6150
F 0 "UDJ26" H 4800 6467 50  0000 C CNN
F 1 "BUF12" H 4800 6376 50  0000 C CNN
F 2 "" H 4800 6150 50  0001 C CNN
F 3 "" H 4800 6150 50  0001 C CNN
	1    4800 6150
	1    0    0    -1  
$EndComp
$Comp
L A5C:BUF12 UDE47
U 1 1 6D234C5A
P 4800 7300
F 0 "UDE47" H 4800 7617 50  0000 C CNN
F 1 "BUF12" H 4800 7526 50  0000 C CNN
F 2 "" H 4800 7300 50  0001 C CNN
F 3 "" H 4800 7300 50  0001 C CNN
	1    4800 7300
	1    0    0    -1  
$EndComp
$Comp
L A5C:NBUF03 UDB?
U 1 1 61EED208
P 5700 3000
AR Path="/61EED208" Ref="UDB?"  Part="1" 
AR Path="/613100A2/61EED208" Ref="UDL51"  Part="1" 
AR Path="/613100A2/61292F37/61EED208" Ref="UDL51"  Part="1" 
F 0 "UDL51" H 5700 3317 50  0000 C CNN
F 1 "NBUF03" H 5700 3226 50  0000 C CNN
F 2 "" H 5700 2800 50  0001 C CNN
F 3 "" H 5700 2800 50  0001 C CNN
	1    5700 3000
	1    0    0    -1  
$EndComp
$Comp
L A5C:NBUF03 UDB?
U 1 1 63B4282F
P 5700 5550
AR Path="/63B4282F" Ref="UDB?"  Part="1" 
AR Path="/613100A2/63B4282F" Ref="UDK17"  Part="1" 
AR Path="/613100A2/61292F37/63B4282F" Ref="UDK17"  Part="1" 
F 0 "UDK17" H 5700 5867 50  0000 C CNN
F 1 "NBUF03" H 5700 5776 50  0000 C CNN
F 2 "" H 5700 5350 50  0001 C CNN
F 3 "" H 5700 5350 50  0001 C CNN
	1    5700 5550
	1    0    0    -1  
$EndComp
$Comp
L A5C:BUF01 UCC146
U 1 1 61EFAD18
P 6300 3000
F 0 "UCC146" H 6300 3317 50  0000 C CNN
F 1 "BUF11" H 6300 3226 50  0000 C CNN
F 2 "" H 6300 3000 50  0001 C CNN
F 3 "" H 6300 3000 50  0001 C CNN
	1    6300 3000
	1    0    0    -1  
$EndComp
$Comp
L A5C:BUF01 UEJ263
U 1 1 63B427BB
P 6300 5550
F 0 "UEJ263" H 6300 5867 50  0000 C CNN
F 1 "BUF11" H 6300 5776 50  0000 C CNN
F 2 "" H 6300 5550 50  0001 C CNN
F 3 "" H 6300 5550 50  0001 C CNN
	1    6300 5550
	1    0    0    -1  
$EndComp
$Comp
L A5C:BUF12 UDG0
U 1 1 613686C6
P 6350 1000
F 0 "UDG0" H 6350 1317 50  0000 C CNN
F 1 "BUF12" H 6350 1226 50  0000 C CNN
F 2 "" H 6350 1000 50  0001 C CNN
F 3 "" H 6350 1000 50  0001 C CNN
	1    6350 1000
	1    0    0    -1  
$EndComp
$Comp
L A5C:BUF12 UDG5
U 1 1 61368E8F
P 6350 1500
F 0 "UDG5" H 6350 1817 50  0000 C CNN
F 1 "BUF12" H 6350 1726 50  0000 C CNN
F 2 "" H 6350 1500 50  0001 C CNN
F 3 "" H 6350 1500 50  0001 C CNN
	1    6350 1500
	1    0    0    -1  
$EndComp
$Comp
L A5C:NBUF03 UDB?
U 1 1 6132CC21
P 6350 2000
AR Path="/6132CC21" Ref="UDB?"  Part="1" 
AR Path="/613100A2/6132CC21" Ref="UDF2"  Part="1" 
AR Path="/613100A2/61292F37/6132CC21" Ref="UDF2"  Part="1" 
F 0 "UDF2" H 6350 2317 50  0000 C CNN
F 1 "NBUF03" H 6350 2226 50  0000 C CNN
F 2 "" H 6350 1800 50  0001 C CNN
F 3 "" H 6350 1800 50  0001 C CNN
	1    6350 2000
	1    0    0    -1  
$EndComp
$Comp
L A5C:BUF12 UDE3
U 1 1 613863C8
P 6350 2500
F 0 "UDE3" H 6350 2817 50  0000 C CNN
F 1 "BUF12" H 6350 2726 50  0000 C CNN
F 2 "" H 6350 2500 50  0001 C CNN
F 3 "" H 6350 2500 50  0001 C CNN
	1    6350 2500
	1    0    0    -1  
$EndComp
$Comp
L A5C:BUF12 UDL0
U 1 1 63B42827
P 6350 3550
F 0 "UDL0" H 6350 3867 50  0000 C CNN
F 1 "BUF12" H 6350 3776 50  0000 C CNN
F 2 "" H 6350 3550 50  0001 C CNN
F 3 "" H 6350 3550 50  0001 C CNN
	1    6350 3550
	1    0    0    -1  
$EndComp
$Comp
L A5C:BUF12 UDJ0
U 1 1 63B42821
P 6350 4050
F 0 "UDJ0" H 6350 4367 50  0000 C CNN
F 1 "BUF12" H 6350 4276 50  0000 C CNN
F 2 "" H 6350 4050 50  0001 C CNN
F 3 "" H 6350 4050 50  0001 C CNN
	1    6350 4050
	1    0    0    -1  
$EndComp
$Comp
L A5C:NBUF03 UDB?
U 1 1 63B427E6
P 6350 4550
AR Path="/63B427E6" Ref="UDB?"  Part="1" 
AR Path="/613100A2/63B427E6" Ref="UDK43"  Part="1" 
AR Path="/613100A2/61292F37/63B427E6" Ref="UDK43"  Part="1" 
F 0 "UDK43" H 6350 4867 50  0000 C CNN
F 1 "NBUF03" H 6350 4776 50  0000 C CNN
F 2 "" H 6350 4350 50  0001 C CNN
F 3 "" H 6350 4350 50  0001 C CNN
	1    6350 4550
	1    0    0    -1  
$EndComp
$Comp
L A5C:BUF12 UDL135
U 1 1 63B427EE
P 6350 5050
F 0 "UDL135" H 6350 5367 50  0000 C CNN
F 1 "BUF12" H 6350 5276 50  0000 C CNN
F 2 "" H 6350 5050 50  0001 C CNN
F 3 "" H 6350 5050 50  0001 C CNN
	1    6350 5050
	1    0    0    -1  
$EndComp
$Comp
L A5C:BUF01 UBI46
U 1 1 61EFBBA1
P 6900 3000
F 0 "UBI46" H 6900 3317 50  0000 C CNN
F 1 "BUF11" H 6900 3226 50  0000 C CNN
F 2 "" H 6900 3000 50  0001 C CNN
F 3 "" H 6900 3000 50  0001 C CNN
	1    6900 3000
	1    0    0    -1  
$EndComp
$Comp
L A5C:BUF01 UEI263
U 1 1 63B427C1
P 6900 5550
F 0 "UEI263" H 6900 5867 50  0000 C CNN
F 1 "BUF11" H 6900 5776 50  0000 C CNN
F 2 "" H 6900 5550 50  0001 C CNN
F 3 "" H 6900 5550 50  0001 C CNN
	1    6900 5550
	1    0    0    -1  
$EndComp
$Comp
L A5C:BUF01 UBH46
U 1 1 61EFC2C5
P 7500 3000
F 0 "UBH46" H 7500 3317 50  0000 C CNN
F 1 "BUF11" H 7500 3226 50  0000 C CNN
F 2 "" H 7500 3000 50  0001 C CNN
F 3 "" H 7500 3000 50  0001 C CNN
	1    7500 3000
	1    0    0    -1  
$EndComp
$Comp
L A5C:BUF01 UEH266
U 1 1 63B427C7
P 7500 5550
F 0 "UEH266" H 7500 5867 50  0000 C CNN
F 1 "BUF11" H 7500 5776 50  0000 C CNN
F 2 "" H 7500 5550 50  0001 C CNN
F 3 "" H 7500 5550 50  0001 C CNN
	1    7500 5550
	1    0    0    -1  
$EndComp
$Comp
L A5C:BUF01 UAB389
U 1 1 61EFC664
P 8100 3000
F 0 "UAB389" H 8100 3317 50  0000 C CNN
F 1 "BUF11" H 8100 3226 50  0000 C CNN
F 2 "" H 8100 3000 50  0001 C CNN
F 3 "" H 8100 3000 50  0001 C CNN
	1    8100 3000
	1    0    0    -1  
$EndComp
$Comp
L A5C:BUF01 UEF254
U 1 1 63B427CD
P 8100 5550
F 0 "UEF254" H 8100 5867 50  0000 C CNN
F 1 "BUF11" H 8100 5776 50  0000 C CNN
F 2 "" H 8100 5550 50  0001 C CNN
F 3 "" H 8100 5550 50  0001 C CNN
	1    8100 5550
	1    0    0    -1  
$EndComp
$Comp
L A5C:BUF01 UAB359
U 1 1 61EFD1F8
P 8700 3000
F 0 "UAB359" H 8700 3317 50  0000 C CNN
F 1 "BUF11" H 8700 3226 50  0000 C CNN
F 2 "" H 8700 3000 50  0001 C CNN
F 3 "" H 8700 3000 50  0001 C CNN
	1    8700 3000
	1    0    0    -1  
$EndComp
$Comp
L A5C:BUF01 UCB307
U 1 1 63B427D3
P 8700 5550
F 0 "UCB307" H 8700 5867 50  0000 C CNN
F 1 "BUF11" H 8700 5776 50  0000 C CNN
F 2 "" H 8700 5550 50  0001 C CNN
F 3 "" H 8700 5550 50  0001 C CNN
	1    8700 5550
	1    0    0    -1  
$EndComp
$Comp
L A5C:BUF01 UAC168
U 1 1 61EFD97E
P 9300 3000
F 0 "UAC168" H 9300 3317 50  0000 C CNN
F 1 "BUF11" H 9300 3226 50  0000 C CNN
F 2 "" H 9300 3000 50  0001 C CNN
F 3 "" H 9300 3000 50  0001 C CNN
	1    9300 3000
	1    0    0    -1  
$EndComp
$Comp
L A5C:BUF01 UCC144
U 1 1 63B427D9
P 9300 5550
F 0 "UCC144" H 9300 5867 50  0000 C CNN
F 1 "BUF11" H 9300 5776 50  0000 C CNN
F 2 "" H 9300 5550 50  0001 C CNN
F 3 "" H 9300 5550 50  0001 C CNN
	1    9300 5550
	1    0    0    -1  
$EndComp
$Comp
L A5C:BUF01 UAD25
U 1 1 61EFDEB0
P 9900 3000
F 0 "UAD25" H 9900 3317 50  0000 C CNN
F 1 "BUF12" H 9900 3226 50  0000 C CNN
F 2 "" H 9900 3000 50  0001 C CNN
F 3 "" H 9900 3000 50  0001 C CNN
	1    9900 3000
	1    0    0    -1  
$EndComp
$Comp
L A5C:BUF01 UCC86
U 1 1 63B427DF
P 9900 5550
F 0 "UCC86" H 9900 5867 50  0000 C CNN
F 1 "BUF12" H 9900 5776 50  0000 C CNN
F 2 "" H 9900 5550 50  0001 C CNN
F 3 "" H 9900 5550 50  0001 C CNN
	1    9900 5550
	1    0    0    -1  
$EndComp
$Comp
L A5C:OAI211 UDJ72
U 1 1 61118E68
P 1950 5900
F 0 "UDJ72" H 1975 6267 50  0000 C CNN
F 1 "OAI211" H 1975 6176 50  0000 C CNN
F 2 "" H 2050 5750 50  0001 C CNN
F 3 "" H 2050 5750 50  0001 C CNN
	1    1950 5900
	1    0    0    -1  
$EndComp
$Comp
L A5C:OAI211 UDJ77
U 1 1 61118E6B
P 1950 7050
F 0 "UDJ77" H 1975 7417 50  0000 C CNN
F 1 "OAI211" H 1975 7326 50  0000 C CNN
F 2 "" H 2050 6900 50  0001 C CNN
F 3 "" H 2050 6900 50  0001 C CNN
	1    1950 7050
	1    0    0    -1  
$EndComp
$Comp
L A5C:M157C UDK19
U 1 1 6181053D
P 4500 1900
F 0 "UDK19" H 4500 2765 50  0000 C CNN
F 1 "M157C" H 4500 2674 50  0000 C CNN
F 2 "" H 4500 1900 50  0001 C CNN
F 3 "" H 4500 1900 50  0001 C CNN
	1    4500 1900
	1    0    0    -1  
$EndComp
$Comp
L A5C:M157C UDK0
U 1 1 63B427F4
P 4500 4450
F 0 "UDK0" H 4500 5315 50  0000 C CNN
F 1 "M157C" H 4500 5224 50  0000 C CNN
F 2 "" H 4500 4450 50  0001 C CNN
F 3 "" H 4500 4450 50  0001 C CNN
	1    4500 4450
	1    0    0    -1  
$EndComp
Text Label 1750 1600 0    50   ~ 0
R-OE
Text HLabel 1550 1600 0    50   Input ~ 0
R-OE
Text HLabel 1550 4650 0    50   Input ~ 0
W-OE
Text Label 1750 4650 0    50   ~ 0
W-OE
Wire Bus Line
	1650 4150 1650 4350
Wire Bus Line
	7050 700  7050 1400
Wire Bus Line
	7050 1650 7050 2400
Wire Bus Line
	7050 3250 7050 3950
Wire Bus Line
	7050 4200 7050 4950
$EndSCHEMATC
