EESchema Schematic File Version 4
EELAYER 30 0
EELAYER END
$Descr A3 16535 11693
encoding utf-8
Sheet 50 83
Title "CPS Reverse Engineering: DL-0311"
Date "2021-09-12"
Rev ""
Comp ""
Comment1 ""
Comment2 ""
Comment3 "Licence: CC-BY"
Comment4 "Author: Loïc *WydD* Petit"
$EndDescr
Connection ~ 11850 7050
Connection ~ 8550 7600
Connection ~ 11450 6100
Connection ~ 8650 6650
Connection ~ 11650 6350
Connection ~ 10950 4550
Connection ~ 11750 6450
Connection ~ 11550 6200
Connection ~ 10850 4450
Connection ~ 2650 4050
Connection ~ 5250 5750
Connection ~ 2650 6550
Connection ~ 2650 7000
Connection ~ 5350 7850
Connection ~ 2650 5850
Connection ~ 2550 5950
Connection ~ 11250 5000
Wire Wire Line
	2450 5050 2750 5050
Wire Wire Line
	2550 3050 2750 3050
Wire Wire Line
	2550 3800 2750 3800
Wire Wire Line
	2550 3900 2750 3900
Wire Wire Line
	2550 4150 2550 5950
Wire Wire Line
	2550 4150 2750 4150
Wire Wire Line
	2550 5950 2750 5950
Wire Wire Line
	2600 7000 2650 7000
Wire Wire Line
	2650 3150 2750 3150
Wire Wire Line
	2650 4050 2650 5850
Wire Wire Line
	2650 5850 2650 6550
Wire Wire Line
	2650 6550 2650 7000
Wire Wire Line
	2650 7000 5450 7000
Wire Wire Line
	2750 4050 2650 4050
Wire Wire Line
	2750 5850 2650 5850
Wire Wire Line
	2750 6550 2650 6550
Wire Wire Line
	4200 5050 5150 5050
Wire Wire Line
	4200 5550 5350 5550
Wire Wire Line
	4200 5650 5450 5650
Wire Wire Line
	4200 5750 5250 5750
Wire Wire Line
	4300 5350 4200 5350
Wire Wire Line
	4300 5450 4200 5450
Wire Wire Line
	4300 5950 4200 5950
Wire Wire Line
	5150 3450 5550 3450
Wire Wire Line
	5250 3550 5550 3550
Wire Wire Line
	5250 5750 5450 5750
Wire Wire Line
	5350 5200 5350 5550
Wire Wire Line
	5350 7500 5350 7850
Wire Wire Line
	5350 7500 5450 7500
Wire Wire Line
	5450 7100 5350 7100
Wire Wire Line
	5450 7250 5350 7250
Wire Wire Line
	5450 7350 5350 7350
Wire Wire Line
	5550 2900 4450 2900
Wire Wire Line
	7250 5500 7350 5500
Wire Wire Line
	7250 5650 7450 5650
Wire Wire Line
	7250 6500 8750 6500
Wire Wire Line
	7250 6950 11650 6950
Wire Wire Line
	7250 7050 11750 7050
Wire Wire Line
	7250 7200 12300 7200
Wire Wire Line
	7250 7300 12300 7300
Wire Wire Line
	7250 7400 12300 7400
Wire Wire Line
	7350 4150 4200 4150
Wire Wire Line
	7350 4150 10950 4150
Wire Wire Line
	7350 5500 7350 4150
Wire Wire Line
	7850 5200 5350 5200
Wire Wire Line
	7850 5650 7850 5200
Wire Wire Line
	7850 5650 8750 5650
Wire Wire Line
	8400 8050 8550 8050
Wire Wire Line
	8550 6000 8550 7600
Wire Wire Line
	8550 7600 8550 8050
Wire Wire Line
	8550 7600 11850 7600
Wire Wire Line
	8650 4750 8750 4750
Wire Wire Line
	8650 4900 8750 4900
Wire Wire Line
	8650 5100 8650 6650
Wire Wire Line
	8650 5100 8750 5100
Wire Wire Line
	8650 6650 8650 7850
Wire Wire Line
	8650 7850 5350 7850
Wire Wire Line
	8750 6000 8550 6000
Wire Wire Line
	8750 6400 7250 6400
Wire Wire Line
	8750 6650 8650 6650
Wire Wire Line
	10750 4550 10950 4550
Wire Wire Line
	10750 4650 12300 4650
Wire Wire Line
	10750 4900 11350 4900
Wire Wire Line
	10750 5000 11250 5000
Wire Wire Line
	10750 5100 11150 5100
Wire Wire Line
	10750 5650 10850 5650
Wire Wire Line
	10750 5750 10950 5750
Wire Wire Line
	10750 5850 11050 5850
Wire Wire Line
	10850 4450 10750 4450
Wire Wire Line
	10850 4450 12300 4450
Wire Wire Line
	10850 5650 10850 4450
Wire Wire Line
	10950 4550 10950 5750
Wire Wire Line
	10950 4550 12300 4550
Wire Wire Line
	11050 4150 10950 4150
Wire Wire Line
	11050 4750 10750 4750
Wire Wire Line
	11050 4750 11050 5850
Wire Wire Line
	11150 5100 11150 6800
Wire Wire Line
	11150 6800 12300 6800
Wire Wire Line
	11250 4750 11350 4750
Wire Wire Line
	11250 5000 11250 4750
Wire Wire Line
	11250 5000 11250 6700
Wire Wire Line
	11250 6700 12300 6700
Wire Wire Line
	11350 6600 11350 4900
Wire Wire Line
	11350 6600 12300 6600
Wire Wire Line
	11650 5150 11650 6350
Wire Wire Line
	11650 6350 11650 6950
Wire Wire Line
	11650 6350 12300 6350
Wire Wire Line
	11750 5250 11750 6450
Wire Wire Line
	11750 5250 12300 5250
Wire Wire Line
	11750 7050 11750 6450
Wire Wire Line
	11850 7050 11850 5500
Wire Wire Line
	11850 7600 11850 7050
Wire Wire Line
	12200 5400 12300 5400
Wire Wire Line
	12200 6950 12300 6950
Wire Wire Line
	12200 7750 12300 7750
Wire Wire Line
	12300 5150 11650 5150
Wire Wire Line
	12300 5500 11850 5500
Wire Wire Line
	12300 6450 11750 6450
Wire Wire Line
	12300 7050 11850 7050
Wire Wire Line
	13850 6550 13950 6550
Wire Wire Line
	13950 6650 13850 6650
Wire Bus Line
	2550 2900 2750 2900
Wire Bus Line
	4200 5200 5050 5200
Wire Bus Line
	4450 3050 5550 3050
Wire Bus Line
	4950 3150 5550 3150
Wire Bus Line
	4950 3800 4200 3800
Wire Bus Line
	5050 3250 5550 3250
Wire Bus Line
	5250 6500 5450 6500
Wire Bus Line
	7250 5750 7550 5750
Wire Bus Line
	7250 5900 7650 5900
Wire Bus Line
	7250 6000 7750 6000
Wire Bus Line
	7250 6300 8750 6300
Wire Bus Line
	7250 7500 12300 7500
Wire Bus Line
	7650 4450 7650 5900
Wire Bus Line
	7650 4450 8750 4450
Wire Bus Line
	7750 4550 7750 6000
Wire Bus Line
	7750 4550 8750 4550
Wire Bus Line
	8750 6200 7250 6200
Wire Bus Line
	10750 6000 12300 6000
Wire Bus Line
	10750 6100 11450 6100
Wire Bus Line
	10750 6200 11550 6200
Wire Bus Line
	11450 4900 11450 6100
Wire Bus Line
	11450 6100 12300 6100
Wire Bus Line
	11550 6200 11550 5000
Wire Bus Line
	11550 6200 12300 6200
Wire Bus Line
	12200 7650 12300 7650
Wire Bus Line
	12300 4900 11450 4900
Wire Bus Line
	12300 5000 11550 5000
Wire Bus Line
	13850 6450 13950 6450
Wire Bus Line
	13950 3850 13850 3850
Wire Bus Line
	13950 6000 13850 6000
Wire Bus Line
	13950 6150 13850 6150
Wire Bus Line
	13950 6350 13850 6350
Text Notes 8450 3650 0    50   ~ 0
Sprite Colour Lookup\n\nDuring BUS-SPRITE-[X,Y,TILE,ATTR]\n- ADDR = OBJRAM-BASE << 8 + 8 * IDX\nDuring BUS-SPRITE-END\n- ADDR = (OBJRAM-BASE ^ 0x40) << 8 + COLOUR << 9 + Y << 5 + X << 1\n  -> Set COLOUR = DATA[0..4]
Text HLabel 2000 5900 0    50   Input ~ 0
MAIN-RESET
Text HLabel 2000 6000 0    50   Input ~ 0
SCAN-243
Text HLabel 2000 7000 0    50   Input ~ 0
CLK4M
Text HLabel 2450 5050 0    50   Input ~ 0
~BUS-WSTOBJ
Text HLabel 2550 2900 0    50   Input ~ 0
BUS-DATA[0..15]
Text HLabel 2550 3050 0    50   Input ~ 0
~OBJRAM-BASE
Text HLabel 2550 3800 0    50   Input ~ 0
SCAN-240-245
Text HLabel 2550 3900 0    50   Input ~ 0
LI-SYNCED
Text HLabel 2750 6550 2    50   Output ~ 0
~CLK4M
Text HLabel 4200 7800 0    50   Input ~ 0
MAIN-RESET
Text HLabel 4200 7900 0    50   Input ~ 0
SCAN-243
Text HLabel 4300 5350 2    50   Output ~ 0
~BUS-SPRITE-X
Text HLabel 4300 5450 2    50   Output ~ 0
~BUS-SPRITE-Y
Text HLabel 4300 5950 2    50   Output ~ 0
WSTOBJ-END
Text HLabel 5250 6500 0    50   Input ~ 0
BUS-DATA[0..15]
Text HLabel 5350 7100 0    50   Input ~ 0
CLK4M
Text HLabel 5350 7250 0    50   Input ~ 0
FLIP
Text HLabel 5350 7350 0    50   Input ~ 0
LI
Text HLabel 14050 2900 2    50   3State ~ 0
ADDR[1..23]
Text HLabel 7800 8050 0    50   Input ~ 0
CLK4M
Text HLabel 8450 5750 0    50   Input ~ 0
BUS-DATA[0..15]
Text HLabel 8450 5900 0    50   Input ~ 0
CLK4M
Text HLabel 8650 4750 0    50   Input ~ 0
LI
Text HLabel 8650 4900 0    50   Input ~ 0
SCAN-243
Text HLabel 11050 4150 2    50   Output ~ 0
SPRITE-BLOCK-READY
Text HLabel 11350 4750 2    50   Output ~ 0
~SPRITE-X-READY-LI
Text HLabel 12200 5400 0    50   Input ~ 0
LI
Text HLabel 12200 6950 0    50   Input ~ 0
LI
Text HLabel 12200 7650 0    50   Input ~ 0
COL[5..8]
Text HLabel 12200 7750 0    50   Input ~ 0
~SPRITE-T
Text HLabel 13950 6000 2    50   3State ~ 0
ROMA-Y[0..3]
Text HLabel 13950 6150 2    50   3State ~ 0
GFX-ADDR[4..19]
Text HLabel 13950 6350 2    50   3State ~ 0
_CB[0..4]
Text HLabel 13950 6450 2    50   3State ~ 0
_CPC[0..0]
Text HLabel 13950 6550 2    50   3State ~ 0
_XFLIP
Text HLabel 13950 6650 2    50   3State ~ 0
_YFLIP
$Comp
L A5C:NOR02 UBB0
U 1 1 602F0BE7
P 2250 5950
F 0 "UBB0" H 2275 6217 50  0000 C CNN
F 1 "NOR02" H 2275 6126 50  0000 C CNN
F 2 "" H 2250 5950 50  0001 C CNN
F 3 "" H 2250 5950 50  0001 C CNN
	1    2250 5950
	1    0    0    -1  
$EndComp
$Comp
L A5C:NOR02 UAD?
U 1 1 6183FA2D
P 4450 7850
AR Path="/61191493/6183FA2D" Ref="UAD?"  Part="1" 
AR Path="/6183FA2D" Ref="UAD103"  Part="1" 
AR Path="/612CA5FA/6183FA2D" Ref="UAD103"  Part="1" 
F 0 "UAD103" H 4475 8117 50  0000 C CNN
F 1 "NOR02" H 4475 8026 50  0000 C CNN
F 2 "" H 4450 7850 50  0001 C CNN
F 3 "" H 4450 7850 50  0001 C CNN
	1    4450 7850
	1    0    0    -1  
$EndComp
$Comp
L A5C:NBUF03 UCA30
U 1 1 60B50502
P 2300 7000
F 0 "UCA30" H 2300 7317 50  0000 C CNN
F 1 "NBUF03" H 2300 7226 50  0000 C CNN
F 2 "" H 2300 6800 50  0001 C CNN
F 3 "" H 2300 6800 50  0001 C CNN
	1    2300 7000
	1    0    0    -1  
$EndComp
$Comp
L A5C:BUF12 UAD?
U 1 1 6183FA33
P 5050 7850
AR Path="/61191493/6183FA33" Ref="UAD?"  Part="1" 
AR Path="/6183FA33" Ref="UAD111"  Part="1" 
AR Path="/612CA5FA/6183FA33" Ref="UAD111"  Part="1" 
F 0 "UAD111" H 5050 8167 50  0000 C CNN
F 1 "BUF12" H 5050 8076 50  0000 C CNN
F 2 "" H 5050 7850 50  0001 C CNN
F 3 "" H 5050 7850 50  0001 C CNN
	1    5050 7850
	1    0    0    -1  
$EndComp
$Comp
L A5C:NBUF03 UAA?
U 1 1 612DBD84
P 8100 8050
AR Path="/61191493/612DBD84" Ref="UAA?"  Part="1" 
AR Path="/612DBD84" Ref="UAA78"  Part="1" 
AR Path="/612CA5FA/612DBD84" Ref="UAA78"  Part="1" 
F 0 "UAA78" H 8100 8367 50  0000 C CNN
F 1 "NBUF03" H 8100 8276 50  0000 C CNN
F 2 "" H 8100 7850 50  0001 C CNN
F 3 "" H 8100 7850 50  0001 C CNN
	1    8100 8050
	1    0    0    1   
$EndComp
$Sheet
S 5550 2750 1450 950 
U 612CAD0C
F0 "bus-sprite-addr-main" 50
F1 "bus-sprite-addr-main.sch" 50
F2 "ENTRY-IDX[0..7]" I L 5550 3150 50 
F3 "~BUS-SPRITE-LOOKUP" I L 5550 3550 50 
F4 "~OBJRAM-BASE[6..15]" I L 5550 3050 50 
F5 "X8-MODE" I L 5550 2900 50 
F6 "~BUS-WSTOBJ" I L 5550 3450 50 
F7 "STATE[0..1]" I L 5550 3250 50 
F8 "ADDR[1..23]" T R 7000 2900 50 
$EndSheet
$Sheet
S 2750 4900 1450 1200
U 612CADB2
F0 "bus-sprite-signals" 50
F1 "bus-sprite-signals.sch" 50
F2 "~RESET" I L 2750 5950 50 
F3 "~BUS-WSTOBJ" I L 2750 5050 50 
F4 "~CLK4M" I L 2750 5850 50 
F5 "~BUS-SPRITE-LOOKUP" O R 4200 5750 50 
F6 "~BUS-SPRITE-X" O R 4200 5350 50 
F7 "~BUS-SPRITE-Y" O R 4200 5450 50 
F8 "~BUS-SPRITE-TILE" O R 4200 5550 50 
F9 "~BUS-SPRITE-ATTR" O R 4200 5650 50 
F10 "WSTOBJ-END" O R 4200 5950 50 
F11 "_~BUS-WSTOBJ" O R 4200 5050 50 
F12 "STATE[0..1]" O R 4200 5200 50 
$EndSheet
$Sheet
S 2750 2750 1700 550 
U 612CADBA
F0 "objram-base" 50
F1 "objram-base.sch" 50
F2 "X8-MODE" O R 4450 2900 50 
F3 "~OBJRAM-BASE[6..15]" O R 4450 3050 50 
F4 "~OBJRAM-BASE" I L 2750 3050 50 
F5 "~CLK4M" I L 2750 3150 50 
F6 "BUS-DATA[0..15]" I L 2750 2900 50 
$EndSheet
$Sheet
S 12300 5850 1550 2050
U 612CAD7D
F0 "sprite-block-counter" 50
F1 "sprite-block-counter.sch" 50
F2 "TILE-YOFF[0..3]" I L 12300 6200 50 
F3 "TILE-XOFF[0..3]" I L 12300 6100 50 
F4 "LI" I L 12300 6950 50 
F5 "~CLK4M" I L 12300 7050 50 
F6 "~SPRITE-BLOCK-RESET" I L 12300 6800 50 
F7 "~SPRITE-X-READY-LI" I L 12300 6700 50 
F8 "~ATTR-XFLIP" I L 12300 6350 50 
F9 "~ATTR-YFLIP" I L 12300 6450 50 
F10 "SPRITE-X-READY" I L 12300 6600 50 
F11 "~SPRITE-T" I L 12300 7750 50 
F12 "COL[5..8]" I L 12300 7650 50 
F13 "~TILE-BASE[0..7]" I L 12300 6000 50 
F14 "~COLOUR[0..4]" I L 12300 7500 50 
F15 "~LOOKUP" I L 12300 7200 50 
F16 "~YFLIP" I L 12300 7400 50 
F17 "~XFLIP" I L 12300 7300 50 
F18 "_CB[0..4]" T R 13850 6350 50 
F19 "_YFLIP" T R 13850 6650 50 
F20 "_XFLIP" T R 13850 6550 50 
F21 "GFX-ADDR[4..19]" T R 13850 6150 50 
F22 "ROMA-Y[0..3]" T R 13850 6000 50 
F23 "_CPC[0..0]" T R 13850 6450 50 
$EndSheet
$Sheet
S 8750 4300 2000 950 
U 612CAD03
F0 "sprite-block-sync" 50
F1 "sprite-block-sync.sch" 50
F2 "SCAN-243" I L 8750 4900 50 
F3 "LI" I L 8750 4750 50 
F4 "SPRITE-X-READY" O R 10750 4900 50 
F5 "~SPRITE-X-READY-LI" O R 10750 5000 50 
F6 "~SPRITE-X-READY-SYNC" O R 10750 4650 50 
F7 "~ATTR-XBLOCK[0..3]" I L 8750 4450 50 
F8 "~ATTR-YBLOCK[0..3]" I L 8750 4550 50 
F9 "BUS-SPRITE-TILE-SYNC" I R 10750 4450 50 
F10 "SPRITE-BLOCK-READY" O R 10750 4550 50 
F11 "SPRITE-BLOCK-RESET" O R 10750 4750 50 
F12 "~SPRITE-BLOCK-RESET" O R 10750 5100 50 
F13 "~RESET-SCAN243" I L 8750 5100 50 
F14 "~CLK4M" I L 8750 5000 50 
$EndSheet
$Sheet
S 5450 5350 1800 2300
U 612CAD11
F0 "sprite-entry-attr" 50
F1 "sprite-entry-attr.sch" 50
F2 "~BUS-SPRITE-ATTR" I L 5450 5650 50 
F3 "SPRITE-BLOCK-READY" I R 7250 5500 50 
F4 "~RESET-SCAN243" I L 5450 7500 50 
F5 "BUS-DATA[0..15]" I L 5450 6500 50 
F6 "CLK4M" I L 5450 7100 50 
F7 "~BUS-SPRITE-LOOKUP" I L 5450 5750 50 
F8 "~ATTR-XBLOCK[0..3]" O R 7250 5900 50 
F9 "ATTR-YBLOCK[0..3]" O R 7250 6300 50 
F10 "~ATTR-YBLOCK[0..3]" O R 7250 6000 50 
F11 "LI" I L 5450 7350 50 
F12 "~CLK4M" I L 5450 7000 50 
F13 "FLIP" I L 5450 7250 50 
F14 "~ATTR-XFLIP" O R 7250 6950 50 
F15 "~ATTR-YFLIP" O R 7250 7050 50 
F16 "ATTR-LOOKUP" O R 7250 5650 50 
F17 "ATTR-YFLIP" O R 7250 6500 50 
F18 "ATTR-XFLIP" O R 7250 6400 50 
F19 "~LOOKUP" O R 7250 7200 50 
F20 "~COLOUR[0..4]" O R 7250 7500 50 
F21 "~XFLIP" O R 7250 7300 50 
F22 "~YFLIP" O R 7250 7400 50 
F23 "ATTR-XBLOCK[0..3]" O R 7250 6200 50 
F24 "~LOOKUP-IDX[0..4]" O R 7250 5750 50 
$EndSheet
$Sheet
S 12300 3700 1550 1950
U 612CAE0A
F0 "sprite-entry-lookup" 50
F1 "sprite-entry-lookup.sch" 50
F2 "~BUS-SPRITE-LOOKUP" I L 12300 3850 50 
F3 "~SPRITE-X-READY-SYNC" I L 12300 4650 50 
F4 "SPRITE-BLOCK-READY" I L 12300 4550 50 
F5 "BUS-SPRITE-TILE-SYNC" I L 12300 4450 50 
F6 "~CLK4M" I L 12300 5500 50 
F7 "TILE-XOFF[0..3]" I L 12300 4900 50 
F8 "TILE-YOFF[0..3]" I L 12300 5000 50 
F9 "ATTR-LOOKUP" I L 12300 3950 50 
F10 "ADDR[1..13]" T R 13850 3850 50 
F11 "LI" I L 12300 5400 50 
F12 "~ATTR-XFLIP" I L 12300 5150 50 
F13 "~ATTR-YFLIP" I L 12300 5250 50 
F14 "~LOOKUP-IDX[0..4]" I L 12300 4050 50 
$EndSheet
$Sheet
S 8750 5500 2000 1250
U 612CAD3C
F0 "sprite-entry-tile" 50
F1 "sprite-entry-tile.sch" 50
F2 "SPRITE-BLOCK-RESET" I R 10750 5850 50 
F3 "~RESET-SCAN243" I L 8750 6650 50 
F4 "CLK4M" I L 8750 5900 50 
F5 "~BUS-SPRITE-TILE" I L 8750 5650 50 
F6 "SPRITE-BLOCK-READY" I R 10750 5750 50 
F7 "~CLK4M" I L 8750 6000 50 
F8 "BUS-SPRITE-TILE-SYNC" O R 10750 5650 50 
F9 "BUS-DATA[0..15]" I L 8750 5750 50 
F10 "ATTR-XFLIP" I L 8750 6400 50 
F11 "ATTR-XBLOCK[0..3]" I L 8750 6200 50 
F12 "ATTR-YFLIP" I L 8750 6500 50 
F13 "ATTR-YBLOCK[0..3]" I L 8750 6300 50 
F14 "TILE-YOFF[0..3]" O R 10750 6200 50 
F15 "TILE-XOFF[0..3]" O R 10750 6100 50 
F16 "~TILE-BASE[0..7]" O R 10750 6000 50 
$EndSheet
$Sheet
S 2750 3650 1450 650 
U 612CADBB
F0 "sprites-entry-index" 50
F1 "sprites-entry-index.sch" 50
F2 "~RESET" I L 2750 4150 50 
F3 "~CLK4M" I L 2750 4050 50 
F4 "SCAN-240-245" I L 2750 3800 50 
F5 "LI-SYNCED" I L 2750 3900 50 
F6 "BLOCK-READY" I R 4200 4150 50 
F7 "ENTRY-IDX[0..7]" O R 4200 3800 50 
$EndSheet
Wire Bus Line
	8450 5750 8750 5750
Wire Wire Line
	8450 5900 8750 5900
Wire Wire Line
	8550 6000 8550 5000
Wire Wire Line
	8550 5000 8750 5000
Connection ~ 8550 6000
Wire Wire Line
	2650 3150 2650 4050
Wire Bus Line
	4950 3150 4950 3800
Wire Bus Line
	5050 3250 5050 5200
Wire Wire Line
	5150 3450 5150 5050
Wire Wire Line
	5250 3550 5250 3850
Connection ~ 5250 3850
Wire Wire Line
	5250 3850 5250 5750
Wire Bus Line
	7000 2900 13950 2900
Wire Bus Line
	14050 2900 13950 2900
Connection ~ 13950 2900
Connection ~ 7350 4150
Wire Wire Line
	5250 3850 12300 3850
Wire Bus Line
	12300 4050 7550 4050
Wire Bus Line
	7550 4050 7550 5750
Wire Wire Line
	12300 3950 7450 3950
Wire Wire Line
	7450 3950 7450 5650
Connection ~ 10950 4150
Wire Wire Line
	10950 4150 10950 4550
Wire Bus Line
	13950 3850 13950 2900
$EndSCHEMATC
