EESchema Schematic File Version 4
EELAYER 30 0
EELAYER END
$Descr A2 23386 16535
encoding utf-8
Sheet 1 83
Title "CPS Reverse Engineering: DL-0311"
Date "2021-09-12"
Rev ""
Comp ""
Comment1 ""
Comment2 ""
Comment3 "Licence: CC-BY"
Comment4 "Author: Loïc *WydD* Petit"
$EndDescr
Connection ~ 2700 3450
Connection ~ 2700 8500
Connection ~ 3350 5550
Connection ~ 3450 5650
Connection ~ 17800 12200
Connection ~ 15750 12100
Connection ~ 15850 12250
Connection ~ 6150 8200
Entry Wire Line
	2700 950  2600 850 
Entry Wire Line
	2700 1200 2600 1100
Entry Wire Line
	2700 1450 2600 1350
Entry Wire Line
	2700 1700 2600 1600
Entry Wire Line
	2700 1950 2600 1850
Entry Wire Line
	2700 2200 2600 2100
Entry Wire Line
	2700 2450 2600 2350
Entry Wire Line
	2700 2700 2600 2600
Entry Wire Line
	2700 2950 2600 2850
Entry Wire Line
	2700 3200 2600 3100
Entry Wire Line
	2700 3450 2600 3350
Entry Wire Line
	2700 3500 2600 3600
Entry Wire Line
	2700 3750 2600 3850
Entry Wire Line
	2700 4000 2600 4100
Entry Wire Line
	2700 4250 2600 4350
Entry Wire Line
	2700 4500 2600 4600
Entry Wire Line
	2700 4750 2600 4850
Entry Wire Line
	2700 5000 2600 5100
Entry Wire Line
	2700 5250 2600 5350
Entry Wire Line
	2700 5500 2600 5600
Entry Wire Line
	2700 5750 2600 5850
Entry Wire Line
	2700 6000 2600 6100
Entry Wire Line
	2700 6250 2600 6350
Entry Wire Line
	2700 6750 2600 6650
Entry Wire Line
	2700 7000 2600 6900
Entry Wire Line
	2700 7250 2600 7150
Entry Wire Line
	2700 7500 2600 7400
Entry Wire Line
	2700 7750 2600 7650
Entry Wire Line
	2700 8000 2600 7900
Entry Wire Line
	2700 8250 2600 8150
Entry Wire Line
	2700 8500 2600 8400
Entry Wire Line
	2700 8550 2600 8650
Entry Wire Line
	2700 8800 2600 8900
Entry Wire Line
	2700 9050 2600 9150
Entry Wire Line
	2700 9300 2600 9400
Entry Wire Line
	2700 9550 2600 9650
Entry Wire Line
	2700 9800 2600 9900
Entry Wire Line
	2700 10050 2600 10150
Entry Wire Line
	2700 10300 2600 10400
Entry Wire Line
	7000 9350 6900 9450
Entry Wire Line
	7000 9600 6900 9700
Entry Wire Line
	7000 9300 6900 9200
Entry Wire Line
	7000 9050 6900 8950
Entry Wire Line
	7000 8800 6900 8700
Entry Wire Line
	17700 10650 17600 10550
Entry Wire Line
	17700 10900 17600 10800
Entry Wire Line
	17700 11150 17600 11050
Entry Wire Line
	17700 11400 17600 11300
Entry Wire Line
	17700 11650 17600 11550
Entry Wire Line
	17700 13650 17600 13750
Entry Wire Line
	17700 13900 17600 14000
Entry Wire Line
	17800 9700 17900 9600
Entry Wire Line
	17800 9950 17900 9850
Entry Wire Line
	17800 10200 17900 10100
Entry Wire Line
	17800 10450 17900 10350
Entry Wire Line
	17800 10700 17900 10600
Entry Wire Line
	17800 10950 17900 10850
Entry Wire Line
	17800 11200 17900 11100
Entry Wire Line
	17800 11450 17900 11350
Entry Wire Line
	17800 11700 17900 11600
Entry Wire Line
	17800 11950 17900 11850
Entry Wire Line
	17800 12200 17900 12100
Entry Wire Line
	17800 12250 17900 12350
Entry Wire Line
	17800 12500 17900 12600
Entry Wire Line
	17800 12750 17900 12850
Entry Wire Line
	17800 13000 17900 13100
Entry Wire Line
	17800 13250 17900 13350
Entry Wire Line
	17800 13500 17900 13600
Entry Wire Line
	17800 13750 17900 13850
Entry Wire Line
	17800 14000 17900 14100
Entry Wire Line
	17800 14250 17900 14350
Entry Wire Line
	17800 14500 17900 14600
Entry Wire Line
	17800 14750 17900 14850
Entry Wire Line
	17800 15000 17900 15100
Entry Wire Line
	20250 3150 20350 3050
Entry Wire Line
	20250 3400 20350 3300
Entry Wire Line
	20350 3750 20450 3650
Entry Wire Line
	20350 4000 20450 3900
Entry Wire Line
	20450 11150 20550 11250
Entry Wire Line
	20450 11400 20550 11500
Entry Wire Line
	20550 10550 20650 10650
Entry Wire Line
	20550 10800 20650 10900
Entry Wire Line
	20650 1050 20750 950 
Entry Wire Line
	20650 1300 20750 1200
Entry Wire Line
	20650 1550 20750 1450
Entry Wire Line
	20650 1800 20750 1700
Entry Wire Line
	20650 2050 20750 1950
Entry Wire Line
	20650 2300 20750 2200
Entry Wire Line
	20650 2550 20750 2450
Entry Wire Line
	20650 2800 20750 2700
Entry Wire Line
	20650 4950 20750 4850
Entry Wire Line
	20650 5200 20750 5100
Entry Wire Line
	20650 5450 20750 5350
Entry Wire Line
	20650 5700 20750 5600
Entry Wire Line
	20650 5950 20750 5850
Entry Wire Line
	20650 6200 20750 6100
Entry Wire Line
	20650 6450 20750 6350
Entry Wire Line
	20650 6700 20750 6600
Entry Wire Line
	20650 6950 20750 6850
Entry Wire Line
	20650 8450 20750 8550
Entry Wire Line
	20650 8700 20750 8800
Entry Wire Line
	20650 8950 20750 9050
Entry Wire Line
	20650 9200 20750 9300
Entry Wire Line
	20650 9450 20750 9550
Entry Wire Line
	20650 9700 20750 9800
Entry Wire Line
	20650 9950 20750 10050
Entry Wire Line
	20650 10200 20750 10300
Entry Wire Line
	20650 12350 20750 12450
Entry Wire Line
	20650 12600 20750 12700
Entry Wire Line
	20650 12850 20750 12950
Entry Wire Line
	20650 13100 20750 13200
Entry Wire Line
	20650 13350 20750 13450
Entry Wire Line
	20650 13600 20750 13700
Entry Wire Line
	20650 13850 20750 13950
Entry Wire Line
	20650 14100 20750 14200
Entry Wire Line
	20650 14350 20750 14450
Wire Wire Line
	2600 850  2200 850 
Wire Wire Line
	2600 1100 2200 1100
Wire Wire Line
	2600 1350 2200 1350
Wire Wire Line
	2600 1600 2200 1600
Wire Wire Line
	2600 1850 2200 1850
Wire Wire Line
	2600 2100 2200 2100
Wire Wire Line
	2600 2350 2200 2350
Wire Wire Line
	2600 2600 2200 2600
Wire Wire Line
	2600 2850 2200 2850
Wire Wire Line
	2600 3100 2200 3100
Wire Wire Line
	2600 3350 2200 3350
Wire Wire Line
	2600 3600 2200 3600
Wire Wire Line
	2600 3850 2200 3850
Wire Wire Line
	2600 4100 2200 4100
Wire Wire Line
	2600 4350 2200 4350
Wire Wire Line
	2600 4600 2200 4600
Wire Wire Line
	2600 4850 2200 4850
Wire Wire Line
	2600 5100 2200 5100
Wire Wire Line
	2600 5350 2200 5350
Wire Wire Line
	2600 5600 2200 5600
Wire Wire Line
	2600 5850 2200 5850
Wire Wire Line
	2600 6100 2200 6100
Wire Wire Line
	2600 6350 2200 6350
Wire Wire Line
	2600 6650 2200 6650
Wire Wire Line
	2600 6900 2200 6900
Wire Wire Line
	2600 7150 2200 7150
Wire Wire Line
	2600 7400 2200 7400
Wire Wire Line
	2600 7650 2200 7650
Wire Wire Line
	2600 7900 2200 7900
Wire Wire Line
	2600 8150 2200 8150
Wire Wire Line
	2600 8400 2200 8400
Wire Wire Line
	2600 8650 2200 8650
Wire Wire Line
	2600 8900 2200 8900
Wire Wire Line
	2600 9150 2200 9150
Wire Wire Line
	2600 9400 2200 9400
Wire Wire Line
	2600 9650 2200 9650
Wire Wire Line
	2600 9900 2200 9900
Wire Wire Line
	2600 10150 2200 10150
Wire Wire Line
	2600 10400 2200 10400
Wire Wire Line
	3350 4400 3350 5550
Wire Wire Line
	3350 5550 3350 8200
Wire Wire Line
	3350 5550 3800 5550
Wire Wire Line
	3350 8200 3800 8200
Wire Wire Line
	3450 4500 3450 5650
Wire Wire Line
	3450 5650 3450 8300
Wire Wire Line
	3450 5650 3800 5650
Wire Wire Line
	3450 8300 3800 8300
Wire Wire Line
	3500 2050 3800 2050
Wire Wire Line
	3500 2300 3800 2300
Wire Wire Line
	3500 3150 3800 3150
Wire Wire Line
	3500 1750 3800 1750
Wire Wire Line
	3550 4600 3550 5750
Wire Wire Line
	3550 5750 3800 5750
Wire Wire Line
	3800 2550 3500 2550
Wire Wire Line
	3800 2900 3500 2900
Wire Wire Line
	3800 1250 3500 1250
Wire Wire Line
	3800 4400 3350 4400
Wire Wire Line
	3800 4500 3450 4500
Wire Wire Line
	3800 4600 3550 4600
Wire Wire Line
	5250 1500 5750 1500
Wire Wire Line
	5250 5500 7550 5500
Wire Wire Line
	5250 5700 7550 5700
Wire Wire Line
	5250 5900 7550 5900
Wire Wire Line
	5250 6600 6550 6600
Wire Wire Line
	5250 6700 6450 6700
Wire Wire Line
	5250 6800 6350 6800
Wire Wire Line
	5250 6900 6250 6900
Wire Wire Line
	5750 1250 5250 1250
Wire Wire Line
	5750 1750 5250 1750
Wire Wire Line
	6250 6900 6250 8400
Wire Wire Line
	6250 8400 7550 8400
Wire Wire Line
	6350 6800 6350 8300
Wire Wire Line
	6350 8300 7550 8300
Wire Wire Line
	6450 6700 6450 8200
Wire Wire Line
	6450 8200 7550 8200
Wire Wire Line
	6550 6600 6550 8100
Wire Wire Line
	6550 8100 7550 8100
Wire Wire Line
	6500 8700 6900 8700
Wire Wire Line
	6500 8950 6900 8950
Wire Wire Line
	6500 9200 6900 9200
Wire Wire Line
	6500 9450 6900 9450
Wire Wire Line
	6500 9700 6900 9700
Wire Wire Line
	16650 4100 16250 4100
Wire Wire Line
	7550 5600 5250 5600
Wire Wire Line
	7550 5800 5250 5800
Wire Wire Line
	9200 6350 9500 6350
Wire Wire Line
	9200 6450 9500 6450
Wire Wire Line
	16250 4350 16650 4350
Wire Wire Line
	9200 5800 10300 5800
Wire Wire Line
	9200 5900 10200 5900
Wire Wire Line
	9200 6000 10100 6000
Wire Wire Line
	9200 6100 10000 6100
Wire Wire Line
	9200 7300 10000 7300
Wire Wire Line
	10100 7400 10700 7400
Wire Wire Line
	10200 7300 10700 7300
Wire Wire Line
	10700 7200 10300 7200
Wire Wire Line
	13850 13350 14300 13350
Wire Wire Line
	15650 12450 16050 12450
Wire Wire Line
	16050 12600 15650 12600
Wire Wire Line
	16700 7450 18050 7450
Wire Wire Line
	16700 7700 18050 7700
Wire Wire Line
	17200 10550 17600 10550
Wire Wire Line
	17200 10800 17600 10800
Wire Wire Line
	17200 11050 17600 11050
Wire Wire Line
	17200 11300 17600 11300
Wire Wire Line
	17200 11550 17600 11550
Wire Wire Line
	17250 12450 17600 12450
Wire Wire Line
	17250 12600 17500 12600
Wire Wire Line
	17250 13500 17600 13500
Wire Wire Line
	17250 13750 17600 13750
Wire Wire Line
	17250 14000 17600 14000
Wire Wire Line
	17500 13200 17250 13200
Wire Wire Line
	17500 13200 17500 12600
Wire Wire Line
	17600 12450 17600 13500
Wire Wire Line
	17900 9600 18300 9600
Wire Wire Line
	17900 9850 18300 9850
Wire Wire Line
	17900 10100 18300 10100
Wire Wire Line
	17900 10350 18300 10350
Wire Wire Line
	17900 10600 18300 10600
Wire Wire Line
	17900 10850 18300 10850
Wire Wire Line
	17900 11100 18300 11100
Wire Wire Line
	17900 11350 18300 11350
Wire Wire Line
	17900 11600 18300 11600
Wire Wire Line
	17900 11850 18300 11850
Wire Wire Line
	17900 12100 18300 12100
Wire Wire Line
	17900 12350 18300 12350
Wire Wire Line
	17900 12600 18300 12600
Wire Wire Line
	17900 12850 18300 12850
Wire Wire Line
	17900 13100 18300 13100
Wire Wire Line
	17900 13350 18300 13350
Wire Wire Line
	17900 13600 18300 13600
Wire Wire Line
	17900 13850 18300 13850
Wire Wire Line
	17900 14100 18300 14100
Wire Wire Line
	17900 14350 18300 14350
Wire Wire Line
	17900 14600 18300 14600
Wire Wire Line
	17900 14850 18300 14850
Wire Wire Line
	17900 15100 18300 15100
Wire Wire Line
	18050 7350 16700 7350
Wire Wire Line
	18050 7600 16700 7600
Wire Wire Line
	12550 2050 13150 2050
Wire Wire Line
	12550 1950 13050 1950
Wire Wire Line
	12550 1850 12950 1850
Wire Wire Line
	12850 1750 12850 1300
Wire Wire Line
	12850 1300 13150 1300
Wire Wire Line
	12950 1550 12950 1850
Wire Wire Line
	12950 1550 13150 1550
Wire Wire Line
	13050 1950 13050 1800
Wire Wire Line
	13050 1800 13150 1800
Wire Wire Line
	19650 6850 20450 6850
Wire Wire Line
	19650 7200 21150 7200
Wire Wire Line
	19650 7450 21150 7450
Wire Wire Line
	19650 7700 21150 7700
Wire Wire Line
	19650 7950 21150 7950
Wire Wire Line
	19650 8200 21150 8200
Wire Wire Line
	19650 8650 20350 8650
Wire Wire Line
	20250 8750 19650 8750
Wire Wire Line
	20250 12100 20250 8750
Wire Wire Line
	20350 3050 21150 3050
Wire Wire Line
	20350 3300 21150 3300
Wire Wire Line
	20350 8650 20350 11850
Wire Wire Line
	20350 11850 21150 11850
Wire Wire Line
	20450 3650 21150 3650
Wire Wire Line
	20450 3900 21150 3900
Wire Wire Line
	20450 4250 20450 6850
Wire Wire Line
	20450 4250 21150 4250
Wire Wire Line
	20550 4500 20550 6950
Wire Wire Line
	20550 4500 21150 4500
Wire Wire Line
	20550 6950 19650 6950
Wire Wire Line
	20550 11250 21150 11250
Wire Wire Line
	20550 11500 21150 11500
Wire Wire Line
	20650 10650 21150 10650
Wire Wire Line
	20650 10900 21150 10900
Wire Wire Line
	20750 950  21150 950 
Wire Wire Line
	20750 1200 21150 1200
Wire Wire Line
	20750 1450 21150 1450
Wire Wire Line
	20750 1700 21150 1700
Wire Wire Line
	20750 1950 21150 1950
Wire Wire Line
	20750 2200 21150 2200
Wire Wire Line
	20750 2450 21150 2450
Wire Wire Line
	20750 2700 21150 2700
Wire Wire Line
	20750 4850 21150 4850
Wire Wire Line
	20750 5100 21150 5100
Wire Wire Line
	20750 5350 21150 5350
Wire Wire Line
	20750 5600 21150 5600
Wire Wire Line
	20750 5850 21150 5850
Wire Wire Line
	20750 6100 21150 6100
Wire Wire Line
	20750 6350 21150 6350
Wire Wire Line
	20750 6600 21150 6600
Wire Wire Line
	20750 6850 21150 6850
Wire Wire Line
	20750 8550 21150 8550
Wire Wire Line
	20750 8800 21150 8800
Wire Wire Line
	20750 9050 21150 9050
Wire Wire Line
	20750 9300 21150 9300
Wire Wire Line
	20750 9550 21150 9550
Wire Wire Line
	20750 9800 21150 9800
Wire Wire Line
	20750 10050 21150 10050
Wire Wire Line
	20750 10300 21150 10300
Wire Wire Line
	20750 12450 21150 12450
Wire Wire Line
	20750 12700 21150 12700
Wire Wire Line
	20750 12950 21150 12950
Wire Wire Line
	20750 13200 21150 13200
Wire Wire Line
	20750 13450 21150 13450
Wire Wire Line
	20750 13700 21150 13700
Wire Wire Line
	20750 13950 21150 13950
Wire Wire Line
	20750 14200 21150 14200
Wire Wire Line
	20750 14450 21150 14450
Wire Wire Line
	21150 12100 20250 12100
Wire Bus Line
	2700 8500 3800 8500
Wire Bus Line
	5250 8200 6150 8200
Wire Bus Line
	5250 9400 6150 9400
Wire Bus Line
	6150 5300 7450 5300
Wire Bus Line
	6150 8200 6150 9400
Wire Bus Line
	9200 7750 10700 7750
Wire Bus Line
	9200 7850 10700 7850
Wire Bus Line
	9200 7950 10700 7950
Wire Bus Line
	9200 8050 10700 8050
Wire Bus Line
	13600 13700 14300 13700
Wire Bus Line
	13600 14450 14300 14450
Wire Bus Line
	13600 14550 14300 14550
Wire Bus Line
	13600 14700 14300 14700
Wire Bus Line
	15650 12100 15750 12100
Wire Bus Line
	15650 12250 15850 12250
Wire Bus Line
	15650 14200 15750 14200
Wire Bus Line
	15650 14350 15850 14350
Wire Bus Line
	15750 12100 15750 14200
Wire Bus Line
	15750 12100 16050 12100
Wire Bus Line
	15850 12250 15850 14350
Wire Bus Line
	15850 12250 16050 12250
Wire Bus Line
	16050 12350 15650 12350
Wire Bus Line
	17250 12100 17700 12100
Wire Bus Line
	17250 12200 17800 12200
Wire Bus Line
	17250 12350 17700 12350
Wire Bus Line
	19650 6650 20250 6650
Wire Bus Line
	19650 7050 20650 7050
Wire Bus Line
	19650 8350 20650 8350
Wire Bus Line
	19650 8450 20550 8450
Wire Bus Line
	19650 8550 20450 8550
Wire Bus Line
	19650 8850 20150 8850
Wire Bus Line
	20150 2900 20150 6550
Wire Bus Line
	20150 2900 20650 2900
Wire Bus Line
	20150 6550 19650 6550
Wire Bus Line
	20150 8850 20150 12250
Wire Bus Line
	20150 12250 20650 12250
Wire Bus Line
	20350 6750 19650 6750
Text Notes 1500 10200 1    500  ~ 0
CD[0..15]
Text Notes 1550 5200 1    500  ~ 0
CA[1..23]
Text Notes 3150 2000 2    50   ~ 0
~CS
Text Notes 3150 2250 2    50   ~ 0
~RD
Text Notes 3150 2500 2    50   ~ 0
~WR
Text Notes 3150 2850 2    50   ~ 0
CLK
Text Notes 3150 3100 2    50   ~ 0
~RESET
Text Notes 3250 1700 2    50   ~ 0
~TEST3
Text Notes 3250 1200 2    50   ~ 0
~TEST1
Text Notes 5300 7550 0    50   ~ 0
READ\n0x26
Text Notes 3900 9100 0    197  ~ 0
CPS-ID
Text Notes 5300 5400 0    50   ~ 0
0x00
Text Notes 5300 5500 0    50   ~ 0
0x02
Text Notes 5300 5600 0    50   ~ 0
0x04
Text Notes 5300 5700 0    50   ~ 0
0x06
Text Notes 5300 5800 0    50   ~ 0
0x08
Text Notes 5300 5900 0    50   ~ 0
0x20
Text Notes 5300 6000 0    50   ~ 0
0x0C
Text Notes 5300 6100 0    50   ~ 0
0x0E
Text Notes 5300 6200 0    50   ~ 0
0x10
Text Notes 5300 6300 0    50   ~ 0
0x12
Text Notes 5300 6400 0    50   ~ 0
0x14
Text Notes 5300 6500 0    50   ~ 0
0x16
Text Notes 5300 6600 0    50   ~ 0
0x18
Text Notes 5300 6700 0    50   ~ 0
0x1A
Text Notes 5300 6800 0    50   ~ 0
0x1C
Text Notes 5300 6900 0    50   ~ 0
0x1E
Text Notes 5300 7100 0    50   ~ 0
0x22
Text Notes 5300 7200 0    50   ~ 0
0x24
Text Notes 5300 7300 0    50   ~ 0
0x28
Text Notes 6150 1200 0    50   ~ 0
CLK125
Text Notes 6150 1450 0    50   ~ 0
CLK250
Text Notes 6150 1700 0    50   ~ 0
~RESETI
Text Notes 6250 10107 0    157  ~ 0
XS[0..4]
Text Notes 17050 4050 0    50   ~ 0
~BR
Text Notes 17050 4300 0    50   ~ 0
~BGACK
Text Notes 17900 2550 0    50   ~ 0
FLIP
Text Notes 17850 2000 0    50   ~ 0
LUTPRO
Text Notes 14250 11750 0    197  ~ 0
ROMA-OUT
Text Notes 16750 11550 1    197  ~ 0
CB[0..5]
Text Notes 16950 13150 2    118  ~ 0
XSEL
Text Notes 16950 13450 2    118  ~ 0
CDEN
Text Notes 17000 13850 2    118  ~ 0
CPC[0..1]
Text Notes 17550 8800 2    50   ~ 0
~REWEN
Text Notes 12200 1450 2    197  ~ 0
WSTROM
Text Notes 19350 14550 1    500  ~ 0
ROMA[0..22]
Text Notes 18850 6250 2    197  ~ 0
VRAM
Text Notes 13550 1250 0    50   ~ 0
PL0WED
Text Notes 13550 1500 0    50   ~ 0
PL1WED
Text Notes 13550 1750 0    50   ~ 0
PL2WED
Text Notes 13550 2000 0    50   ~ 0
PL3WED
Text Notes 21550 3200 0    157  ~ 0
~ACAS[0..1]
Text Notes 21550 3750 0    157  ~ 0
~ASOE[0..1]
Text Notes 21550 4250 0    118  ~ 0
~ASCK
Text Notes 21550 4500 0    118  ~ 0
~ADTOE
Text Notes 21550 7150 0    50   ~ 0
~FWE
Text Notes 21550 7400 0    50   ~ 0
~FRAS
Text Notes 21550 7650 0    50   ~ 0
OBJEO
Text Notes 21550 7900 0    50   ~ 0
~OBJUP
Text Notes 21550 8150 0    50   ~ 0
FRAME
Text Notes 21550 10800 0    157  ~ 0
~BCAS[0..1]
Text Notes 21550 11350 0    157  ~ 0
~BSOE[0..1]
Text Notes 21550 11850 0    118  ~ 0
~BSCK
Text Notes 21550 12100 0    118  ~ 0
~BDTOE
Text Notes 21850 2600 1    236  ~ 0
AA[0..7]
Text Notes 21850 6500 1    236  ~ 0
AD[4..12]
Text Notes 21850 10200 1    236  ~ 0
BA[0..7]
Text Notes 21850 14100 1    236  ~ 0
BD[4..12]
Text Label 2300 6650 0    50   ~ 0
CD15
Text Label 2300 6900 0    50   ~ 0
CD14
Text Label 2300 7150 0    50   ~ 0
CD13
Text Label 2300 7400 0    50   ~ 0
CD12
Text Label 2300 7650 0    50   ~ 0
CD11
Text Label 2300 7900 0    50   ~ 0
CD10
Text Label 2300 8150 0    50   ~ 0
CD9
Text Label 2300 8400 0    50   ~ 0
CD8
Text Label 2300 8650 0    50   ~ 0
CD7
Text Label 2300 8900 0    50   ~ 0
CD6
Text Label 2300 9150 0    50   ~ 0
CD5
Text Label 2300 9400 0    50   ~ 0
CD4
Text Label 2300 9650 0    50   ~ 0
CD3
Text Label 2300 9900 0    50   ~ 0
CD2
Text Label 2300 10150 0    50   ~ 0
CD1
Text Label 2300 10400 0    50   ~ 0
CD0
Text Label 2450 850  2    50   ~ 0
CA23
Text Label 2450 1100 2    50   ~ 0
CA22
Text Label 2450 1350 2    50   ~ 0
CA21
Text Label 2450 1600 2    50   ~ 0
CA20
Text Label 2450 1850 2    50   ~ 0
CA19
Text Label 2450 2100 2    50   ~ 0
CA18
Text Label 2450 2350 2    50   ~ 0
CA17
Text Label 2450 2600 2    50   ~ 0
CA16
Text Label 2450 2850 2    50   ~ 0
CA15
Text Label 2450 3100 2    50   ~ 0
CA14
Text Label 2450 3350 2    50   ~ 0
CA13
Text Label 2450 3600 2    50   ~ 0
CA12
Text Label 2450 3850 2    50   ~ 0
CA11
Text Label 2450 4100 2    50   ~ 0
CA10
Text Label 2450 4350 2    50   ~ 0
CA9
Text Label 2450 4600 2    50   ~ 0
CA8
Text Label 2450 4850 2    50   ~ 0
CA7
Text Label 2450 5100 2    50   ~ 0
CA6
Text Label 2450 5350 2    50   ~ 0
CA5
Text Label 2450 5600 2    50   ~ 0
CA4
Text Label 2450 5850 2    50   ~ 0
CA3
Text Label 2450 6100 2    50   ~ 0
CA2
Text Label 2450 6350 2    50   ~ 0
CA1
Text Label 5350 1250 0    50   ~ 0
CLK8M
Text Label 5350 1500 0    50   ~ 0
CLK4M
Text Label 5350 1750 0    50   ~ 0
~RESETI
Text Label 9500 6350 2    50   ~ 0
CLK4M
Text Label 9500 6450 2    50   ~ 0
~CLK4M
Text Label 6800 8700 2    50   ~ 0
XS4
Text Label 6800 8950 2    50   ~ 0
XS3
Text Label 6800 9200 2    50   ~ 0
XS2
Text Label 6800 9450 2    50   ~ 0
XS1
Text Label 6800 9700 2    50   ~ 0
XS0
Text Label 16850 2600 2    50   ~ 0
FLIP
Text Label 16850 2050 2    50   ~ 0
LUTPRO
Text Label 10450 8750 0    50   ~ 0
FLIP
Text Label 13600 14200 0    50   ~ 0
COL[1..8]
Text Label 13600 14300 0    50   ~ 0
LINE[0..8]
Text Label 13600 14450 0    50   ~ 0
~RAM-TILE[0..15]
Text Label 13600 14550 0    50   ~ 0
~RAM-ATTR[0..15]
Text Label 13850 13350 0    50   ~ 0
~WSTROM
Text Label 13850 13450 0    50   ~ 0
COL[1..8]
Text Label 13850 12900 0    50   ~ 0
FLIP
Text Label 13850 13600 0    50   ~ 0
CLK4M
Text Label 14600 8200 0    50   ~ 0
~CLK4M
Text Label 17500 10550 2    50   ~ 0
_CB0
Text Label 17500 10800 2    50   ~ 0
_CB1
Text Label 17500 11050 2    50   ~ 0
_CB2
Text Label 17500 11300 2    50   ~ 0
_CB3
Text Label 17500 11550 2    50   ~ 0
_CB4
Text Label 17550 13750 2    50   ~ 0
_CPC1
Text Label 17550 14000 2    50   ~ 0
_CPC0
Text Label 17900 9600 0    50   ~ 0
_ROMA0
Text Label 17900 9850 0    50   ~ 0
_ROMA1
Text Label 17900 10100 0    50   ~ 0
_ROMA2
Text Label 17900 10350 0    50   ~ 0
_ROMA3
Text Label 17900 10600 0    50   ~ 0
_ROMA4
Text Label 17900 10850 0    50   ~ 0
_ROMA5
Text Label 17900 11100 0    50   ~ 0
_ROMA6
Text Label 17900 11350 0    50   ~ 0
_ROMA7
Text Label 17900 11600 0    50   ~ 0
_ROMA8
Text Label 17900 11850 0    50   ~ 0
_ROMA9
Text Label 17900 12100 0    50   ~ 0
_ROMA10
Text Label 17900 12350 0    50   ~ 0
_ROMA11
Text Label 17900 12600 0    50   ~ 0
_ROMA12
Text Label 17900 12850 0    50   ~ 0
_ROMA13
Text Label 17900 13100 0    50   ~ 0
_ROMA14
Text Label 17900 13350 0    50   ~ 0
_ROMA15
Text Label 17900 13600 0    50   ~ 0
_ROMA16
Text Label 17900 13850 0    50   ~ 0
_ROMA17
Text Label 17900 14100 0    50   ~ 0
_ROMA18
Text Label 17900 14350 0    50   ~ 0
_ROMA19
Text Label 17900 14600 0    50   ~ 0
_ROMA20
Text Label 17900 14850 0    50   ~ 0
_ROMA21
Text Label 17900 15100 0    50   ~ 0
_ROMA22
Text Label 20800 950  0    50   ~ 0
AA0
Text Label 20800 1200 0    50   ~ 0
AA1
Text Label 20800 1450 0    50   ~ 0
AA2
Text Label 20800 1700 0    50   ~ 0
AA3
Text Label 20800 1950 0    50   ~ 0
AA4
Text Label 20800 2200 0    50   ~ 0
AA5
Text Label 20800 2450 0    50   ~ 0
AA6
Text Label 20800 2700 0    50   ~ 0
AA7
Text Label 20800 3050 0    50   ~ 0
~ACAS0
Text Label 20800 3300 0    50   ~ 0
~ACAS1
Text Label 20800 3650 0    50   ~ 0
~ASOE0
Text Label 20800 3900 0    50   ~ 0
~ASOE1
Text Label 20800 4250 0    50   ~ 0
~ASCK
Text Label 20800 4500 0    50   ~ 0
~ADTOE
Text Label 20800 4850 0    50   ~ 0
AD4
Text Label 20800 5100 0    50   ~ 0
AD5
Text Label 20800 5350 0    50   ~ 0
AD6
Text Label 20800 5600 0    50   ~ 0
AD7
Text Label 20800 5850 0    50   ~ 0
AD8
Text Label 20800 6100 0    50   ~ 0
AD9
Text Label 20800 6350 0    50   ~ 0
AD10
Text Label 20800 6600 0    50   ~ 0
AD11
Text Label 20800 6850 0    50   ~ 0
AD12
Text Label 20800 8550 0    50   ~ 0
BA0
Text Label 20800 8800 0    50   ~ 0
BA1
Text Label 20800 9050 0    50   ~ 0
BA2
Text Label 20800 9300 0    50   ~ 0
BA3
Text Label 20800 9550 0    50   ~ 0
BA4
Text Label 20800 9800 0    50   ~ 0
BA5
Text Label 20800 10050 0    50   ~ 0
BA6
Text Label 20800 10300 0    50   ~ 0
BA7
Text Label 20800 10650 0    50   ~ 0
~BCAS0
Text Label 20800 10900 0    50   ~ 0
~BCAS1
Text Label 20800 11250 0    50   ~ 0
~BSOE0
Text Label 20800 11500 0    50   ~ 0
~BSOE1
Text Label 20800 11850 0    50   ~ 0
~BSCK
Text Label 20800 12100 0    50   ~ 0
~BDTOE
Text Label 20800 12450 0    50   ~ 0
BD4
Text Label 20800 12700 0    50   ~ 0
BD5
Text Label 20800 12950 0    50   ~ 0
BD6
Text Label 20800 13200 0    50   ~ 0
BD7
Text Label 20800 13450 0    50   ~ 0
BD8
Text Label 20800 13700 0    50   ~ 0
BD9
Text Label 20800 13950 0    50   ~ 0
BD10
Text Label 20800 14200 0    50   ~ 0
BD11
Text Label 20800 14450 0    50   ~ 0
BD12
$Comp
L A5C:PIN P159
U 1 1 612F4EB6
P 2200 850
F 0 "P159" H 2278 942 50  0000 L CNN
F 1 "PIN" H 2278 897 50  0001 L CNN
F 2 "" H 2200 850 50  0001 C CNN
F 3 "" H 2200 850 50  0001 C CNN
	1    2200 850 
	-1   0    0    -1  
$EndComp
$Comp
L A5C:PIN P158
U 1 1 6132114F
P 2200 1100
F 0 "P158" H 2278 1192 50  0000 L CNN
F 1 "PIN" H 2278 1147 50  0001 L CNN
F 2 "" H 2200 1100 50  0001 C CNN
F 3 "" H 2200 1100 50  0001 C CNN
	1    2200 1100
	-1   0    0    -1  
$EndComp
$Comp
L A5C:PIN P157
U 1 1 6132191C
P 2200 1350
F 0 "P157" H 2278 1442 50  0000 L CNN
F 1 "PIN" H 2278 1397 50  0001 L CNN
F 2 "" H 2200 1350 50  0001 C CNN
F 3 "" H 2200 1350 50  0001 C CNN
	1    2200 1350
	-1   0    0    -1  
$EndComp
$Comp
L A5C:PIN P156
U 1 1 61322A48
P 2200 1600
F 0 "P156" H 2278 1692 50  0000 L CNN
F 1 "PIN" H 2278 1647 50  0001 L CNN
F 2 "" H 2200 1600 50  0001 C CNN
F 3 "" H 2200 1600 50  0001 C CNN
	1    2200 1600
	-1   0    0    -1  
$EndComp
$Comp
L A5C:PIN P155
U 1 1 61322A4E
P 2200 1850
F 0 "P155" H 2278 1942 50  0000 L CNN
F 1 "PIN" H 2278 1897 50  0001 L CNN
F 2 "" H 2200 1850 50  0001 C CNN
F 3 "" H 2200 1850 50  0001 C CNN
	1    2200 1850
	-1   0    0    -1  
$EndComp
$Comp
L A5C:PIN P154
U 1 1 6134CE89
P 2200 2100
F 0 "P154" H 2278 2192 50  0000 L CNN
F 1 "PIN" H 2278 2147 50  0001 L CNN
F 2 "" H 2200 2100 50  0001 C CNN
F 3 "" H 2200 2100 50  0001 C CNN
	1    2200 2100
	-1   0    0    -1  
$EndComp
$Comp
L A5C:PIN P153
U 1 1 6134CE8F
P 2200 2350
F 0 "P153" H 2278 2442 50  0000 L CNN
F 1 "PIN" H 2278 2397 50  0001 L CNN
F 2 "" H 2200 2350 50  0001 C CNN
F 3 "" H 2200 2350 50  0001 C CNN
	1    2200 2350
	-1   0    0    -1  
$EndComp
$Comp
L A5C:PIN P152
U 1 1 613769C4
P 2200 2600
F 0 "P152" H 2278 2692 50  0000 L CNN
F 1 "PIN" H 2278 2647 50  0001 L CNN
F 2 "" H 2200 2600 50  0001 C CNN
F 3 "" H 2200 2600 50  0001 C CNN
	1    2200 2600
	-1   0    0    -1  
$EndComp
$Comp
L A5C:PIN P151
U 1 1 6137C273
P 2200 2850
F 0 "P151" H 2278 2942 50  0000 L CNN
F 1 "PIN" H 2278 2897 50  0001 L CNN
F 2 "" H 2200 2850 50  0001 C CNN
F 3 "" H 2200 2850 50  0001 C CNN
	1    2200 2850
	-1   0    0    -1  
$EndComp
$Comp
L A5C:PIN P150
U 1 1 6137C279
P 2200 3100
F 0 "P150" H 2278 3192 50  0000 L CNN
F 1 "PIN" H 2278 3147 50  0001 L CNN
F 2 "" H 2200 3100 50  0001 C CNN
F 3 "" H 2200 3100 50  0001 C CNN
	1    2200 3100
	-1   0    0    -1  
$EndComp
$Comp
L A5C:PIN P149
U 1 1 6137C27F
P 2200 3350
F 0 "P149" H 2278 3442 50  0000 L CNN
F 1 "PIN" H 2278 3397 50  0001 L CNN
F 2 "" H 2200 3350 50  0001 C CNN
F 3 "" H 2200 3350 50  0001 C CNN
	1    2200 3350
	-1   0    0    -1  
$EndComp
$Comp
L A5C:PIN P148
U 1 1 6137C285
P 2200 3600
F 0 "P148" H 2278 3692 50  0000 L CNN
F 1 "PIN" H 2278 3647 50  0001 L CNN
F 2 "" H 2200 3600 50  0001 C CNN
F 3 "" H 2200 3600 50  0001 C CNN
	1    2200 3600
	-1   0    0    -1  
$EndComp
$Comp
L A5C:PIN P147
U 1 1 6137C28B
P 2200 3850
F 0 "P147" H 2278 3942 50  0000 L CNN
F 1 "PIN" H 2278 3897 50  0001 L CNN
F 2 "" H 2200 3850 50  0001 C CNN
F 3 "" H 2200 3850 50  0001 C CNN
	1    2200 3850
	-1   0    0    -1  
$EndComp
$Comp
L A5C:PIN P146
U 1 1 6137C291
P 2200 4100
F 0 "P146" H 2278 4192 50  0000 L CNN
F 1 "PIN" H 2278 4147 50  0001 L CNN
F 2 "" H 2200 4100 50  0001 C CNN
F 3 "" H 2200 4100 50  0001 C CNN
	1    2200 4100
	-1   0    0    -1  
$EndComp
$Comp
L A5C:PIN P145
U 1 1 6137C297
P 2200 4350
F 0 "P145" H 2278 4442 50  0000 L CNN
F 1 "PIN" H 2278 4397 50  0001 L CNN
F 2 "" H 2200 4350 50  0001 C CNN
F 3 "" H 2200 4350 50  0001 C CNN
	1    2200 4350
	-1   0    0    -1  
$EndComp
$Comp
L A5C:PIN P144
U 1 1 6137C29D
P 2200 4600
F 0 "P144" H 2278 4692 50  0000 L CNN
F 1 "PIN" H 2278 4647 50  0001 L CNN
F 2 "" H 2200 4600 50  0001 C CNN
F 3 "" H 2200 4600 50  0001 C CNN
	1    2200 4600
	-1   0    0    -1  
$EndComp
$Comp
L A5C:PIN P143
U 1 1 613D502E
P 2200 4850
F 0 "P143" H 2278 4942 50  0000 L CNN
F 1 "PIN" H 2278 4897 50  0001 L CNN
F 2 "" H 2200 4850 50  0001 C CNN
F 3 "" H 2200 4850 50  0001 C CNN
	1    2200 4850
	-1   0    0    -1  
$EndComp
$Comp
L A5C:PIN P142
U 1 1 613D5034
P 2200 5100
F 0 "P142" H 2278 5192 50  0000 L CNN
F 1 "PIN" H 2278 5147 50  0001 L CNN
F 2 "" H 2200 5100 50  0001 C CNN
F 3 "" H 2200 5100 50  0001 C CNN
	1    2200 5100
	-1   0    0    -1  
$EndComp
$Comp
L A5C:PIN P141
U 1 1 613D503A
P 2200 5350
F 0 "P141" H 2278 5442 50  0000 L CNN
F 1 "PIN" H 2278 5397 50  0001 L CNN
F 2 "" H 2200 5350 50  0001 C CNN
F 3 "" H 2200 5350 50  0001 C CNN
	1    2200 5350
	-1   0    0    -1  
$EndComp
$Comp
L A5C:PIN P140
U 1 1 613D5040
P 2200 5600
F 0 "P140" H 2278 5692 50  0000 L CNN
F 1 "PIN" H 2278 5647 50  0001 L CNN
F 2 "" H 2200 5600 50  0001 C CNN
F 3 "" H 2200 5600 50  0001 C CNN
	1    2200 5600
	-1   0    0    -1  
$EndComp
$Comp
L A5C:PIN P139
U 1 1 613D5046
P 2200 5850
F 0 "P139" H 2278 5942 50  0000 L CNN
F 1 "PIN" H 2278 5897 50  0001 L CNN
F 2 "" H 2200 5850 50  0001 C CNN
F 3 "" H 2200 5850 50  0001 C CNN
	1    2200 5850
	-1   0    0    -1  
$EndComp
$Comp
L A5C:PIN P138
U 1 1 613D504C
P 2200 6100
F 0 "P138" H 2278 6192 50  0000 L CNN
F 1 "PIN" H 2278 6147 50  0001 L CNN
F 2 "" H 2200 6100 50  0001 C CNN
F 3 "" H 2200 6100 50  0001 C CNN
	1    2200 6100
	-1   0    0    -1  
$EndComp
$Comp
L A5C:PIN P137
U 1 1 613D5052
P 2200 6350
F 0 "P137" H 2278 6442 50  0000 L CNN
F 1 "PIN" H 2278 6397 50  0001 L CNN
F 2 "" H 2200 6350 50  0001 C CNN
F 3 "" H 2200 6350 50  0001 C CNN
	1    2200 6350
	-1   0    0    -1  
$EndComp
$Comp
L A5C:PIN P135
U 1 1 60AF05A3
P 2200 6650
F 0 "P135" H 2278 6742 50  0000 L CNN
F 1 "PIN" H 2278 6697 50  0001 L CNN
F 2 "" H 2200 6650 50  0001 C CNN
F 3 "" H 2200 6650 50  0001 C CNN
	1    2200 6650
	-1   0    0    -1  
$EndComp
$Comp
L A5C:PIN P133
U 1 1 60AF0525
P 2200 7150
F 0 "P133" H 2278 7242 50  0000 L CNN
F 1 "PIN" H 2278 7197 50  0001 L CNN
F 2 "" H 2200 7150 50  0001 C CNN
F 3 "" H 2200 7150 50  0001 C CNN
	1    2200 7150
	-1   0    0    -1  
$EndComp
$Comp
L A5C:PIN P132
U 1 1 60AF052B
P 2200 7400
F 0 "P132" H 2278 7492 50  0000 L CNN
F 1 "PIN" H 2278 7447 50  0001 L CNN
F 2 "" H 2200 7400 50  0001 C CNN
F 3 "" H 2200 7400 50  0001 C CNN
	1    2200 7400
	-1   0    0    -1  
$EndComp
$Comp
L A5C:PIN P131
U 1 1 60AF05AD
P 2200 7650
F 0 "P131" H 2278 7742 50  0000 L CNN
F 1 "PIN" H 2278 7697 50  0001 L CNN
F 2 "" H 2200 7650 50  0001 C CNN
F 3 "" H 2200 7650 50  0001 C CNN
	1    2200 7650
	-1   0    0    -1  
$EndComp
$Comp
L A5C:PIN P130
U 1 1 60AF0531
P 2200 7900
F 0 "P130" H 2278 7992 50  0000 L CNN
F 1 "PIN" H 2278 7947 50  0001 L CNN
F 2 "" H 2200 7900 50  0001 C CNN
F 3 "" H 2200 7900 50  0001 C CNN
	1    2200 7900
	-1   0    0    -1  
$EndComp
$Comp
L A5C:PIN P129
U 1 1 60AF0537
P 2200 8150
F 0 "P129" H 2278 8242 50  0000 L CNN
F 1 "PIN" H 2278 8197 50  0001 L CNN
F 2 "" H 2200 8150 50  0001 C CNN
F 3 "" H 2200 8150 50  0001 C CNN
	1    2200 8150
	-1   0    0    -1  
$EndComp
$Comp
L A5C:PIN P128
U 1 1 60AF053D
P 2200 8400
F 0 "P128" H 2278 8492 50  0000 L CNN
F 1 "PIN" H 2278 8447 50  0001 L CNN
F 2 "" H 2200 8400 50  0001 C CNN
F 3 "" H 2200 8400 50  0001 C CNN
	1    2200 8400
	-1   0    0    -1  
$EndComp
$Comp
L A5C:PIN P127
U 1 1 60AF0543
P 2200 8650
F 0 "P127" H 2278 8742 50  0000 L CNN
F 1 "PIN" H 2278 8697 50  0001 L CNN
F 2 "" H 2200 8650 50  0001 C CNN
F 3 "" H 2200 8650 50  0001 C CNN
	1    2200 8650
	-1   0    0    -1  
$EndComp
$Comp
L A5C:PIN P126
U 1 1 60AF0549
P 2200 8900
F 0 "P126" H 2278 8992 50  0000 L CNN
F 1 "PIN" H 2278 8947 50  0001 L CNN
F 2 "" H 2200 8900 50  0001 C CNN
F 3 "" H 2200 8900 50  0001 C CNN
	1    2200 8900
	-1   0    0    -1  
$EndComp
$Comp
L A5C:PIN P125
U 1 1 60AF054F
P 2200 9150
F 0 "P125" H 2278 9242 50  0000 L CNN
F 1 "PIN" H 2278 9197 50  0001 L CNN
F 2 "" H 2200 9150 50  0001 C CNN
F 3 "" H 2200 9150 50  0001 C CNN
	1    2200 9150
	-1   0    0    -1  
$EndComp
$Comp
L A5C:PIN P124
U 1 1 60AF0555
P 2200 9400
F 0 "P124" H 2278 9492 50  0000 L CNN
F 1 "PIN" H 2278 9447 50  0001 L CNN
F 2 "" H 2200 9400 50  0001 C CNN
F 3 "" H 2200 9400 50  0001 C CNN
	1    2200 9400
	-1   0    0    -1  
$EndComp
$Comp
L A5C:PIN P123
U 1 1 60AF055B
P 2200 9650
F 0 "P123" H 2278 9742 50  0000 L CNN
F 1 "PIN" H 2278 9697 50  0001 L CNN
F 2 "" H 2200 9650 50  0001 C CNN
F 3 "" H 2200 9650 50  0001 C CNN
	1    2200 9650
	-1   0    0    -1  
$EndComp
$Comp
L A5C:PIN P122
U 1 1 60AF0561
P 2200 9900
F 0 "P122" H 2278 9992 50  0000 L CNN
F 1 "PIN" H 2278 9947 50  0001 L CNN
F 2 "" H 2200 9900 50  0001 C CNN
F 3 "" H 2200 9900 50  0001 C CNN
	1    2200 9900
	-1   0    0    -1  
$EndComp
$Comp
L A5C:PIN P121
U 1 1 60AF0567
P 2200 10150
F 0 "P121" H 2278 10242 50  0000 L CNN
F 1 "PIN" H 2278 10197 50  0001 L CNN
F 2 "" H 2200 10150 50  0001 C CNN
F 3 "" H 2200 10150 50  0001 C CNN
	1    2200 10150
	-1   0    0    -1  
$EndComp
$Comp
L A5C:PIN P120
U 1 1 60AF056D
P 2200 10400
F 0 "P120" H 2278 10492 50  0000 L CNN
F 1 "PIN" H 2278 10447 50  0001 L CNN
F 2 "" H 2200 10400 50  0001 C CNN
F 3 "" H 2200 10400 50  0001 C CNN
	1    2200 10400
	-1   0    0    -1  
$EndComp
$Comp
L A5C:PIN P2
U 1 1 602B73B4
P 3500 2050
F 0 "P2" H 3578 2142 50  0000 L CNN
F 1 "PIN" H 3578 2097 50  0001 L CNN
F 2 "" H 3500 2050 50  0001 C CNN
F 3 "" H 3500 2050 50  0001 C CNN
	1    3500 2050
	-1   0    0    -1  
$EndComp
$Comp
L A5C:PIN P1
U 1 1 602B5582
P 3500 2300
F 0 "P1" H 3412 2392 50  0000 R CNN
F 1 "PIN" H 3578 2347 50  0001 L CNN
F 2 "" H 3500 2300 50  0001 C CNN
F 3 "" H 3500 2300 50  0001 C CNN
	1    3500 2300
	1    0    0    -1  
$EndComp
$Comp
L A5C:PIN P160
U 1 1 602B4A22
P 3500 2550
F 0 "P160" H 3578 2642 50  0000 L CNN
F 1 "PIN" H 3578 2597 50  0001 L CNN
F 2 "" H 3500 2550 50  0001 C CNN
F 3 "" H 3500 2550 50  0001 C CNN
	1    3500 2550
	-1   0    0    -1  
$EndComp
$Comp
L A5C:PIN P4
U 1 1 60357D5C
P 3500 2900
F 0 "P4" H 3412 2992 50  0000 R CNN
F 1 "PIN" H 3578 2947 50  0001 L CNN
F 2 "" H 3500 2900 50  0001 C CNN
F 3 "" H 3500 2900 50  0001 C CNN
	1    3500 2900
	1    0    0    -1  
$EndComp
$Comp
L A5C:PIN P106
U 1 1 60352C0A
P 3500 3150
F 0 "P106" H 3578 3242 50  0000 L CNN
F 1 "PIN" H 3578 3197 50  0001 L CNN
F 2 "" H 3500 3150 50  0001 C CNN
F 3 "" H 3500 3150 50  0001 C CNN
	1    3500 3150
	-1   0    0    -1  
$EndComp
$Comp
L A5C:PIN P3
U 1 1 602FE105
P 3500 1750
F 0 "P3" H 3578 1842 50  0000 L CNN
F 1 "PIN" H 3578 1797 50  0001 L CNN
F 2 "" H 3500 1750 50  0001 C CNN
F 3 "" H 3500 1750 50  0001 C CNN
	1    3500 1750
	-1   0    0    -1  
$EndComp
$Comp
L A5C:PIN P6
U 1 1 602FE113
P 3500 1250
F 0 "P6" H 3412 1342 50  0000 R CNN
F 1 "PIN" H 3578 1297 50  0001 L CNN
F 2 "" H 3500 1250 50  0001 C CNN
F 3 "" H 3500 1250 50  0001 C CNN
	1    3500 1250
	1    0    0    -1  
$EndComp
$Comp
L A5C:PIN P109
U 1 1 6056F95E
P 5750 1250
F 0 "P109" H 5662 1342 50  0000 R CNN
F 1 "PIN" H 5828 1297 50  0001 L CNN
F 2 "" H 5750 1250 50  0001 C CNN
F 3 "" H 5750 1250 50  0001 C CNN
	1    5750 1250
	-1   0    0    -1  
$EndComp
$Comp
L A5C:PIN P107
U 1 1 6057E905
P 5750 1500
F 0 "P107" H 5662 1592 50  0000 R CNN
F 1 "PIN" H 5828 1547 50  0001 L CNN
F 2 "" H 5750 1500 50  0001 C CNN
F 3 "" H 5750 1500 50  0001 C CNN
	1    5750 1500
	-1   0    0    -1  
$EndComp
$Comp
L A5C:PIN P105
U 1 1 605ACAA3
P 5750 1750
F 0 "P105" H 5662 1842 50  0000 R CNN
F 1 "PIN" H 5828 1797 50  0001 L CNN
F 2 "" H 5750 1750 50  0001 C CNN
F 3 "" H 5750 1750 50  0001 C CNN
	1    5750 1750
	-1   0    0    -1  
$EndComp
$Comp
L A5C:PIN P61
U 1 1 662FEF0D
P 6500 8700
F 0 "P61" H 6578 8792 50  0000 L CNN
F 1 "PIN" H 6578 8747 50  0001 L CNN
F 2 "" H 6500 8700 50  0001 C CNN
F 3 "" H 6500 8700 50  0001 C CNN
	1    6500 8700
	-1   0    0    -1  
$EndComp
$Comp
L A5C:PIN P62
U 1 1 662FEF13
P 6500 8950
F 0 "P62" H 6578 9042 50  0000 L CNN
F 1 "PIN" H 6578 8997 50  0001 L CNN
F 2 "" H 6500 8950 50  0001 C CNN
F 3 "" H 6500 8950 50  0001 C CNN
	1    6500 8950
	-1   0    0    -1  
$EndComp
$Comp
L A5C:PIN P63
U 1 1 662FEF19
P 6500 9200
F 0 "P63" H 6578 9292 50  0000 L CNN
F 1 "PIN" H 6578 9247 50  0001 L CNN
F 2 "" H 6500 9200 50  0001 C CNN
F 3 "" H 6500 9200 50  0001 C CNN
	1    6500 9200
	-1   0    0    -1  
$EndComp
$Comp
L A5C:PIN P64
U 1 1 662FEF1F
P 6500 9450
F 0 "P64" H 6578 9542 50  0000 L CNN
F 1 "PIN" H 6578 9497 50  0001 L CNN
F 2 "" H 6500 9450 50  0001 C CNN
F 3 "" H 6500 9450 50  0001 C CNN
	1    6500 9450
	-1   0    0    -1  
$EndComp
$Comp
L A5C:PIN P65
U 1 1 662FEF29
P 6500 9700
F 0 "P65" H 6578 9792 50  0000 L CNN
F 1 "PIN" H 6578 9747 50  0001 L CNN
F 2 "" H 6500 9700 50  0001 C CNN
F 3 "" H 6500 9700 50  0001 C CNN
	1    6500 9700
	-1   0    0    -1  
$EndComp
$Comp
L A5C:PIN P117
U 1 1 681F91A1
P 16650 4100
F 0 "P117" H 16562 4192 50  0000 R CNN
F 1 "PIN" H 16728 4147 50  0001 L CNN
F 2 "" H 16650 4100 50  0001 C CNN
F 3 "" H 16650 4100 50  0001 C CNN
	1    16650 4100
	-1   0    0    -1  
$EndComp
$Comp
L A5C:PIN P118
U 1 1 674EC310
P 16650 4350
F 0 "P118" H 16728 4442 50  0000 L CNN
F 1 "PIN" H 16728 4397 50  0001 L CNN
F 2 "" H 16650 4350 50  0001 C CNN
F 3 "" H 16650 4350 50  0001 C CNN
	1    16650 4350
	1    0    0    -1  
$EndComp
$Comp
L A5C:PIN P104
U 1 1 72F9476D
P 17450 2600
F 0 "P104" H 17362 2692 50  0000 R CNN
F 1 "PIN" H 17528 2647 50  0001 L CNN
F 2 "" H 17450 2600 50  0001 C CNN
F 3 "" H 17450 2600 50  0001 C CNN
	1    17450 2600
	-1   0    0    -1  
$EndComp
$Comp
L A5C:PIN P116
U 1 1 6908B9EB
P 17450 2050
F 0 "P116" H 17362 2142 50  0000 R CNN
F 1 "PIN" H 17528 2097 50  0001 L CNN
F 2 "" H 17450 2050 50  0001 C CNN
F 3 "" H 17450 2050 50  0001 C CNN
	1    17450 2050
	-1   0    0    -1  
$EndComp
$Comp
L A5C:PIN P99
U 1 1 6727B90C
P 17200 10550
F 0 "P99" H 17278 10642 50  0000 L CNN
F 1 "PIN" H 17278 10597 50  0001 L CNN
F 2 "" H 17200 10550 50  0001 C CNN
F 3 "" H 17200 10550 50  0001 C CNN
	1    17200 10550
	-1   0    0    -1  
$EndComp
$Comp
L A5C:PIN P100
U 1 1 6727B912
P 17200 10800
F 0 "P100" H 17278 10892 50  0000 L CNN
F 1 "PIN" H 17278 10847 50  0001 L CNN
F 2 "" H 17200 10800 50  0001 C CNN
F 3 "" H 17200 10800 50  0001 C CNN
	1    17200 10800
	-1   0    0    -1  
$EndComp
$Comp
L A5C:PIN P101
U 1 1 6727B918
P 17200 11050
F 0 "P101" H 17278 11142 50  0000 L CNN
F 1 "PIN" H 17278 11097 50  0001 L CNN
F 2 "" H 17200 11050 50  0001 C CNN
F 3 "" H 17200 11050 50  0001 C CNN
	1    17200 11050
	-1   0    0    -1  
$EndComp
$Comp
L A5C:PIN P102
U 1 1 6727B91E
P 17200 11300
F 0 "P102" H 17278 11392 50  0000 L CNN
F 1 "PIN" H 17278 11347 50  0001 L CNN
F 2 "" H 17200 11300 50  0001 C CNN
F 3 "" H 17200 11300 50  0001 C CNN
	1    17200 11300
	-1   0    0    -1  
$EndComp
$Comp
L A5C:PIN P103
U 1 1 673DFA9E
P 17200 11550
F 0 "P103" H 17278 11642 50  0000 L CNN
F 1 "PIN" H 17278 11597 50  0001 L CNN
F 2 "" H 17200 11550 50  0001 C CNN
F 3 "" H 17200 11550 50  0001 C CNN
	1    17200 11550
	-1   0    0    -1  
$EndComp
$Comp
L A5C:PIN P69
U 1 1 65F9D8F6
P 17250 13200
F 0 "P69" H 17328 13292 50  0000 L CNN
F 1 "PIN" H 17328 13247 50  0001 L CNN
F 2 "" H 17250 13200 50  0001 C CNN
F 3 "" H 17250 13200 50  0001 C CNN
	1    17250 13200
	-1   0    0    -1  
$EndComp
$Comp
L A5C:PIN P68
U 1 1 613AD362
P 17250 13500
F 0 "P68" H 17328 13592 50  0000 L CNN
F 1 "PIN" H 17328 13547 50  0001 L CNN
F 2 "" H 17250 13500 50  0001 C CNN
F 3 "" H 17250 13500 50  0001 C CNN
	1    17250 13500
	-1   0    0    -1  
$EndComp
$Comp
L A5C:PIN P67
U 1 1 65C47E0A
P 17250 13750
F 0 "P67" H 17328 13842 50  0000 L CNN
F 1 "PIN" H 17328 13797 50  0001 L CNN
F 2 "" H 17250 13750 50  0001 C CNN
F 3 "" H 17250 13750 50  0001 C CNN
	1    17250 13750
	-1   0    0    -1  
$EndComp
$Comp
L A5C:PIN P66
U 1 1 65C47E03
P 17250 14000
F 0 "P66" H 17328 14092 50  0000 L CNN
F 1 "PIN" H 17328 14047 50  0001 L CNN
F 2 "" H 17250 14000 50  0001 C CNN
F 3 "" H 17250 14000 50  0001 C CNN
	1    17250 14000
	-1   0    0    -1  
$EndComp
$Comp
L A5C:PIN P57
U 1 1 61FE2917
P 17850 8850
F 0 "P57" H 17928 8942 50  0000 L CNN
F 1 "PIN" H 17928 8897 50  0001 L CNN
F 2 "" H 17850 8850 50  0001 C CNN
F 3 "" H 17850 8850 50  0001 C CNN
	1    17850 8850
	-1   0    0    -1  
$EndComp
$Comp
L A5C:PIN P75
U 1 1 63178F05
P 18300 9600
F 0 "P75" H 18378 9692 50  0000 L CNN
F 1 "PIN" H 18378 9647 50  0001 L CNN
F 2 "" H 18300 9600 50  0001 C CNN
F 3 "" H 18300 9600 50  0001 C CNN
	1    18300 9600
	1    0    0    -1  
$EndComp
$Comp
L A5C:PIN P76
U 1 1 63178F0B
P 18300 9850
F 0 "P76" H 18378 9942 50  0000 L CNN
F 1 "PIN" H 18378 9897 50  0001 L CNN
F 2 "" H 18300 9850 50  0001 C CNN
F 3 "" H 18300 9850 50  0001 C CNN
	1    18300 9850
	1    0    0    -1  
$EndComp
$Comp
L A5C:PIN P77
U 1 1 63178F11
P 18300 10100
F 0 "P77" H 18378 10192 50  0000 L CNN
F 1 "PIN" H 18378 10147 50  0001 L CNN
F 2 "" H 18300 10100 50  0001 C CNN
F 3 "" H 18300 10100 50  0001 C CNN
	1    18300 10100
	1    0    0    -1  
$EndComp
$Comp
L A5C:PIN P78
U 1 1 63178F17
P 18300 10350
F 0 "P78" H 18378 10442 50  0000 L CNN
F 1 "PIN" H 18378 10397 50  0001 L CNN
F 2 "" H 18300 10350 50  0001 C CNN
F 3 "" H 18300 10350 50  0001 C CNN
	1    18300 10350
	1    0    0    -1  
$EndComp
$Comp
L A5C:PIN P79
U 1 1 63178F1D
P 18300 10600
F 0 "P79" H 18378 10692 50  0000 L CNN
F 1 "PIN" H 18378 10647 50  0001 L CNN
F 2 "" H 18300 10600 50  0001 C CNN
F 3 "" H 18300 10600 50  0001 C CNN
	1    18300 10600
	1    0    0    -1  
$EndComp
$Comp
L A5C:PIN P80
U 1 1 63178F23
P 18300 10850
F 0 "P80" H 18378 10942 50  0000 L CNN
F 1 "PIN" H 18378 10897 50  0001 L CNN
F 2 "" H 18300 10850 50  0001 C CNN
F 3 "" H 18300 10850 50  0001 C CNN
	1    18300 10850
	1    0    0    -1  
$EndComp
$Comp
L A5C:PIN P82
U 1 1 63178F29
P 18300 11100
F 0 "P82" H 18378 11192 50  0000 L CNN
F 1 "PIN" H 18378 11147 50  0001 L CNN
F 2 "" H 18300 11100 50  0001 C CNN
F 3 "" H 18300 11100 50  0001 C CNN
	1    18300 11100
	1    0    0    -1  
$EndComp
$Comp
L A5C:PIN P83
U 1 1 63178F2F
P 18300 11350
F 0 "P83" H 18378 11442 50  0000 L CNN
F 1 "PIN" H 18378 11397 50  0001 L CNN
F 2 "" H 18300 11350 50  0001 C CNN
F 3 "" H 18300 11350 50  0001 C CNN
	1    18300 11350
	1    0    0    -1  
$EndComp
$Comp
L A5C:PIN P84
U 1 1 63178F35
P 18300 11600
F 0 "P84" H 18378 11692 50  0000 L CNN
F 1 "PIN" H 18378 11647 50  0001 L CNN
F 2 "" H 18300 11600 50  0001 C CNN
F 3 "" H 18300 11600 50  0001 C CNN
	1    18300 11600
	1    0    0    -1  
$EndComp
$Comp
L A5C:PIN P85
U 1 1 63178F3B
P 18300 11850
F 0 "P85" H 18378 11942 50  0000 L CNN
F 1 "PIN" H 18378 11897 50  0001 L CNN
F 2 "" H 18300 11850 50  0001 C CNN
F 3 "" H 18300 11850 50  0001 C CNN
	1    18300 11850
	1    0    0    -1  
$EndComp
$Comp
L A5C:PIN P86
U 1 1 63178F41
P 18300 12100
F 0 "P86" H 18378 12192 50  0000 L CNN
F 1 "PIN" H 18378 12147 50  0001 L CNN
F 2 "" H 18300 12100 50  0001 C CNN
F 3 "" H 18300 12100 50  0001 C CNN
	1    18300 12100
	1    0    0    -1  
$EndComp
$Comp
L A5C:PIN P87
U 1 1 63178F47
P 18300 12350
F 0 "P87" H 18378 12442 50  0000 L CNN
F 1 "PIN" H 18378 12397 50  0001 L CNN
F 2 "" H 18300 12350 50  0001 C CNN
F 3 "" H 18300 12350 50  0001 C CNN
	1    18300 12350
	1    0    0    -1  
$EndComp
$Comp
L A5C:PIN P88
U 1 1 63178F4D
P 18300 12600
F 0 "P88" H 18378 12692 50  0000 L CNN
F 1 "PIN" H 18378 12647 50  0001 L CNN
F 2 "" H 18300 12600 50  0001 C CNN
F 3 "" H 18300 12600 50  0001 C CNN
	1    18300 12600
	1    0    0    -1  
$EndComp
$Comp
L A5C:PIN P89
U 1 1 63178F53
P 18300 12850
F 0 "P89" H 18378 12942 50  0000 L CNN
F 1 "PIN" H 18378 12897 50  0001 L CNN
F 2 "" H 18300 12850 50  0001 C CNN
F 3 "" H 18300 12850 50  0001 C CNN
	1    18300 12850
	1    0    0    -1  
$EndComp
$Comp
L A5C:PIN P90
U 1 1 63178F59
P 18300 13100
F 0 "P90" H 18378 13192 50  0000 L CNN
F 1 "PIN" H 18378 13147 50  0001 L CNN
F 2 "" H 18300 13100 50  0001 C CNN
F 3 "" H 18300 13100 50  0001 C CNN
	1    18300 13100
	1    0    0    -1  
$EndComp
$Comp
L A5C:PIN P91
U 1 1 63178F5F
P 18300 13350
F 0 "P91" H 18378 13442 50  0000 L CNN
F 1 "PIN" H 18378 13397 50  0001 L CNN
F 2 "" H 18300 13350 50  0001 C CNN
F 3 "" H 18300 13350 50  0001 C CNN
	1    18300 13350
	1    0    0    -1  
$EndComp
$Comp
L A5C:PIN P92
U 1 1 63178F65
P 18300 13600
F 0 "P92" H 18378 13692 50  0000 L CNN
F 1 "PIN" H 18378 13647 50  0001 L CNN
F 2 "" H 18300 13600 50  0001 C CNN
F 3 "" H 18300 13600 50  0001 C CNN
	1    18300 13600
	1    0    0    -1  
$EndComp
$Comp
L A5C:PIN P93
U 1 1 63178F6B
P 18300 13850
F 0 "P93" H 18378 13942 50  0000 L CNN
F 1 "PIN" H 18378 13897 50  0001 L CNN
F 2 "" H 18300 13850 50  0001 C CNN
F 3 "" H 18300 13850 50  0001 C CNN
	1    18300 13850
	1    0    0    -1  
$EndComp
$Comp
L A5C:PIN P94
U 1 1 63178F71
P 18300 14100
F 0 "P94" H 18378 14192 50  0000 L CNN
F 1 "PIN" H 18378 14147 50  0001 L CNN
F 2 "" H 18300 14100 50  0001 C CNN
F 3 "" H 18300 14100 50  0001 C CNN
	1    18300 14100
	1    0    0    -1  
$EndComp
$Comp
L A5C:PIN P95
U 1 1 63178F77
P 18300 14350
F 0 "P95" H 18378 14442 50  0000 L CNN
F 1 "PIN" H 18378 14397 50  0001 L CNN
F 2 "" H 18300 14350 50  0001 C CNN
F 3 "" H 18300 14350 50  0001 C CNN
	1    18300 14350
	1    0    0    -1  
$EndComp
$Comp
L A5C:PIN P96
U 1 1 63178F7D
P 18300 14600
F 0 "P96" H 18378 14692 50  0000 L CNN
F 1 "PIN" H 18378 14647 50  0001 L CNN
F 2 "" H 18300 14600 50  0001 C CNN
F 3 "" H 18300 14600 50  0001 C CNN
	1    18300 14600
	1    0    0    -1  
$EndComp
$Comp
L A5C:PIN P97
U 1 1 63178F83
P 18300 14850
F 0 "P97" H 18378 14942 50  0000 L CNN
F 1 "PIN" H 18378 14897 50  0001 L CNN
F 2 "" H 18300 14850 50  0001 C CNN
F 3 "" H 18300 14850 50  0001 C CNN
	1    18300 14850
	1    0    0    -1  
$EndComp
$Comp
L A5C:PIN P98
U 1 1 63178F89
P 18300 15100
F 0 "P98" H 18378 15192 50  0000 L CNN
F 1 "PIN" H 18378 15147 50  0001 L CNN
F 2 "" H 18300 15100 50  0001 C CNN
F 3 "" H 18300 15100 50  0001 C CNN
	1    18300 15100
	1    0    0    -1  
$EndComp
$Comp
L A5C:PIN P71
U 1 1 61118DA9
P 13150 1300
F 0 "P71" H 13062 1392 50  0000 R CNN
F 1 "PIN" H 13228 1347 50  0001 L CNN
F 2 "" H 13150 1300 50  0001 C CNN
F 3 "" H 13150 1300 50  0001 C CNN
	1    13150 1300
	-1   0    0    -1  
$EndComp
$Comp
L A5C:PIN P72
U 1 1 61118DA8
P 13150 1550
F 0 "P72" H 13062 1642 50  0000 R CNN
F 1 "PIN" H 13228 1597 50  0001 L CNN
F 2 "" H 13150 1550 50  0001 C CNN
F 3 "" H 13150 1550 50  0001 C CNN
	1    13150 1550
	-1   0    0    -1  
$EndComp
$Comp
L A5C:PIN P73
U 1 1 61118DA7
P 13150 1800
F 0 "P73" H 13062 1892 50  0000 R CNN
F 1 "PIN" H 13228 1847 50  0001 L CNN
F 2 "" H 13150 1800 50  0001 C CNN
F 3 "" H 13150 1800 50  0001 C CNN
	1    13150 1800
	-1   0    0    -1  
$EndComp
$Comp
L A5C:PIN P74
U 1 1 61118DA6
P 13150 2050
F 0 "P74" H 13062 2142 50  0000 R CNN
F 1 "PIN" H 13228 2097 50  0001 L CNN
F 2 "" H 13150 2050 50  0001 C CNN
F 3 "" H 13150 2050 50  0001 C CNN
	1    13150 2050
	-1   0    0    -1  
$EndComp
$Comp
L A5C:PIN P7
U 1 1 634B0AC4
P 21150 950
F 0 "P7" H 21228 1042 50  0000 L CNN
F 1 "PIN" H 21228 997 50  0001 L CNN
F 2 "" H 21150 950 50  0001 C CNN
F 3 "" H 21150 950 50  0001 C CNN
	1    21150 950 
	1    0    0    -1  
$EndComp
$Comp
L A5C:PIN P8
U 1 1 634B0ACA
P 21150 1200
F 0 "P8" H 21228 1292 50  0000 L CNN
F 1 "PIN" H 21228 1247 50  0001 L CNN
F 2 "" H 21150 1200 50  0001 C CNN
F 3 "" H 21150 1200 50  0001 C CNN
	1    21150 1200
	1    0    0    -1  
$EndComp
$Comp
L A5C:PIN P9
U 1 1 634B0AD0
P 21150 1450
F 0 "P9" H 21228 1542 50  0000 L CNN
F 1 "PIN" H 21228 1497 50  0001 L CNN
F 2 "" H 21150 1450 50  0001 C CNN
F 3 "" H 21150 1450 50  0001 C CNN
	1    21150 1450
	1    0    0    -1  
$EndComp
$Comp
L A5C:PIN P10
U 1 1 634B0AD6
P 21150 1700
F 0 "P10" H 21228 1792 50  0000 L CNN
F 1 "PIN" H 21228 1747 50  0001 L CNN
F 2 "" H 21150 1700 50  0001 C CNN
F 3 "" H 21150 1700 50  0001 C CNN
	1    21150 1700
	1    0    0    -1  
$EndComp
$Comp
L A5C:PIN P11
U 1 1 634B0ADC
P 21150 1950
F 0 "P11" H 21228 2042 50  0000 L CNN
F 1 "PIN" H 21228 1997 50  0001 L CNN
F 2 "" H 21150 1950 50  0001 C CNN
F 3 "" H 21150 1950 50  0001 C CNN
	1    21150 1950
	1    0    0    -1  
$EndComp
$Comp
L A5C:PIN P12
U 1 1 634B0AE2
P 21150 2200
F 0 "P12" H 21228 2292 50  0000 L CNN
F 1 "PIN" H 21228 2247 50  0001 L CNN
F 2 "" H 21150 2200 50  0001 C CNN
F 3 "" H 21150 2200 50  0001 C CNN
	1    21150 2200
	1    0    0    -1  
$EndComp
$Comp
L A5C:PIN P13
U 1 1 634B0AE8
P 21150 2450
F 0 "P13" H 21228 2542 50  0000 L CNN
F 1 "PIN" H 21228 2497 50  0001 L CNN
F 2 "" H 21150 2450 50  0001 C CNN
F 3 "" H 21150 2450 50  0001 C CNN
	1    21150 2450
	1    0    0    -1  
$EndComp
$Comp
L A5C:PIN P14
U 1 1 634B0AEE
P 21150 2700
F 0 "P14" H 21228 2792 50  0000 L CNN
F 1 "PIN" H 21228 2747 50  0001 L CNN
F 2 "" H 21150 2700 50  0001 C CNN
F 3 "" H 21150 2700 50  0001 C CNN
	1    21150 2700
	1    0    0    -1  
$EndComp
$Comp
L A5C:PIN P15
U 1 1 6393AFA7
P 21150 3050
F 0 "P15" H 21228 3142 50  0000 L CNN
F 1 "PIN" H 21228 3097 50  0001 L CNN
F 2 "" H 21150 3050 50  0001 C CNN
F 3 "" H 21150 3050 50  0001 C CNN
	1    21150 3050
	1    0    0    -1  
$EndComp
$Comp
L A5C:PIN P16
U 1 1 6393AFAD
P 21150 3300
F 0 "P16" H 21228 3392 50  0000 L CNN
F 1 "PIN" H 21228 3347 50  0001 L CNN
F 2 "" H 21150 3300 50  0001 C CNN
F 3 "" H 21150 3300 50  0001 C CNN
	1    21150 3300
	1    0    0    -1  
$EndComp
$Comp
L A5C:PIN P17
U 1 1 6399B9F0
P 21150 3650
F 0 "P17" H 21228 3742 50  0000 L CNN
F 1 "PIN" H 21228 3697 50  0001 L CNN
F 2 "" H 21150 3650 50  0001 C CNN
F 3 "" H 21150 3650 50  0001 C CNN
	1    21150 3650
	1    0    0    -1  
$EndComp
$Comp
L A5C:PIN P18
U 1 1 6399B9F6
P 21150 3900
F 0 "P18" H 21228 3992 50  0000 L CNN
F 1 "PIN" H 21228 3947 50  0001 L CNN
F 2 "" H 21150 3900 50  0001 C CNN
F 3 "" H 21150 3900 50  0001 C CNN
	1    21150 3900
	1    0    0    -1  
$EndComp
$Comp
L A5C:PIN P20
U 1 1 63BC396D
P 21150 4250
F 0 "P20" H 21228 4342 50  0000 L CNN
F 1 "PIN" H 21228 4297 50  0001 L CNN
F 2 "" H 21150 4250 50  0001 C CNN
F 3 "" H 21150 4250 50  0001 C CNN
	1    21150 4250
	1    0    0    -1  
$EndComp
$Comp
L A5C:PIN P21
U 1 1 63BC3CBB
P 21150 4500
F 0 "P21" H 21228 4592 50  0000 L CNN
F 1 "PIN" H 21228 4547 50  0001 L CNN
F 2 "" H 21150 4500 50  0001 C CNN
F 3 "" H 21150 4500 50  0001 C CNN
	1    21150 4500
	1    0    0    -1  
$EndComp
$Comp
L A5C:PIN P22
U 1 1 638F91A7
P 21150 4850
F 0 "P22" H 21228 4942 50  0000 L CNN
F 1 "PIN" H 21228 4897 50  0001 L CNN
F 2 "" H 21150 4850 50  0001 C CNN
F 3 "" H 21150 4850 50  0001 C CNN
	1    21150 4850
	1    0    0    -1  
$EndComp
$Comp
L A5C:PIN P23
U 1 1 638F91AD
P 21150 5100
F 0 "P23" H 21228 5192 50  0000 L CNN
F 1 "PIN" H 21228 5147 50  0001 L CNN
F 2 "" H 21150 5100 50  0001 C CNN
F 3 "" H 21150 5100 50  0001 C CNN
	1    21150 5100
	1    0    0    -1  
$EndComp
$Comp
L A5C:PIN P24
U 1 1 638F91B3
P 21150 5350
F 0 "P24" H 21228 5442 50  0000 L CNN
F 1 "PIN" H 21228 5397 50  0001 L CNN
F 2 "" H 21150 5350 50  0001 C CNN
F 3 "" H 21150 5350 50  0001 C CNN
	1    21150 5350
	1    0    0    -1  
$EndComp
$Comp
L A5C:PIN P25
U 1 1 638F91B9
P 21150 5600
F 0 "P25" H 21228 5692 50  0000 L CNN
F 1 "PIN" H 21228 5647 50  0001 L CNN
F 2 "" H 21150 5600 50  0001 C CNN
F 3 "" H 21150 5600 50  0001 C CNN
	1    21150 5600
	1    0    0    -1  
$EndComp
$Comp
L A5C:PIN P26
U 1 1 638F91BF
P 21150 5850
F 0 "P26" H 21228 5942 50  0000 L CNN
F 1 "PIN" H 21228 5897 50  0001 L CNN
F 2 "" H 21150 5850 50  0001 C CNN
F 3 "" H 21150 5850 50  0001 C CNN
	1    21150 5850
	1    0    0    -1  
$EndComp
$Comp
L A5C:PIN P27
U 1 1 638F91C5
P 21150 6100
F 0 "P27" H 21228 6192 50  0000 L CNN
F 1 "PIN" H 21228 6147 50  0001 L CNN
F 2 "" H 21150 6100 50  0001 C CNN
F 3 "" H 21150 6100 50  0001 C CNN
	1    21150 6100
	1    0    0    -1  
$EndComp
$Comp
L A5C:PIN P28
U 1 1 638F91CB
P 21150 6350
F 0 "P28" H 21228 6442 50  0000 L CNN
F 1 "PIN" H 21228 6397 50  0001 L CNN
F 2 "" H 21150 6350 50  0001 C CNN
F 3 "" H 21150 6350 50  0001 C CNN
	1    21150 6350
	1    0    0    -1  
$EndComp
$Comp
L A5C:PIN P29
U 1 1 638F91D1
P 21150 6600
F 0 "P29" H 21228 6692 50  0000 L CNN
F 1 "PIN" H 21228 6647 50  0001 L CNN
F 2 "" H 21150 6600 50  0001 C CNN
F 3 "" H 21150 6600 50  0001 C CNN
	1    21150 6600
	1    0    0    -1  
$EndComp
$Comp
L A5C:PIN P30
U 1 1 63918618
P 21150 6850
F 0 "P30" H 21228 6942 50  0000 L CNN
F 1 "PIN" H 21228 6897 50  0001 L CNN
F 2 "" H 21150 6850 50  0001 C CNN
F 3 "" H 21150 6850 50  0001 C CNN
	1    21150 6850
	1    0    0    -1  
$EndComp
$Comp
L A5C:PIN P31
U 1 1 63362C46
P 21150 7200
F 0 "P31" H 21062 7292 50  0000 R CNN
F 1 "PIN" H 21228 7247 50  0001 L CNN
F 2 "" H 21150 7200 50  0001 C CNN
F 3 "" H 21150 7200 50  0001 C CNN
	1    21150 7200
	-1   0    0    -1  
$EndComp
$Comp
L A5C:PIN P32
U 1 1 6337EA5A
P 21150 7450
F 0 "P32" H 21062 7542 50  0000 R CNN
F 1 "PIN" H 21228 7497 50  0001 L CNN
F 2 "" H 21150 7450 50  0001 C CNN
F 3 "" H 21150 7450 50  0001 C CNN
	1    21150 7450
	-1   0    0    -1  
$EndComp
$Comp
L A5C:PIN P58
U 1 1 6A0EE353
P 21150 7700
F 0 "P58" H 21062 7792 50  0000 R CNN
F 1 "PIN" H 21228 7747 50  0001 L CNN
F 2 "" H 21150 7700 50  0001 C CNN
F 3 "" H 21150 7700 50  0001 C CNN
	1    21150 7700
	-1   0    0    -1  
$EndComp
$Comp
L A5C:PIN P59
U 1 1 6AF8692C
P 21150 7950
F 0 "P59" H 21062 8042 50  0000 R CNN
F 1 "PIN" H 21228 7997 50  0001 L CNN
F 2 "" H 21150 7950 50  0001 C CNN
F 3 "" H 21150 7950 50  0001 C CNN
	1    21150 7950
	-1   0    0    -1  
$EndComp
$Comp
L A5C:PIN P60
U 1 1 6B7BCA47
P 21150 8200
F 0 "P60" H 21062 8292 50  0000 R CNN
F 1 "PIN" H 21228 8247 50  0001 L CNN
F 2 "" H 21150 8200 50  0001 C CNN
F 3 "" H 21150 8200 50  0001 C CNN
	1    21150 8200
	-1   0    0    -1  
$EndComp
$Comp
L A5C:PIN P33
U 1 1 640DB378
P 21150 8550
F 0 "P33" H 21228 8642 50  0000 L CNN
F 1 "PIN" H 21228 8597 50  0001 L CNN
F 2 "" H 21150 8550 50  0001 C CNN
F 3 "" H 21150 8550 50  0001 C CNN
	1    21150 8550
	1    0    0    -1  
$EndComp
$Comp
L A5C:PIN P34
U 1 1 640DB37E
P 21150 8800
F 0 "P34" H 21228 8892 50  0000 L CNN
F 1 "PIN" H 21228 8847 50  0001 L CNN
F 2 "" H 21150 8800 50  0001 C CNN
F 3 "" H 21150 8800 50  0001 C CNN
	1    21150 8800
	1    0    0    -1  
$EndComp
$Comp
L A5C:PIN P35
U 1 1 640DB384
P 21150 9050
F 0 "P35" H 21228 9142 50  0000 L CNN
F 1 "PIN" H 21228 9097 50  0001 L CNN
F 2 "" H 21150 9050 50  0001 C CNN
F 3 "" H 21150 9050 50  0001 C CNN
	1    21150 9050
	1    0    0    -1  
$EndComp
$Comp
L A5C:PIN P36
U 1 1 640DB38A
P 21150 9300
F 0 "P36" H 21228 9392 50  0000 L CNN
F 1 "PIN" H 21228 9347 50  0001 L CNN
F 2 "" H 21150 9300 50  0001 C CNN
F 3 "" H 21150 9300 50  0001 C CNN
	1    21150 9300
	1    0    0    -1  
$EndComp
$Comp
L A5C:PIN P37
U 1 1 640DB390
P 21150 9550
F 0 "P37" H 21228 9642 50  0000 L CNN
F 1 "PIN" H 21228 9597 50  0001 L CNN
F 2 "" H 21150 9550 50  0001 C CNN
F 3 "" H 21150 9550 50  0001 C CNN
	1    21150 9550
	1    0    0    -1  
$EndComp
$Comp
L A5C:PIN P38
U 1 1 640DB396
P 21150 9800
F 0 "P38" H 21228 9892 50  0000 L CNN
F 1 "PIN" H 21228 9847 50  0001 L CNN
F 2 "" H 21150 9800 50  0001 C CNN
F 3 "" H 21150 9800 50  0001 C CNN
	1    21150 9800
	1    0    0    -1  
$EndComp
$Comp
L A5C:PIN P39
U 1 1 640DB39C
P 21150 10050
F 0 "P39" H 21228 10142 50  0000 L CNN
F 1 "PIN" H 21228 10097 50  0001 L CNN
F 2 "" H 21150 10050 50  0001 C CNN
F 3 "" H 21150 10050 50  0001 C CNN
	1    21150 10050
	1    0    0    -1  
$EndComp
$Comp
L A5C:PIN P40
U 1 1 640DB3A2
P 21150 10300
F 0 "P40" H 21228 10392 50  0000 L CNN
F 1 "PIN" H 21228 10347 50  0001 L CNN
F 2 "" H 21150 10300 50  0001 C CNN
F 3 "" H 21150 10300 50  0001 C CNN
	1    21150 10300
	1    0    0    -1  
$EndComp
$Comp
L A5C:PIN P41
U 1 1 640DB40E
P 21150 10650
F 0 "P41" H 21228 10742 50  0000 L CNN
F 1 "PIN" H 21228 10697 50  0001 L CNN
F 2 "" H 21150 10650 50  0001 C CNN
F 3 "" H 21150 10650 50  0001 C CNN
	1    21150 10650
	1    0    0    -1  
$EndComp
$Comp
L A5C:PIN P42
U 1 1 640DB414
P 21150 10900
F 0 "P42" H 21228 10992 50  0000 L CNN
F 1 "PIN" H 21228 10947 50  0001 L CNN
F 2 "" H 21150 10900 50  0001 C CNN
F 3 "" H 21150 10900 50  0001 C CNN
	1    21150 10900
	1    0    0    -1  
$EndComp
$Comp
L A5C:PIN P43
U 1 1 640DB420
P 21150 11250
F 0 "P43" H 21228 11342 50  0000 L CNN
F 1 "PIN" H 21228 11297 50  0001 L CNN
F 2 "" H 21150 11250 50  0001 C CNN
F 3 "" H 21150 11250 50  0001 C CNN
	1    21150 11250
	1    0    0    -1  
$EndComp
$Comp
L A5C:PIN P44
U 1 1 640DB426
P 21150 11500
F 0 "P44" H 21228 11592 50  0000 L CNN
F 1 "PIN" H 21228 11547 50  0001 L CNN
F 2 "" H 21150 11500 50  0001 C CNN
F 3 "" H 21150 11500 50  0001 C CNN
	1    21150 11500
	1    0    0    -1  
$EndComp
$Comp
L A5C:PIN P46
U 1 1 640DB42D
P 21150 11850
F 0 "P46" H 21228 11942 50  0000 L CNN
F 1 "PIN" H 21228 11897 50  0001 L CNN
F 2 "" H 21150 11850 50  0001 C CNN
F 3 "" H 21150 11850 50  0001 C CNN
	1    21150 11850
	1    0    0    -1  
$EndComp
$Comp
L A5C:PIN P47
U 1 1 640DB433
P 21150 12100
F 0 "P47" H 21228 12192 50  0000 L CNN
F 1 "PIN" H 21228 12147 50  0001 L CNN
F 2 "" H 21150 12100 50  0001 C CNN
F 3 "" H 21150 12100 50  0001 C CNN
	1    21150 12100
	1    0    0    -1  
$EndComp
$Comp
L A5C:PIN P48
U 1 1 640DB3D3
P 21150 12450
F 0 "P48" H 21228 12542 50  0000 L CNN
F 1 "PIN" H 21228 12497 50  0001 L CNN
F 2 "" H 21150 12450 50  0001 C CNN
F 3 "" H 21150 12450 50  0001 C CNN
	1    21150 12450
	1    0    0    -1  
$EndComp
$Comp
L A5C:PIN P49
U 1 1 640DB3D9
P 21150 12700
F 0 "P49" H 21228 12792 50  0000 L CNN
F 1 "PIN" H 21228 12747 50  0001 L CNN
F 2 "" H 21150 12700 50  0001 C CNN
F 3 "" H 21150 12700 50  0001 C CNN
	1    21150 12700
	1    0    0    -1  
$EndComp
$Comp
L A5C:PIN P50
U 1 1 640DB3DF
P 21150 12950
F 0 "P50" H 21228 13042 50  0000 L CNN
F 1 "PIN" H 21228 12997 50  0001 L CNN
F 2 "" H 21150 12950 50  0001 C CNN
F 3 "" H 21150 12950 50  0001 C CNN
	1    21150 12950
	1    0    0    -1  
$EndComp
$Comp
L A5C:PIN P51
U 1 1 640DB3E5
P 21150 13200
F 0 "P51" H 21228 13292 50  0000 L CNN
F 1 "PIN" H 21228 13247 50  0001 L CNN
F 2 "" H 21150 13200 50  0001 C CNN
F 3 "" H 21150 13200 50  0001 C CNN
	1    21150 13200
	1    0    0    -1  
$EndComp
$Comp
L A5C:PIN P52
U 1 1 640DB3EB
P 21150 13450
F 0 "P52" H 21228 13542 50  0000 L CNN
F 1 "PIN" H 21228 13497 50  0001 L CNN
F 2 "" H 21150 13450 50  0001 C CNN
F 3 "" H 21150 13450 50  0001 C CNN
	1    21150 13450
	1    0    0    -1  
$EndComp
$Comp
L A5C:PIN P53
U 1 1 640DB3F1
P 21150 13700
F 0 "P53" H 21228 13792 50  0000 L CNN
F 1 "PIN" H 21228 13747 50  0001 L CNN
F 2 "" H 21150 13700 50  0001 C CNN
F 3 "" H 21150 13700 50  0001 C CNN
	1    21150 13700
	1    0    0    -1  
$EndComp
$Comp
L A5C:PIN P54
U 1 1 640DB3F7
P 21150 13950
F 0 "P54" H 21228 14042 50  0000 L CNN
F 1 "PIN" H 21228 13997 50  0001 L CNN
F 2 "" H 21150 13950 50  0001 C CNN
F 3 "" H 21150 13950 50  0001 C CNN
	1    21150 13950
	1    0    0    -1  
$EndComp
$Comp
L A5C:PIN P55
U 1 1 640DB3FD
P 21150 14200
F 0 "P55" H 21228 14292 50  0000 L CNN
F 1 "PIN" H 21228 14247 50  0001 L CNN
F 2 "" H 21150 14200 50  0001 C CNN
F 3 "" H 21150 14200 50  0001 C CNN
	1    21150 14200
	1    0    0    -1  
$EndComp
$Comp
L A5C:PIN P56
U 1 1 640DB403
P 21150 14450
F 0 "P56" H 21228 14542 50  0000 L CNN
F 1 "PIN" H 21228 14497 50  0001 L CNN
F 2 "" H 21150 14450 50  0001 C CNN
F 3 "" H 21150 14450 50  0001 C CNN
	1    21150 14450
	1    0    0    -1  
$EndComp
$Comp
L A5C:BUF12 UBF138
U 1 1 72F94773
P 17150 2600
F 0 "UBF138" H 17150 2917 50  0000 C CNN
F 1 "BUF12" H 17150 2826 50  0000 C CNN
F 2 "" H 17150 2600 50  0001 C CNN
F 3 "" H 17150 2600 50  0001 C CNN
	1    17150 2600
	1    0    0    -1  
$EndComp
$Comp
L A5C:BUF12 UAC522
U 1 1 691CCD85
P 17150 2050
F 0 "UAC522" H 17150 2367 50  0000 C CNN
F 1 "BUF12" H 17150 2276 50  0000 C CNN
F 2 "" H 17150 2050 50  0001 C CNN
F 3 "" H 17150 2050 50  0001 C CNN
	1    17150 2050
	1    0    0    -1  
$EndComp
$Sheet
S 3800 5250 1450 2450
U 611A5354
F0 "addr-decoder" 50
F1 "addr-decoder.sch" 50
F2 "WRITE" I L 3800 5650 50 
F3 "~DECODE" I L 3800 5750 50 
F4 "READ" I L 3800 5550 50 
F5 "~OBJRAM-BASE" O R 5250 5400 50 
F6 "~SCROLL1-BASE" O R 5250 5500 50 
F7 "~SCROLL2-BASE" O R 5250 5600 50 
F8 "~SCROLL3-BASE" O R 5250 5700 50 
F9 "~ROWSCROLL-BASE" O R 5250 5800 50 
F10 "~PALETTE-BASE" O R 5250 7000 50 
F11 "~SCROLL1-X" O R 5250 6000 50 
F12 "~SCROLL1-Y" O R 5250 6100 50 
F13 "~SCROLL2-X" O R 5250 6200 50 
F14 "~SCROLL2-Y" O R 5250 6300 50 
F15 "~SCROLL3-X" O R 5250 6400 50 
F16 "~SCROLL3-Y" O R 5250 6500 50 
F17 "~STAR1-X" O R 5250 6600 50 
F18 "~STAR1-Y" O R 5250 6700 50 
F19 "~STAR2-X" O R 5250 6800 50 
F20 "~STAR2-Y" O R 5250 6900 50 
F21 "~ROWSCROLL-OFFSET" O R 5250 5900 50 
F22 "~VIDEO-CONTROL" O R 5250 7100 50 
F23 "~WSTROM-COPY" O R 5250 7200 50 
F24 "~SCANLINE" O R 5250 7300 50 
F25 "~CPS-ID" O R 5250 7550 50 
F26 "CA[1..5]" I L 3800 5400 50 
$EndSheet
$Sheet
S 3800 8050 1450 600 
U 604B5523
F0 "bus-data-io" 50
F1 "bus-data-io.sch" 50
F2 "BUS-DATA[0..15]" B R 5250 8200 50 
F3 "CD[0..15]" B L 3800 8500 50 
F4 "READ" I L 3800 8200 50 
F5 "WRITE" I L 3800 8300 50 
$EndSheet
$Sheet
S 15000 1900 1250 3150
U 60A9F60C
F0 "bus-requests" 50
F1 "bus-requests.sch" 50
F2 "~BGACK" I R 16250 4350 50 
F3 "BUS-~I~O" O L 15000 3550 50 
F4 "~BR" O R 16250 4100 50 
F5 "BUS-READY" O L 15000 4200 50 
F6 "LI" I L 15000 2150 50 
F7 "FLIP" O R 16250 2600 50 
F8 "LUTPRO" O R 16250 2050 50 
F9 "WSTROM-END" I L 15000 3000 50 
F10 "WSTLUT-END" I L 15000 3100 50 
F11 "WSTOBJ-END" I L 15000 3200 50 
F12 "SCROLL-CNT[0..6]" O L 15000 3900 50 
F13 "~PALETTE-BASE" I L 15000 2400 50 
F14 "~WSTROM-COPY" I L 15000 2600 50 
F15 "~VIDEO-CONTROL" I L 15000 2500 50 
F16 "LINE[0..8]" I L 15000 2050 50 
F17 "BUS-DATA[0..15]" I L 15000 2750 50 
F18 "~BUS-WSTROM" O L 15000 4800 50 
F19 "~BUS-WSTOBJ" O L 15000 4900 50 
F20 "~BUS-ROWSCROLL" O L 15000 4300 50 
F21 "~BUS-SCROLL1" O L 15000 4400 50 
F22 "~BUS-SCROLL2" O L 15000 4500 50 
F23 "~BUS-SCROLL3" O L 15000 4600 50 
F24 "~BUS-WSTLUT" O L 15000 4700 50 
F25 "BUS-STATE[0..2]" O L 15000 4050 50 
F26 "~WSTROM-RESET" O L 15000 2900 50 
F27 "LI-SYNCED" O R 16250 4900 50 
F28 "MAIN-RESET" I L 15000 3650 50 
F29 "CLK4M" I L 15000 2250 50 
$EndSheet
$Sheet
S 3800 9250 1450 450 
U 61195FDC
F0 "cps-id" 50
F1 "cps-id.sch" 50
F2 "~CPS-ID" I R 5250 9550 50 
F3 "~CPS-ID-RESET" I L 3800 9400 50 
F4 "BUS-DATA[0..15]" T R 5250 9400 50 
$EndSheet
$Sheet
S 16050 11950 1200 800 
U 651E67D1
F0 "roma-bus" 50
F1 "roma-bus.sch" 50
F2 "ROMA[0..22]" I L 16050 12100 50 
F3 "_ROMA[0..22]" O R 17250 12200 50 
F4 "_CDEN" O R 17250 12450 50 
F5 "CDEN" I L 16050 12450 50 
F6 "_CB[0..4]" O R 17250 12100 50 
F7 "_CPC[0..1]" O R 17250 12350 50 
F8 "_XSEL" O R 17250 12600 50 
F9 "XSEL" I L 16050 12600 50 
F10 "CPC[0..1]" I L 16050 12350 50 
F11 "CB[0..4]" I L 16050 12250 50 
$EndSheet
$Sheet
S 7550 5150 1650 1750
U 61111462
F0 "scroll-bus-addr" 50
F1 "scroll-bus-addr.sch" 50
F2 "~ROWSCROLL-OFFSET" I L 7550 5900 50 
F3 "~SCROLL1-Y" I L 7550 6100 50 
F4 "~SCROLL2-Y" I L 7550 6300 50 
F5 "~SCROLL3-Y" I L 7550 6500 50 
F6 "~SCROLL1-X" I L 7550 6000 50 
F7 "~SCROLL2-X" I L 7550 6200 50 
F8 "~SCROLL3-X" I L 7550 6400 50 
F9 "SCROLL-CNT[0..6]" I R 9200 5500 50 
F10 "~BUS-SCROLL1" I R 9200 5800 50 
F11 "~BUS-SCROLL2" I R 9200 5900 50 
F12 "~BUS-SCROLL3" I R 9200 6000 50 
F13 "CLK4M" I R 9200 6350 50 
F14 "LINE[0..8]" I R 9200 6650 50 
F15 "FLIP" I R 9200 6750 50 
F16 "ADDR[1..23]" T R 9200 5300 50 
F17 "~BUS-ROWSCROLL" I R 9200 6100 50 
F18 "~SCROLL1-BASE" I L 7550 5500 50 
F19 "~SCROLL2-BASE" I L 7550 5600 50 
F20 "~SCROLL3-BASE" I L 7550 5700 50 
F21 "BUS-DATA[0..15]" I L 7550 5300 50 
F22 "~ROWSCROLL-BASE" I L 7550 5800 50 
F23 "BUS-READY" I R 9200 5650 50 
F24 "~CLK4M" I R 9200 6450 50 
$EndSheet
$Sheet
S 7550 7150 1650 2300
U 612D3239
F0 "scroll-positions" 50
F1 "scroll-positions.sch" 50
F2 "~STAR2-X" I L 7550 8300 50 
F3 "~STAR1-X" I L 7550 8100 50 
F4 "~STAR1-Y" I L 7550 8200 50 
F5 "~STAR2-Y" I L 7550 8400 50 
F6 "~SCROLL1-T" I R 9200 8200 50 
F7 "~SCROLL2-T" I R 9200 8300 50 
F8 "~SCROLL3-T" I R 9200 8400 50 
F9 "~SCROLL1-X" I L 7550 7500 50 
F10 "~SCROLL2-X" I L 7550 7700 50 
F11 "~SCROLL3-X" I L 7550 7900 50 
F12 "~SCROLL1-Y" I L 7550 7600 50 
F13 "~SCROLL2-Y" I L 7550 7800 50 
F14 "~SCROLL3-Y" I L 7550 8000 50 
F15 "FLIP" I R 9200 8750 50 
F16 "~STAR1-T" I R 9200 8500 50 
F17 "~STAR2-T" I R 9200 8600 50 
F18 "STARS-T" O R 9200 9300 50 
F19 "FI" I L 7550 8750 50 
F20 "LI" I L 7550 8650 50 
F21 "SCROLL1-X[0..5]" O R 9200 7750 50 
F22 "CLK4M" I L 7550 8550 50 
F23 "LINE[0..8]" I R 9200 7550 50 
F24 "XS-OUT[0..4]" O L 7550 9300 50 
F25 "ROMA-Y[0..5]" T R 9200 9150 50 
F26 "GFX-ADDR[4..19]" T R 9200 9050 50 
F27 "~BUS-ROWSCROLL" I R 9200 7300 50 
F28 "BUS-DATA[0..8]" I L 7550 7300 50 
F29 "Y-OUT[3..8]" O R 9200 8050 50 
F30 "MAIN-RESET" I L 7550 8900 50 
F31 "SCROLL2-X[0..5]" O R 9200 7850 50 
F32 "SCROLL3-X[0..3]" O R 9200 7950 50 
$EndSheet
$Sheet
S 14300 14050 1350 800 
U 6112ED26
F0 "sram-debug" 50
F1 "sram-debug.sch" 50
F2 "~RAM-TILE[0..15]" I L 14300 14450 50 
F3 "~RAM-ATTR[0..9]" I L 14300 14550 50 
F4 "CB[0..3]" T R 15650 14350 50 
F5 "ROMA[0..21]" T R 15650 14200 50 
F6 "~DEBUG[2..3]" I L 14300 14700 50 
F7 "COL[1..8]" I L 14300 14200 50 
F8 "LINE[0..8]" I L 14300 14300 50 
$EndSheet
$Sheet
S 18050 6400 1600 2600
U 613100A2
F0 "vram-controller" 50
F1 "vram-controller.sch" 50
F2 "COL[1..8]" I L 18050 6650 50 
F3 "LINE[0..8]" I L 18050 6550 50 
F4 "FLIP" I L 18050 6750 50 
F5 "MAIN-RESET" I L 18050 8000 50 
F6 "CLK8M" I L 18050 8300 50 
F7 "CLK4M" I L 18050 8200 50 
F8 "~FWE" O R 19650 7200 50 
F9 "SCAN-240-245" I L 18050 7000 50 
F10 "OBJEO" O R 19650 7700 50 
F11 "~REWEN" I L 18050 8850 50 
F12 "FRAME" O R 19650 8200 50 
F13 "~FRAS" O R 19650 7450 50 
F14 "LI" I L 18050 8100 50 
F15 "~SPRITE-X-READY-LI" I L 18050 7600 50 
F16 "BUS-DATA[0..8]" I L 18050 7150 50 
F17 "~BUS-SPRITE-Y" I L 18050 7450 50 
F18 "SPRITE-BLOCK-READY" I L 18050 7700 50 
F19 "~OBJUP" O R 19650 7950 50 
F20 "SCAN-243" I L 18050 6900 50 
F21 "~SPRITE-T" I L 18050 7850 50 
F22 "_CB[0..4]" I L 18050 8550 50 
F23 "AA[0..7]" O R 19650 6550 50 
F24 "~BUS-SPRITE-X" I L 18050 7350 50 
F25 "BA[0..7]" O R 19650 8350 50 
F26 "AD[4..12]" O R 19650 7050 50 
F27 "BD[4..12]" O R 19650 8850 50 
F28 "~ACAS[0..1]" O R 19650 6650 50 
F29 "~ASOE[0..1]" O R 19650 6750 50 
F30 "~BCAS[0..1]" O R 19650 8450 50 
F31 "~BSOE[0..1]" O R 19650 8550 50 
F32 "~ADTOE" O R 19650 6950 50 
F33 "~ASCK" O R 19650 6850 50 
F34 "~BDTOE" O R 19650 8750 50 
F35 "~BSCK" O R 19650 8650 50 
$EndSheet
$Sheet
S 11000 1600 1550 1350
U 612E58BE
F0 "wstrom" 50
F1 "wstrom.sch" 50
F2 "COL[1..2]" I L 11000 2050 50 
F3 "~WSTROM" I R 12550 2250 50 
F4 "~WSTROM-COPY" I L 11000 1900 50 
F5 "CLK4M" I L 11000 2200 50 
F6 "CLK8M" I L 11000 2300 50 
F7 "BUS-DATA[0..15]" I L 11000 1750 50 
F8 "~DEBUG[6..6]" I L 11000 2500 50 
F9 "MAIN-RESET" I L 11000 2650 50 
F10 "~WSTROM-RESET" I R 12550 2350 50 
F11 "~PL0WED" O R 12550 1750 50 
F12 "~PL1WED" O R 12550 1850 50 
F13 "~PL2WED" O R 12550 1950 50 
F14 "~PL3WED" O R 12550 2050 50 
F15 "ADDR[1..23]" T R 12550 2800 50 
F16 "GFX-ADDR[0..22]" T R 12550 2600 50 
F17 "WSTROM-END" O R 12550 2450 50 
$EndSheet
Wire Wire Line
	12850 1750 12550 1750
Wire Bus Line
	12550 2800 12650 2800
Text Label 12600 2250 0    50   ~ 0
~WSTROM
Connection ~ 6150 5300
$Sheet
S 7300 2200 1600 850 
U 612FA445
F0 "wstlut" 50
F1 "wstlut.sch" 50
F2 "~BUS-WSTLUT" I R 8900 2500 50 
F3 "LUTPRO" I R 8900 2600 50 
F4 "~CLK4M" I L 7300 2650 50 
F5 "~PALETTE-BASE" I L 7300 2500 50 
F6 "BUS-DATA[0..15]" I L 7300 2350 50 
F7 "WSTLUT-END" O R 8900 2900 50 
F8 "~DEBUG[5..5]" I L 7300 2800 50 
F9 "MAIN-RESET" I L 7300 2900 50 
F10 "ADDR[1..23]" T R 8900 2350 50 
$EndSheet
Text Notes 7300 2047 0    197  ~ 0
WSTLUT
Wire Bus Line
	7300 2350 6150 2350
Wire Bus Line
	6150 2350 6150 3300
Wire Bus Line
	6150 3300 10100 3300
Wire Bus Line
	10700 6850 10600 6850
Wire Bus Line
	6150 3300 6150 5300
Wire Bus Line
	10600 3300 10600 6850
$Sheet
S 15000 6400 1700 1950
U 612CA5FA
F0 "sprites-controller" 50
F1 "sprites-controller.sch" 50
F2 "MAIN-RESET" I R 16700 8000 50 
F3 "SCAN-243" I R 16700 6900 50 
F4 "CLK4M" I R 16700 8200 50 
F5 "~BUS-WSTOBJ" I L 15000 6550 50 
F6 "BUS-DATA[0..15]" I R 16700 7150 50 
F7 "~OBJRAM-BASE" I R 16700 7250 50 
F8 "SCAN-240-245" I R 16700 7000 50 
F9 "LI-SYNCED" I R 16700 6550 50 
F10 "~CLK4M" O L 15000 8200 50 
F11 "~BUS-SPRITE-X" O R 16700 7350 50 
F12 "~BUS-SPRITE-Y" O R 16700 7450 50 
F13 "WSTOBJ-END" O L 15000 6650 50 
F14 "FLIP" I R 16700 6750 50 
F15 "LI" I R 16700 8100 50 
F16 "ADDR[1..23]" T L 15000 6750 50 
F17 "COL[5..8]" I R 16700 6650 50 
F18 "~SPRITE-T" I R 16700 7850 50 
F19 "ROMA-Y[0..3]" T L 15000 6950 50 
F20 "GFX-ADDR[4..19]" T L 15000 6850 50 
F21 "_CB[0..4]" T L 15000 7100 50 
F22 "_CPC[0..0]" T L 15000 7200 50 
F23 "_XFLIP" T L 15000 7450 50 
F24 "_YFLIP" T L 15000 7550 50 
F25 "SPRITE-BLOCK-READY" O R 16700 7700 50 
F26 "~SPRITE-X-READY-LI" O R 16700 7600 50 
$EndSheet
Text Notes 15000 6250 0    197  ~ 0
SPRITES
Wire Wire Line
	16700 8200 18050 8200
Wire Bus Line
	16700 6650 18050 6650
Wire Wire Line
	18050 6750 16700 6750
Wire Wire Line
	16700 6900 18050 6900
Wire Wire Line
	18050 7000 16700 7000
Wire Wire Line
	17850 8850 18050 8850
Wire Wire Line
	18050 8100 16700 8100
Text Label 14250 4900 0    50   ~ 0
~BUS-WSTOBJ
Wire Wire Line
	18050 8300 17750 8300
Text Label 17750 8300 0    50   ~ 0
CLK8M
Wire Wire Line
	14600 8200 15000 8200
Text Label 6100 5400 2    50   ~ 0
~OBJRAM-BASE
Wire Wire Line
	5250 5400 6100 5400
Connection ~ 9950 3450
Wire Bus Line
	9950 2350 9950 3450
Wire Wire Line
	3250 4200 3250 9400
Connection ~ 6150 3300
Text Label 17300 7250 2    50   ~ 0
~OBJRAM-BASE
Text Label 12600 2350 0    50   ~ 0
~WSTROM-RESET
Connection ~ 10100 3300
Wire Bus Line
	10100 3300 10600 3300
Wire Bus Line
	10100 1750 11000 1750
Text Label 9550 2600 2    50   ~ 0
LUTPRO
Wire Wire Line
	8900 2600 9550 2600
Text Label 9550 2500 2    50   ~ 0
~BUS-WSTLUT
Text Label 6650 2500 0    50   ~ 0
~PALETTE-BASE
Text Label 6650 2900 0    50   ~ 0
MAIN-RESET
Wire Wire Line
	7300 2900 6650 2900
Wire Bus Line
	6650 2800 7300 2800
Wire Wire Line
	6650 2500 7300 2500
Wire Wire Line
	7300 2650 7000 2650
Text Label 7000 2650 0    50   ~ 0
~CLK4M
Wire Wire Line
	11000 2200 10700 2200
Text Label 10700 2200 0    50   ~ 0
CLK4M
Wire Wire Line
	11000 2300 10700 2300
Text Label 10700 2300 0    50   ~ 0
CLK8M
Wire Bus Line
	10350 2500 11000 2500
Text Label 10350 2650 0    50   ~ 0
MAIN-RESET
Wire Wire Line
	11000 2650 10350 2650
Text Label 10350 1900 0    50   ~ 0
~WSTROM-COPY
Wire Wire Line
	10350 1900 11000 1900
Wire Wire Line
	12900 2250 12550 2250
Wire Bus Line
	11000 2050 10550 2050
Text Label 10550 2050 0    50   ~ 0
COL[1..8]
Wire Bus Line
	8900 2350 9950 2350
Text Label 18000 6750 2    50   ~ 0
FLIP
Text Label 18000 6650 2    50   ~ 0
COL[1..8]
Text Label 18000 7000 2    50   ~ 0
SCAN-240-245
Text Label 18000 6900 2    50   ~ 0
SCAN-243
Text Label 18000 8100 2    50   ~ 0
LI
Text Label 18000 8200 2    50   ~ 0
CLK4M
Text Label 18000 8000 2    50   ~ 0
MAIN-RESET
Text Label 5600 3550 2    50   ~ 0
BUS-~I~O
Wire Wire Line
	12250 8200 12550 8200
Text Label 12550 8200 2    50   ~ 0
CLK4M
Wire Wire Line
	12250 8300 12550 8300
Text Label 12550 8300 2    50   ~ 0
CLK8M
Text Label 3100 3450 2    50   ~ 0
CA[1..23]
Text Label 3600 2550 0    50   ~ 0
~WR
Wire Bus Line
	5250 4200 5800 4200
Text Label 5800 4200 2    50   ~ 0
~DEBUG[1..6]
$Comp
L A5C:PIN P134
U 1 1 60AF059D
P 2200 6900
F 0 "P134" H 2278 6992 50  0000 L CNN
F 1 "PIN" H 2278 6947 50  0001 L CNN
F 2 "" H 2200 6900 50  0001 C CNN
F 3 "" H 2200 6900 50  0001 C CNN
	1    2200 6900
	-1   0    0    -1  
$EndComp
Text Label 19700 8850 0    50   ~ 0
BD[4..12]
Text Label 19700 8550 0    50   ~ 0
~BSOE[0..1]
Text Label 19700 8450 0    50   ~ 0
~BCAS[0..1]
Text Label 19700 8350 0    50   ~ 0
BA[0..7]
Text Label 19700 7050 0    50   ~ 0
AD[4..12]
Text Label 19700 6750 0    50   ~ 0
~ASOE[0..1]
Text Label 19700 6650 0    50   ~ 0
~ACAS[0..1]
Text Label 19700 6550 0    50   ~ 0
AA[0..7]
Text Label 2750 8500 0    50   ~ 0
CD[0..15]
Text Label 17300 12200 0    50   ~ 0
_ROMA[0..22]
Text Label 17300 12100 0    50   ~ 0
_CB[0..4]
Text Label 17300 12350 0    50   ~ 0
_CPC[0..1]
$Comp
L A5C:PIN P5
U 1 1 602FE10C
P 3500 1500
F 0 "P5" H 3412 1592 50  0000 R CNN
F 1 "PIN" H 3578 1547 50  0001 L CNN
F 2 "" H 3500 1500 50  0001 C CNN
F 3 "" H 3500 1500 50  0001 C CNN
	1    3500 1500
	1    0    0    -1  
$EndComp
Text Notes 3250 1450 2    50   ~ 0
~TEST2
Wire Wire Line
	3500 1500 3800 1500
Wire Bus Line
	3150 3450 3150 5400
Text Label 7500 9300 2    50   ~ 0
XS[0..4]
Wire Wire Line
	15000 2250 14700 2250
Text Label 14700 2250 0    50   ~ 0
CLK4M
Text Label 12600 2450 0    50   ~ 0
WSTROM-END
Wire Wire Line
	12550 2450 13200 2450
Text Label 5300 3650 0    50   ~ 0
MAIN-RESET
Wire Wire Line
	7550 8550 7250 8550
Text Label 7250 8550 0    50   ~ 0
CLK4M
Wire Wire Line
	7550 8650 7250 8650
Text Label 7250 8650 0    50   ~ 0
LI
Wire Wire Line
	7550 8750 7250 8750
Text Label 7250 8750 0    50   ~ 0
FI
$Comp
L power:VCC #PWR01
U 1 1 65808816
P 11250 14250
F 0 "#PWR01" H 11250 14100 50  0001 C CNN
F 1 "VCC" H 11265 14423 50  0000 C CNN
F 2 "" H 11250 14250 50  0001 C CNN
F 3 "" H 11250 14250 50  0001 C CNN
	1    11250 14250
	1    0    0    -1  
$EndComp
$Comp
L power:GND #PWR02
U 1 1 65809025
P 11650 14750
F 0 "#PWR02" H 11650 14500 50  0001 C CNN
F 1 "GND" H 11655 14577 50  0000 C CNN
F 2 "" H 11650 14750 50  0001 C CNN
F 3 "" H 11650 14750 50  0001 C CNN
	1    11650 14750
	1    0    0    -1  
$EndComp
$Comp
L power:PWR_FLAG #FLG01
U 1 1 65809B02
P 11350 14750
F 0 "#FLG01" H 11350 14825 50  0001 C CNN
F 1 "PWR_FLAG" H 11350 14923 50  0001 C CNN
F 2 "" H 11350 14750 50  0001 C CNN
F 3 "~" H 11350 14750 50  0001 C CNN
	1    11350 14750
	-1   0    0    -1  
$EndComp
$Comp
L power:PWR_FLAG #FLG02
U 1 1 6584BFC6
P 11550 14750
F 0 "#FLG02" H 11550 14825 50  0001 C CNN
F 1 "PWR_FLAG" H 11550 14923 50  0001 C CNN
F 2 "" H 11550 14750 50  0001 C CNN
F 3 "~" H 11550 14750 50  0001 C CNN
	1    11550 14750
	1    0    0    -1  
$EndComp
Text Label 7050 8900 0    50   ~ 0
MAIN-RESET
Wire Bus Line
	12250 8550 12750 8550
Text Label 12750 8550 2    50   ~ 0
CA[10..17]
Wire Bus Line
	12250 8650 12750 8650
$Sheet
S 10700 6700 1550 2200
U 612E497E
F0 "scroll-sram" 50
F1 "scroll-sram.sch" 50
F2 "CA[10..17]" I R 12250 8550 50 
F3 "SCROLL1-X[0..5]" I L 10700 7750 50 
F4 "Y-OUT[3..5]" I L 10700 8050 50 
F5 "~SCROLL1-T" I L 10700 8200 50 
F6 "~SCROLL3-T" I L 10700 8400 50 
F7 "~SCROLL2-T" I L 10700 8300 50 
F8 "~BUS-SCROLL1" I L 10700 7200 50 
F9 "~BUS-SCROLL2" I L 10700 7300 50 
F10 "~BUS-SCROLL3" I L 10700 7400 50 
F11 "BUS-STATE[0..1]" I L 10700 7100 50 
F12 "LINE[3..5]" I L 10700 7550 50 
F13 "SCROLL-CNT[0..6]" I L 10700 7000 50 
F14 "CLK4M" I R 12250 8200 50 
F15 "CLK8M" I R 12250 8300 50 
F16 "~DEBUG-WR" I R 12250 8750 50 
F17 "FLIP" I L 10700 8750 50 
F18 "GFX-ADDR[4..19]" T R 12250 6850 50 
F19 "_CB[0..4]" T R 12250 7100 50 
F20 "_CPC[0..1]" T R 12250 7200 50 
F21 "_CDEN" T R 12250 7300 50 
F22 "_YFLIP" T R 12250 7550 50 
F23 "_XFLIP" T R 12250 7450 50 
F24 "BUS-DATA[0..15]" I L 10700 6850 50 
F25 "~DEBUG[3..3]" I R 12250 8650 50 
F26 "~RAM-TILE[0..15]" O R 12250 7750 50 
F27 "~RAM-ATTR[0..15]" O R 12250 7850 50 
F28 "SCROLL2-X[0..5]" I L 10700 7850 50 
F29 "SCROLL3-X[0..3]" I L 10700 7950 50 
$EndSheet
Wire Bus Line
	12950 7750 12250 7750
Wire Bus Line
	12950 7850 12250 7850
Text Label 12950 7850 2    50   ~ 0
~RAM-ATTR[0..15]
Text Label 12950 7750 2    50   ~ 0
~RAM-TILE[0..15]
Text Label 17600 6550 0    50   ~ 0
LINE[0..8]
Wire Bus Line
	18050 6550 17600 6550
Wire Wire Line
	13850 13600 14300 13600
Wire Bus Line
	16700 7150 16800 7150
Wire Wire Line
	16250 2600 16850 2600
Wire Wire Line
	16850 2050 16250 2050
Wire Wire Line
	8900 2500 9800 2500
Wire Wire Line
	15000 4600 10300 4600
Wire Wire Line
	10200 4500 15000 4500
Wire Wire Line
	10100 4400 15000 4400
Wire Wire Line
	10000 4300 15000 4300
Text Label 14250 4800 0    50   ~ 0
~BUS-WSTROM
Wire Wire Line
	12550 2350 13300 2350
Connection ~ 10600 3300
Wire Wire Line
	9200 5650 9900 5650
Wire Wire Line
	5250 3550 15000 3550
$Sheet
S 3800 1100 1450 3650
U 611D6E08
F0 "main-signals" 50
F1 "main-signals.sch" 50
F2 "~CS" I L 3800 2050 50 
F3 "~WR" I L 3800 2550 50 
F4 "~RD" I L 3800 2300 50 
F5 "~RESET" I L 3800 3150 50 
F6 "CLK" I L 3800 2900 50 
F7 "~TEST3" I L 3800 1750 50 
F8 "~TEST2" I L 3800 1500 50 
F9 "~TEST1" I L 3800 1250 50 
F10 "CLK8M" O R 5250 1250 50 
F11 "MAIN-RESET" O R 5250 3650 50 
F12 "CLK4M" O R 5250 1500 50 
F13 "~RESETI" O R 5250 1750 50 
F14 "BUS-~I~O" I R 5250 3550 50 
F15 "~CPS-ID-RESET" O L 3800 4200 50 
F16 "CA[1..23]" T L 3800 3450 50 
F17 "ADDR[1..23]" I R 5250 3450 50 
F18 "WRITE" O L 3800 4500 50 
F19 "READ" O L 3800 4400 50 
F20 "~DECODE" O L 3800 4600 50 
F21 "~DEBUG[1..6]" O R 5250 4200 50 
$EndSheet
Wire Bus Line
	9600 5300 9600 3450
Wire Wire Line
	15000 4200 9900 4200
Wire Wire Line
	9900 4200 9900 5650
Wire Wire Line
	9800 4700 15000 4700
Wire Wire Line
	9200 8200 9500 8200
Wire Wire Line
	9200 8300 9600 8300
Wire Wire Line
	9200 8400 9700 8400
Connection ~ 9500 8200
Wire Wire Line
	9500 8200 10700 8200
Connection ~ 9600 8300
Wire Wire Line
	9600 8300 10700 8300
Connection ~ 9700 8400
Wire Wire Line
	9700 8400 10700 8400
Wire Wire Line
	9800 8500 9200 8500
Wire Wire Line
	9200 8600 9900 8600
Text Notes 14950 1750 0    197  ~ 0
BUS\nREQUESTS\nMODULE
Wire Wire Line
	9800 4700 9800 2500
Wire Wire Line
	16900 6550 16900 4900
Text Label 16850 3150 2    50   ~ 0
~BUS-WSTOBJ
Text Label 16850 3650 2    50   ~ 0
~BUS-WSTLUT
$Comp
L A5C:NBUF03 UAD523
U 1 1 61118D75
P 17150 3650
F 0 "UAD523" H 17150 3967 50  0000 C CNN
F 1 "NBUF03" H 17150 3876 50  0000 C CNN
F 2 "" H 17150 3450 50  0001 C CNN
F 3 "" H 17150 3450 50  0001 C CNN
	1    17150 3650
	1    0    0    -1  
$EndComp
$Comp
L A5C:BUF12 UAC519
U 1 1 61118D74
P 17150 3150
F 0 "UAC519" H 17150 3467 50  0000 C CNN
F 1 "BUF12" H 17150 3376 50  0000 C CNN
F 2 "" H 17150 3150 50  0001 C CNN
F 3 "" H 17150 3150 50  0001 C CNN
	1    17150 3150
	1    0    0    -1  
$EndComp
$Comp
L A5C:PIN P114
U 1 1 61118D72
P 17450 3650
F 0 "P114" H 17362 3742 50  0000 R CNN
F 1 "PIN" H 17528 3697 50  0001 L CNN
F 2 "" H 17450 3650 50  0001 C CNN
F 3 "" H 17450 3650 50  0001 C CNN
	1    17450 3650
	-1   0    0    -1  
$EndComp
$Comp
L A5C:PIN P115
U 1 1 61118D73
P 17450 3150
F 0 "P115" H 17362 3242 50  0000 R CNN
F 1 "PIN" H 17528 3197 50  0001 L CNN
F 2 "" H 17450 3150 50  0001 C CNN
F 3 "" H 17450 3150 50  0001 C CNN
	1    17450 3150
	-1   0    0    -1  
$EndComp
Text Notes 17850 3600 0    50   ~ 0
~WSTLUT
Text Notes 17850 3100 0    50   ~ 0
~WSTOBJ
Wire Wire Line
	15000 3650 5250 3650
Wire Bus Line
	14000 6750 15000 6750
Wire Wire Line
	15000 6550 14900 6550
Wire Wire Line
	14900 6550 14900 4900
Connection ~ 14900 4900
Wire Wire Line
	14900 4900 15000 4900
Text Label 14250 4700 0    50   ~ 0
~BUS-WSTLUT
Wire Bus Line
	10700 7000 10500 7000
Wire Bus Line
	15000 3900 10500 3900
Wire Bus Line
	10400 4050 15000 4050
Wire Bus Line
	9200 5500 10500 5500
Wire Bus Line
	10500 3900 10500 5500
Wire Bus Line
	10500 5500 10500 7000
Connection ~ 10500 5500
Wire Bus Line
	10400 4050 10400 7100
Wire Bus Line
	10400 7100 10700 7100
Wire Wire Line
	13300 2900 15000 2900
Wire Wire Line
	15000 3000 13200 3000
Wire Bus Line
	9950 3450 12650 3450
Wire Bus Line
	12650 2800 12650 3450
Connection ~ 12650 3450
Wire Wire Line
	13200 2450 13200 3000
Wire Wire Line
	13300 2350 13300 2900
Wire Bus Line
	10100 1750 10100 3300
Text Label 14550 2050 0    50   ~ 0
LINE[0..8]
Wire Bus Line
	15000 2050 14550 2050
Wire Wire Line
	15000 2150 14550 2150
Text Label 14550 2150 0    50   ~ 0
LI
Wire Wire Line
	14800 6650 14800 3200
Wire Wire Line
	14800 3200 15000 3200
Wire Wire Line
	14800 6650 15000 6650
Wire Wire Line
	14250 4800 15000 4800
Wire Wire Line
	14250 4900 14900 4900
Wire Wire Line
	10000 4300 10000 6100
Wire Wire Line
	10300 4600 10300 5800
Wire Wire Line
	10200 4500 10200 5900
Wire Wire Line
	10100 4400 10100 6000
Connection ~ 10000 6100
Wire Wire Line
	10000 6100 10000 7300
Connection ~ 10100 6000
Wire Wire Line
	10100 6000 10100 7400
Connection ~ 10200 5900
Wire Wire Line
	10200 5900 10200 7300
Connection ~ 10300 5800
Wire Wire Line
	10300 5800 10300 7200
Wire Wire Line
	8900 2900 9700 2900
Wire Wire Line
	9700 3100 15000 3100
Wire Wire Line
	9700 3100 9700 2900
$Sheet
S 14300 11950 1350 1900
U 6767F143
F0 "raster-out" 50
F1 "raster-out.sch" 50
F2 "~SCROLL1-T" I L 14300 13150 50 
F3 "~SCROLL3-T" I L 14300 13050 50 
F4 "~WSTROM" I L 14300 13350 50 
F5 "STARS-T" I L 14300 13250 50 
F6 "_YFLIP" I L 14300 12800 50 
F7 "CLK4M" I L 14300 13600 50 
F8 "ROMA-Y[0..5]" T L 14300 12200 50 
F9 "GFX-ADDR[0..22]" T L 14300 12100 50 
F10 "_XFLIP" I L 14300 12700 50 
F11 "_CDEN" I L 14300 12550 50 
F12 "~DEBUG[2..3]" I L 14300 13700 50 
F13 "_CPC[0..1]" I L 14300 12450 50 
F14 "FLIP" I L 14300 12900 50 
F15 "_CB[0..4]" I L 14300 12350 50 
F16 "CB[0..4]" T R 15650 12250 50 
F17 "CDEN" O R 15650 12450 50 
F18 "ROMA[0..22]" T R 15650 12100 50 
F19 "XSEL" O R 15650 12600 50 
F20 "CPC[0..1]" O R 15650 12350 50 
F21 "COL[1..1]" I L 14300 13450 50 
$EndSheet
Wire Wire Line
	13850 12900 14300 12900
Wire Bus Line
	9200 7550 9300 7550
Wire Bus Line
	9200 6650 9300 6650
Text Label 6100 7100 2    50   ~ 0
~VIDEO-CONTROL
Text Label 6100 7000 2    50   ~ 0
~PALETTE-BASE
Text Label 6100 7200 2    50   ~ 0
~WSTROM-COPY
Wire Wire Line
	5250 7000 6100 7000
Wire Wire Line
	5250 7100 6100 7100
Wire Wire Line
	5250 7200 6100 7200
Text Notes 14950 2400 2    50   ~ 0
0x0A
Text Notes 14950 2500 2    50   ~ 0
0x22
Text Notes 14950 2600 2    50   ~ 0
0x24
Text Label 14100 2500 0    50   ~ 0
~VIDEO-CONTROL
Text Label 14100 2400 0    50   ~ 0
~PALETTE-BASE
Text Label 14100 2600 0    50   ~ 0
~WSTROM-COPY
Wire Wire Line
	14100 2400 15000 2400
Wire Wire Line
	14100 2500 15000 2500
Wire Wire Line
	14100 2600 15000 2600
Wire Wire Line
	2300 12900 1650 12900
Text Label 1650 12900 0    50   ~ 0
SCAN-243
Wire Wire Line
	2300 12800 1650 12800
Text Label 1650 12800 0    50   ~ 0
SCAN-240-245
Text Label 4150 12450 0    50   ~ 0
LINE[0..8]
Text Notes 700  15515 0    197  ~ 0
VIDEO\nCOUNTER
Wire Bus Line
	3550 12550 3950 12550
$Comp
L A5C:PIN P19
U 1 1 6138FAA1
P 11950 14250
F 0 "P19" H 12028 14342 50  0000 L CNN
F 1 "PIN" H 12028 14297 50  0001 L CNN
F 2 "" H 11950 14250 50  0001 C CNN
F 3 "" H 11950 14250 50  0001 C CNN
	1    11950 14250
	1    0    0    -1  
$EndComp
$Comp
L A5C:PIN P45
U 1 1 613D4515
P 10950 14250
F 0 "P45" H 11028 14342 50  0000 L CNN
F 1 "PIN" H 11028 14297 50  0001 L CNN
F 2 "" H 10950 14250 50  0001 C CNN
F 3 "" H 10950 14250 50  0001 C CNN
	1    10950 14250
	-1   0    0    -1  
$EndComp
$Comp
L A5C:PIN P70
U 1 1 61418ED6
P 11950 14500
F 0 "P70" H 12028 14592 50  0000 L CNN
F 1 "PIN" H 12028 14547 50  0001 L CNN
F 2 "" H 11950 14500 50  0001 C CNN
F 3 "" H 11950 14500 50  0001 C CNN
	1    11950 14500
	1    0    0    -1  
$EndComp
$Comp
L A5C:PIN P81
U 1 1 6145D8AA
P 10950 14500
F 0 "P81" H 11028 14592 50  0000 L CNN
F 1 "PIN" H 11028 14547 50  0001 L CNN
F 2 "" H 10950 14500 50  0001 C CNN
F 3 "" H 10950 14500 50  0001 C CNN
	1    10950 14500
	-1   0    0    -1  
$EndComp
$Comp
L A5C:PIN P119
U 1 1 614A21AC
P 11950 14750
F 0 "P119" H 12028 14842 50  0000 L CNN
F 1 "PIN" H 12028 14797 50  0001 L CNN
F 2 "" H 11950 14750 50  0001 C CNN
F 3 "" H 11950 14750 50  0001 C CNN
	1    11950 14750
	1    0    0    -1  
$EndComp
$Comp
L A5C:PIN P136
U 1 1 6152B425
P 10950 14750
F 0 "P136" H 11028 14842 50  0000 L CNN
F 1 "PIN" H 11028 14797 50  0001 L CNN
F 2 "" H 10950 14750 50  0001 C CNN
F 3 "" H 10950 14750 50  0001 C CNN
	1    10950 14750
	-1   0    0    -1  
$EndComp
Wire Wire Line
	10950 14500 11250 14500
Wire Wire Line
	10950 14250 11250 14250
Wire Wire Line
	11250 14250 11250 14500
Wire Wire Line
	11250 14750 10950 14750
Connection ~ 11250 14500
Wire Wire Line
	11250 14500 11250 14750
Connection ~ 11250 14250
Wire Wire Line
	11350 14750 11250 14750
Connection ~ 11250 14750
Wire Wire Line
	11650 14500 11950 14500
Wire Wire Line
	11650 14250 11950 14250
Wire Wire Line
	11950 14750 11650 14750
Wire Wire Line
	11650 14750 11650 14500
Connection ~ 11650 14750
Connection ~ 11650 14500
Wire Wire Line
	11650 14500 11650 14250
Wire Wire Line
	11650 14750 11550 14750
Wire Wire Line
	1250 14150 2300 14150
Wire Wire Line
	1250 14400 2300 14400
Wire Wire Line
	1850 13900 2300 13900
Wire Wire Line
	2300 13400 1850 13400
Wire Wire Line
	2300 14550 2000 14550
Wire Wire Line
	2300 14650 2000 14650
Text Notes 900  13350 2    50   ~ 0
LI
Text Notes 900  13850 2    50   ~ 0
FI
Text Notes 900  14100 2    50   ~ 0
VSYNC
Text Notes 900  14350 2    50   ~ 0
HSYNC
Text Label 1900 13400 0    50   ~ 0
LI
Text Label 1900 13900 0    50   ~ 0
FI
Text Label 2000 14550 0    50   ~ 0
CLK4M
Text Label 2000 14650 0    50   ~ 0
~RESETI
$Comp
L A5C:PIN P112
U 1 1 64B13CD1
P 1250 13400
F 0 "P112" H 1162 13492 50  0000 R CNN
F 1 "PIN" H 1328 13447 50  0001 L CNN
F 2 "" H 1250 13400 50  0001 C CNN
F 3 "" H 1250 13400 50  0001 C CNN
	1    1250 13400
	1    0    0    -1  
$EndComp
$Comp
L A5C:PIN P111
U 1 1 65857A30
P 1250 13900
F 0 "P111" H 1162 13992 50  0000 R CNN
F 1 "PIN" H 1328 13947 50  0001 L CNN
F 2 "" H 1250 13900 50  0001 C CNN
F 3 "" H 1250 13900 50  0001 C CNN
	1    1250 13900
	1    0    0    -1  
$EndComp
$Comp
L A5C:PIN P110
U 1 1 62F27212
P 1250 14150
F 0 "P110" H 1162 14242 50  0000 R CNN
F 1 "PIN" H 1328 14197 50  0001 L CNN
F 2 "" H 1250 14150 50  0001 C CNN
F 3 "" H 1250 14150 50  0001 C CNN
	1    1250 14150
	1    0    0    -1  
$EndComp
$Comp
L A5C:PIN P108
U 1 1 62FA6F33
P 1250 14400
F 0 "P108" H 1162 14492 50  0000 R CNN
F 1 "PIN" H 1328 14447 50  0001 L CNN
F 2 "" H 1250 14400 50  0001 C CNN
F 3 "" H 1250 14400 50  0001 C CNN
	1    1250 14400
	1    0    0    -1  
$EndComp
$Comp
L A5C:BUF12 UBA173
U 1 1 64B11A49
P 1550 13400
F 0 "UBA173" H 1550 13717 50  0000 C CNN
F 1 "BUF12" H 1550 13626 50  0000 C CNN
F 2 "" H 1550 13400 50  0001 C CNN
F 3 "" H 1550 13400 50  0001 C CNN
	1    1550 13400
	-1   0    0    -1  
$EndComp
$Comp
L A5C:BUF12 UBB10
U 1 1 65857A28
P 1550 13900
F 0 "UBB10" H 1550 14217 50  0000 C CNN
F 1 "BUF12" H 1550 14126 50  0000 C CNN
F 2 "" H 1550 13900 50  0001 C CNN
F 3 "" H 1550 13900 50  0001 C CNN
	1    1550 13900
	-1   0    0    -1  
$EndComp
Text Notes 950  12200 2    50   ~ 0
~WSTROM
Text Label 1900 12250 0    50   ~ 0
~WSTROM
$Comp
L A5C:PIN P113
U 1 1 63FA4D7E
P 1250 12250
F 0 "P113" H 1162 12342 50  0000 R CNN
F 1 "PIN" H 1328 12297 50  0001 L CNN
F 2 "" H 1250 12250 50  0001 C CNN
F 3 "" H 1250 12250 50  0001 C CNN
	1    1250 12250
	1    0    0    -1  
$EndComp
$Comp
L A5C:BUF12 UAD519
U 1 1 63FA4D84
P 1550 12250
F 0 "UAD519" H 1550 12567 50  0000 C CNN
F 1 "BUF12" H 1550 12476 50  0000 C CNN
F 2 "" H 1550 12250 50  0001 C CNN
F 3 "" H 1550 12250 50  0001 C CNN
	1    1550 12250
	-1   0    0    -1  
$EndComp
$Sheet
S 2300 11300 1250 1750
U 612BE578
F0 "video-timings" 50
F1 "video-timings.sch" 50
F2 "~WSTROM" O L 2300 12250 50 
F3 "COL[1..8]" I R 3550 12800 50 
F4 "~LINE[0..8]" I R 3550 12550 50 
F5 "LINE[0..8]" I R 3550 12450 50 
F6 "~BUS-WSTROM" I R 3550 12250 50 
F7 "SCAN-240-245" O L 2300 12800 50 
F8 "SCAN-243" O L 2300 12900 50 
F9 "LINE-INC" I R 3550 12650 50 
F10 "GFX-ADDR[20..22]" T R 3550 12100 50 
F11 "~SPRITE-T" O R 3550 11950 50 
F12 "~SCROLL1-T" O R 3550 11450 50 
F13 "~SCROLL2-T" O R 3550 11550 50 
F14 "~SCROLL3-T" O R 3550 11650 50 
F15 "~STAR2-T" O R 3550 11850 50 
F16 "~STAR1-T" O R 3550 11750 50 
F17 "~COL[1..8]" I R 3550 12900 50 
$EndSheet
Wire Wire Line
	1850 12250 2300 12250
Text Notes 3800 10350 0    50   ~ 0
Only readable register of the A-01.\n\nProvides an ID similar to CPS-B-21.\nBut the ID is hardwired to 0.\nIt still contains a read counter\nwhich could be used for security.
Text Notes 4800 5200 0    50   ~ 0
All signals here are write\non the main BUS with the\nhardwired addresses.
Text Notes 5300 3350 0    50   ~ 0
CA can set as\noutput using the\nbus request.\nIt is driven as \nthe ADDR bus.
Text Notes 7300 1650 0    50   ~ 0
During the WSTLUT phase, The ADDR bus iterates on the\nRAM addresses where the palette is. The CPS-B will take care of pointing\nthe palette ram to the right address and do the write.\nThe BUS-REQUEST happens after a write on ~PALETTE-BASE
Text Notes 11000 1000 0    50   ~ 0
The WSTROM phase is not used in the final release.\nThe idea is to write a 64k page from RAM to video data.\nThe PLxWED are flags to write on specific chips.\nThe CPS-B-21 will transmit data to the chips.\nThe BUS-REQUEST becomes available after a write on ~WSTROM-COPY
Text Notes 17000 1500 0    50   ~ 0
This module synchronizes all the bus requests\nintents that the A-01 needs to perform. Once\na bus request is decided ~BR~ goes low. When\n~BGACK~ goes low, BUS-READY becomes high,\nADDR becomes usable and the correct \n~BUS-***~ signal becomes low.\n\nThe end of the bus request is given by a specific\nsignal (***-END).
Text Label 4150 12250 2    50   ~ 0
~BUS-WSTROM
Wire Wire Line
	3550 12250 4150 12250
Wire Bus Line
	3550 14150 6150 14150
Connection ~ 6150 9400
Wire Wire Line
	5250 7300 6050 7300
Wire Wire Line
	3550 14300 6050 14300
Wire Bus Line
	3550 14650 4150 14650
Wire Wire Line
	13350 6650 13350 7300
Wire Wire Line
	13200 6650 13200 7450
Wire Wire Line
	13100 6650 13100 7550
Wire Bus Line
	13450 6650 13450 7200
Wire Bus Line
	13550 6650 13550 7100
Wire Wire Line
	14300 12800 13100 12800
Wire Wire Line
	13200 12700 14300 12700
Wire Bus Line
	13450 12450 14300 12450
Wire Bus Line
	14300 12350 13550 12350
Wire Bus Line
	13700 12200 14300 12200
Wire Bus Line
	14300 12100 13800 12100
Wire Bus Line
	9200 9050 13800 9050
Connection ~ 13800 9050
Wire Bus Line
	9200 9150 13700 9150
Wire Bus Line
	13700 6650 13700 6950
Connection ~ 13700 9150
Wire Bus Line
	13700 9150 13700 12200
Wire Bus Line
	15000 6850 13800 6850
Connection ~ 13800 6850
Wire Bus Line
	13800 6850 13800 9050
Wire Bus Line
	15000 6950 13700 6950
Connection ~ 13700 6950
Wire Bus Line
	13700 6950 13700 8550
Wire Bus Line
	15000 7100 13550 7100
Connection ~ 13550 7100
Wire Bus Line
	13550 7100 13550 12350
Wire Bus Line
	15000 7200 13450 7200
Connection ~ 13450 7200
Wire Bus Line
	13450 7200 13450 12450
Wire Wire Line
	15000 7450 13200 7450
Connection ~ 13200 7450
Wire Wire Line
	13200 7450 13200 12700
Wire Wire Line
	15000 7550 13100 7550
Connection ~ 13100 7550
Wire Wire Line
	13100 7550 13100 12800
Wire Wire Line
	12250 7550 13100 7550
Wire Wire Line
	13200 7450 12250 7450
Wire Wire Line
	12250 7300 13350 7300
Connection ~ 13350 7300
Wire Wire Line
	13350 7300 13350 12550
Wire Bus Line
	13450 7200 12250 7200
Wire Bus Line
	12250 7100 13550 7100
Wire Bus Line
	13800 6850 12250 6850
Wire Bus Line
	13800 2600 13800 6850
Wire Bus Line
	12550 2600 13800 2600
Wire Bus Line
	12650 3450 14000 3450
Wire Bus Line
	14000 3450 14000 6750
Wire Bus Line
	14150 3300 14150 5200
Wire Bus Line
	10600 3300 14150 3300
Wire Bus Line
	15000 2750 14150 2750
Wire Bus Line
	14150 2750 14150 3300
Connection ~ 14150 3300
Text Notes 700  11150 0    197  ~ 0
VIDEO\nTIMINGS
Text Notes 10200 11000 1    100  Italic 0
GFX TIMINGS
Text Notes 6750 8000 1    100  Italic 0
REGISTER SIGNALS
Text Notes 14000 11000 1    100  Italic 0
GFX DATA BUS
Text Notes 8400 3450 2    100  Italic 0
MAIN BUS
Text Notes 11150 4200 0    100  Italic 0
BUS REQUEST SIGNALS
Wire Wire Line
	7300 6000 7300 7500
Wire Wire Line
	7200 6100 7200 7600
Wire Wire Line
	6800 6500 6800 8000
Wire Wire Line
	6900 6400 6900 7900
Wire Wire Line
	7000 6300 7000 7800
Wire Wire Line
	7100 6200 7100 7700
Wire Bus Line
	13800 9050 13800 12100
Wire Wire Line
	6050 7300 6050 14300
Wire Bus Line
	6150 9400 6150 14150
Wire Wire Line
	9200 9300 9400 9300
Wire Wire Line
	7550 8900 7050 8900
Wire Bus Line
	7550 9300 7000 9300
Text Notes 7500 10150 0    197  ~ 0
SCROLL\nPOSITIONS
Connection ~ 13800 12100
Wire Wire Line
	13350 12550 14300 12550
Wire Bus Line
	3550 12100 13800 12100
Wire Wire Line
	3250 4200 3800 4200
Wire Wire Line
	3250 9400 3800 9400
Wire Bus Line
	3550 12450 4050 12450
Wire Bus Line
	3950 12550 3950 13500
Wire Bus Line
	3950 13500 3550 13500
Wire Bus Line
	3550 13400 4050 13400
Wire Bus Line
	4050 13400 4050 12450
Connection ~ 4050 12450
Wire Wire Line
	3550 12650 3850 12650
Wire Wire Line
	3850 12650 3850 13600
Wire Wire Line
	3850 13600 3550 13600
Wire Bus Line
	3650 12900 3550 12900
Wire Wire Line
	9200 8750 9400 8750
Wire Wire Line
	9400 6750 9400 8750
Wire Wire Line
	9200 6750 9400 6750
Connection ~ 9400 8750
Wire Wire Line
	9400 8750 10700 8750
Wire Wire Line
	9500 13150 14300 13150
Wire Wire Line
	9700 13050 14300 13050
Wire Wire Line
	9400 9300 9400 13250
Wire Wire Line
	9400 13250 14300 13250
Wire Wire Line
	5250 7550 5950 7550
Wire Wire Line
	5950 9550 5250 9550
Wire Wire Line
	5950 7550 5950 9550
Connection ~ 3150 3450
Wire Bus Line
	3150 3450 3800 3450
Wire Bus Line
	3150 5400 3800 5400
Wire Bus Line
	2700 3450 3150 3450
Wire Wire Line
	9900 8600 9900 11850
Wire Wire Line
	9800 8500 9800 11750
Wire Wire Line
	9600 8300 9600 11550
Wire Wire Line
	3550 11750 9800 11750
Wire Wire Line
	3550 11450 9500 11450
Wire Wire Line
	3550 11550 9600 11550
Wire Wire Line
	9700 8400 9700 11650
Wire Wire Line
	9500 8200 9500 11450
Connection ~ 9500 11450
Wire Wire Line
	9500 11450 9500 13150
Wire Wire Line
	3550 11850 9900 11850
Wire Wire Line
	3550 11950 10000 11950
Wire Wire Line
	10000 11950 10000 9300
Wire Wire Line
	10000 9300 16800 9300
Wire Wire Line
	16700 7850 16800 7850
Wire Wire Line
	17300 7250 16700 7250
Wire Wire Line
	16700 8000 18050 8000
Wire Wire Line
	16800 7850 16800 9300
Connection ~ 16800 7850
Wire Wire Line
	16800 7850 18050 7850
Wire Bus Line
	16800 5200 14150 5200
Connection ~ 16800 7150
Wire Bus Line
	16800 7150 18050 7150
Wire Wire Line
	16700 6550 16900 6550
Wire Wire Line
	16250 4900 16900 4900
Wire Bus Line
	18050 8550 13700 8550
Connection ~ 13700 8550
Wire Bus Line
	13700 8550 13700 9150
Connection ~ 9600 3450
Wire Bus Line
	9600 3450 9950 3450
Wire Bus Line
	5250 3450 9600 3450
Wire Bus Line
	9200 5300 9600 5300
Wire Bus Line
	6150 5300 6150 8200
Wire Wire Line
	5250 6500 6800 6500
Wire Wire Line
	5250 6400 6900 6400
Wire Wire Line
	5250 6300 7000 6300
Wire Wire Line
	5250 6200 7100 6200
Wire Wire Line
	5250 6100 7200 6100
Wire Wire Line
	5250 6000 7300 6000
Connection ~ 6800 6500
Wire Wire Line
	6800 6500 7550 6500
Connection ~ 6900 6400
Wire Wire Line
	6900 6400 7550 6400
Connection ~ 7000 6300
Wire Wire Line
	7000 6300 7550 6300
Connection ~ 7100 6200
Wire Wire Line
	7100 6200 7550 6200
Connection ~ 7200 6100
Wire Wire Line
	7200 6100 7550 6100
Connection ~ 7300 6000
Wire Wire Line
	7300 6000 7550 6000
Wire Wire Line
	7300 7500 7550 7500
Wire Wire Line
	7200 7600 7550 7600
Wire Wire Line
	7100 7700 7550 7700
Wire Wire Line
	7000 7800 7550 7800
Wire Wire Line
	6900 7900 7550 7900
Wire Wire Line
	6800 8000 7550 8000
Wire Bus Line
	7550 7300 7450 7300
Wire Bus Line
	7450 7300 7450 5300
Connection ~ 7450 5300
Wire Bus Line
	7450 5300 7550 5300
Wire Bus Line
	16800 5200 16800 7150
Connection ~ 9700 11650
Wire Wire Line
	3550 11650 9700 11650
Wire Wire Line
	9700 11650 9700 13050
Text Notes 7550 4350 0    50   ~ 0
During bus requests for scrolls operations,\nthis module sets the address of the ram\nto get the scroll data back.\nThis data is then put inside the SRAM.
$Sheet
S 2300 13250 1250 1550
U 60A4D282
F0 "video-counter" 50
F1 "video-counter.sch" 50
F2 "HSYNC" I L 2300 14400 50 
F3 "BUS-DATA[0..15]" I R 3550 14150 50 
F4 "FI" O L 2300 13900 50 
F5 "~RESETI" I L 2300 14650 50 
F6 "CLK4M" I L 2300 14550 50 
F7 "LINE[0..8]" O R 3550 13400 50 
F8 "LI" O L 2300 13400 50 
F9 "VSYNC" I L 2300 14150 50 
F10 "COL[1..8]" O R 3550 13750 50 
F11 "~SCANLINE" I R 3550 14300 50 
F12 "~LINE[0..8]" O R 3550 13500 50 
F13 "LINE-INC" O R 3550 13600 50 
F14 "~COL[1..8]" O R 3550 13850 50 
F15 "~DEBUG[1..4]" I R 3550 14650 50 
$EndSheet
Wire Bus Line
	3550 12800 3750 12800
Wire Bus Line
	3650 12900 3650 13850
Wire Bus Line
	3650 13850 3550 13850
Wire Bus Line
	3550 13750 3750 13750
Wire Bus Line
	3750 13750 3750 12800
Connection ~ 3750 12800
Text Label 4150 12800 0    50   ~ 0
COL[1..8]
Connection ~ 7000 9300
Text Notes 5300 7000 0    50   ~ 0
0x0A
Text Notes 7500 5000 0    197  ~ 0
SCROLL\nBUS ADDRESS
Wire Bus Line
	9300 6650 9300 7550
Connection ~ 9300 7550
Wire Bus Line
	9300 7550 10700 7550
Wire Bus Line
	9300 7550 9300 12450
Text Label 12550 8750 2    50   ~ 0
~WR
Wire Wire Line
	12250 8750 12550 8750
Wire Bus Line
	4050 12450 9300 12450
Wire Bus Line
	3750 12800 4550 12800
Wire Bus Line
	13600 14300 14300 14300
Wire Bus Line
	13600 14200 14300 14200
Wire Bus Line
	14300 13450 13850 13450
Text Notes 7550 10550 0    50   ~ 0
During graphics raster, this module\nwill compute the correct X/Y coordinates.\nThe stars doesnt require the SRAM so it\nwill directly outputs to the GFX bus.
Text Notes 14300 11400 0    50   ~ 0
This module takes the graphics bus and\nconverts it to GFX ROM addresses and\ndata sent to the CPS-B for raster.\n\nIt can be interpreted as a big multiplexer\nwhich will provide the correct output\nbased on the commun bus data and on\neach layer.
Text Notes 15000 5900 0    50   ~ 0
The sprite controller reads the sprite entries\nfrom the main BUS and assembles the\ndata to the graphics bus.\n\nOnly the ADDR and flip attributes are used\nby the ROMA controller. The CB bus is used\nby the VRAM controller.
Text Notes 18050 5900 0    50   ~ 0
The VRAM stores the sprites data in double buffer.\nDuring one frame, one side is reading,\nthe other side is writting new data.\n\nDuring read operations:\n- The address of the sprite to draw\n   is written in XA[0..7] based on the\n   video counter.\n- The data is fed by the VRAM to\n   the CPS-B.\n\nDuring write operations:\n- The address of the sprite\n   is written in XA[0..7] based on the\n   X/Y attribute of the sprite.\n- The data is mainly the CB part of \n   the gfx bus (the palette id) which\n   is fed by the sprites controller. The\n   4 LSB are provided directly by the CPS-B\n\nThe VRAM is a CAS/RAS-based serial RAM\nwhich makes the logic a bit hard to follow.
Text Notes 17300 9350 0    50   ~ 0
~REWEN~ is given by the CPS-B.\nTells if we should write the data\nor not (= if colour is transparent)
Text Notes 15000 8950 0    50   ~ 0
It's important to note that the graphics bus\nis not used as a raster because it happens\nduring HBLANK. It is only there to send\nthe colour data via the CPS-B to the VRAM.
Text Notes 2300 15800 0    50   ~ 0
Produces the LINE / COL bus mainly\nusing the CLK4M pulse.\n\nYou can change the initialization values\nusing the ~SCANLINE~ register.\n\nVery similar to the CPS-B counter.\nBut it has a HSYNC/VSYNC as input.\nIt is surely there to synchronize two\nboards together.
Text Notes 10750 5850 0    50   ~ 0
The SRAM acts as a buffer that stores the scroll data\nfor the current row of all scroll layers.\nIt contains 256 entries of 16+10 bits.\n\nIt is written during the bus requests and\nit is read during the raster.
Text Notes 10700 6500 0    197  ~ 0
SCROLL\nSRAM
Text Notes 14300 15500 0    50   ~ 0
Outputs internal data to ROMA / CB for testing purposes\n\n~DEBUG3~ outputs the current RAM data\n    RAM address is set by CA and ~WR~\n\n~DEBUG2~ outputs the video counter
Text Notes 4300 14650 0    50   ~ 0
~DEBUG1~ stops the counter increment\n~DEBUG4~ resets the counter to the init value
Text Notes 7250 3150 2    50   ~ 0
~DEBUG5~\nresets the counter
Text Notes 10950 2900 2    50   ~ 0
~DEBUG6~\nresets the counter
Text Label 4150 14650 2    50   ~ 0
~DEBUG[1..6]
Text Label 13600 14700 0    50   ~ 0
~DEBUG[1..6]
Text Label 13600 13700 0    50   ~ 0
~DEBUG[1..6]
Text Label 12750 8650 2    50   ~ 0
~DEBUG[1..6]
Text Label 6650 2800 0    50   ~ 0
~DEBUG[1..6]
Text Label 10350 2500 0    50   ~ 0
~DEBUG[1..6]
Text Notes 1000 1400 0    157  ~ 0
MAIN\nCPU\nBUS
Text Notes 2300 11150 0    50   ~ 0
From the video counter, this will generate\nthe main graphics timings. And the main\nsprite reset timing.\n\nIt also takes care of the default `ROMA[20..22]`\nvalues (unless WSTROM is in use)
Wire Bus Line
	20550 8450 20550 10800
Wire Bus Line
	20450 8550 20450 11400
Wire Bus Line
	20350 3750 20350 6750
Wire Bus Line
	20250 3150 20250 6650
Wire Bus Line
	17700 12350 17700 13900
Wire Bus Line
	7000 8800 7000 9300
Wire Bus Line
	7000 9300 7000 9600
Wire Bus Line
	17700 10650 17700 12100
Wire Bus Line
	2700 6750 2700 8500
Wire Bus Line
	20650 12250 20650 14350
Wire Bus Line
	20650 8350 20650 10200
Wire Bus Line
	20650 4950 20650 7050
Wire Bus Line
	20650 1050 20650 2900
Wire Bus Line
	17800 9700 17800 12200
Wire Bus Line
	2700 8500 2700 10300
Wire Bus Line
	2700 950  2700 3450
Wire Bus Line
	2700 3450 2700 6250
Wire Bus Line
	17800 12200 17800 15000
$EndSCHEMATC
