EESchema Schematic File Version 4
EELAYER 30 0
EELAYER END
$Descr A4 8268 11693 portrait
encoding utf-8
Sheet 58 69
Title ""
Date "2020-11-26"
Rev ""
Comp ""
Comment1 "Licence: CC-BY"
Comment2 "Author: Loïc *WydD* Petit"
Comment3 ""
Comment4 ""
$EndDescr
Connection ~ 3550 5400
Connection ~ 3650 7150
Connection ~ 3850 6950
Connection ~ 3750 7050
Connection ~ 3550 7250
Connection ~ 3950 6850
Connection ~ 4150 6650
Connection ~ 4050 6750
Connection ~ 4250 6550
Connection ~ 3650 5300
Connection ~ 3750 5200
Connection ~ 4050 4900
Connection ~ 3950 5000
Connection ~ 3850 5100
Connection ~ 4150 4800
Connection ~ 4250 4700
Connection ~ 3950 3150
Connection ~ 3750 3350
Connection ~ 3550 3550
Connection ~ 3850 3250
Connection ~ 3650 3450
Connection ~ 4250 2850
Connection ~ 4050 3050
Connection ~ 4150 2950
Connection ~ 3550 1700
Connection ~ 3650 1600
Connection ~ 3750 1500
Connection ~ 3850 1400
Connection ~ 3950 1300
Connection ~ 4050 1200
Connection ~ 4150 1100
Connection ~ 4250 1000
Entry Wire Line
	2400 1100 2500 1000
Entry Wire Line
	2400 1200 2500 1100
Entry Wire Line
	2400 1300 2500 1200
Entry Wire Line
	2400 1400 2500 1300
Entry Wire Line
	2400 1500 2500 1400
Entry Wire Line
	2400 1600 2500 1500
Entry Wire Line
	2400 1700 2500 1600
Entry Wire Line
	2400 1800 2500 1700
Entry Wire Line
	4350 2000 4450 1900
Entry Wire Line
	4350 2100 4450 2000
Entry Wire Line
	4350 2200 4450 2100
Entry Wire Line
	4350 3850 4450 3750
Entry Wire Line
	4350 3950 4450 3850
Entry Wire Line
	4350 4050 4450 3950
Entry Wire Line
	4350 5700 4450 5600
Entry Wire Line
	4350 5800 4450 5700
Entry Wire Line
	4350 5900 4450 5800
Entry Wire Line
	4350 7550 4450 7450
Entry Wire Line
	4350 7650 4450 7550
Entry Wire Line
	4350 7750 4450 7650
Entry Wire Line
	4350 9400 4450 9300
Entry Wire Line
	4350 9500 4450 9400
Entry Wire Line
	4350 9600 4450 9500
Entry Wire Line
	6600 1350 6700 1450
Entry Wire Line
	6600 3200 6700 3300
Entry Wire Line
	6600 5050 6700 5150
Entry Wire Line
	6600 6900 6700 7000
Entry Wire Line
	6600 8750 6700 8850
Wire Wire Line
	2500 1000 4250 1000
Wire Wire Line
	2500 1100 4150 1100
Wire Wire Line
	2500 1200 4050 1200
Wire Wire Line
	2500 1300 3950 1300
Wire Wire Line
	2500 1400 3850 1400
Wire Wire Line
	2500 1500 3750 1500
Wire Wire Line
	2500 1600 3650 1600
Wire Wire Line
	2500 1700 3550 1700
Wire Wire Line
	3550 1700 4800 1700
Wire Wire Line
	3550 3550 3550 1700
Wire Wire Line
	3550 3550 4800 3550
Wire Wire Line
	3550 5400 3550 3550
Wire Wire Line
	3550 5400 4800 5400
Wire Wire Line
	3550 7250 3550 5400
Wire Wire Line
	3550 7250 4800 7250
Wire Wire Line
	3550 9100 3550 7250
Wire Wire Line
	3550 9100 4800 9100
Wire Wire Line
	3650 1600 3650 3450
Wire Wire Line
	3650 1600 4800 1600
Wire Wire Line
	3650 3450 3650 5300
Wire Wire Line
	3650 3450 4800 3450
Wire Wire Line
	3650 5300 3650 7150
Wire Wire Line
	3650 5300 4800 5300
Wire Wire Line
	3650 7150 3650 9000
Wire Wire Line
	3650 7150 4800 7150
Wire Wire Line
	3650 9000 4800 9000
Wire Wire Line
	3750 1500 4800 1500
Wire Wire Line
	3750 3350 3750 1500
Wire Wire Line
	3750 3350 4800 3350
Wire Wire Line
	3750 5200 3750 3350
Wire Wire Line
	3750 5200 4800 5200
Wire Wire Line
	3750 7050 3750 5200
Wire Wire Line
	3750 7050 4800 7050
Wire Wire Line
	3750 8900 3750 7050
Wire Wire Line
	3750 8900 4800 8900
Wire Wire Line
	3850 1400 3850 3250
Wire Wire Line
	3850 1400 4800 1400
Wire Wire Line
	3850 3250 3850 5100
Wire Wire Line
	3850 3250 4800 3250
Wire Wire Line
	3850 5100 3850 6950
Wire Wire Line
	3850 5100 4800 5100
Wire Wire Line
	3850 6950 3850 8800
Wire Wire Line
	3850 6950 4800 6950
Wire Wire Line
	3850 8800 4800 8800
Wire Wire Line
	3950 1300 4800 1300
Wire Wire Line
	3950 3150 3950 1300
Wire Wire Line
	3950 3150 4800 3150
Wire Wire Line
	3950 5000 3950 3150
Wire Wire Line
	3950 5000 4800 5000
Wire Wire Line
	3950 6850 3950 5000
Wire Wire Line
	3950 6850 4800 6850
Wire Wire Line
	3950 8700 3950 6850
Wire Wire Line
	3950 8700 4800 8700
Wire Wire Line
	4050 1200 4050 3050
Wire Wire Line
	4050 1200 4800 1200
Wire Wire Line
	4050 3050 4050 4900
Wire Wire Line
	4050 3050 4800 3050
Wire Wire Line
	4050 4900 4050 6750
Wire Wire Line
	4050 4900 4800 4900
Wire Wire Line
	4050 6750 4050 8600
Wire Wire Line
	4050 6750 4800 6750
Wire Wire Line
	4050 8600 4800 8600
Wire Wire Line
	4150 1100 4800 1100
Wire Wire Line
	4150 2950 4150 1100
Wire Wire Line
	4150 2950 4800 2950
Wire Wire Line
	4150 4800 4150 2950
Wire Wire Line
	4150 4800 4800 4800
Wire Wire Line
	4150 6650 4150 4800
Wire Wire Line
	4150 6650 4800 6650
Wire Wire Line
	4150 8500 4150 6650
Wire Wire Line
	4150 8500 4800 8500
Wire Wire Line
	4250 1000 4250 2850
Wire Wire Line
	4250 1000 4800 1000
Wire Wire Line
	4250 2850 4250 4700
Wire Wire Line
	4250 2850 4800 2850
Wire Wire Line
	4250 4700 4250 6550
Wire Wire Line
	4250 4700 4800 4700
Wire Wire Line
	4250 6550 4250 8400
Wire Wire Line
	4250 6550 4800 6550
Wire Wire Line
	4250 8400 4800 8400
Wire Wire Line
	4450 1900 4800 1900
Wire Wire Line
	4450 3750 4800 3750
Wire Wire Line
	4450 5600 4800 5600
Wire Wire Line
	4450 7450 4800 7450
Wire Wire Line
	4450 9300 4800 9300
Wire Wire Line
	4800 2000 4450 2000
Wire Wire Line
	4800 2100 4450 2100
Wire Wire Line
	4800 3850 4450 3850
Wire Wire Line
	4800 3950 4450 3950
Wire Wire Line
	4800 5700 4450 5700
Wire Wire Line
	4800 5800 4450 5800
Wire Wire Line
	4800 7550 4450 7550
Wire Wire Line
	4800 7650 4450 7650
Wire Wire Line
	4800 9400 4450 9400
Wire Wire Line
	4800 9500 4450 9500
Wire Wire Line
	5800 8750 6600 8750
Wire Wire Line
	5800 1350 6600 1350
Wire Wire Line
	5800 3200 6600 3200
Wire Wire Line
	5800 5050 6600 5050
Wire Wire Line
	5800 6900 6600 6900
Wire Bus Line
	2400 1900 2300 1900
Wire Bus Line
	4350 9700 4150 9700
Wire Bus Line
	6700 9050 6850 9050
Text Label 2600 1000 0    50   ~ 0
BUS-DATA0
Text Label 2600 1100 0    50   ~ 0
BUS-DATA1
Text Label 2600 1200 0    50   ~ 0
BUS-DATA2
Text Label 2600 1300 0    50   ~ 0
BUS-DATA3
Text Label 2600 1400 0    50   ~ 0
BUS-DATA4
Text Label 2600 1500 0    50   ~ 0
BUS-DATA5
Text Label 2600 1600 0    50   ~ 0
BUS-DATA6
Text Label 2600 1700 0    50   ~ 0
BUS-DATA7
Text Label 4450 1900 0    50   ~ 0
KEY137
Text Label 4450 2000 0    50   ~ 0
KEY136
Text Label 4450 2100 0    50   ~ 0
KEY135
Text Label 4450 3750 0    50   ~ 0
KEY13
Text Label 4450 3850 0    50   ~ 0
KEY12
Text Label 4450 3950 0    50   ~ 0
KEY11
Text Label 4450 5600 0    50   ~ 0
KEY41
Text Label 4450 5700 0    50   ~ 0
KEY40
Text Label 4450 5800 0    50   ~ 0
KEY39
Text Label 4450 7450 0    50   ~ 0
KEY114
Text Label 4450 7550 0    50   ~ 0
KEY113
Text Label 4450 7650 0    50   ~ 0
KEY112
Text Label 4450 9300 0    50   ~ 0
KEY80
Text Label 4450 9400 0    50   ~ 0
KEY79
Text Label 4450 9500 0    50   ~ 0
KEY78
Text Label 5900 8750 0    50   ~ 0
LAYER-D5
Text Label 5900 1350 0    50   ~ 0
LAYER-D1
Text Label 5900 3200 0    50   ~ 0
LAYER-D2
Text Label 5900 5050 0    50   ~ 0
LAYER-D3
Text Label 5900 6900 0    50   ~ 0
LAYER-D4
Text HLabel 2300 1900 0    50   Input ~ 0
BUS-DATA[0..7]
Text HLabel 4150 9700 0    50   Input ~ 0
KEY[11..137]
Text HLabel 6850 9050 2    50   Output ~ 0
LAYER-D[1..5]
$Comp
L power:GND #PWR?
U 1 1 5FBD5828
P 4800 2300
AR Path="/5F784DC4/5FBD5828" Ref="#PWR?"  Part="1" 
AR Path="/5FBF8EAD/5FBFA073/5FBD5828" Ref="#PWR0205"  Part="1" 
F 0 "#PWR0205" H 4800 2050 50  0001 C CNN
F 1 "GND" H 4805 2130 50  0000 C CNN
F 2 "" H 4800 2300 50  0001 C CNN
F 3 "" H 4800 2300 50  0001 C CNN
	1    4800 2300
	1    0    0    -1  
$EndComp
$Comp
L power:GND #PWR?
U 1 1 5FBD2B70
P 4800 4150
AR Path="/5F784DC4/5FBD2B70" Ref="#PWR?"  Part="1" 
AR Path="/5FBF8EAD/5FBFA073/5FBD2B70" Ref="#PWR0206"  Part="1" 
F 0 "#PWR0206" H 4800 3900 50  0001 C CNN
F 1 "GND" H 4805 3980 50  0000 C CNN
F 2 "" H 4800 4150 50  0001 C CNN
F 3 "" H 4800 4150 50  0001 C CNN
	1    4800 4150
	1    0    0    -1  
$EndComp
$Comp
L power:GND #PWR?
U 1 1 5FBD20F8
P 4800 6000
AR Path="/5F784DC4/5FBD20F8" Ref="#PWR?"  Part="1" 
AR Path="/5FBF8EAD/5FBFA073/5FBD20F8" Ref="#PWR0207"  Part="1" 
F 0 "#PWR0207" H 4800 5750 50  0001 C CNN
F 1 "GND" H 4805 5830 50  0000 C CNN
F 2 "" H 4800 6000 50  0001 C CNN
F 3 "" H 4800 6000 50  0001 C CNN
	1    4800 6000
	1    0    0    -1  
$EndComp
$Comp
L power:GND #PWR?
U 1 1 5FBCF369
P 4800 7850
AR Path="/5F784DC4/5FBCF369" Ref="#PWR?"  Part="1" 
AR Path="/5FBF8EAD/5FBFA073/5FBCF369" Ref="#PWR0208"  Part="1" 
F 0 "#PWR0208" H 4800 7600 50  0001 C CNN
F 1 "GND" H 4805 7680 50  0000 C CNN
F 2 "" H 4800 7850 50  0001 C CNN
F 3 "" H 4800 7850 50  0001 C CNN
	1    4800 7850
	1    0    0    -1  
$EndComp
$Comp
L power:GND #PWR?
U 1 1 5FBC1BD5
P 4800 9700
AR Path="/5F784DC4/5FBC1BD5" Ref="#PWR?"  Part="1" 
AR Path="/5FBF8EAD/5FBFA073/5FBC1BD5" Ref="#PWR0209"  Part="1" 
F 0 "#PWR0209" H 4800 9450 50  0001 C CNN
F 1 "GND" H 4805 9530 50  0000 C CNN
F 2 "" H 4800 9700 50  0001 C CNN
F 3 "" H 4800 9700 50  0001 C CNN
	1    4800 9700
	1    0    0    -1  
$EndComp
$Comp
L A5C:M151C UCO109
U 1 1 724C48BB
P 5300 1600
AR Path="/5F784DC4/724C48BB" Ref="UCO109"  Part="1" 
AR Path="/5FBF8EAD/5FBFA073/724C48BB" Ref="UCO109"  Part="1" 
F 0 "UCO109" H 5300 2467 50  0000 C CNN
F 1 "M151C" H 5300 2376 50  0000 C CNN
F 2 "" H 5300 1600 50  0001 C CNN
F 3 "" H 5300 1600 50  0001 C CNN
	1    5300 1600
	1    0    0    -1  
$EndComp
$Comp
L A5C:M151C UCJ192
U 1 1 74E21BEE
P 5300 3450
AR Path="/5F784DC4/74E21BEE" Ref="UCJ192"  Part="1" 
AR Path="/5FBF8EAD/5FBFA073/74E21BEE" Ref="UCJ192"  Part="1" 
F 0 "UCJ192" H 5300 4317 50  0000 C CNN
F 1 "M151C" H 5300 4226 50  0000 C CNN
F 2 "" H 5300 3450 50  0001 C CNN
F 3 "" H 5300 3450 50  0001 C CNN
	1    5300 3450
	1    0    0    -1  
$EndComp
$Comp
L A5C:M151C UCO184
U 1 1 749DABB6
P 5300 5300
AR Path="/5F784DC4/749DABB6" Ref="UCO184"  Part="1" 
AR Path="/5FBF8EAD/5FBFA073/749DABB6" Ref="UCO184"  Part="1" 
F 0 "UCO184" H 5300 6167 50  0000 C CNN
F 1 "M151C" H 5300 6076 50  0000 C CNN
F 2 "" H 5300 5300 50  0001 C CNN
F 3 "" H 5300 5300 50  0001 C CNN
	1    5300 5300
	1    0    0    -1  
$EndComp
$Comp
L A5C:M151C UCO26
U 1 1 724C1377
P 5300 7150
AR Path="/5F784DC4/724C1377" Ref="UCO26"  Part="1" 
AR Path="/5FBF8EAD/5FBFA073/724C1377" Ref="UCO26"  Part="1" 
F 0 "UCO26" H 5300 8017 50  0000 C CNN
F 1 "M151C" H 5300 7926 50  0000 C CNN
F 2 "" H 5300 7150 50  0001 C CNN
F 3 "" H 5300 7150 50  0001 C CNN
	1    5300 7150
	1    0    0    -1  
$EndComp
$Comp
L A5C:M151C UCL166
U 1 1 745A48C2
P 5300 9000
AR Path="/5F784DC4/745A48C2" Ref="UCL166"  Part="1" 
AR Path="/5FBF8EAD/5FBFA073/745A48C2" Ref="UCL166"  Part="1" 
F 0 "UCL166" H 5300 9867 50  0000 C CNN
F 1 "M151C" H 5300 9776 50  0000 C CNN
F 2 "" H 5300 9000 50  0001 C CNN
F 3 "" H 5300 9000 50  0001 C CNN
	1    5300 9000
	1    0    0    -1  
$EndComp
Wire Bus Line
	6700 1450 6700 9050
Wire Bus Line
	2400 1100 2400 1900
Wire Bus Line
	4350 2000 4350 9700
$EndSCHEMATC
