EESchema Schematic File Version 4
EELAYER 30 0
EELAYER END
$Descr A4 11693 8268
encoding utf-8
Sheet 11 83
Title "CPS Reverse Engineering: DL-0311"
Date "2021-09-12"
Rev ""
Comp ""
Comment1 ""
Comment2 ""
Comment3 "Licence: CC-BY"
Comment4 "Author: Loïc *WydD* Petit"
$EndDescr
Connection ~ 3950 2200
Connection ~ 3950 2650
Connection ~ 3950 3100
Connection ~ 3950 3550
Connection ~ 3950 4000
Connection ~ 3950 4450
Connection ~ 3350 5800
Connection ~ 3950 4900
Connection ~ 3950 5350
Connection ~ 8650 4450
Connection ~ 6250 4900
Connection ~ 6250 5350
Connection ~ 6250 4450
Connection ~ 8650 4900
Connection ~ 8650 4000
Connection ~ 6250 2650
Connection ~ 6250 3100
Connection ~ 8650 3550
Connection ~ 8650 2650
Connection ~ 8650 3100
Connection ~ 6250 2200
Connection ~ 6650 1650
Connection ~ 5050 1550
Connection ~ 9050 1650
Connection ~ 2750 1550
Connection ~ 8650 5350
Entry Wire Line
	2850 2100 2750 2000
Entry Wire Line
	2850 2550 2750 2450
Entry Wire Line
	2850 3000 2750 2900
Entry Wire Line
	2850 3450 2750 3350
Entry Wire Line
	2850 3900 2750 3800
Entry Wire Line
	2850 4350 2750 4250
Entry Wire Line
	2850 4800 2750 4700
Entry Wire Line
	2850 5250 2750 5150
Entry Wire Line
	4250 2100 4350 2000
Entry Wire Line
	4250 2550 4350 2450
Entry Wire Line
	4250 3000 4350 2900
Entry Wire Line
	4250 3450 4350 3350
Entry Wire Line
	4250 3900 4350 3800
Entry Wire Line
	4250 4350 4350 4250
Entry Wire Line
	4250 4800 4350 4700
Entry Wire Line
	4250 5250 4350 5150
Entry Wire Line
	5150 2100 5050 2000
Entry Wire Line
	5150 2550 5050 2450
Entry Wire Line
	5150 3000 5050 2900
Entry Wire Line
	5150 3450 5050 3350
Entry Wire Line
	5150 3900 5050 3800
Entry Wire Line
	5150 4350 5050 4250
Entry Wire Line
	5150 4800 5050 4700
Entry Wire Line
	5150 5250 5050 5150
Entry Wire Line
	6550 2100 6650 2000
Entry Wire Line
	6550 2550 6650 2450
Entry Wire Line
	6550 3000 6650 2900
Entry Wire Line
	6550 3450 6650 3350
Entry Wire Line
	6550 3900 6650 3800
Entry Wire Line
	6550 4350 6650 4250
Entry Wire Line
	6550 4800 6650 4700
Entry Wire Line
	6550 5250 6650 5150
Entry Wire Line
	7550 2100 7450 2000
Entry Wire Line
	7550 2550 7450 2450
Entry Wire Line
	7550 3000 7450 2900
Entry Wire Line
	7550 3450 7450 3350
Entry Wire Line
	7550 3900 7450 3800
Entry Wire Line
	7550 4350 7450 4250
Entry Wire Line
	7550 4800 7450 4700
Entry Wire Line
	8950 2100 9050 2000
Entry Wire Line
	8950 2550 9050 2450
Entry Wire Line
	8950 3000 9050 2900
Entry Wire Line
	8950 3450 9050 3350
Entry Wire Line
	8950 3900 9050 3800
Entry Wire Line
	8950 4350 9050 4250
Entry Wire Line
	8950 4800 9050 4700
Wire Wire Line
	3350 5800 3050 5800
Wire Wire Line
	3350 6050 3350 5800
Wire Wire Line
	3350 6050 5650 6050
Wire Wire Line
	3450 2100 2850 2100
Wire Wire Line
	3450 2550 2850 2550
Wire Wire Line
	3450 3000 2850 3000
Wire Wire Line
	3450 3450 2850 3450
Wire Wire Line
	3450 3900 2850 3900
Wire Wire Line
	3450 4350 2850 4350
Wire Wire Line
	3450 4800 2850 4800
Wire Wire Line
	3450 5250 2850 5250
Wire Wire Line
	3750 2200 3950 2200
Wire Wire Line
	3750 2650 3950 2650
Wire Wire Line
	3750 3550 3950 3550
Wire Wire Line
	3750 4450 3950 4450
Wire Wire Line
	3750 4900 3950 4900
Wire Wire Line
	3750 5350 3950 5350
Wire Wire Line
	3850 2100 4250 2100
Wire Wire Line
	3850 2550 4250 2550
Wire Wire Line
	3850 3000 4250 3000
Wire Wire Line
	3850 3450 4250 3450
Wire Wire Line
	3850 3900 4250 3900
Wire Wire Line
	3850 4350 4250 4350
Wire Wire Line
	3850 4800 4250 4800
Wire Wire Line
	3850 5250 4250 5250
Wire Wire Line
	3950 1750 3950 2200
Wire Wire Line
	3950 1750 6250 1750
Wire Wire Line
	3950 2200 3950 2650
Wire Wire Line
	3950 2650 3950 3100
Wire Wire Line
	3950 3100 3750 3100
Wire Wire Line
	3950 3100 3950 3550
Wire Wire Line
	3950 3550 3950 4000
Wire Wire Line
	3950 4000 3750 4000
Wire Wire Line
	3950 4000 3950 4450
Wire Wire Line
	3950 4450 3950 4900
Wire Wire Line
	3950 4900 3950 5350
Wire Wire Line
	3950 5800 3950 5350
Wire Wire Line
	5650 5800 5650 6050
Wire Wire Line
	5750 2100 5150 2100
Wire Wire Line
	5750 2550 5150 2550
Wire Wire Line
	5750 3000 5150 3000
Wire Wire Line
	5750 3450 5150 3450
Wire Wire Line
	5750 3900 5150 3900
Wire Wire Line
	5750 4350 5150 4350
Wire Wire Line
	5750 4800 5150 4800
Wire Wire Line
	5750 5250 5150 5250
Wire Wire Line
	6050 2200 6250 2200
Wire Wire Line
	6050 2650 6250 2650
Wire Wire Line
	6050 3550 6250 3550
Wire Wire Line
	6050 4450 6250 4450
Wire Wire Line
	6050 4900 6250 4900
Wire Wire Line
	6150 2100 6550 2100
Wire Wire Line
	6150 2550 6550 2550
Wire Wire Line
	6150 3000 6550 3000
Wire Wire Line
	6150 3450 6550 3450
Wire Wire Line
	6150 3900 6550 3900
Wire Wire Line
	6150 4350 6550 4350
Wire Wire Line
	6150 4800 6550 4800
Wire Wire Line
	6150 5250 6550 5250
Wire Wire Line
	6250 2200 6250 1750
Wire Wire Line
	6250 2200 6250 2650
Wire Wire Line
	6250 2650 6250 3100
Wire Wire Line
	6250 3100 6050 3100
Wire Wire Line
	6250 3100 6250 3550
Wire Wire Line
	6250 4000 6050 4000
Wire Wire Line
	6250 4000 6250 4450
Wire Wire Line
	6250 4450 6250 4900
Wire Wire Line
	6250 4900 6250 5350
Wire Wire Line
	6250 5350 6050 5350
Wire Wire Line
	6250 5350 8650 5350
Wire Wire Line
	6250 5800 6250 5350
Wire Wire Line
	8150 2100 7550 2100
Wire Wire Line
	8150 2550 7550 2550
Wire Wire Line
	8150 3000 7550 3000
Wire Wire Line
	8150 3450 7550 3450
Wire Wire Line
	8150 3900 7550 3900
Wire Wire Line
	8150 4350 7550 4350
Wire Wire Line
	8150 4800 7550 4800
Wire Wire Line
	8450 2200 8650 2200
Wire Wire Line
	8450 2650 8650 2650
Wire Wire Line
	8450 3550 8650 3550
Wire Wire Line
	8450 4450 8650 4450
Wire Wire Line
	8450 4900 8650 4900
Wire Wire Line
	8550 2100 8950 2100
Wire Wire Line
	8550 2550 8950 2550
Wire Wire Line
	8550 3000 8950 3000
Wire Wire Line
	8550 3450 8950 3450
Wire Wire Line
	8550 3900 8950 3900
Wire Wire Line
	8550 4350 8950 4350
Wire Wire Line
	8550 4800 8950 4800
Wire Wire Line
	8650 2200 8650 2650
Wire Wire Line
	8650 2650 8650 3100
Wire Wire Line
	8650 3100 8450 3100
Wire Wire Line
	8650 3100 8650 3550
Wire Wire Line
	8650 3550 8650 4000
Wire Wire Line
	8650 4000 8450 4000
Wire Wire Line
	8650 4000 8650 4450
Wire Wire Line
	8650 4450 8650 4900
Wire Wire Line
	8650 5350 8650 4900
Wire Wire Line
	8650 5350 8750 5350
Wire Bus Line
	2750 1550 2550 1550
Wire Bus Line
	4350 1650 6650 1650
Wire Bus Line
	5050 1550 2750 1550
Wire Bus Line
	6650 1650 9050 1650
Wire Bus Line
	7450 1550 5050 1550
Wire Bus Line
	9050 1650 9250 1650
Text Label 3400 2100 2    50   ~ 0
ADDR-OUT23
Text Label 3400 2550 2    50   ~ 0
ADDR-OUT22
Text Label 3400 3000 2    50   ~ 0
ADDR-OUT21
Text Label 3400 3450 2    50   ~ 0
ADDR-OUT20
Text Label 3400 3900 2    50   ~ 0
ADDR-OUT19
Text Label 3400 4350 2    50   ~ 0
ADDR-OUT18
Text Label 3400 4800 2    50   ~ 0
ADDR-OUT17
Text Label 3400 5250 2    50   ~ 0
ADDR-OUT16
Text Label 4000 2100 0    50   ~ 0
CA23
Text Label 4000 2550 0    50   ~ 0
CA22
Text Label 4000 3000 0    50   ~ 0
CA21
Text Label 4000 3450 0    50   ~ 0
CA20
Text Label 4000 3900 0    50   ~ 0
CA19
Text Label 4000 4350 0    50   ~ 0
CA18
Text Label 4000 4800 0    50   ~ 0
CA17
Text Label 4000 5250 0    50   ~ 0
CA16
Text Label 5700 2100 2    50   ~ 0
ADDR-OUT15
Text Label 5700 2550 2    50   ~ 0
ADDR-OUT14
Text Label 5700 3000 2    50   ~ 0
ADDR-OUT13
Text Label 5700 3450 2    50   ~ 0
ADDR-OUT12
Text Label 5700 3900 2    50   ~ 0
ADDR-OUT11
Text Label 5700 4350 2    50   ~ 0
ADDR-OUT10
Text Label 5700 4800 2    50   ~ 0
ADDR-OUT9
Text Label 5700 5250 2    50   ~ 0
ADDR-OUT8
Text Label 6300 2100 0    50   ~ 0
CA15
Text Label 6300 2550 0    50   ~ 0
CA14
Text Label 6300 3000 0    50   ~ 0
CA13
Text Label 6300 3450 0    50   ~ 0
CA12
Text Label 6300 3900 0    50   ~ 0
CA11
Text Label 6300 4350 0    50   ~ 0
CA10
Text Label 6300 4800 0    50   ~ 0
CA9
Text Label 6300 5250 0    50   ~ 0
CA8
Text Label 8100 2100 2    50   ~ 0
ADDR-OUT7
Text Label 8100 2550 2    50   ~ 0
ADDR-OUT6
Text Label 8100 3000 2    50   ~ 0
ADDR-OUT5
Text Label 8100 3450 2    50   ~ 0
ADDR-OUT4
Text Label 8100 3900 2    50   ~ 0
ADDR-OUT3
Text Label 8100 4350 2    50   ~ 0
ADDR-OUT2
Text Label 8100 4800 2    50   ~ 0
ADDR-OUT1
Text Label 8700 2100 0    50   ~ 0
CA7
Text Label 8700 2550 0    50   ~ 0
CA6
Text Label 8700 3000 0    50   ~ 0
CA5
Text Label 8700 3450 0    50   ~ 0
CA4
Text Label 8700 3900 0    50   ~ 0
CA3
Text Label 8700 4350 0    50   ~ 0
CA2
Text Label 8700 4800 0    50   ~ 0
CA1
Text HLabel 2550 1550 0    50   Input ~ 0
ADDR-OUT[1..23]
Text HLabel 3050 5800 0    50   Input ~ 0
~I~O
Text HLabel 8750 5350 2    50   Output ~ 0
~RD-E
Text HLabel 9250 1650 2    50   BiDi ~ 0
CA[1..23]
$Comp
L A5C:OUTTRI UAA24
U 1 1 61130FBF
P 3650 2100
F 0 "UAA24" H 3650 2365 50  0000 C CNN
F 1 "OUTTRI" H 3650 2274 50  0000 C CNN
F 2 "" H 3150 2050 50  0001 C CNN
F 3 "" H 3150 2050 50  0001 C CNN
	1    3650 2100
	1    0    0    -1  
$EndComp
$Comp
L A5C:OUTTRI UAA29
U 1 1 611337D9
P 3650 2550
F 0 "UAA29" H 3650 2815 50  0000 C CNN
F 1 "OUTTRI" H 3650 2724 50  0000 C CNN
F 2 "" H 3150 2500 50  0001 C CNN
F 3 "" H 3150 2500 50  0001 C CNN
	1    3650 2550
	1    0    0    -1  
$EndComp
$Comp
L A5C:OUTTRI UAA48
U 1 1 611881B9
P 3650 3000
F 0 "UAA48" H 3650 3265 50  0000 C CNN
F 1 "OUTTRI" H 3650 3174 50  0000 C CNN
F 2 "" H 3150 2950 50  0001 C CNN
F 3 "" H 3150 2950 50  0001 C CNN
	1    3650 3000
	1    0    0    -1  
$EndComp
$Comp
L A5C:OUTTRI UAA53
U 1 1 611881BF
P 3650 3450
F 0 "UAA53" H 3650 3715 50  0000 C CNN
F 1 "OUTTRI" H 3650 3624 50  0000 C CNN
F 2 "" H 3150 3400 50  0001 C CNN
F 3 "" H 3150 3400 50  0001 C CNN
	1    3650 3450
	1    0    0    -1  
$EndComp
$Comp
L A5C:OUTTRI UAA58
U 1 1 611B50EA
P 3650 3900
F 0 "UAA58" H 3650 4165 50  0000 C CNN
F 1 "OUTTRI" H 3650 4074 50  0000 C CNN
F 2 "" H 3150 3850 50  0001 C CNN
F 3 "" H 3150 3850 50  0001 C CNN
	1    3650 3900
	1    0    0    -1  
$EndComp
$Comp
L A5C:OUTTRI UAA82
U 1 1 611B50F0
P 3650 4350
F 0 "UAA82" H 3650 4615 50  0000 C CNN
F 1 "OUTTRI" H 3650 4524 50  0000 C CNN
F 2 "" H 3150 4300 50  0001 C CNN
F 3 "" H 3150 4300 50  0001 C CNN
	1    3650 4350
	1    0    0    -1  
$EndComp
$Comp
L A5C:OUTTRI UAA87
U 1 1 611B50F6
P 3650 4800
F 0 "UAA87" H 3650 5065 50  0000 C CNN
F 1 "OUTTRI" H 3650 4974 50  0000 C CNN
F 2 "" H 3150 4750 50  0001 C CNN
F 3 "" H 3150 4750 50  0001 C CNN
	1    3650 4800
	1    0    0    -1  
$EndComp
$Comp
L A5C:OUTTRI UAA122
U 1 1 611B50FC
P 3650 5250
F 0 "UAA122" H 3650 5515 50  0000 C CNN
F 1 "OUTTRI" H 3650 5424 50  0000 C CNN
F 2 "" H 3150 5200 50  0001 C CNN
F 3 "" H 3150 5200 50  0001 C CNN
	1    3650 5250
	1    0    0    -1  
$EndComp
$Comp
L A5C:OUTTRI UAA127
U 1 1 611E3E9A
P 5950 2100
F 0 "UAA127" H 5950 2365 50  0000 C CNN
F 1 "OUTTRI" H 5950 2274 50  0000 C CNN
F 2 "" H 5450 2050 50  0001 C CNN
F 3 "" H 5450 2050 50  0001 C CNN
	1    5950 2100
	1    0    0    -1  
$EndComp
$Comp
L A5C:OUTTRI UAA132
U 1 1 611E3EA0
P 5950 2550
F 0 "UAA132" H 5950 2815 50  0000 C CNN
F 1 "OUTTRI" H 5950 2724 50  0000 C CNN
F 2 "" H 5450 2500 50  0001 C CNN
F 3 "" H 5450 2500 50  0001 C CNN
	1    5950 2550
	1    0    0    -1  
$EndComp
$Comp
L A5C:OUTTRI UAA140
U 1 1 611E3EA6
P 5950 3000
F 0 "UAA140" H 5950 3265 50  0000 C CNN
F 1 "OUTTRI" H 5950 3174 50  0000 C CNN
F 2 "" H 5450 2950 50  0001 C CNN
F 3 "" H 5450 2950 50  0001 C CNN
	1    5950 3000
	1    0    0    -1  
$EndComp
$Comp
L A5C:OUTTRI UAA148
U 1 1 611E3EAC
P 5950 3450
F 0 "UAA148" H 5950 3715 50  0000 C CNN
F 1 "OUTTRI" H 5950 3624 50  0000 C CNN
F 2 "" H 5450 3400 50  0001 C CNN
F 3 "" H 5450 3400 50  0001 C CNN
	1    5950 3450
	1    0    0    -1  
$EndComp
$Comp
L A5C:OUTTRI UAA206
U 1 1 611E3EB2
P 5950 3900
F 0 "UAA206" H 5950 4165 50  0000 C CNN
F 1 "OUTTRI" H 5950 4074 50  0000 C CNN
F 2 "" H 5450 3850 50  0001 C CNN
F 3 "" H 5450 3850 50  0001 C CNN
	1    5950 3900
	1    0    0    -1  
$EndComp
$Comp
L A5C:OUTTRI UAA259
U 1 1 611E3EB8
P 5950 4350
F 0 "UAA259" H 5950 4615 50  0000 C CNN
F 1 "OUTTRI" H 5950 4524 50  0000 C CNN
F 2 "" H 5450 4300 50  0001 C CNN
F 3 "" H 5450 4300 50  0001 C CNN
	1    5950 4350
	1    0    0    -1  
$EndComp
$Comp
L A5C:OUTTRI UAA238
U 1 1 611E3EBE
P 5950 4800
F 0 "UAA238" H 5950 5065 50  0000 C CNN
F 1 "OUTTRI" H 5950 4974 50  0000 C CNN
F 2 "" H 5450 4750 50  0001 C CNN
F 3 "" H 5450 4750 50  0001 C CNN
	1    5950 4800
	1    0    0    -1  
$EndComp
$Comp
L A5C:OUTTRI UAA217
U 1 1 61212CEF
P 5950 5250
F 0 "UAA217" H 5950 5515 50  0000 C CNN
F 1 "OUTTRI" H 5950 5424 50  0000 C CNN
F 2 "" H 5450 5200 50  0001 C CNN
F 3 "" H 5450 5200 50  0001 C CNN
	1    5950 5250
	1    0    0    -1  
$EndComp
$Comp
L A5C:OUTTRI UAA267
U 1 1 61212CFB
P 8350 2100
F 0 "UAA267" H 8350 2365 50  0000 C CNN
F 1 "OUTTRI" H 8350 2274 50  0000 C CNN
F 2 "" H 7850 2050 50  0001 C CNN
F 3 "" H 7850 2050 50  0001 C CNN
	1    8350 2100
	1    0    0    -1  
$EndComp
$Comp
L A5C:OUTTRI UAA243
U 1 1 61212D01
P 8350 2550
F 0 "UAA243" H 8350 2815 50  0000 C CNN
F 1 "OUTTRI" H 8350 2724 50  0000 C CNN
F 2 "" H 7850 2500 50  0001 C CNN
F 3 "" H 7850 2500 50  0001 C CNN
	1    8350 2550
	1    0    0    -1  
$EndComp
$Comp
L A5C:OUTTRI UAA304
U 1 1 61212D07
P 8350 3000
F 0 "UAA304" H 8350 3265 50  0000 C CNN
F 1 "OUTTRI" H 8350 3174 50  0000 C CNN
F 2 "" H 7850 2950 50  0001 C CNN
F 3 "" H 7850 2950 50  0001 C CNN
	1    8350 3000
	1    0    0    -1  
$EndComp
$Comp
L A5C:OUTTRI UAA317
U 1 1 61212D0D
P 8350 3450
F 0 "UAA317" H 8350 3715 50  0000 C CNN
F 1 "OUTTRI" H 8350 3624 50  0000 C CNN
F 2 "" H 7850 3400 50  0001 C CNN
F 3 "" H 7850 3400 50  0001 C CNN
	1    8350 3450
	1    0    0    -1  
$EndComp
$Comp
L A5C:OUTTRI UAA296
U 1 1 61212D13
P 8350 3900
F 0 "UAA296" H 8350 4165 50  0000 C CNN
F 1 "OUTTRI" H 8350 4074 50  0000 C CNN
F 2 "" H 7850 3850 50  0001 C CNN
F 3 "" H 7850 3850 50  0001 C CNN
	1    8350 3900
	1    0    0    -1  
$EndComp
$Comp
L A5C:OUTTRI UAA327
U 1 1 61212D19
P 8350 4350
F 0 "UAA327" H 8350 4615 50  0000 C CNN
F 1 "OUTTRI" H 8350 4524 50  0000 C CNN
F 2 "" H 7850 4300 50  0001 C CNN
F 3 "" H 7850 4300 50  0001 C CNN
	1    8350 4350
	1    0    0    -1  
$EndComp
$Comp
L A5C:OUTTRI UAA346
U 1 1 611E3E94
P 8350 4800
F 0 "UAA346" H 8350 5065 50  0000 C CNN
F 1 "OUTTRI" H 8350 4974 50  0000 C CNN
F 2 "" H 7850 4750 50  0001 C CNN
F 3 "" H 7850 4750 50  0001 C CNN
	1    8350 4800
	1    0    0    -1  
$EndComp
$Comp
L A5C:NBUF03 UAA138
U 1 1 61926EED
P 3650 5800
F 0 "UAA138" H 3650 6117 50  0000 C CNN
F 1 "NBUF03" H 3650 6026 50  0000 C CNN
F 2 "" H 3650 5600 50  0001 C CNN
F 3 "" H 3650 5600 50  0001 C CNN
	1    3650 5800
	1    0    0    -1  
$EndComp
$Comp
L A5C:NBUF03 UAA144
U 1 1 618EE860
P 5950 5800
F 0 "UAA144" H 5950 6117 50  0000 C CNN
F 1 "NBUF03" H 5950 6026 50  0000 C CNN
F 2 "" H 5950 5600 50  0001 C CNN
F 3 "" H 5950 5600 50  0001 C CNN
	1    5950 5800
	1    0    0    -1  
$EndComp
Wire Bus Line
	7450 1550 7450 4700
Wire Bus Line
	9050 1650 9050 4700
Wire Bus Line
	2750 1550 2750 5150
Wire Bus Line
	4350 1650 4350 5150
Wire Bus Line
	5050 1550 5050 5150
Wire Bus Line
	6650 1650 6650 5150
$EndSCHEMATC
