EESchema Schematic File Version 4
EELAYER 30 0
EELAYER END
$Descr A4 11693 8268
encoding utf-8
Sheet 65 69
Title ""
Date "2020-11-26"
Rev ""
Comp ""
Comment1 "Licence: CC-BY"
Comment2 "Author: Loïc *WydD* Petit"
Comment3 ""
Comment4 ""
$EndDescr
Connection ~ 2950 5450
Connection ~ 2950 4700
Connection ~ 2950 3950
Connection ~ 2950 3200
Connection ~ 2950 2450
Connection ~ 2850 2650
Connection ~ 2850 3400
Connection ~ 2850 4150
Connection ~ 2850 4900
Connection ~ 2850 5650
Connection ~ 5850 4900
Connection ~ 5850 3400
Connection ~ 5950 2450
Connection ~ 5950 4700
Connection ~ 5950 3950
Connection ~ 5850 4150
Connection ~ 5950 3200
Connection ~ 5850 2650
Connection ~ 5950 5450
Connection ~ 5850 5650
Connection ~ 2950 6200
Connection ~ 5950 6400
Connection ~ 3300 6400
Connection ~ 2950 6500
Entry Wire Line
	2350 1400 2450 1500
Entry Wire Line
	2350 2150 2450 2250
Entry Wire Line
	2350 2900 2450 3000
Entry Wire Line
	2350 3650 2450 3750
Entry Wire Line
	2350 4400 2450 4500
Entry Wire Line
	2350 5350 2450 5250
Entry Wire Line
	2350 6100 2450 6000
Entry Wire Line
	4650 1500 4750 1400
Entry Wire Line
	4650 2250 4750 2150
Entry Wire Line
	4650 3000 4750 2900
Entry Wire Line
	4650 3750 4750 3650
Entry Wire Line
	4650 4500 4750 4400
Entry Wire Line
	5350 1600 5450 1500
Entry Wire Line
	5350 2350 5450 2250
Entry Wire Line
	5350 3100 5450 3000
Entry Wire Line
	5350 3850 5450 3750
Entry Wire Line
	5350 4600 5450 4500
Entry Wire Line
	5350 5350 5450 5250
Entry Wire Line
	7050 1050 7150 1150
Entry Wire Line
	7050 1150 7150 1250
Entry Wire Line
	7050 2150 7150 2250
Entry Wire Line
	7050 2250 7150 2350
Entry Wire Line
	7050 3650 7150 3750
Entry Wire Line
	7050 3750 7150 3850
Entry Wire Line
	7050 5150 7150 5250
Entry Wire Line
	7050 5250 7150 5350
Wire Wire Line
	1000 6650 1550 6650
Wire Wire Line
	1550 6550 1550 6650
Wire Wire Line
	2100 6500 2950 6500
Wire Wire Line
	2450 4500 3050 4500
Wire Wire Line
	2450 1500 3050 1500
Wire Wire Line
	2450 2250 3050 2250
Wire Wire Line
	2450 3000 3050 3000
Wire Wire Line
	2450 3750 3050 3750
Wire Wire Line
	2450 5250 3050 5250
Wire Wire Line
	2450 6000 3050 6000
Wire Wire Line
	2850 1900 3300 1900
Wire Wire Line
	2850 2650 2850 1900
Wire Wire Line
	2850 2650 3300 2650
Wire Wire Line
	2850 3400 2850 2650
Wire Wire Line
	2850 3400 2850 4150
Wire Wire Line
	2850 3400 3300 3400
Wire Wire Line
	2850 4150 2850 4900
Wire Wire Line
	2850 4900 2850 5650
Wire Wire Line
	2850 4900 3300 4900
Wire Wire Line
	2850 5650 2850 6400
Wire Wire Line
	2850 5650 3300 5650
Wire Wire Line
	2950 1700 2950 2450
Wire Wire Line
	2950 2450 2950 3200
Wire Wire Line
	2950 2450 3050 2450
Wire Wire Line
	2950 3200 2950 3950
Wire Wire Line
	2950 3200 3050 3200
Wire Wire Line
	2950 3950 2950 4700
Wire Wire Line
	2950 3950 3050 3950
Wire Wire Line
	2950 4700 2950 5450
Wire Wire Line
	2950 4700 3050 4700
Wire Wire Line
	2950 5450 2950 6200
Wire Wire Line
	2950 5450 3050 5450
Wire Wire Line
	2950 6200 3050 6200
Wire Wire Line
	2950 6500 2950 6200
Wire Wire Line
	2950 6500 5850 6500
Wire Wire Line
	3050 1700 2950 1700
Wire Wire Line
	3300 4150 2850 4150
Wire Wire Line
	3300 6400 2850 6400
Wire Wire Line
	3300 6400 5950 6400
Wire Wire Line
	3550 5250 3650 5250
Wire Wire Line
	3550 6000 5200 6000
Wire Wire Line
	3650 5250 3650 5900
Wire Wire Line
	3650 5900 5100 5900
Wire Wire Line
	4150 1500 4650 1500
Wire Wire Line
	4150 2250 4650 2250
Wire Wire Line
	4150 3000 4650 3000
Wire Wire Line
	4150 3750 4650 3750
Wire Wire Line
	4150 4500 4650 4500
Wire Wire Line
	5100 1050 7050 1050
Wire Wire Line
	5100 5900 5100 1050
Wire Wire Line
	5200 1150 5200 6000
Wire Wire Line
	5450 1500 6050 1500
Wire Wire Line
	5450 2250 6050 2250
Wire Wire Line
	5450 3000 6050 3000
Wire Wire Line
	5450 3750 6050 3750
Wire Wire Line
	5450 4500 6050 4500
Wire Wire Line
	5450 5250 6050 5250
Wire Wire Line
	5850 1900 6300 1900
Wire Wire Line
	5850 2650 5850 1900
Wire Wire Line
	5850 2650 6300 2650
Wire Wire Line
	5850 3400 5850 2650
Wire Wire Line
	5850 3400 5850 4150
Wire Wire Line
	5850 3400 6300 3400
Wire Wire Line
	5850 4150 5850 4900
Wire Wire Line
	5850 4900 5850 5650
Wire Wire Line
	5850 4900 6300 4900
Wire Wire Line
	5850 5650 5850 6500
Wire Wire Line
	5850 5650 6300 5650
Wire Wire Line
	5950 1700 5950 2450
Wire Wire Line
	5950 2450 5950 3200
Wire Wire Line
	5950 2450 6050 2450
Wire Wire Line
	5950 3200 5950 3950
Wire Wire Line
	5950 3200 6050 3200
Wire Wire Line
	5950 3950 5950 4700
Wire Wire Line
	5950 3950 6050 3950
Wire Wire Line
	5950 4700 5950 5450
Wire Wire Line
	5950 4700 6050 4700
Wire Wire Line
	5950 5450 5950 6400
Wire Wire Line
	5950 5450 6050 5450
Wire Wire Line
	5950 6400 6200 6400
Wire Wire Line
	6050 1700 5950 1700
Wire Wire Line
	6300 4150 5850 4150
Wire Wire Line
	6550 2250 7050 2250
Wire Wire Line
	6550 3750 7050 3750
Wire Wire Line
	6550 4500 6650 4500
Wire Wire Line
	6550 5250 7050 5250
Wire Wire Line
	6650 1500 6550 1500
Wire Wire Line
	6650 2150 6650 1500
Wire Wire Line
	6650 3000 6550 3000
Wire Wire Line
	6650 3650 6650 3000
Wire Wire Line
	6650 4500 6650 5150
Wire Wire Line
	7050 1150 5200 1150
Wire Wire Line
	7050 2150 6650 2150
Wire Wire Line
	7050 3650 6650 3650
Wire Wire Line
	7050 5150 6650 5150
Wire Bus Line
	2000 1050 2350 1050
Wire Bus Line
	2000 5100 2350 5100
Wire Bus Line
	2350 6600 5350 6600
Wire Bus Line
	4750 750  5000 750 
Wire Bus Line
	7150 1350 7250 1350
Wire Bus Line
	7150 2450 7250 2450
Wire Bus Line
	7150 3950 7250 3950
Wire Bus Line
	7150 5450 7250 5450
Text Notes 6750 900  0    50   ~ 0
SSF2X: 3
Text Notes 6750 1950 0    50   ~ 0
SSF2X: 2
Text Notes 6800 3350 0    50   ~ 0
SSF2X: 0
Text Notes 6850 4750 0    50   ~ 0
SSF2X: 1
Text Label 2550 4500 0    50   ~ 0
BUS5
Text Label 2550 1500 0    50   ~ 0
BUS1
Text Label 2550 2250 0    50   ~ 0
BUS2
Text Label 2550 3000 0    50   ~ 0
BUS3
Text Label 2550 3750 0    50   ~ 0
BUS4
Text Label 2550 5250 0    50   ~ 0
BUS6
Text Label 2550 6000 0    50   ~ 0
BUS7
Text Label 3700 5900 0    50   ~ 0
ROW4-S0
Text Label 3700 6000 0    50   ~ 0
ROW4-S1
Text Label 4150 1500 0    50   ~ 0
~LAYERS-E0
Text Label 4150 2250 0    50   ~ 0
~LAYERS-E1
Text Label 4150 3000 0    50   ~ 0
~LAYERS-E2
Text Label 4150 3750 0    50   ~ 0
~LAYERS-E3
Text Label 4150 4500 0    50   ~ 0
~LAYERS-E4
Text Label 5550 1500 0    50   ~ 0
BUS8
Text Label 5550 2250 0    50   ~ 0
BUS9
Text Label 5550 3000 0    50   ~ 0
BUS10
Text Label 5550 3750 0    50   ~ 0
BUS11
Text Label 5550 4500 0    50   ~ 0
BUS12
Text Label 5550 5250 0    50   ~ 0
BUS13
Text Label 6700 2150 0    50   ~ 0
ROW3-S0
Text Label 6700 2250 0    50   ~ 0
ROW3-S1
Text Label 6700 3650 0    50   ~ 0
ROW2-S0
Text Label 6700 3750 0    50   ~ 0
ROW2-S1
Text Label 6700 5150 0    50   ~ 0
ROW1-S0
Text Label 6700 5250 0    50   ~ 0
ROW1-S1
Text HLabel 1000 6400 0    50   Input ~ 0
~E
Text HLabel 1000 6500 0    50   Input ~ 0
WR
Text HLabel 1000 6650 0    50   Input ~ 0
~CLK4M
Text HLabel 2000 1050 0    50   Input ~ 0
BUS[1..5]
Text HLabel 2000 5100 0    50   Input ~ 0
BUS[6..13]
Text HLabel 5000 750  2    50   Output ~ 0
~LAYERS-E[0..4]
Text HLabel 6200 6400 2    50   Input ~ 0
~RESET
Text HLabel 7250 1350 2    50   Output ~ 0
ROW4-S[0..1]
Text HLabel 7250 2450 2    50   Output ~ 0
ROW3-S[0..1]
Text HLabel 7250 3950 2    50   Output ~ 0
ROW2-S[0..1]
Text HLabel 7250 5450 2    50   Output ~ 0
ROW1-S[0..1]
$Comp
L A5C:NOR02 UBE46
U 1 1 5F70D64E
P 1250 6450
AR Path="/5F84D673/5F70D64E" Ref="UBE46"  Part="1" 
AR Path="/5FBEEC97/5FC01C28/5F70D64E" Ref="UBE46"  Part="1" 
F 0 "UBE46" H 1275 6716 50  0000 C CNN
F 1 "NOR02" H 1275 6625 50  0000 C CNN
F 2 "" H 1250 6450 50  0001 C CNN
F 3 "" H 1250 6450 50  0001 C CNN
	1    1250 6450
	1    0    0    -1  
$EndComp
$Comp
L A5C:NAND02 UBE48
U 1 1 5F70D9CD
P 1800 6500
AR Path="/5F84D673/5F70D9CD" Ref="UBE48"  Part="1" 
AR Path="/5FBEEC97/5FC01C28/5F70D9CD" Ref="UBE48"  Part="1" 
F 0 "UBE48" H 1825 6766 50  0000 C CNN
F 1 "NAND02" H 1825 6675 50  0000 C CNN
F 2 "" H 1800 6500 50  0001 C CNN
F 3 "" H 1800 6500 50  0001 C CNN
	1    1800 6500
	1    0    0    -1  
$EndComp
$Comp
L A5C:INV01 UBH16
U 1 1 5F7D51A7
P 3850 1500
AR Path="/5F84D673/5F7D51A7" Ref="UBH16"  Part="1" 
AR Path="/5FBEEC97/5FC01C28/5F7D51A7" Ref="UBH16"  Part="1" 
F 0 "UBH16" H 3850 1816 50  0000 C CNN
F 1 "INV01" H 3850 1725 50  0000 C CNN
F 2 "" H 3850 1300 50  0001 C CNN
F 3 "" H 3850 1300 50  0001 C CNN
	1    3850 1500
	1    0    0    -1  
$EndComp
$Comp
L A5C:INV01 UBH38
U 1 1 5F7D83D4
P 3850 2250
AR Path="/5F84D673/5F7D83D4" Ref="UBH38"  Part="1" 
AR Path="/5FBEEC97/5FC01C28/5F7D83D4" Ref="UBH38"  Part="1" 
F 0 "UBH38" H 3850 2566 50  0000 C CNN
F 1 "INV01" H 3850 2475 50  0000 C CNN
F 2 "" H 3850 2050 50  0001 C CNN
F 3 "" H 3850 2050 50  0001 C CNN
	1    3850 2250
	1    0    0    -1  
$EndComp
$Comp
L A5C:INV01 UBH60
U 1 1 5F7D891D
P 3850 3000
AR Path="/5F84D673/5F7D891D" Ref="UBH60"  Part="1" 
AR Path="/5FBEEC97/5FC01C28/5F7D891D" Ref="UBH60"  Part="1" 
F 0 "UBH60" H 3850 3316 50  0000 C CNN
F 1 "INV01" H 3850 3225 50  0000 C CNN
F 2 "" H 3850 2800 50  0001 C CNN
F 3 "" H 3850 2800 50  0001 C CNN
	1    3850 3000
	1    0    0    -1  
$EndComp
$Comp
L A5C:INV01 UBF12
U 1 1 5F7D890E
P 3850 3750
AR Path="/5F84D673/5F7D890E" Ref="UBF12"  Part="1" 
AR Path="/5FBEEC97/5FC01C28/5F7D890E" Ref="UBF12"  Part="1" 
F 0 "UBF12" H 3850 4066 50  0000 C CNN
F 1 "INV01" H 3850 3975 50  0000 C CNN
F 2 "" H 3850 3550 50  0001 C CNN
F 3 "" H 3850 3550 50  0001 C CNN
	1    3850 3750
	1    0    0    -1  
$EndComp
$Comp
L A5C:INV01 UBF16
U 1 1 5F7E5E12
P 3850 4500
AR Path="/5F84D673/5F7E5E12" Ref="UBF16"  Part="1" 
AR Path="/5FBEEC97/5FC01C28/5F7E5E12" Ref="UBF16"  Part="1" 
F 0 "UBF16" H 3850 4816 50  0000 C CNN
F 1 "INV01" H 3850 4725 50  0000 C CNN
F 2 "" H 3850 4300 50  0001 C CNN
F 3 "" H 3850 4300 50  0001 C CNN
	1    3850 4500
	1    0    0    -1  
$EndComp
$Comp
L A5C:DFFCOR UBE50
U 1 1 5F84DF40
P 3300 1600
AR Path="/5F84D673/5F84DF40" Ref="UBE50"  Part="1" 
AR Path="/5FBEEC97/5FC01C28/5F84DF40" Ref="UBE50"  Part="1" 
F 0 "UBE50" H 3300 1961 50  0000 C CNN
F 1 "DFFCOR" H 3300 1870 50  0000 C CNN
F 2 "" H 3300 1600 50  0001 C CNN
F 3 "" H 3300 1600 50  0001 C CNN
F 4 "UBE81;UBE84" H 3300 1600 50  0001 C CNN "MiscRef"
	1    3300 1600
	1    0    0    -1  
$EndComp
$Comp
L A5C:DFFCOR UBE55
U 1 1 5F84EAC5
P 3300 2350
AR Path="/5F84D673/5F84EAC5" Ref="UBE55"  Part="1" 
AR Path="/5FBEEC97/5FC01C28/5F84EAC5" Ref="UBE55"  Part="1" 
F 0 "UBE55" H 3300 2711 50  0000 C CNN
F 1 "DFFCOR" H 3300 2620 50  0000 C CNN
F 2 "" H 3300 2350 50  0001 C CNN
F 3 "" H 3300 2350 50  0001 C CNN
	1    3300 2350
	1    0    0    -1  
$EndComp
$Comp
L A5C:DFFCOR UBE59
U 1 1 5F84F6A6
P 3300 3100
AR Path="/5F84D673/5F84F6A6" Ref="UBE59"  Part="1" 
AR Path="/5FBEEC97/5FC01C28/5F84F6A6" Ref="UBE59"  Part="1" 
F 0 "UBE59" H 3300 3461 50  0000 C CNN
F 1 "DFFCOR" H 3300 3370 50  0000 C CNN
F 2 "" H 3300 3100 50  0001 C CNN
F 3 "" H 3300 3100 50  0001 C CNN
	1    3300 3100
	1    0    0    -1  
$EndComp
$Comp
L A5C:DFFCOR UBE64
U 1 1 5F84F6BE
P 3300 3850
AR Path="/5F84D673/5F84F6BE" Ref="UBE64"  Part="1" 
AR Path="/5FBEEC97/5FC01C28/5F84F6BE" Ref="UBE64"  Part="1" 
F 0 "UBE64" H 3300 4211 50  0000 C CNN
F 1 "DFFCOR" H 3300 4120 50  0000 C CNN
F 2 "" H 3300 3850 50  0001 C CNN
F 3 "" H 3300 3850 50  0001 C CNN
	1    3300 3850
	1    0    0    -1  
$EndComp
$Comp
L A5C:DFFCOR UBE68
U 1 1 5F850F66
P 3300 4600
AR Path="/5F84D673/5F850F66" Ref="UBE68"  Part="1" 
AR Path="/5FBEEC97/5FC01C28/5F850F66" Ref="UBE68"  Part="1" 
F 0 "UBE68" H 3300 4961 50  0000 C CNN
F 1 "DFFCOR" H 3300 4870 50  0000 C CNN
F 2 "" H 3300 4600 50  0001 C CNN
F 3 "" H 3300 4600 50  0001 C CNN
	1    3300 4600
	1    0    0    -1  
$EndComp
$Comp
L A5C:DFFCOR UBE72
U 1 1 5F850F96
P 3300 5350
AR Path="/5F84D673/5F850F96" Ref="UBE72"  Part="1" 
AR Path="/5FBEEC97/5FC01C28/5F850F96" Ref="UBE72"  Part="1" 
F 0 "UBE72" H 3300 5711 50  0000 C CNN
F 1 "DFFCOR" H 3300 5620 50  0000 C CNN
F 2 "" H 3300 5350 50  0001 C CNN
F 3 "" H 3300 5350 50  0001 C CNN
	1    3300 5350
	1    0    0    -1  
$EndComp
$Comp
L A5C:DFFCOR UBE77
U 1 1 5F850F7E
P 3300 6100
AR Path="/5F84D673/5F850F7E" Ref="UBE77"  Part="1" 
AR Path="/5FBEEC97/5FC01C28/5F850F7E" Ref="UBE77"  Part="1" 
F 0 "UBE77" H 3300 6461 50  0000 C CNN
F 1 "DFFCOR" H 3300 6370 50  0000 C CNN
F 2 "" H 3300 6100 50  0001 C CNN
F 3 "" H 3300 6100 50  0001 C CNN
	1    3300 6100
	1    0    0    -1  
$EndComp
$Comp
L A5C:DFFCOR UBE86
U 1 1 5F85906D
P 6300 1600
AR Path="/5F84D673/5F85906D" Ref="UBE86"  Part="1" 
AR Path="/5FBEEC97/5FC01C28/5F85906D" Ref="UBE86"  Part="1" 
F 0 "UBE86" H 6300 1961 50  0000 C CNN
F 1 "DFFCOR" H 6300 1870 50  0000 C CNN
F 2 "" H 6300 1600 50  0001 C CNN
F 3 "" H 6300 1600 50  0001 C CNN
	1    6300 1600
	1    0    0    -1  
$EndComp
$Comp
L A5C:DFFCOR UBE90
U 1 1 5F859085
P 6300 2350
AR Path="/5F84D673/5F859085" Ref="UBE90"  Part="1" 
AR Path="/5FBEEC97/5FC01C28/5F859085" Ref="UBE90"  Part="1" 
F 0 "UBE90" H 6300 2711 50  0000 C CNN
F 1 "DFFCOR" H 6300 2620 50  0000 C CNN
F 2 "" H 6300 2350 50  0001 C CNN
F 3 "" H 6300 2350 50  0001 C CNN
	1    6300 2350
	1    0    0    -1  
$EndComp
$Comp
L A5C:DFFCOR UBE95
U 1 1 5F8590C0
P 6300 3100
AR Path="/5F84D673/5F8590C0" Ref="UBE95"  Part="1" 
AR Path="/5FBEEC97/5FC01C28/5F8590C0" Ref="UBE95"  Part="1" 
F 0 "UBE95" H 6300 3461 50  0000 C CNN
F 1 "DFFCOR" H 6300 3370 50  0000 C CNN
F 2 "" H 6300 3100 50  0001 C CNN
F 3 "" H 6300 3100 50  0001 C CNN
	1    6300 3100
	1    0    0    -1  
$EndComp
$Comp
L A5C:DFFCOR UBE99
U 1 1 5F85904F
P 6300 3850
AR Path="/5F84D673/5F85904F" Ref="UBE99"  Part="1" 
AR Path="/5FBEEC97/5FC01C28/5F85904F" Ref="UBE99"  Part="1" 
F 0 "UBE99" H 6300 4211 50  0000 C CNN
F 1 "DFFCOR" H 6300 4120 50  0000 C CNN
F 2 "" H 6300 3850 50  0001 C CNN
F 3 "" H 6300 3850 50  0001 C CNN
	1    6300 3850
	1    0    0    -1  
$EndComp
$Comp
L A5C:DFFCOR UBE104
U 1 1 5F8590A4
P 6300 4600
AR Path="/5F84D673/5F8590A4" Ref="UBE104"  Part="1" 
AR Path="/5FBEEC97/5FC01C28/5F8590A4" Ref="UBE104"  Part="1" 
F 0 "UBE104" H 6300 4961 50  0000 C CNN
F 1 "DFFCOR" H 6300 4870 50  0000 C CNN
F 2 "" H 6300 4600 50  0001 C CNN
F 3 "" H 6300 4600 50  0001 C CNN
	1    6300 4600
	1    0    0    -1  
$EndComp
$Comp
L A5C:DFFCOR UBE108
U 1 1 5F85902F
P 6300 5350
AR Path="/5F84D673/5F85902F" Ref="UBE108"  Part="1" 
AR Path="/5FBEEC97/5FC01C28/5F85902F" Ref="UBE108"  Part="1" 
F 0 "UBE108" H 6300 5711 50  0000 C CNN
F 1 "DFFCOR" H 6300 5620 50  0000 C CNN
F 2 "" H 6300 5350 50  0001 C CNN
F 3 "" H 6300 5350 50  0001 C CNN
	1    6300 5350
	1    0    0    -1  
$EndComp
NoConn ~ 3550 1600
NoConn ~ 3550 2350
NoConn ~ 3550 3100
NoConn ~ 3550 3850
NoConn ~ 3550 4600
NoConn ~ 3550 5350
NoConn ~ 3550 6100
NoConn ~ 6550 5350
NoConn ~ 6550 4600
NoConn ~ 6550 3850
NoConn ~ 6550 3100
NoConn ~ 6550 2350
NoConn ~ 6550 1600
Wire Bus Line
	7150 1150 7150 1350
Wire Bus Line
	7150 2250 7150 2450
Wire Bus Line
	7150 3750 7150 3950
Wire Bus Line
	7150 5250 7150 5450
Wire Bus Line
	2350 5100 2350 6600
Wire Bus Line
	2350 1050 2350 4400
Wire Bus Line
	4750 750  4750 4400
Wire Bus Line
	5350 1600 5350 6600
$EndSCHEMATC
