EESchema Schematic File Version 4
EELAYER 30 0
EELAYER END
$Descr A3 16535 11693
encoding utf-8
Sheet 55 83
Title "CPS Reverse Engineering: DL-0311"
Date "2021-09-12"
Rev ""
Comp ""
Comment1 ""
Comment2 ""
Comment3 "Licence: CC-BY"
Comment4 "Author: Loïc *WydD* Petit"
$EndDescr
Connection ~ 7700 9100
Connection ~ 9000 9300
Connection ~ 9000 9600
Connection ~ 7700 9900
Connection ~ 8900 10300
Connection ~ 9350 9200
Connection ~ 7700 8300
Connection ~ 6550 9650
Connection ~ 6650 9050
Connection ~ 6650 9850
Connection ~ 6550 8050
Connection ~ 6650 10650
Connection ~ 6550 8850
Connection ~ 9350 8000
Connection ~ 9200 8100
Connection ~ 9200 8500
Connection ~ 9100 8900
Connection ~ 9100 8700
Connection ~ 9350 8600
Connection ~ 9100 9700
Connection ~ 9200 9800
Connection ~ 9200 9100
Connection ~ 9100 9000
Connection ~ 8900 10000
Connection ~ 9000 9700
Connection ~ 9100 10500
Connection ~ 9000 10400
Connection ~ 8900 10500
Connection ~ 9200 10600
Connection ~ 9350 9900
Connection ~ 4450 8100
Connection ~ 7700 5150
Connection ~ 8750 6500
Connection ~ 9000 3750
Connection ~ 6550 3300
Connection ~ 6550 2500
Connection ~ 6650 5100
Connection ~ 6550 4100
Connection ~ 4450 2550
Connection ~ 9350 2450
Connection ~ 9100 3150
Connection ~ 9200 2950
Connection ~ 9200 2550
Connection ~ 8900 4450
Connection ~ 9200 4250
Connection ~ 9000 4050
Connection ~ 9100 4150
Connection ~ 9000 4150
Connection ~ 9350 4350
Connection ~ 8900 4950
Connection ~ 8900 4750
Connection ~ 9000 4850
Connection ~ 9100 4950
Connection ~ 9200 5050
Connection ~ 7750 950 
Connection ~ 9100 3450
Connection ~ 9350 3650
Connection ~ 9200 3550
Connection ~ 9350 3050
Connection ~ 9100 3350
Connection ~ 10450 4950
Connection ~ 7700 3550
Connection ~ 7700 4350
Connection ~ 6650 3500
Connection ~ 6650 4300
Connection ~ 11350 5000
Connection ~ 10300 10500
Connection ~ 2550 8150
Connection ~ 3350 8150
Connection ~ 3800 2600
NoConn ~ 8300 9800
NoConn ~ 8300 9000
NoConn ~ 8300 10600
NoConn ~ 8350 8200
Entry Wire Line
	5400 5750 5300 5850
Entry Wire Line
	5400 5850 5300 5950
Entry Wire Line
	5400 5950 5300 6050
Entry Wire Line
	5400 6050 5300 6150
Entry Wire Line
	5400 6500 5300 6400
Entry Wire Line
	5400 6600 5300 6500
Entry Wire Line
	5400 6700 5300 6600
Entry Wire Line
	5400 6800 5300 6700
Wire Wire Line
	1650 8100 1850 8100
Wire Wire Line
	1750 7100 1750 8200
Wire Wire Line
	1750 7100 11350 7100
Wire Wire Line
	1750 8200 1850 8200
Wire Wire Line
	2400 8150 2550 8150
Wire Wire Line
	2550 8150 2550 8550
Wire Wire Line
	2550 8150 2750 8150
Wire Wire Line
	2650 8550 2550 8550
Wire Wire Line
	3350 8150 3900 8150
Wire Wire Line
	3350 8450 3350 8150
Wire Wire Line
	3450 8450 3350 8450
Wire Wire Line
	3700 2600 3800 2600
Wire Wire Line
	3800 2600 3800 8050
Wire Wire Line
	3800 2600 3900 2600
Wire Wire Line
	3900 1600 3900 2500
Wire Wire Line
	3900 8050 3800 8050
Wire Wire Line
	4450 2550 4450 5150
Wire Wire Line
	4450 5150 5050 5150
Wire Wire Line
	4450 8100 4450 10700
Wire Wire Line
	4450 10700 5050 10700
Wire Wire Line
	5400 5750 6150 5750
Wire Wire Line
	5400 5850 6250 5850
Wire Wire Line
	5400 5950 6350 5950
Wire Wire Line
	5400 6050 6450 6050
Wire Wire Line
	5400 6500 6450 6500
Wire Wire Line
	5400 6600 6350 6600
Wire Wire Line
	5400 6700 6250 6700
Wire Wire Line
	5400 6800 6150 6800
Wire Wire Line
	5600 2500 6550 2500
Wire Wire Line
	5600 5100 6650 5100
Wire Wire Line
	5600 8050 6550 8050
Wire Wire Line
	5600 10650 6650 10650
Wire Wire Line
	5750 1750 5750 5000
Wire Wire Line
	5750 5000 6750 5000
Wire Wire Line
	5750 7300 5750 10550
Wire Wire Line
	5750 10550 6750 10550
Wire Wire Line
	5850 1850 5850 4200
Wire Wire Line
	5850 4200 6750 4200
Wire Wire Line
	5850 7400 5850 9750
Wire Wire Line
	5850 9750 6750 9750
Wire Wire Line
	5950 1950 5950 3400
Wire Wire Line
	5950 3400 6750 3400
Wire Wire Line
	5950 7500 5950 8950
Wire Wire Line
	5950 8950 6750 8950
Wire Wire Line
	6050 2050 10850 2050
Wire Wire Line
	6050 2600 6050 2050
Wire Wire Line
	6050 7600 10850 7600
Wire Wire Line
	6050 8150 6050 7600
Wire Wire Line
	6150 2400 6800 2400
Wire Wire Line
	6150 5750 6150 2400
Wire Wire Line
	6150 6800 6150 10350
Wire Wire Line
	6150 10350 6750 10350
Wire Wire Line
	6250 3200 6250 5850
Wire Wire Line
	6250 3200 6750 3200
Wire Wire Line
	6250 6700 6250 9550
Wire Wire Line
	6250 9550 6750 9550
Wire Wire Line
	6350 4000 6750 4000
Wire Wire Line
	6350 5950 6350 4000
Wire Wire Line
	6350 6600 6350 8750
Wire Wire Line
	6350 8750 6750 8750
Wire Wire Line
	6450 4800 6450 6050
Wire Wire Line
	6450 6500 6450 7950
Wire Wire Line
	6550 2500 6800 2500
Wire Wire Line
	6550 3300 6550 2500
Wire Wire Line
	6550 4100 6550 3300
Wire Wire Line
	6550 4100 6550 4900
Wire Wire Line
	6550 8050 6800 8050
Wire Wire Line
	6550 8850 6550 8050
Wire Wire Line
	6550 9650 6550 8850
Wire Wire Line
	6550 9650 6550 10450
Wire Wire Line
	6650 2700 6800 2700
Wire Wire Line
	6650 3500 6650 2700
Wire Wire Line
	6650 4300 6650 3500
Wire Wire Line
	6650 5100 6650 4300
Wire Wire Line
	6650 8250 6800 8250
Wire Wire Line
	6650 9050 6650 8250
Wire Wire Line
	6650 9850 6650 9050
Wire Wire Line
	6650 10650 6650 9850
Wire Wire Line
	6750 3300 6550 3300
Wire Wire Line
	6750 3500 6650 3500
Wire Wire Line
	6750 4100 6550 4100
Wire Wire Line
	6750 4300 6650 4300
Wire Wire Line
	6750 4800 6450 4800
Wire Wire Line
	6750 4900 6550 4900
Wire Wire Line
	6750 5100 6650 5100
Wire Wire Line
	6750 8850 6550 8850
Wire Wire Line
	6750 9050 6650 9050
Wire Wire Line
	6750 9650 6550 9650
Wire Wire Line
	6750 9850 6650 9850
Wire Wire Line
	6750 10450 6550 10450
Wire Wire Line
	6750 10650 6650 10650
Wire Wire Line
	6800 2600 6050 2600
Wire Wire Line
	6800 7950 6450 7950
Wire Wire Line
	6800 8150 6050 8150
Wire Wire Line
	7600 3350 7800 3350
Wire Wire Line
	7600 4150 7800 4150
Wire Wire Line
	7600 4950 7800 4950
Wire Wire Line
	7600 8900 7800 8900
Wire Wire Line
	7600 9700 7800 9700
Wire Wire Line
	7600 10500 7800 10500
Wire Wire Line
	7650 1350 7850 1350
Wire Wire Line
	7650 2550 7850 2550
Wire Wire Line
	7650 8100 7850 8100
Wire Wire Line
	7700 2750 7850 2750
Wire Wire Line
	7700 3550 7700 2750
Wire Wire Line
	7700 4350 7700 3550
Wire Wire Line
	7700 4350 7800 4350
Wire Wire Line
	7700 5150 7700 4350
Wire Wire Line
	7700 5150 7700 6200
Wire Wire Line
	7700 8300 7850 8300
Wire Wire Line
	7700 9100 7700 8300
Wire Wire Line
	7700 9900 7700 9100
Wire Wire Line
	7700 9900 7800 9900
Wire Wire Line
	7700 10700 7700 9900
Wire Wire Line
	7750 950  7850 950 
Wire Wire Line
	7750 1450 7750 950 
Wire Wire Line
	7750 1450 7850 1450
Wire Wire Line
	7800 3550 7700 3550
Wire Wire Line
	7800 5150 7700 5150
Wire Wire Line
	7800 9100 7700 9100
Wire Wire Line
	7800 10700 7700 10700
Wire Wire Line
	8300 4150 9000 4150
Wire Wire Line
	8300 4250 8500 4250
Wire Wire Line
	8300 4950 8900 4950
Wire Wire Line
	8300 9700 9000 9700
Wire Wire Line
	8300 10500 8900 10500
Wire Wire Line
	8350 2550 9200 2550
Wire Wire Line
	8350 2650 8700 2650
Wire Wire Line
	8350 8100 9200 8100
Wire Wire Line
	8400 5050 8300 5050
Wire Wire Line
	8400 5050 8400 5900
Wire Wire Line
	8400 5900 9550 5900
Wire Wire Line
	8450 950  9400 950 
Wire Wire Line
	8500 4250 8500 5800
Wire Wire Line
	8500 5800 9550 5800
Wire Wire Line
	8600 3450 8300 3450
Wire Wire Line
	8600 5700 8600 3450
Wire Wire Line
	8600 5700 9550 5700
Wire Wire Line
	8600 6900 8800 6900
Wire Wire Line
	8700 2650 8700 5600
Wire Wire Line
	8700 5600 9550 5600
Wire Wire Line
	8750 6100 10450 6100
Wire Wire Line
	8750 6500 8750 6100
Wire Wire Line
	8750 6500 8800 6500
Wire Wire Line
	8750 7000 8750 6500
Wire Wire Line
	8750 7000 8800 7000
Wire Wire Line
	8900 2300 8900 4450
Wire Wire Line
	8900 4450 8900 4750
Wire Wire Line
	8900 4450 10200 4450
Wire Wire Line
	8900 4750 8900 4950
Wire Wire Line
	8900 4950 8900 5500
Wire Wire Line
	8900 7850 8900 10000
Wire Wire Line
	8900 10000 8900 10300
Wire Wire Line
	8900 10000 10200 10000
Wire Wire Line
	8900 10300 8900 10500
Wire Wire Line
	8900 10500 8900 11050
Wire Wire Line
	9000 2300 9000 3750
Wire Wire Line
	9000 3750 9000 4050
Wire Wire Line
	9000 3750 10200 3750
Wire Wire Line
	9000 4050 9000 4150
Wire Wire Line
	9000 4150 9000 4850
Wire Wire Line
	9000 4850 9000 5500
Wire Wire Line
	9000 7850 9000 9300
Wire Wire Line
	9000 9300 9000 9600
Wire Wire Line
	9000 9300 10200 9300
Wire Wire Line
	9000 9600 9000 9700
Wire Wire Line
	9000 9700 9000 10400
Wire Wire Line
	9000 10400 9000 11050
Wire Wire Line
	9100 2300 9100 3150
Wire Wire Line
	9100 3150 9100 3350
Wire Wire Line
	9100 3150 10200 3150
Wire Wire Line
	9100 3350 8300 3350
Wire Wire Line
	9100 3350 9100 3450
Wire Wire Line
	9100 3450 9100 4150
Wire Wire Line
	9100 4150 9100 4950
Wire Wire Line
	9100 4950 9100 5500
Wire Wire Line
	9100 7850 9100 8700
Wire Wire Line
	9100 8700 9100 8900
Wire Wire Line
	9100 8700 10200 8700
Wire Wire Line
	9100 8900 8300 8900
Wire Wire Line
	9100 8900 9100 9000
Wire Wire Line
	9100 9000 9100 9700
Wire Wire Line
	9100 9700 9100 10500
Wire Wire Line
	9100 10500 9100 11050
Wire Wire Line
	9200 2300 9200 2550
Wire Wire Line
	9200 2550 9200 2950
Wire Wire Line
	9200 2950 9200 3550
Wire Wire Line
	9200 3550 9200 4250
Wire Wire Line
	9200 4250 9200 5050
Wire Wire Line
	9200 5050 9200 5500
Wire Wire Line
	9200 7850 9200 8100
Wire Wire Line
	9200 8100 9200 8500
Wire Wire Line
	9200 8500 9200 9100
Wire Wire Line
	9200 9100 9200 9800
Wire Wire Line
	9200 9800 9200 10600
Wire Wire Line
	9200 10600 9200 11050
Wire Wire Line
	9350 1400 8400 1400
Wire Wire Line
	9350 1400 9350 2450
Wire Wire Line
	9350 2450 9350 3050
Wire Wire Line
	9350 2450 10200 2450
Wire Wire Line
	9350 3050 9350 3650
Wire Wire Line
	9350 3050 9450 3050
Wire Wire Line
	9350 3650 9350 4350
Wire Wire Line
	9350 3650 9450 3650
Wire Wire Line
	9350 4350 9350 5500
Wire Wire Line
	9350 4350 9450 4350
Wire Wire Line
	9350 6950 9350 8000
Wire Wire Line
	9350 8000 9350 8600
Wire Wire Line
	9350 8000 10200 8000
Wire Wire Line
	9350 8600 9350 9200
Wire Wire Line
	9350 8600 9450 8600
Wire Wire Line
	9350 9200 9350 9900
Wire Wire Line
	9350 9200 9450 9200
Wire Wire Line
	9350 9900 9350 11050
Wire Wire Line
	9350 9900 9450 9900
Wire Wire Line
	9400 950  9400 5150
Wire Wire Line
	9400 5150 9450 5150
Wire Wire Line
	9400 6500 9400 10700
Wire Wire Line
	9400 10700 9450 10700
Wire Wire Line
	9450 2950 9200 2950
Wire Wire Line
	9450 3450 9100 3450
Wire Wire Line
	9450 3550 9200 3550
Wire Wire Line
	9450 4050 9000 4050
Wire Wire Line
	9450 4150 9100 4150
Wire Wire Line
	9450 4250 9200 4250
Wire Wire Line
	9450 4750 8900 4750
Wire Wire Line
	9450 4850 9000 4850
Wire Wire Line
	9450 4950 9100 4950
Wire Wire Line
	9450 5050 9200 5050
Wire Wire Line
	9450 8500 9200 8500
Wire Wire Line
	9450 9000 9100 9000
Wire Wire Line
	9450 9100 9200 9100
Wire Wire Line
	9450 9600 9000 9600
Wire Wire Line
	9450 9700 9100 9700
Wire Wire Line
	9450 9800 9200 9800
Wire Wire Line
	9450 10300 8900 10300
Wire Wire Line
	9450 10400 9000 10400
Wire Wire Line
	9450 10500 9100 10500
Wire Wire Line
	9450 10600 9200 10600
Wire Wire Line
	10000 3000 10000 3050
Wire Wire Line
	10000 3050 10200 3050
Wire Wire Line
	10000 8550 10000 8600
Wire Wire Line
	10000 8600 10200 8600
Wire Wire Line
	10050 3650 10050 3550
Wire Wire Line
	10050 4350 10050 4200
Wire Wire Line
	10050 9200 10050 9100
Wire Wire Line
	10050 9900 10050 9750
Wire Wire Line
	10200 2550 9200 2550
Wire Wire Line
	10200 3650 10050 3650
Wire Wire Line
	10200 4350 10050 4350
Wire Wire Line
	10200 4950 10450 4950
Wire Wire Line
	10200 8100 9200 8100
Wire Wire Line
	10200 9200 10050 9200
Wire Wire Line
	10200 9900 10050 9900
Wire Wire Line
	10200 10500 10300 10500
Wire Wire Line
	10300 10500 10600 10500
Wire Wire Line
	10300 10850 10300 10500
Wire Wire Line
	10400 10850 10300 10850
Wire Wire Line
	10450 4600 10450 4950
Wire Wire Line
	10450 4950 10450 6100
Wire Wire Line
	10450 4950 10800 4950
Wire Wire Line
	10550 4600 10450 4600
Wire Wire Line
	10650 5800 10200 5800
Wire Wire Line
	10750 3100 10950 3100
Wire Wire Line
	10750 3700 11050 3700
Wire Wire Line
	10750 4400 11150 4400
Wire Wire Line
	10750 8650 10950 8650
Wire Wire Line
	10750 9250 11050 9250
Wire Wire Line
	10750 9950 11150 9950
Wire Wire Line
	10850 2050 10850 2500
Wire Wire Line
	10850 2500 10750 2500
Wire Wire Line
	10850 7600 10850 8050
Wire Wire Line
	10850 8050 10750 8050
Wire Wire Line
	10950 1950 5950 1950
Wire Wire Line
	10950 3100 10950 1950
Wire Wire Line
	10950 7500 5950 7500
Wire Wire Line
	10950 8650 10950 7500
Wire Wire Line
	11050 1850 5850 1850
Wire Wire Line
	11050 3700 11050 1850
Wire Wire Line
	11050 7400 5850 7400
Wire Wire Line
	11050 9250 11050 7400
Wire Wire Line
	11150 1750 5750 1750
Wire Wire Line
	11150 1750 11150 4400
Wire Wire Line
	11150 7300 5750 7300
Wire Wire Line
	11150 7300 11150 9950
Wire Wire Line
	11150 10550 11350 10550
Wire Wire Line
	11350 1600 3900 1600
Wire Wire Line
	11350 5000 11350 1600
Wire Wire Line
	11350 10550 11350 7100
Wire Wire Line
	11500 5000 11350 5000
Wire Bus Line
	5100 6350 5300 6350
Wire Bus Line
	5300 6200 5100 6200
Text Notes 2050 8900 0    50   ~ 0
SCAN-243 OR\n[SPRITE-POS-READY & LI]
Text Notes 3300 9600 0    50   ~ 0
load when:\nMAIN-RESET OR\nSCAN-243 OR\n[SPRITE-POS-READY & LI]
Text Notes 4550 3250 0    50   ~ 0
load when:\nSPRITE-X-READY & LI OR\n[SCAN-243 + RESET]
Text Notes 4600 8800 0    50   ~ 0
0 = load\n1 = inc
Text Notes 4800 3700 0    50   ~ 0
Sprite Attribute\nX Block Size
Text Notes 4800 9300 0    50   ~ 0
Sprite Attribute\nY Block Size
Text Notes 5350 4300 0    50   ~ 0
UCA314\n\n~Q[0..3]
Text Notes 5400 8900 0    50   ~ 0
UBF0\n\n~Q[0..3]
Text Notes 9750 1500 0    50   ~ 0
inc when: LI
Text Label 6000 5750 2    50   ~ 0
~ATTR-XBLOCK0
Text Label 6000 5850 2    50   ~ 0
~ATTR-XBLOCK1
Text Label 6000 5950 2    50   ~ 0
~ATTR-XBLOCK2
Text Label 6000 6050 2    50   ~ 0
~ATTR-XBLOCK3
Text Label 6000 6500 2    50   ~ 0
~ATTR-YBLOCK0
Text Label 6000 6600 2    50   ~ 0
~ATTR-YBLOCK1
Text Label 6000 6700 2    50   ~ 0
~ATTR-YBLOCK2
Text Label 6000 6800 2    50   ~ 0
~ATTR-YBLOCK3
Text HLabel 1050 8100 0    50   Input ~ 0
SCAN-243
Text HLabel 2650 8550 2    50   Output ~ 0
SPRITE-BLOCK-RESET
Text HLabel 3450 8450 2    50   Output ~ 0
~SPRITE-BLOCK-RESET
Text HLabel 3700 2600 0    50   Input ~ 0
~RESET-SCAN243
Text HLabel 5100 6200 0    50   Input ~ 0
~ATTR-XBLOCK[0..3]
Text HLabel 5100 6350 0    50   Input ~ 0
~ATTR-YBLOCK[0..3]
Text HLabel 7650 1350 0    50   Input ~ 0
LI
Text HLabel 8600 6900 0    50   Input ~ 0
LI
Text HLabel 9550 6000 0    50   Input ~ 0
BUS-SPRITE-TILE-SYNC
Text HLabel 10400 10850 2    50   Output ~ 0
SPRITE-BLOCK-READY
Text HLabel 10550 4600 2    50   Output ~ 0
SPRITE-X-READY
Text HLabel 10600 10600 0    50   Input ~ 0
LI
Text HLabel 10650 5800 2    50   Output ~ 0
~SPRITE-X-READY-SYNC
Text HLabel 10800 5050 0    50   Input ~ 0
LI
Text HLabel 11500 5000 2    50   Output ~ 0
~SPRITE-X-READY-LI
$Comp
L power:VCC #PWR0111
U 1 1 60DAEB83
P 5050 2450
F 0 "#PWR0111" H 5050 2300 50  0001 C CNN
F 1 "VCC" H 5065 2623 50  0000 C CNN
F 2 "" H 5050 2450 50  0001 C CNN
F 3 "" H 5050 2450 50  0001 C CNN
	1    5050 2450
	1    0    0    -1  
$EndComp
$Comp
L power:VCC #PWR0112
U 1 1 609BF350
P 5050 5050
F 0 "#PWR0112" H 5050 4900 50  0001 C CNN
F 1 "VCC" H 5065 5223 50  0000 C CNN
F 2 "" H 5050 5050 50  0001 C CNN
F 3 "" H 5050 5050 50  0001 C CNN
	1    5050 5050
	1    0    0    -1  
$EndComp
$Comp
L power:VCC #PWR0113
U 1 1 60CDB2E0
P 5050 8000
F 0 "#PWR0113" H 5050 7850 50  0001 C CNN
F 1 "VCC" H 5065 8173 50  0000 C CNN
F 2 "" H 5050 8000 50  0001 C CNN
F 3 "" H 5050 8000 50  0001 C CNN
	1    5050 8000
	1    0    0    -1  
$EndComp
$Comp
L power:VCC #PWR0114
U 1 1 60B7E573
P 5050 10600
F 0 "#PWR0114" H 5050 10450 50  0001 C CNN
F 1 "VCC" H 5065 10773 50  0000 C CNN
F 2 "" H 5050 10600 50  0001 C CNN
F 3 "" H 5050 10600 50  0001 C CNN
	1    5050 10600
	1    0    0    -1  
$EndComp
$Comp
L power:VCC #PWR0117
U 1 1 60B0E175
P 7750 950
F 0 "#PWR0117" H 7750 800 50  0001 C CNN
F 1 "VCC" H 7765 1123 50  0000 C CNN
F 2 "" H 7750 950 50  0001 C CNN
F 3 "" H 7750 950 50  0001 C CNN
	1    7750 950 
	1    0    0    -1  
$EndComp
$Comp
L A5C:NAND02 UCB123
U 1 1 61118D63
P 2100 8150
F 0 "UCB123" H 2125 8417 50  0000 C CNN
F 1 "NAND02" H 2125 8326 50  0000 C CNN
F 2 "" H 2100 8150 50  0001 C CNN
F 3 "" H 2100 8150 50  0001 C CNN
	1    2100 8150
	1    0    0    -1  
$EndComp
$Comp
L A5C:AND02 UAC44
U 1 1 61025F58
P 4150 2550
F 0 "UAC44" H 4175 2817 50  0000 C CNN
F 1 "AND02" H 4175 2726 50  0000 C CNN
F 2 "" H 4150 2550 50  0001 C CNN
F 3 "" H 4150 2550 50  0001 C CNN
	1    4150 2550
	1    0    0    -1  
$EndComp
$Comp
L A5C:AND02 UAD76
U 1 1 60FA9371
P 4150 8100
F 0 "UAD76" H 4175 8367 50  0000 C CNN
F 1 "AND02" H 4175 8276 50  0000 C CNN
F 2 "" H 4150 8100 50  0001 C CNN
F 3 "" H 4150 8100 50  0001 C CNN
	1    4150 8100
	1    0    0    -1  
$EndComp
$Comp
L A5C:AND02 UAB52
U 1 1 608E541E
P 5300 2500
F 0 "UAB52" H 5325 2767 50  0000 C CNN
F 1 "AND02" H 5325 2676 50  0000 C CNN
F 2 "" H 5300 2500 50  0001 C CNN
F 3 "" H 5300 2500 50  0001 C CNN
	1    5300 2500
	1    0    0    -1  
$EndComp
$Comp
L A5C:AND02 UAC49
U 1 1 608647C2
P 5300 5100
F 0 "UAC49" H 5325 5367 50  0000 C CNN
F 1 "AND02" H 5325 5276 50  0000 C CNN
F 2 "" H 5300 5100 50  0001 C CNN
F 3 "" H 5300 5100 50  0001 C CNN
	1    5300 5100
	1    0    0    -1  
$EndComp
$Comp
L A5C:AND02 UAD54
U 1 1 60B7E55E
P 5300 8050
F 0 "UAD54" H 5325 8317 50  0000 C CNN
F 1 "AND02" H 5325 8226 50  0000 C CNN
F 2 "" H 5300 8050 50  0001 C CNN
F 3 "" H 5300 8050 50  0001 C CNN
	1    5300 8050
	1    0    0    -1  
$EndComp
$Comp
L A5C:AND02 UAD71
U 1 1 60B7E54F
P 5300 10650
F 0 "UAD71" H 5325 10917 50  0000 C CNN
F 1 "AND02" H 5325 10826 50  0000 C CNN
F 2 "" H 5300 10650 50  0001 C CNN
F 3 "" H 5300 10650 50  0001 C CNN
	1    5300 10650
	1    0    0    -1  
$EndComp
$Comp
L A5C:NAND02 UAB84
U 1 1 604930E1
P 8100 1400
F 0 "UAB84" H 8125 1667 50  0000 C CNN
F 1 "NAND02" H 8125 1576 50  0000 C CNN
F 2 "" H 8100 1400 50  0001 C CNN
F 3 "" H 8100 1400 50  0001 C CNN
	1    8100 1400
	1    0    0    -1  
$EndComp
$Comp
L A5C:NAND02 UAC166
U 1 1 60B7E4CA
P 9050 6950
F 0 "UAC166" H 9075 7217 50  0000 C CNN
F 1 "NAND02" H 9075 7126 50  0000 C CNN
F 2 "" H 9050 6950 50  0001 C CNN
F 3 "" H 9050 6950 50  0001 C CNN
	1    9050 6950
	1    0    0    -1  
$EndComp
$Comp
L A5C:NOR02 UAB86
U 1 1 6030F18E
P 9700 3000
F 0 "UAB86" H 9725 3267 50  0000 C CNN
F 1 "NOR02" H 9725 3176 50  0000 C CNN
F 2 "" H 9700 3000 50  0001 C CNN
F 3 "" H 9700 3000 50  0001 C CNN
	1    9700 3000
	1    0    0    -1  
$EndComp
$Comp
L A5C:NOR02 UAC135
U 1 1 60B7E45D
P 9700 8550
F 0 "UAC135" H 9725 8817 50  0000 C CNN
F 1 "NOR02" H 9725 8726 50  0000 C CNN
F 2 "" H 9700 8550 50  0001 C CNN
F 3 "" H 9700 8550 50  0001 C CNN
	1    9700 8550
	1    0    0    -1  
$EndComp
$Comp
L A5C:XOR02 UAB101
U 1 1 60311F5C
P 10450 2500
F 0 "UAB101" H 10475 2767 50  0000 C CNN
F 1 "XOR02" H 10475 2676 50  0000 C CNN
F 2 "" H 10450 2500 50  0001 C CNN
F 3 "" H 10450 2500 50  0001 C CNN
	1    10450 2500
	1    0    0    -1  
$EndComp
$Comp
L A5C:XNOR02 UAB79
U 1 1 60314991
P 10450 3100
F 0 "UAB79" H 10475 3367 50  0000 C CNN
F 1 "XNOR02" H 10475 3276 50  0000 C CNN
F 2 "" H 10475 3100 50  0001 C CNN
F 3 "" H 10475 3100 50  0001 C CNN
	1    10450 3100
	1    0    0    -1  
$EndComp
$Comp
L A5C:XNOR02 UAB92
U 1 1 60315524
P 10450 3700
F 0 "UAB92" H 10475 3967 50  0000 C CNN
F 1 "XNOR02" H 10475 3876 50  0000 C CNN
F 2 "" H 10475 3700 50  0001 C CNN
F 3 "" H 10475 3700 50  0001 C CNN
	1    10450 3700
	1    0    0    -1  
$EndComp
$Comp
L A5C:XNOR02 UAC98
U 1 1 60315D8B
P 10450 4400
F 0 "UAC98" H 10475 4667 50  0000 C CNN
F 1 "XNOR02" H 10475 4576 50  0000 C CNN
F 2 "" H 10475 4400 50  0001 C CNN
F 3 "" H 10475 4400 50  0001 C CNN
	1    10450 4400
	1    0    0    -1  
$EndComp
$Comp
L A5C:XOR02 UAD95
U 1 1 60B7E46F
P 10450 8050
F 0 "UAD95" H 10475 8317 50  0000 C CNN
F 1 "XOR02" H 10475 8226 50  0000 C CNN
F 2 "" H 10450 8050 50  0001 C CNN
F 3 "" H 10450 8050 50  0001 C CNN
	1    10450 8050
	1    0    0    -1  
$EndComp
$Comp
L A5C:XNOR02 UAC140
U 1 1 60B7E475
P 10450 8650
F 0 "UAC140" H 10475 8917 50  0000 C CNN
F 1 "XNOR02" H 10475 8826 50  0000 C CNN
F 2 "" H 10475 8650 50  0001 C CNN
F 3 "" H 10475 8650 50  0001 C CNN
	1    10450 8650
	1    0    0    -1  
$EndComp
$Comp
L A5C:XNOR02 UAD130
U 1 1 60B7E47B
P 10450 9250
F 0 "UAD130" H 10475 9517 50  0000 C CNN
F 1 "XNOR02" H 10475 9426 50  0000 C CNN
F 2 "" H 10475 9250 50  0001 C CNN
F 3 "" H 10475 9250 50  0001 C CNN
	1    10450 9250
	1    0    0    -1  
$EndComp
$Comp
L A5C:XNOR02 UAD157
U 1 1 60B7E481
P 10450 9950
F 0 "UAD157" H 10475 10217 50  0000 C CNN
F 1 "XNOR02" H 10475 10126 50  0000 C CNN
F 2 "" H 10475 9950 50  0001 C CNN
F 3 "" H 10475 9950 50  0001 C CNN
	1    10450 9950
	1    0    0    -1  
$EndComp
$Comp
L A5C:NAND02 UCA106
U 1 1 61118D64
P 10850 10550
F 0 "UCA106" H 10875 10817 50  0000 C CNN
F 1 "NAND02" H 10875 10726 50  0000 C CNN
F 2 "" H 10850 10550 50  0001 C CNN
F 3 "" H 10850 10550 50  0001 C CNN
	1    10850 10550
	1    0    0    -1  
$EndComp
$Comp
L A5C:NAND02 UAC127
U 1 1 650344DD
P 11050 5000
F 0 "UAC127" H 11075 5267 50  0000 C CNN
F 1 "NAND02" H 11075 5176 50  0000 C CNN
F 2 "" H 11050 5000 50  0001 C CNN
F 3 "" H 11050 5000 50  0001 C CNN
	1    11050 5000
	1    0    0    -1  
$EndComp
$Comp
L A5C:INV01 UCB106
U 1 1 61118D62
P 1350 8100
F 0 "UCB106" H 1350 8417 50  0000 C CNN
F 1 "INV01" H 1350 8326 50  0000 C CNN
F 2 "" H 1350 7900 50  0001 C CNN
F 3 "" H 1350 7900 50  0001 C CNN
	1    1350 8100
	1    0    0    -1  
$EndComp
$Comp
L A5C:INV01 UCB128
U 1 1 61118D65
P 3050 8150
F 0 "UCB128" H 3050 8467 50  0000 C CNN
F 1 "INV01" H 3050 8376 50  0000 C CNN
F 2 "" H 3050 7950 50  0001 C CNN
F 3 "" H 3050 7950 50  0001 C CNN
	1    3050 8150
	1    0    0    -1  
$EndComp
$Comp
L A5C:INV01 UAB48
U 1 1 609AAB67
P 4750 2550
F 0 "UAB48" H 4750 2867 50  0000 C CNN
F 1 "INV01" H 4750 2776 50  0000 C CNN
F 2 "" H 4750 2350 50  0001 C CNN
F 3 "" H 4750 2350 50  0001 C CNN
	1    4750 2550
	1    0    0    -1  
$EndComp
$Comp
L A5C:INV01 UAD57
U 1 1 60B7E56C
P 4750 8100
F 0 "UAD57" H 4750 8417 50  0000 C CNN
F 1 "INV01" H 4750 8326 50  0000 C CNN
F 2 "" H 4750 7900 50  0001 C CNN
F 3 "" H 4750 7900 50  0001 C CNN
	1    4750 8100
	1    0    0    -1  
$EndComp
$Comp
L A5C:INV01 UAB71
U 1 1 60A3A097
P 8150 950
F 0 "UAB71" H 8150 1267 50  0000 C CNN
F 1 "INV01" H 8150 1176 50  0000 C CNN
F 2 "" H 8150 750 50  0001 C CNN
F 3 "" H 8150 750 50  0001 C CNN
	1    8150 950 
	1    0    0    -1  
$EndComp
$Comp
L A5C:INV01 UAC132
U 1 1 60B7E57D
P 9100 6500
F 0 "UAC132" H 9100 6817 50  0000 C CNN
F 1 "INV01" H 9100 6726 50  0000 C CNN
F 2 "" H 9100 6300 50  0001 C CNN
F 3 "" H 9100 6300 50  0001 C CNN
	1    9100 6500
	1    0    0    -1  
$EndComp
$Comp
L A5C:NOR03 UAB89
U 1 1 6030E4E5
P 9750 3550
F 0 "UAB89" H 9750 3867 50  0000 C CNN
F 1 "NOR03" H 9750 3776 50  0000 C CNN
F 2 "" H 9750 3550 50  0001 C CNN
F 3 "" H 9750 3550 50  0001 C CNN
	1    9750 3550
	1    0    0    -1  
$EndComp
$Comp
L A5C:NOR03 UAD79
U 1 1 60B7E457
P 9750 9100
F 0 "UAD79" H 9750 9417 50  0000 C CNN
F 1 "NOR03" H 9750 9326 50  0000 C CNN
F 2 "" H 9750 9100 50  0001 C CNN
F 3 "" H 9750 9100 50  0001 C CNN
	1    9750 9100
	1    0    0    -1  
$EndComp
$Comp
L A5C:DFFCOO UAB111
U 1 1 60441743
P 8050 3450
F 0 "UAB111" H 8050 3815 50  0000 C CNN
F 1 "DFFCOO" H 8050 3724 50  0000 C CNN
F 2 "" H 8050 3450 50  0001 C CNN
F 3 "" H 8050 3450 50  0001 C CNN
	1    8050 3450
	1    0    0    -1  
$EndComp
$Comp
L A5C:DFFCOO UAB63
U 1 1 6044998E
P 8050 4250
F 0 "UAB63" H 8050 4615 50  0000 C CNN
F 1 "DFFCOO" H 8050 4524 50  0000 C CNN
F 2 "" H 8050 4250 50  0001 C CNN
F 3 "" H 8050 4250 50  0001 C CNN
	1    8050 4250
	1    0    0    -1  
$EndComp
$Comp
L A5C:DFFCOO UAD106
U 1 1 60451976
P 8050 5050
F 0 "UAD106" H 8050 5415 50  0000 C CNN
F 1 "DFFCOO" H 8050 5324 50  0000 C CNN
F 2 "" H 8050 5050 50  0001 C CNN
F 3 "" H 8050 5050 50  0001 C CNN
	1    8050 5050
	1    0    0    -1  
$EndComp
$Comp
L A5C:DFFCOO UAD137
U 1 1 60B7E4AC
P 8050 9000
F 0 "UAD137" H 8050 9365 50  0000 C CNN
F 1 "DFFCOO" H 8050 9274 50  0000 C CNN
F 2 "" H 8050 9000 50  0001 C CNN
F 3 "" H 8050 9000 50  0001 C CNN
	1    8050 9000
	1    0    0    -1  
$EndComp
$Comp
L A5C:DFFCOO UAD143
U 1 1 60B7E4B3
P 8050 9800
F 0 "UAD143" H 8050 10165 50  0000 C CNN
F 1 "DFFCOO" H 8050 10074 50  0000 C CNN
F 2 "" H 8050 9800 50  0001 C CNN
F 3 "" H 8050 9800 50  0001 C CNN
	1    8050 9800
	1    0    0    -1  
$EndComp
$Comp
L A5C:DFFCOO UAC156
U 1 1 60B7E4BA
P 8050 10600
F 0 "UAC156" H 8050 10965 50  0000 C CNN
F 1 "DFFCOO" H 8050 10874 50  0000 C CNN
F 2 "" H 8050 10600 50  0001 C CNN
F 3 "" H 8050 10600 50  0001 C CNN
	1    8050 10600
	1    0    0    -1  
$EndComp
$Comp
L A5C:DFFCOO UAA106
U 1 1 60410D66
P 8100 2650
F 0 "UAA106" H 8100 3015 50  0000 C CNN
F 1 "DFFCOO" H 8100 2924 50  0000 C CNN
F 2 "" H 8100 2650 50  0001 C CNN
F 3 "" H 8100 2650 50  0001 C CNN
	1    8100 2650
	1    0    0    -1  
$EndComp
$Comp
L A5C:DFFCOO UAD124
U 1 1 60B7E4A5
P 8100 8200
F 0 "UAD124" H 8100 8565 50  0000 C CNN
F 1 "DFFCOO" H 8100 8474 50  0000 C CNN
F 2 "" H 8100 8200 50  0001 C CNN
F 3 "" H 8100 8200 50  0001 C CNN
	1    8100 8200
	1    0    0    -1  
$EndComp
$Comp
L A5C:NOR04 UAB95
U 1 1 603102B7
P 9750 4200
F 0 "UAB95" H 9750 4542 50  0000 C CNN
F 1 "NOR04" H 9750 4451 50  0000 C CNN
F 2 "" H 9750 4200 50  0001 C CNN
F 3 "" H 9750 4200 50  0001 C CNN
	1    9750 4200
	1    0    0    -1  
$EndComp
$Comp
L A5C:NOR04 UAD151
U 1 1 60B7E463
P 9750 9750
F 0 "UAD151" H 9750 10092 50  0000 C CNN
F 1 "NOR04" H 9750 10001 50  0000 C CNN
F 2 "" H 9750 9750 50  0001 C CNN
F 3 "" H 9750 9750 50  0001 C CNN
	1    9750 9750
	1    0    0    -1  
$EndComp
$Comp
L A5C:NAND05 UAB116
U 1 1 606D2529
P 9850 5800
F 0 "UAB116" H 9875 6190 50  0000 C CNN
F 1 "NAND05" H 9875 6099 50  0000 C CNN
F 2 "" H 9850 5500 50  0001 C CNN
F 3 "" H 9850 5500 50  0001 C CNN
	1    9850 5800
	1    0    0    -1  
$EndComp
$Comp
L A5C:AOI22 UAB76
U 1 1 603FB984
P 7150 3300
F 0 "UAB76" H 7175 3617 50  0000 C CNN
F 1 "AOI22" H 7175 3526 50  0000 C CNN
F 2 "" H 7300 3300 50  0001 C CNN
F 3 "" H 7300 3300 50  0001 C CNN
	1    7150 3300
	1    0    0    -1  
$EndComp
$Comp
L A5C:AOI22 UAB108
U 1 1 603FC465
P 7150 4100
F 0 "UAB108" H 7175 4417 50  0000 C CNN
F 1 "AOI22" H 7175 4326 50  0000 C CNN
F 2 "" H 7300 4100 50  0001 C CNN
F 3 "" H 7300 4100 50  0001 C CNN
	1    7150 4100
	1    0    0    -1  
$EndComp
$Comp
L A5C:AOI22 UAC102
U 1 1 603FCEB0
P 7150 4900
F 0 "UAC102" H 7175 5217 50  0000 C CNN
F 1 "AOI22" H 7175 5126 50  0000 C CNN
F 2 "" H 7300 4900 50  0001 C CNN
F 3 "" H 7300 4900 50  0001 C CNN
	1    7150 4900
	1    0    0    -1  
$EndComp
$Comp
L A5C:AOI22 UAD133
U 1 1 60B7E493
P 7150 8850
F 0 "UAD133" H 7175 9167 50  0000 C CNN
F 1 "AOI22" H 7175 9076 50  0000 C CNN
F 2 "" H 7300 8850 50  0001 C CNN
F 3 "" H 7300 8850 50  0001 C CNN
	1    7150 8850
	1    0    0    -1  
$EndComp
$Comp
L A5C:AOI22 UAD154
U 1 1 60B7E499
P 7150 9650
F 0 "UAD154" H 7175 9967 50  0000 C CNN
F 1 "AOI22" H 7175 9876 50  0000 C CNN
F 2 "" H 7300 9650 50  0001 C CNN
F 3 "" H 7300 9650 50  0001 C CNN
	1    7150 9650
	1    0    0    -1  
$EndComp
$Comp
L A5C:AOI22 UAD160
U 1 1 60B7E49F
P 7150 10450
F 0 "UAD160" H 7175 10767 50  0000 C CNN
F 1 "AOI22" H 7175 10676 50  0000 C CNN
F 2 "" H 7300 10450 50  0001 C CNN
F 3 "" H 7300 10450 50  0001 C CNN
	1    7150 10450
	1    0    0    -1  
$EndComp
$Comp
L A5C:AOI22 UAB105
U 1 1 603FB1CD
P 7200 2500
F 0 "UAB105" H 7225 2817 50  0000 C CNN
F 1 "AOI22" H 7225 2726 50  0000 C CNN
F 2 "" H 7350 2500 50  0001 C CNN
F 3 "" H 7350 2500 50  0001 C CNN
	1    7200 2500
	1    0    0    -1  
$EndComp
$Comp
L A5C:AOI22 UAD114
U 1 1 60B7E48D
P 7200 8050
F 0 "UAD114" H 7225 8367 50  0000 C CNN
F 1 "AOI22" H 7225 8276 50  0000 C CNN
F 2 "" H 7350 8050 50  0001 C CNN
F 3 "" H 7350 8050 50  0001 C CNN
	1    7200 8050
	1    0    0    -1  
$EndComp
$Comp
L A5C:NOR05 UAB98
U 1 1 603112EF
P 9750 4950
F 0 "UAB98" H 9825 5365 50  0000 C CNN
F 1 "NOR05" H 9825 5274 50  0000 C CNN
F 2 "" H 9750 5000 50  0001 C CNN
F 3 "" H 9750 5000 50  0001 C CNN
	1    9750 4950
	1    0    0    -1  
$EndComp
$Comp
L A5C:NOR05 UAD148
U 1 1 60B7E469
P 9750 10500
F 0 "UAD148" H 9825 10915 50  0000 C CNN
F 1 "NOR05" H 9825 10824 50  0000 C CNN
F 2 "" H 9750 10550 50  0001 C CNN
F 3 "" H 9750 10550 50  0001 C CNN
	1    9750 10500
	1    0    0    -1  
$EndComp
Text HLabel 7600 6200 0    50   Input ~ 0
~CLK4M
Wire Wire Line
	7600 6200 7700 6200
Connection ~ 7700 6200
Wire Wire Line
	7700 6200 7700 8300
Wire Bus Line
	5300 5850 5300 6200
Wire Bus Line
	5300 6350 5300 6700
$EndSCHEMATC
