EESchema Schematic File Version 4
EELAYER 30 0
EELAYER END
$Descr A3 11693 16535 portrait
encoding utf-8
Sheet 52 69
Title ""
Date "2020-11-26"
Rev ""
Comp ""
Comment1 "Licence: CC-BY"
Comment2 "Author: Loïc *WydD* Petit"
Comment3 ""
Comment4 ""
$EndDescr
Connection ~ 5500 2800
Connection ~ 5600 2900
Connection ~ 5700 3000
Connection ~ 5800 3100
Connection ~ 5900 3200
Connection ~ 6000 3300
Connection ~ 6100 3400
Connection ~ 6200 3500
Connection ~ 4400 4100
Connection ~ 4500 5800
Connection ~ 7150 2550
Connection ~ 4400 3750
Connection ~ 4500 5450
Connection ~ 4600 3850
Connection ~ 4700 5550
Connection ~ 5300 1750
Connection ~ 5500 6200
Connection ~ 5600 6300
Connection ~ 5700 6400
Connection ~ 5800 6500
Connection ~ 5900 6600
Connection ~ 6000 6700
Connection ~ 6100 6800
Connection ~ 6200 6900
Connection ~ 7150 5950
Connection ~ 4400 7150
Connection ~ 4400 7500
Connection ~ 4600 7250
Connection ~ 4500 8850
Connection ~ 4500 9200
Connection ~ 4700 8950
Connection ~ 6450 3900
Connection ~ 6550 3800
Connection ~ 6650 3650
Connection ~ 6750 4050
Connection ~ 3750 1550
Connection ~ 3650 1450
Connection ~ 3250 850 
Connection ~ 5500 9600
Connection ~ 5600 9700
Connection ~ 5700 9800
Connection ~ 5800 9900
Connection ~ 5900 10000
Connection ~ 6000 10100
Connection ~ 6100 10200
Connection ~ 6200 10300
Connection ~ 4400 10900
Connection ~ 4500 12600
Connection ~ 7150 9350
Connection ~ 5500 13000
Connection ~ 5600 13100
Connection ~ 5700 13200
Connection ~ 5800 13300
Connection ~ 5900 13400
Connection ~ 6000 13500
Connection ~ 6100 13600
Connection ~ 6200 13700
Connection ~ 7150 12750
Connection ~ 4400 13950
Connection ~ 4500 15650
Connection ~ 4400 10550
Connection ~ 4500 12250
Connection ~ 4600 10650
Connection ~ 4700 12350
Connection ~ 6450 10700
Connection ~ 6450 7300
Connection ~ 6550 10600
Connection ~ 6550 7200
Connection ~ 6650 10450
Connection ~ 6650 7050
Connection ~ 6750 7450
Connection ~ 6750 10850
Connection ~ 7850 6300
Connection ~ 7950 6500
Connection ~ 7850 9700
Connection ~ 7950 9900
Connection ~ 7850 13100
Connection ~ 7950 13300
Connection ~ 9000 4600
Connection ~ 7850 4150
Connection ~ 7950 4600
Connection ~ 3100 3950
Connection ~ 3100 7350
Connection ~ 3100 10750
Connection ~ 3100 14150
Connection ~ 5800 2300
Connection ~ 3750 2300
Connection ~ 1850 3000
Connection ~ 4500 4200
NoConn ~ 7600 2900
NoConn ~ 7600 3000
NoConn ~ 7600 3100
NoConn ~ 7600 3200
NoConn ~ 7600 3300
NoConn ~ 7600 3400
NoConn ~ 7600 6300
NoConn ~ 7600 6400
NoConn ~ 7600 6500
NoConn ~ 7600 6600
NoConn ~ 7600 6700
NoConn ~ 7600 6800
NoConn ~ 7600 9700
NoConn ~ 7600 9800
NoConn ~ 7600 9900
NoConn ~ 7600 10000
NoConn ~ 7600 10100
NoConn ~ 7600 10200
NoConn ~ 7600 13100
NoConn ~ 7600 13200
NoConn ~ 7600 13300
NoConn ~ 7600 13400
NoConn ~ 7600 13500
NoConn ~ 7600 13600
Entry Wire Line
	3100 2900 3200 2800
Entry Wire Line
	3100 3000 3200 2900
Entry Wire Line
	3100 3100 3200 3000
Entry Wire Line
	3100 3200 3200 3100
Entry Wire Line
	3100 3300 3200 3200
Entry Wire Line
	3100 3400 3200 3300
Entry Wire Line
	3100 3500 3200 3400
Entry Wire Line
	3100 3600 3200 3500
Entry Wire Line
	3100 4400 3200 4500
Entry Wire Line
	3100 4500 3200 4600
Entry Wire Line
	3100 4600 3200 4700
Entry Wire Line
	3100 4700 3200 4800
Entry Wire Line
	3100 4800 3200 4900
Entry Wire Line
	3100 4900 3200 5000
Entry Wire Line
	3100 5000 3200 5100
Entry Wire Line
	3100 5100 3200 5200
Entry Wire Line
	3100 6300 3200 6200
Entry Wire Line
	3100 6400 3200 6300
Entry Wire Line
	3100 6500 3200 6400
Entry Wire Line
	3100 6600 3200 6500
Entry Wire Line
	3100 6700 3200 6600
Entry Wire Line
	3100 6800 3200 6700
Entry Wire Line
	3100 6900 3200 6800
Entry Wire Line
	3100 7000 3200 6900
Entry Wire Line
	3100 7800 3200 7900
Entry Wire Line
	3100 7900 3200 8000
Entry Wire Line
	3100 8000 3200 8100
Entry Wire Line
	3100 8100 3200 8200
Entry Wire Line
	3100 8200 3200 8300
Entry Wire Line
	3100 8300 3200 8400
Entry Wire Line
	3100 8400 3200 8500
Entry Wire Line
	3100 8500 3200 8600
Entry Wire Line
	3100 9700 3200 9600
Entry Wire Line
	3100 9800 3200 9700
Entry Wire Line
	3100 9900 3200 9800
Entry Wire Line
	3100 10000 3200 9900
Entry Wire Line
	3100 10100 3200 10000
Entry Wire Line
	3100 10200 3200 10100
Entry Wire Line
	3100 10300 3200 10200
Entry Wire Line
	3100 10400 3200 10300
Entry Wire Line
	3100 11200 3200 11300
Entry Wire Line
	3100 11300 3200 11400
Entry Wire Line
	3100 11400 3200 11500
Entry Wire Line
	3100 11500 3200 11600
Entry Wire Line
	3100 11600 3200 11700
Entry Wire Line
	3100 11700 3200 11800
Entry Wire Line
	3100 11800 3200 11900
Entry Wire Line
	3100 11900 3200 12000
Entry Wire Line
	3100 13100 3200 13000
Entry Wire Line
	3100 13200 3200 13100
Entry Wire Line
	3100 13300 3200 13200
Entry Wire Line
	3100 13400 3200 13300
Entry Wire Line
	3100 13500 3200 13400
Entry Wire Line
	3100 13600 3200 13500
Entry Wire Line
	3100 13700 3200 13600
Entry Wire Line
	3100 13800 3200 13700
Entry Wire Line
	3100 14600 3200 14700
Entry Wire Line
	3100 14700 3200 14800
Entry Wire Line
	3100 14800 3200 14900
Entry Wire Line
	3100 14900 3200 15000
Entry Wire Line
	3100 15000 3200 15100
Entry Wire Line
	3100 15100 3200 15200
Entry Wire Line
	3100 15200 3200 15300
Entry Wire Line
	3100 15300 3200 15400
Wire Wire Line
	750  3200 750  4200
Wire Wire Line
	750  3200 1250 3200
Wire Wire Line
	750  4200 4500 4200
Wire Wire Line
	1750 3000 1850 3000
Wire Wire Line
	1850 2350 3200 2350
Wire Wire Line
	1850 3000 1850 2350
Wire Wire Line
	1850 3000 2000 3000
Wire Wire Line
	2000 3650 2000 3200
Wire Wire Line
	2500 3000 3000 3000
Wire Wire Line
	3250 850  3150 850 
Wire Wire Line
	3250 1350 3250 850 
Wire Wire Line
	3500 3750 3500 4100
Wire Wire Line
	3500 3750 3700 3750
Wire Wire Line
	3500 4100 4400 4100
Wire Wire Line
	3500 5450 3500 5800
Wire Wire Line
	3500 5450 3700 5450
Wire Wire Line
	3500 5800 4500 5800
Wire Wire Line
	3500 7150 3500 7500
Wire Wire Line
	3500 7150 3700 7150
Wire Wire Line
	3500 7500 4400 7500
Wire Wire Line
	3500 8850 3500 9200
Wire Wire Line
	3500 8850 3700 8850
Wire Wire Line
	3500 9200 4500 9200
Wire Wire Line
	3500 10550 3500 10900
Wire Wire Line
	3500 10550 3700 10550
Wire Wire Line
	3500 10900 4400 10900
Wire Wire Line
	3500 12250 3500 12600
Wire Wire Line
	3500 12250 3700 12250
Wire Wire Line
	3500 12600 4500 12600
Wire Wire Line
	3500 13950 3500 14300
Wire Wire Line
	3500 13950 3700 13950
Wire Wire Line
	3500 14300 4400 14300
Wire Wire Line
	3500 15650 3500 16000
Wire Wire Line
	3500 15650 3700 15650
Wire Wire Line
	3500 16000 4500 16000
Wire Wire Line
	3650 950  3850 950 
Wire Wire Line
	3650 1450 3150 1450
Wire Wire Line
	3650 1450 3650 950 
Wire Wire Line
	3700 2800 3200 2800
Wire Wire Line
	3700 2900 3200 2900
Wire Wire Line
	3700 3000 3200 3000
Wire Wire Line
	3700 3100 3200 3100
Wire Wire Line
	3700 3200 3200 3200
Wire Wire Line
	3700 3300 3200 3300
Wire Wire Line
	3700 3400 3200 3400
Wire Wire Line
	3700 3500 3200 3500
Wire Wire Line
	3700 4500 3200 4500
Wire Wire Line
	3700 4600 3200 4600
Wire Wire Line
	3700 4700 3200 4700
Wire Wire Line
	3700 4800 3200 4800
Wire Wire Line
	3700 4900 3200 4900
Wire Wire Line
	3700 5000 3200 5000
Wire Wire Line
	3700 5100 3200 5100
Wire Wire Line
	3700 5200 3200 5200
Wire Wire Line
	3700 6200 3200 6200
Wire Wire Line
	3700 6300 3200 6300
Wire Wire Line
	3700 6400 3200 6400
Wire Wire Line
	3700 6500 3200 6500
Wire Wire Line
	3700 6600 3200 6600
Wire Wire Line
	3700 6700 3200 6700
Wire Wire Line
	3700 6800 3200 6800
Wire Wire Line
	3700 6900 3200 6900
Wire Wire Line
	3700 7900 3200 7900
Wire Wire Line
	3700 8000 3200 8000
Wire Wire Line
	3700 8100 3200 8100
Wire Wire Line
	3700 8200 3200 8200
Wire Wire Line
	3700 8300 3200 8300
Wire Wire Line
	3700 8400 3200 8400
Wire Wire Line
	3700 8500 3200 8500
Wire Wire Line
	3700 8600 3200 8600
Wire Wire Line
	3700 9600 3200 9600
Wire Wire Line
	3700 9700 3200 9700
Wire Wire Line
	3700 9800 3200 9800
Wire Wire Line
	3700 9900 3200 9900
Wire Wire Line
	3700 10000 3200 10000
Wire Wire Line
	3700 10100 3200 10100
Wire Wire Line
	3700 10200 3200 10200
Wire Wire Line
	3700 10300 3200 10300
Wire Wire Line
	3700 11300 3200 11300
Wire Wire Line
	3700 11400 3200 11400
Wire Wire Line
	3700 11500 3200 11500
Wire Wire Line
	3700 11600 3200 11600
Wire Wire Line
	3700 11700 3200 11700
Wire Wire Line
	3700 11800 3200 11800
Wire Wire Line
	3700 11900 3200 11900
Wire Wire Line
	3700 12000 3200 12000
Wire Wire Line
	3700 13000 3200 13000
Wire Wire Line
	3700 13100 3200 13100
Wire Wire Line
	3700 13200 3200 13200
Wire Wire Line
	3700 13300 3200 13300
Wire Wire Line
	3700 13400 3200 13400
Wire Wire Line
	3700 13500 3200 13500
Wire Wire Line
	3700 13600 3200 13600
Wire Wire Line
	3700 13700 3200 13700
Wire Wire Line
	3700 14700 3200 14700
Wire Wire Line
	3700 14800 3200 14800
Wire Wire Line
	3700 14900 3200 14900
Wire Wire Line
	3700 15000 3200 15000
Wire Wire Line
	3700 15100 3200 15100
Wire Wire Line
	3700 15200 3200 15200
Wire Wire Line
	3700 15300 3200 15300
Wire Wire Line
	3700 15400 3200 15400
Wire Wire Line
	3750 1050 3850 1050
Wire Wire Line
	3750 1550 3150 1550
Wire Wire Line
	3750 1550 3750 1050
Wire Wire Line
	3750 1900 3750 2300
Wire Wire Line
	3850 1350 3250 1350
Wire Wire Line
	3850 1450 3650 1450
Wire Wire Line
	3850 1550 3750 1550
Wire Wire Line
	4300 2800 4800 2800
Wire Wire Line
	4300 2900 4800 2900
Wire Wire Line
	4300 3000 4800 3000
Wire Wire Line
	4300 3100 4800 3100
Wire Wire Line
	4300 3200 4800 3200
Wire Wire Line
	4300 3300 4800 3300
Wire Wire Line
	4300 3400 4800 3400
Wire Wire Line
	4300 3500 4800 3500
Wire Wire Line
	4300 4500 4800 4500
Wire Wire Line
	4300 4600 4800 4600
Wire Wire Line
	4300 4700 4800 4700
Wire Wire Line
	4300 4800 4800 4800
Wire Wire Line
	4300 4900 4800 4900
Wire Wire Line
	4300 5000 4800 5000
Wire Wire Line
	4300 5100 4800 5100
Wire Wire Line
	4300 5200 4800 5200
Wire Wire Line
	4300 6200 4800 6200
Wire Wire Line
	4300 6300 4800 6300
Wire Wire Line
	4300 6400 4800 6400
Wire Wire Line
	4300 6500 4800 6500
Wire Wire Line
	4300 6600 4800 6600
Wire Wire Line
	4300 6700 4800 6700
Wire Wire Line
	4300 6800 4800 6800
Wire Wire Line
	4300 6900 4800 6900
Wire Wire Line
	4300 7900 4800 7900
Wire Wire Line
	4300 8000 4800 8000
Wire Wire Line
	4300 8100 4800 8100
Wire Wire Line
	4300 8200 4800 8200
Wire Wire Line
	4300 8300 4800 8300
Wire Wire Line
	4300 8400 4800 8400
Wire Wire Line
	4300 8500 4800 8500
Wire Wire Line
	4300 8600 4800 8600
Wire Wire Line
	4300 9600 4800 9600
Wire Wire Line
	4300 9700 4800 9700
Wire Wire Line
	4300 9800 4800 9800
Wire Wire Line
	4300 9900 4800 9900
Wire Wire Line
	4300 10000 4800 10000
Wire Wire Line
	4300 10100 4800 10100
Wire Wire Line
	4300 10200 4800 10200
Wire Wire Line
	4300 10300 4800 10300
Wire Wire Line
	4300 11300 4800 11300
Wire Wire Line
	4300 11400 4800 11400
Wire Wire Line
	4300 11500 4800 11500
Wire Wire Line
	4300 11600 4800 11600
Wire Wire Line
	4300 11700 4800 11700
Wire Wire Line
	4300 11800 4800 11800
Wire Wire Line
	4300 11900 4800 11900
Wire Wire Line
	4300 12000 4800 12000
Wire Wire Line
	4300 13000 4800 13000
Wire Wire Line
	4300 13100 4800 13100
Wire Wire Line
	4300 13200 4800 13200
Wire Wire Line
	4300 13300 4800 13300
Wire Wire Line
	4300 13400 4800 13400
Wire Wire Line
	4300 13500 4800 13500
Wire Wire Line
	4300 13600 4800 13600
Wire Wire Line
	4300 13700 4800 13700
Wire Wire Line
	4300 14700 4800 14700
Wire Wire Line
	4300 14800 4800 14800
Wire Wire Line
	4300 14900 4800 14900
Wire Wire Line
	4300 15000 4800 15000
Wire Wire Line
	4300 15100 4800 15100
Wire Wire Line
	4300 15200 4800 15200
Wire Wire Line
	4300 15300 4800 15300
Wire Wire Line
	4300 15400 4800 15400
Wire Wire Line
	4350 2300 4600 2300
Wire Wire Line
	4400 1450 4400 3750
Wire Wire Line
	4400 3750 4400 4100
Wire Wire Line
	4400 3750 4800 3750
Wire Wire Line
	4400 4100 4400 7150
Wire Wire Line
	4400 7150 4400 7500
Wire Wire Line
	4400 7150 4800 7150
Wire Wire Line
	4400 7500 4400 10550
Wire Wire Line
	4400 10550 4400 10900
Wire Wire Line
	4400 10550 4800 10550
Wire Wire Line
	4400 10900 4400 13950
Wire Wire Line
	4400 13950 4400 14300
Wire Wire Line
	4400 13950 4800 13950
Wire Wire Line
	4500 950  4400 950 
Wire Wire Line
	4500 950  4500 4200
Wire Wire Line
	4500 4200 4500 5450
Wire Wire Line
	4500 5450 4500 5800
Wire Wire Line
	4500 5450 4800 5450
Wire Wire Line
	4500 5800 4500 8850
Wire Wire Line
	4500 8850 4500 9200
Wire Wire Line
	4500 8850 4800 8850
Wire Wire Line
	4500 9200 4500 12250
Wire Wire Line
	4500 12250 4500 12600
Wire Wire Line
	4500 12250 4800 12250
Wire Wire Line
	4500 12600 4500 15650
Wire Wire Line
	4500 15650 4500 16000
Wire Wire Line
	4500 15650 4800 15650
Wire Wire Line
	4600 2300 4600 3850
Wire Wire Line
	4600 3850 4600 7250
Wire Wire Line
	4600 7250 4600 10650
Wire Wire Line
	4600 10650 4600 14050
Wire Wire Line
	4700 1900 3750 1900
Wire Wire Line
	4700 1900 4700 5550
Wire Wire Line
	4700 5550 4700 8950
Wire Wire Line
	4700 8950 4700 12350
Wire Wire Line
	4700 12350 4700 15750
Wire Wire Line
	4800 1750 5300 1750
Wire Wire Line
	4800 3850 4600 3850
Wire Wire Line
	4800 5550 4700 5550
Wire Wire Line
	4800 7250 4600 7250
Wire Wire Line
	4800 8950 4700 8950
Wire Wire Line
	4800 10650 4600 10650
Wire Wire Line
	4800 12350 4700 12350
Wire Wire Line
	4800 14050 4600 14050
Wire Wire Line
	4800 15750 4700 15750
Wire Wire Line
	5300 2200 5300 1750
Wire Wire Line
	5350 2300 5800 2300
Wire Wire Line
	5400 2800 5500 2800
Wire Wire Line
	5400 2900 5600 2900
Wire Wire Line
	5400 3000 5700 3000
Wire Wire Line
	5400 3100 5800 3100
Wire Wire Line
	5400 3200 5900 3200
Wire Wire Line
	5400 3300 6000 3300
Wire Wire Line
	5400 3400 6100 3400
Wire Wire Line
	5400 3500 6200 3500
Wire Wire Line
	5400 4500 5500 4500
Wire Wire Line
	5400 4700 5700 4700
Wire Wire Line
	5400 4900 5900 4900
Wire Wire Line
	5400 5100 6100 5100
Wire Wire Line
	5400 6200 5500 6200
Wire Wire Line
	5400 6300 5600 6300
Wire Wire Line
	5400 6400 5700 6400
Wire Wire Line
	5400 6500 5800 6500
Wire Wire Line
	5400 6600 5900 6600
Wire Wire Line
	5400 6700 6000 6700
Wire Wire Line
	5400 6800 6100 6800
Wire Wire Line
	5400 6900 6200 6900
Wire Wire Line
	5400 7900 5500 7900
Wire Wire Line
	5400 8100 5700 8100
Wire Wire Line
	5400 8300 5900 8300
Wire Wire Line
	5400 8500 6100 8500
Wire Wire Line
	5400 9600 5500 9600
Wire Wire Line
	5400 9700 5600 9700
Wire Wire Line
	5400 9800 5700 9800
Wire Wire Line
	5400 9900 5800 9900
Wire Wire Line
	5400 10000 5900 10000
Wire Wire Line
	5400 10100 6000 10100
Wire Wire Line
	5400 10200 6100 10200
Wire Wire Line
	5400 10300 6200 10300
Wire Wire Line
	5400 11300 5500 11300
Wire Wire Line
	5400 11500 5700 11500
Wire Wire Line
	5400 11700 5900 11700
Wire Wire Line
	5400 11900 6100 11900
Wire Wire Line
	5400 13000 5500 13000
Wire Wire Line
	5400 13100 5600 13100
Wire Wire Line
	5400 13200 5700 13200
Wire Wire Line
	5400 13300 5800 13300
Wire Wire Line
	5400 13400 5900 13400
Wire Wire Line
	5400 13500 6000 13500
Wire Wire Line
	5400 13600 6100 13600
Wire Wire Line
	5400 13700 6200 13700
Wire Wire Line
	5400 14700 5500 14700
Wire Wire Line
	5400 14900 5700 14900
Wire Wire Line
	5400 15100 5900 15100
Wire Wire Line
	5400 15300 6100 15300
Wire Wire Line
	5500 2800 6800 2800
Wire Wire Line
	5500 4500 5500 2800
Wire Wire Line
	5500 6200 6800 6200
Wire Wire Line
	5500 7900 5500 6200
Wire Wire Line
	5500 9600 6800 9600
Wire Wire Line
	5500 11300 5500 9600
Wire Wire Line
	5500 13000 6800 13000
Wire Wire Line
	5500 14700 5500 13000
Wire Wire Line
	5600 2900 5600 4600
Wire Wire Line
	5600 2900 6800 2900
Wire Wire Line
	5600 4600 5400 4600
Wire Wire Line
	5600 6300 5600 8000
Wire Wire Line
	5600 6300 6800 6300
Wire Wire Line
	5600 8000 5400 8000
Wire Wire Line
	5600 9700 5600 11400
Wire Wire Line
	5600 9700 6800 9700
Wire Wire Line
	5600 11400 5400 11400
Wire Wire Line
	5600 13100 5600 14800
Wire Wire Line
	5600 13100 6800 13100
Wire Wire Line
	5600 14800 5400 14800
Wire Wire Line
	5700 3000 6800 3000
Wire Wire Line
	5700 4700 5700 3000
Wire Wire Line
	5700 6400 6800 6400
Wire Wire Line
	5700 8100 5700 6400
Wire Wire Line
	5700 9800 6800 9800
Wire Wire Line
	5700 11500 5700 9800
Wire Wire Line
	5700 13200 6800 13200
Wire Wire Line
	5700 14900 5700 13200
Wire Wire Line
	5800 1850 5800 2300
Wire Wire Line
	5800 1850 5900 1850
Wire Wire Line
	5800 3100 5800 4800
Wire Wire Line
	5800 3100 6800 3100
Wire Wire Line
	5800 4800 5400 4800
Wire Wire Line
	5800 6500 5800 8200
Wire Wire Line
	5800 6500 6800 6500
Wire Wire Line
	5800 8200 5400 8200
Wire Wire Line
	5800 9900 5800 11600
Wire Wire Line
	5800 9900 6800 9900
Wire Wire Line
	5800 11600 5400 11600
Wire Wire Line
	5800 13300 5800 15000
Wire Wire Line
	5800 13300 6800 13300
Wire Wire Line
	5800 15000 5400 15000
Wire Wire Line
	5900 2200 5300 2200
Wire Wire Line
	5900 2300 5800 2300
Wire Wire Line
	5900 3200 6800 3200
Wire Wire Line
	5900 4900 5900 3200
Wire Wire Line
	5900 6600 6800 6600
Wire Wire Line
	5900 8300 5900 6600
Wire Wire Line
	5900 10000 6800 10000
Wire Wire Line
	5900 11700 5900 10000
Wire Wire Line
	5900 13400 6800 13400
Wire Wire Line
	5900 15100 5900 13400
Wire Wire Line
	6000 3300 6000 5000
Wire Wire Line
	6000 3300 6800 3300
Wire Wire Line
	6000 5000 5400 5000
Wire Wire Line
	6000 6700 6000 8400
Wire Wire Line
	6000 6700 6800 6700
Wire Wire Line
	6000 8400 5400 8400
Wire Wire Line
	6000 10100 6000 11800
Wire Wire Line
	6000 10100 6800 10100
Wire Wire Line
	6000 11800 5400 11800
Wire Wire Line
	6000 13500 6000 15200
Wire Wire Line
	6000 13500 6800 13500
Wire Wire Line
	6000 15200 5400 15200
Wire Wire Line
	6100 3400 6800 3400
Wire Wire Line
	6100 5100 6100 3400
Wire Wire Line
	6100 6800 6800 6800
Wire Wire Line
	6100 8500 6100 6800
Wire Wire Line
	6100 10200 6800 10200
Wire Wire Line
	6100 11900 6100 10200
Wire Wire Line
	6100 13600 6800 13600
Wire Wire Line
	6100 15300 6100 13600
Wire Wire Line
	6200 3500 6200 5200
Wire Wire Line
	6200 3500 6800 3500
Wire Wire Line
	6200 5200 5400 5200
Wire Wire Line
	6200 6900 6200 8600
Wire Wire Line
	6200 6900 6800 6900
Wire Wire Line
	6200 8600 5400 8600
Wire Wire Line
	6200 10300 6200 12000
Wire Wire Line
	6200 10300 6800 10300
Wire Wire Line
	6200 12000 5400 12000
Wire Wire Line
	6200 13700 6200 15400
Wire Wire Line
	6200 13700 6800 13700
Wire Wire Line
	6200 15400 5400 15400
Wire Wire Line
	6450 1800 6550 1800
Wire Wire Line
	6450 2250 6450 3900
Wire Wire Line
	6450 3900 6450 7300
Wire Wire Line
	6450 3900 6800 3900
Wire Wire Line
	6450 7300 6800 7300
Wire Wire Line
	6450 10700 6450 7300
Wire Wire Line
	6450 10700 6450 14100
Wire Wire Line
	6450 10700 6800 10700
Wire Wire Line
	6450 14100 6800 14100
Wire Wire Line
	6550 1800 6550 3800
Wire Wire Line
	6550 3800 6550 7200
Wire Wire Line
	6550 7200 6550 10600
Wire Wire Line
	6550 10600 6550 14000
Wire Wire Line
	6650 1600 6650 3650
Wire Wire Line
	6650 1600 7600 1600
Wire Wire Line
	6650 3650 6650 7050
Wire Wire Line
	6650 10450 6650 7050
Wire Wire Line
	6650 10450 6650 13850
Wire Wire Line
	6750 2150 6850 2150
Wire Wire Line
	6750 4050 6750 2150
Wire Wire Line
	6750 4050 6750 7450
Wire Wire Line
	6750 7450 6750 10850
Wire Wire Line
	6750 10850 6750 14250
Wire Wire Line
	6800 3650 6650 3650
Wire Wire Line
	6800 3800 6550 3800
Wire Wire Line
	6800 4050 6750 4050
Wire Wire Line
	6800 7050 6650 7050
Wire Wire Line
	6800 7200 6550 7200
Wire Wire Line
	6800 7450 6750 7450
Wire Wire Line
	6800 10450 6650 10450
Wire Wire Line
	6800 10600 6550 10600
Wire Wire Line
	6800 10850 6750 10850
Wire Wire Line
	6800 13850 6650 13850
Wire Wire Line
	6800 14000 6550 14000
Wire Wire Line
	6800 14250 6750 14250
Wire Wire Line
	7150 2550 7250 2550
Wire Wire Line
	7150 5950 7250 5950
Wire Wire Line
	7150 9350 7250 9350
Wire Wire Line
	7150 12750 7250 12750
Wire Wire Line
	7700 3000 7700 3500
Wire Wire Line
	7700 3000 8050 3000
Wire Wire Line
	7700 3500 7600 3500
Wire Wire Line
	7700 6400 7700 6900
Wire Wire Line
	7700 6900 7600 6900
Wire Wire Line
	7700 9800 7700 10300
Wire Wire Line
	7700 10300 7600 10300
Wire Wire Line
	7700 13200 7700 13700
Wire Wire Line
	7700 13700 7600 13700
Wire Wire Line
	7850 2900 7850 4150
Wire Wire Line
	7850 4150 7850 6300
Wire Wire Line
	7850 6300 7850 9700
Wire Wire Line
	7850 9700 7850 13100
Wire Wire Line
	7850 13100 7850 13950
Wire Wire Line
	7850 13100 8050 13100
Wire Wire Line
	7950 3100 7950 4600
Wire Wire Line
	7950 3100 8050 3100
Wire Wire Line
	7950 4600 7950 6500
Wire Wire Line
	7950 6500 7950 9900
Wire Wire Line
	7950 9900 7950 13300
Wire Wire Line
	7950 13300 7950 13950
Wire Wire Line
	8050 2800 7600 2800
Wire Wire Line
	8050 2900 7850 2900
Wire Wire Line
	8050 6200 7600 6200
Wire Wire Line
	8050 6300 7850 6300
Wire Wire Line
	8050 6400 7700 6400
Wire Wire Line
	8050 6500 7950 6500
Wire Wire Line
	8050 9600 7600 9600
Wire Wire Line
	8050 9700 7850 9700
Wire Wire Line
	8050 9800 7700 9800
Wire Wire Line
	8050 9900 7950 9900
Wire Wire Line
	8050 13000 7600 13000
Wire Wire Line
	8050 13200 7700 13200
Wire Wire Line
	8050 13300 7950 13300
Wire Wire Line
	8200 1600 8400 1600
Wire Wire Line
	8400 4600 7950 4600
Wire Wire Line
	9000 4150 7850 4150
Wire Wire Line
	9000 4600 9000 4150
Wire Wire Line
	9600 4600 10100 4600
Wire Bus Line
	3100 3950 2800 3950
Wire Bus Line
	3100 7350 2800 7350
Wire Bus Line
	3100 10750 2800 10750
Wire Bus Line
	3100 14150 2800 14150
Text Notes 800  8250 0    50   ~ 0
TOP MATRIX BUS\n0: MAIN-~RESETI\n1: CLK8M\n2: UBD337-Q (SERIAL-CHNL)\n3: UAA254-Q (SERIAL-LOAD)\n4: UBD383-Q (GFX-CHNL)\n\n5: BPD0 (P129)\n6: BPD1 (P130)\n7: BPD2 (P131)\n8: BPD3 (P132)\n9: BPD4 (P133)\n10: BPD5 (P134)\n11: BPD6 (P135)\n12: BPD7 (P136)\n\n13: APD0 (P137)\n14: APD1 (P138)\n15: APD2 (P139)\n16: APD3 (P140)\n17: APD4 (P141)\n18: APD5 (P142)\n19: APD6 (P143)\n20: APD7 (P144)\n\n21: DPD0 (P145)\n22: DPD1 (P146)\n23: DPD2 (P147)\n24: DPD3 (P148)\n25: DPD4 (P149)\n26: DPD5 (P150)\n27: DPD6 (P151)\n28: DPD7 (P152)\n\n29: CPD0 (P137)\n30: CPD1 (P138)\n31: CPD2 (P139)\n32: CPD3 (P140)\n33: CPD4 (P141)\n34: CPD5 (P142)\n35: CPD6 (P143)\n36: CPD7 (P144)
Text Notes 2050 1500 0    50   ~ 0
9, 11\nLoop at 16
Text Notes 2100 900  0    50   ~ 0
2-3\nLoop at 4
Text Notes 2100 2300 0    50   ~ 0
8-15\nLoop at 16
Text Notes 4800 2200 0    50   ~ 0
3\nLoop at 8
Text Label 2550 3000 0    50   ~ 0
XSEL-SYNC
Text Label 3350 9600 0    50   ~ 0
APD0
Text Label 3350 9700 0    50   ~ 0
APD1
Text Label 3350 9800 0    50   ~ 0
APD2
Text Label 3350 9900 0    50   ~ 0
APD3
Text Label 3350 10000 0    50   ~ 0
APD4
Text Label 3350 10100 0    50   ~ 0
APD5
Text Label 3350 10200 0    50   ~ 0
APD6
Text Label 3350 10300 0    50   ~ 0
APD7
Text Label 3350 11300 0    50   ~ 0
APD0
Text Label 3350 11400 0    50   ~ 0
APD1
Text Label 3350 11500 0    50   ~ 0
APD2
Text Label 3350 11600 0    50   ~ 0
APD3
Text Label 3350 11700 0    50   ~ 0
APD4
Text Label 3350 11800 0    50   ~ 0
APD5
Text Label 3350 11900 0    50   ~ 0
APD6
Text Label 3350 12000 0    50   ~ 0
APD7
Text Label 3550 2800 2    50   ~ 0
BPD0
Text Label 3550 2900 2    50   ~ 0
BPD1
Text Label 3550 3000 2    50   ~ 0
BPD2
Text Label 3550 3100 2    50   ~ 0
BPD3
Text Label 3550 3200 2    50   ~ 0
BPD4
Text Label 3550 3300 2    50   ~ 0
BPD5
Text Label 3550 3400 2    50   ~ 0
BPD6
Text Label 3550 3500 2    50   ~ 0
BPD7
Text Label 3550 4500 2    50   ~ 0
BPD0
Text Label 3550 4600 2    50   ~ 0
BPD1
Text Label 3550 4700 2    50   ~ 0
BPD2
Text Label 3550 4800 2    50   ~ 0
BPD3
Text Label 3550 4900 2    50   ~ 0
BPD4
Text Label 3550 5000 2    50   ~ 0
BPD5
Text Label 3550 5100 2    50   ~ 0
BPD6
Text Label 3550 5200 2    50   ~ 0
BPD7
Text Label 3550 6200 2    50   ~ 0
DPD0
Text Label 3550 6300 2    50   ~ 0
DPD1
Text Label 3550 6400 2    50   ~ 0
DPD2
Text Label 3550 6500 2    50   ~ 0
DPD3
Text Label 3550 6600 2    50   ~ 0
DPD4
Text Label 3550 6700 2    50   ~ 0
DPD5
Text Label 3550 6800 2    50   ~ 0
DPD6
Text Label 3550 6900 2    50   ~ 0
DPD7
Text Label 3550 7900 2    50   ~ 0
DPD0
Text Label 3550 8000 2    50   ~ 0
DPD1
Text Label 3550 8100 2    50   ~ 0
DPD2
Text Label 3550 8200 2    50   ~ 0
DPD3
Text Label 3550 8300 2    50   ~ 0
DPD4
Text Label 3550 8400 2    50   ~ 0
DPD5
Text Label 3550 8500 2    50   ~ 0
DPD6
Text Label 3550 8600 2    50   ~ 0
DPD7
Text Label 3550 13000 2    50   ~ 0
CPD0
Text Label 3550 13100 2    50   ~ 0
CPD1
Text Label 3550 13200 2    50   ~ 0
CPD2
Text Label 3550 13300 2    50   ~ 0
CPD3
Text Label 3550 13400 2    50   ~ 0
CPD4
Text Label 3550 13500 2    50   ~ 0
CPD5
Text Label 3550 13600 2    50   ~ 0
CPD6
Text Label 3550 13700 2    50   ~ 0
CPD7
Text Label 3550 14700 2    50   ~ 0
CPD0
Text Label 3550 14800 2    50   ~ 0
CPD1
Text Label 3550 14900 2    50   ~ 0
CPD2
Text Label 3550 15000 2    50   ~ 0
CPD3
Text Label 3550 15100 2    50   ~ 0
CPD4
Text Label 3550 15200 2    50   ~ 0
CPD5
Text Label 3550 15300 2    50   ~ 0
CPD6
Text Label 3550 15400 2    50   ~ 0
CPD7
Text Label 4800 1750 0    50   ~ 0
XSEL-SYNC
Text Label 9650 4600 0    50   ~ 0
XSEL-SYNC
Text HLabel 1250 3000 0    50   Input ~ 0
XSEL
Text HLabel 1450 3600 0    50   Input ~ 0
SERIAL-LOAD
Text HLabel 1450 3700 0    50   Input ~ 0
CLK8M
Text HLabel 2800 3950 0    50   Input ~ 0
BPD[0..7]
Text HLabel 2800 7350 0    50   Input ~ 0
DPD[0..7]
Text HLabel 2800 10750 0    50   Input ~ 0
APD[0..7]
Text HLabel 2800 14150 0    50   Input ~ 0
CPD[0..7]
Text HLabel 3150 850  0    50   Input ~ 0
GFX-CHNL
Text HLabel 3150 1450 0    50   Input ~ 0
GFX-LOAD
Text HLabel 3150 1550 0    50   Input ~ 0
CLK8M
Text HLabel 3200 2250 0    50   Input ~ 0
SERIAL-CHNL
Text HLabel 5350 2300 0    50   Input ~ 0
SERIAL-LOAD
Text HLabel 7450 2150 2    50   Input ~ 0
~RESET
Text HLabel 8400 1600 2    50   Input ~ 0
CLK8M
Text HLabel 8900 2950 2    50   Output ~ 0
B
Text HLabel 8900 6350 2    50   Output ~ 0
D
Text HLabel 8900 9750 2    50   Output ~ 0
A
Text HLabel 8900 13150 2    50   Output ~ 0
C
$Comp
L power:VCC #PWR?
U 1 1 603BEB64
P 7150 2550
AR Path="/6428BC4C/603BEB64" Ref="#PWR?"  Part="1" 
AR Path="/620F934F/603BEB64" Ref="#PWR?"  Part="1" 
AR Path="/603749E8/603BEB64" Ref="#PWR?"  Part="1" 
AR Path="/5FC1A6C6/5FC1AD94/603BEB64" Ref="#PWR0191"  Part="1" 
F 0 "#PWR0191" H 7150 2400 50  0001 C CNN
F 1 "VCC" H 7165 2723 50  0000 C CNN
F 2 "" H 7150 2550 50  0001 C CNN
F 3 "" H 7150 2550 50  0001 C CNN
	1    7150 2550
	1    0    0    -1  
$EndComp
$Comp
L power:VCC #PWR?
U 1 1 603BEB6A
P 7150 5950
AR Path="/6428BC4C/603BEB6A" Ref="#PWR?"  Part="1" 
AR Path="/620F934F/603BEB6A" Ref="#PWR?"  Part="1" 
AR Path="/603749E8/603BEB6A" Ref="#PWR?"  Part="1" 
AR Path="/5FC1A6C6/5FC1AD94/603BEB6A" Ref="#PWR0192"  Part="1" 
F 0 "#PWR0192" H 7150 5800 50  0001 C CNN
F 1 "VCC" H 7165 6123 50  0000 C CNN
F 2 "" H 7150 5950 50  0001 C CNN
F 3 "" H 7150 5950 50  0001 C CNN
	1    7150 5950
	1    0    0    -1  
$EndComp
$Comp
L power:VCC #PWR?
U 1 1 603BEB70
P 7150 9350
AR Path="/6428BC4C/603BEB70" Ref="#PWR?"  Part="1" 
AR Path="/620F934F/603BEB70" Ref="#PWR?"  Part="1" 
AR Path="/603749E8/603BEB70" Ref="#PWR?"  Part="1" 
AR Path="/5FC1A6C6/5FC1AD94/603BEB70" Ref="#PWR0193"  Part="1" 
F 0 "#PWR0193" H 7150 9200 50  0001 C CNN
F 1 "VCC" H 7165 9523 50  0000 C CNN
F 2 "" H 7150 9350 50  0001 C CNN
F 3 "" H 7150 9350 50  0001 C CNN
	1    7150 9350
	1    0    0    -1  
$EndComp
$Comp
L power:VCC #PWR?
U 1 1 603BEB76
P 7150 12750
AR Path="/6428BC4C/603BEB76" Ref="#PWR?"  Part="1" 
AR Path="/620F934F/603BEB76" Ref="#PWR?"  Part="1" 
AR Path="/603749E8/603BEB76" Ref="#PWR?"  Part="1" 
AR Path="/5FC1A6C6/5FC1AD94/603BEB76" Ref="#PWR0194"  Part="1" 
F 0 "#PWR0194" H 7150 12600 50  0001 C CNN
F 1 "VCC" H 7165 12923 50  0000 C CNN
F 2 "" H 7150 12750 50  0001 C CNN
F 3 "" H 7150 12750 50  0001 C CNN
	1    7150 12750
	1    0    0    -1  
$EndComp
$Comp
L power:GND #PWR?
U 1 1 603BEB7C
P 3700 3850
AR Path="/6428BC4C/603BEB7C" Ref="#PWR?"  Part="1" 
AR Path="/620F934F/603BEB7C" Ref="#PWR?"  Part="1" 
AR Path="/603749E8/603BEB7C" Ref="#PWR?"  Part="1" 
AR Path="/5FC1A6C6/5FC1AD94/603BEB7C" Ref="#PWR0195"  Part="1" 
F 0 "#PWR0195" H 3700 3600 50  0001 C CNN
F 1 "GND" H 3705 3677 50  0000 C CNN
F 2 "" H 3700 3850 50  0001 C CNN
F 3 "" H 3700 3850 50  0001 C CNN
	1    3700 3850
	1    0    0    -1  
$EndComp
$Comp
L power:GND #PWR?
U 1 1 603BEB82
P 3700 5550
AR Path="/6428BC4C/603BEB82" Ref="#PWR?"  Part="1" 
AR Path="/620F934F/603BEB82" Ref="#PWR?"  Part="1" 
AR Path="/603749E8/603BEB82" Ref="#PWR?"  Part="1" 
AR Path="/5FC1A6C6/5FC1AD94/603BEB82" Ref="#PWR0196"  Part="1" 
F 0 "#PWR0196" H 3700 5300 50  0001 C CNN
F 1 "GND" H 3705 5377 50  0000 C CNN
F 2 "" H 3700 5550 50  0001 C CNN
F 3 "" H 3700 5550 50  0001 C CNN
	1    3700 5550
	1    0    0    -1  
$EndComp
$Comp
L power:GND #PWR?
U 1 1 603BEB88
P 3700 7250
AR Path="/6428BC4C/603BEB88" Ref="#PWR?"  Part="1" 
AR Path="/620F934F/603BEB88" Ref="#PWR?"  Part="1" 
AR Path="/603749E8/603BEB88" Ref="#PWR?"  Part="1" 
AR Path="/5FC1A6C6/5FC1AD94/603BEB88" Ref="#PWR0197"  Part="1" 
F 0 "#PWR0197" H 3700 7000 50  0001 C CNN
F 1 "GND" H 3705 7077 50  0000 C CNN
F 2 "" H 3700 7250 50  0001 C CNN
F 3 "" H 3700 7250 50  0001 C CNN
	1    3700 7250
	1    0    0    -1  
$EndComp
$Comp
L power:GND #PWR?
U 1 1 603BEB8E
P 3700 8950
AR Path="/6428BC4C/603BEB8E" Ref="#PWR?"  Part="1" 
AR Path="/620F934F/603BEB8E" Ref="#PWR?"  Part="1" 
AR Path="/603749E8/603BEB8E" Ref="#PWR?"  Part="1" 
AR Path="/5FC1A6C6/5FC1AD94/603BEB8E" Ref="#PWR0198"  Part="1" 
F 0 "#PWR0198" H 3700 8700 50  0001 C CNN
F 1 "GND" H 3705 8777 50  0000 C CNN
F 2 "" H 3700 8950 50  0001 C CNN
F 3 "" H 3700 8950 50  0001 C CNN
	1    3700 8950
	1    0    0    -1  
$EndComp
$Comp
L power:GND #PWR?
U 1 1 603BEB94
P 3700 10650
AR Path="/6428BC4C/603BEB94" Ref="#PWR?"  Part="1" 
AR Path="/620F934F/603BEB94" Ref="#PWR?"  Part="1" 
AR Path="/603749E8/603BEB94" Ref="#PWR?"  Part="1" 
AR Path="/5FC1A6C6/5FC1AD94/603BEB94" Ref="#PWR0199"  Part="1" 
F 0 "#PWR0199" H 3700 10400 50  0001 C CNN
F 1 "GND" H 3705 10477 50  0000 C CNN
F 2 "" H 3700 10650 50  0001 C CNN
F 3 "" H 3700 10650 50  0001 C CNN
	1    3700 10650
	1    0    0    -1  
$EndComp
$Comp
L power:GND #PWR?
U 1 1 603BEB9A
P 3700 12350
AR Path="/6428BC4C/603BEB9A" Ref="#PWR?"  Part="1" 
AR Path="/620F934F/603BEB9A" Ref="#PWR?"  Part="1" 
AR Path="/603749E8/603BEB9A" Ref="#PWR?"  Part="1" 
AR Path="/5FC1A6C6/5FC1AD94/603BEB9A" Ref="#PWR0200"  Part="1" 
F 0 "#PWR0200" H 3700 12100 50  0001 C CNN
F 1 "GND" H 3705 12177 50  0000 C CNN
F 2 "" H 3700 12350 50  0001 C CNN
F 3 "" H 3700 12350 50  0001 C CNN
	1    3700 12350
	1    0    0    -1  
$EndComp
$Comp
L power:GND #PWR?
U 1 1 603BEBA0
P 3700 14050
AR Path="/6428BC4C/603BEBA0" Ref="#PWR?"  Part="1" 
AR Path="/620F934F/603BEBA0" Ref="#PWR?"  Part="1" 
AR Path="/603749E8/603BEBA0" Ref="#PWR?"  Part="1" 
AR Path="/5FC1A6C6/5FC1AD94/603BEBA0" Ref="#PWR0201"  Part="1" 
F 0 "#PWR0201" H 3700 13800 50  0001 C CNN
F 1 "GND" H 3705 13877 50  0000 C CNN
F 2 "" H 3700 14050 50  0001 C CNN
F 3 "" H 3700 14050 50  0001 C CNN
	1    3700 14050
	1    0    0    -1  
$EndComp
$Comp
L power:GND #PWR?
U 1 1 603BEBA6
P 3700 15750
AR Path="/6428BC4C/603BEBA6" Ref="#PWR?"  Part="1" 
AR Path="/620F934F/603BEBA6" Ref="#PWR?"  Part="1" 
AR Path="/603749E8/603BEBA6" Ref="#PWR?"  Part="1" 
AR Path="/5FC1A6C6/5FC1AD94/603BEBA6" Ref="#PWR0202"  Part="1" 
F 0 "#PWR0202" H 3700 15500 50  0001 C CNN
F 1 "GND" H 3705 15577 50  0000 C CNN
F 2 "" H 3700 15750 50  0001 C CNN
F 3 "" H 3700 15750 50  0001 C CNN
	1    3700 15750
	1    0    0    -1  
$EndComp
$Comp
L A5C:NAND02 UAR361
U 1 1 6064F648
P 1700 3650
F 0 "UAR361" H 1725 3917 50  0000 C CNN
F 1 "NAND02" H 1725 3826 50  0000 C CNN
F 2 "" H 1700 3650 50  0001 C CNN
F 3 "" H 1700 3650 50  0001 C CNN
	1    1700 3650
	1    0    0    -1  
$EndComp
$Comp
L A5C:XOR02 UAR349
U 1 1 6044866A
P 3450 2300
F 0 "UAR349" H 3475 2567 50  0000 C CNN
F 1 "XOR02" H 3475 2476 50  0000 C CNN
F 2 "" H 3450 2300 50  0001 C CNN
F 3 "" H 3450 2300 50  0001 C CNN
	1    3450 2300
	1    0    0    -1  
$EndComp
$Comp
L A5C:OR02 UAI?
U 1 1 603BEBAC
P 6150 1800
AR Path="/6428BC4C/603BEBAC" Ref="UAI?"  Part="1" 
AR Path="/620F934F/603BEBAC" Ref="UAI?"  Part="1" 
AR Path="/603749E8/603BEBAC" Ref="UAI324"  Part="1" 
AR Path="/5FC1A6C6/5FC1AD94/603BEBAC" Ref="UAI324"  Part="1" 
F 0 "UAI324" H 6175 2067 50  0000 C CNN
F 1 "OR02" H 6175 1976 50  0000 C CNN
F 2 "" H 6200 1800 50  0001 C CNN
F 3 "" H 6200 1800 50  0001 C CNN
	1    6150 1800
	1    0    0    -1  
$EndComp
$Comp
L A5C:OR02 UAH?
U 1 1 603BEBB2
P 6150 2250
AR Path="/6428BC4C/603BEBB2" Ref="UAH?"  Part="1" 
AR Path="/620F934F/603BEBB2" Ref="UAH?"  Part="1" 
AR Path="/603749E8/603BEBB2" Ref="UAG325"  Part="1" 
AR Path="/5FC1A6C6/5FC1AD94/603BEBB2" Ref="UAG325"  Part="1" 
F 0 "UAG325" H 6175 2517 50  0000 C CNN
F 1 "OR02" H 6175 2426 50  0000 C CNN
F 2 "" H 6200 2250 50  0001 C CNN
F 3 "" H 6200 2250 50  0001 C CNN
	1    6150 2250
	1    0    0    -1  
$EndComp
$Comp
L A5C:NAND03 UAG?
U 1 1 603BEBB8
P 4100 950
AR Path="/6428BC4C/603BEBB8" Ref="UAG?"  Part="1" 
AR Path="/620F934F/603BEBB8" Ref="UAG?"  Part="1" 
AR Path="/603749E8/603BEBB8" Ref="UAF325"  Part="1" 
AR Path="/5FC1A6C6/5FC1AD94/603BEBB8" Ref="UAF325"  Part="1" 
F 0 "UAF325" H 4125 1242 50  0000 C CNN
F 1 "NAND03" H 4125 1151 50  0000 C CNN
F 2 "" H 4100 950 50  0001 C CNN
F 3 "" H 4100 950 50  0001 C CNN
	1    4100 950 
	1    0    0    -1  
$EndComp
$Comp
L A5C:NAND03 UAE?
U 1 1 603BEBBE
P 4100 1450
AR Path="/6428BC4C/603BEBBE" Ref="UAE?"  Part="1" 
AR Path="/620F934F/603BEBBE" Ref="UAE?"  Part="1" 
AR Path="/603749E8/603BEBBE" Ref="UAE325"  Part="1" 
AR Path="/5FC1A6C6/5FC1AD94/603BEBBE" Ref="UAE325"  Part="1" 
F 0 "UAE325" H 4125 1742 50  0000 C CNN
F 1 "NAND03" H 4125 1651 50  0000 C CNN
F 2 "" H 4100 1450 50  0001 C CNN
F 3 "" H 4100 1450 50  0001 C CNN
	1    4100 1450
	1    0    0    -1  
$EndComp
$Comp
L A5C:INV01 UAG?
U 1 1 603BEBC4
P 3550 850
AR Path="/6428BC4C/603BEBC4" Ref="UAG?"  Part="1" 
AR Path="/620F934F/603BEBC4" Ref="UAG?"  Part="1" 
AR Path="/603749E8/603BEBC4" Ref="UAG324"  Part="1" 
AR Path="/5FC1A6C6/5FC1AD94/603BEBC4" Ref="UAG324"  Part="1" 
F 0 "UAG324" H 3550 1167 50  0000 C CNN
F 1 "INV01" H 3550 1076 50  0000 C CNN
F 2 "" H 3550 650 50  0001 C CNN
F 3 "" H 3550 650 50  0001 C CNN
	1    3550 850 
	1    0    0    -1  
$EndComp
$Comp
L A5C:INV01 UAH?
U 1 1 603BEBCA
P 4050 2300
AR Path="/6428BC4C/603BEBCA" Ref="UAH?"  Part="1" 
AR Path="/620F934F/603BEBCA" Ref="UAH?"  Part="1" 
AR Path="/603749E8/603BEBCA" Ref="UAH324"  Part="1" 
AR Path="/5FC1A6C6/5FC1AD94/603BEBCA" Ref="UAH324"  Part="1" 
F 0 "UAH324" H 4050 2617 50  0000 C CNN
F 1 "INV01" H 4050 2526 50  0000 C CNN
F 2 "" H 4050 2100 50  0001 C CNN
F 3 "" H 4050 2100 50  0001 C CNN
	1    4050 2300
	1    0    0    -1  
$EndComp
$Comp
L A5C:INV01 UAI?
U 1 1 603BEBD0
P 5600 1750
AR Path="/6428BC4C/603BEBD0" Ref="UAI?"  Part="1" 
AR Path="/620F934F/603BEBD0" Ref="UAI?"  Part="1" 
AR Path="/603749E8/603BEBD0" Ref="UAI326"  Part="1" 
AR Path="/5FC1A6C6/5FC1AD94/603BEBD0" Ref="UAI326"  Part="1" 
F 0 "UAI326" H 5600 2067 50  0000 C CNN
F 1 "INV01" H 5600 1976 50  0000 C CNN
F 2 "" H 5600 1550 50  0001 C CNN
F 3 "" H 5600 1550 50  0001 C CNN
	1    5600 1750
	1    0    0    -1  
$EndComp
$Comp
L A5C:BUF12 UAR?
U 1 1 6C35D256
P 7150 2150
AR Path="/6C35D256" Ref="UAR?"  Part="1" 
AR Path="/603749E8/6C35D256" Ref="UAR327"  Part="1" 
AR Path="/5FC1A6C6/5FC1AD94/6C35D256" Ref="UAR327"  Part="1" 
F 0 "UAR327" H 7150 2467 50  0000 C CNN
F 1 "BUF12" H 7150 2376 50  0000 C CNN
F 2 "" H 7150 2150 50  0001 C CNN
F 3 "" H 7150 2150 50  0001 C CNN
	1    7150 2150
	-1   0    0    -1  
$EndComp
$Comp
L A5C:INV01 UAG?
U 1 1 603BEBDC
P 7900 1600
AR Path="/6428BC4C/603BEBDC" Ref="UAG?"  Part="1" 
AR Path="/620F934F/603BEBDC" Ref="UAG?"  Part="1" 
AR Path="/603749E8/603BEBDC" Ref="UAE362"  Part="1" 
AR Path="/5FC1A6C6/5FC1AD94/603BEBDC" Ref="UAE362"  Part="1" 
F 0 "UAE362" H 7900 1917 50  0000 C CNN
F 1 "INV01" H 7900 1826 50  0000 C CNN
F 2 "" H 7900 1400 50  0001 C CNN
F 3 "" H 7900 1400 50  0001 C CNN
	1    7900 1600
	-1   0    0    -1  
$EndComp
$Comp
L A5C:INV01 UAN?
U 1 1 603BEBEE
P 8700 4600
AR Path="/6428BC4C/603BEBEE" Ref="UAN?"  Part="1" 
AR Path="/620F934F/603BEBEE" Ref="UAN?"  Part="1" 
AR Path="/603749E8/603BEBEE" Ref="UAN287"  Part="1" 
AR Path="/5FC1A6C6/5FC1AD94/603BEBEE" Ref="UAN287"  Part="1" 
F 0 "UAN287" H 8700 4917 50  0000 C CNN
F 1 "INV01" H 8700 4826 50  0000 C CNN
F 2 "" H 8700 4400 50  0001 C CNN
F 3 "" H 8700 4400 50  0001 C CNN
	1    8700 4600
	-1   0    0    -1  
$EndComp
$Comp
L A5C:INV01 UAO?
U 1 1 603BEBF4
P 9300 4600
AR Path="/6428BC4C/603BEBF4" Ref="UAO?"  Part="1" 
AR Path="/620F934F/603BEBF4" Ref="UAO?"  Part="1" 
AR Path="/603749E8/603BEBF4" Ref="UAO287"  Part="1" 
AR Path="/5FC1A6C6/5FC1AD94/603BEBF4" Ref="UAO287"  Part="1" 
F 0 "UAO287" H 9300 4917 50  0000 C CNN
F 1 "INV01" H 9300 4826 50  0000 C CNN
F 2 "" H 9300 4400 50  0001 C CNN
F 3 "" H 9300 4400 50  0001 C CNN
	1    9300 4600
	-1   0    0    -1  
$EndComp
$Comp
L A5C:DFFCOO UAR357
U 1 1 604D6BA1
P 1500 3100
F 0 "UAR357" H 1500 3465 50  0000 C CNN
F 1 "DFFCOO" H 1500 3374 50  0000 C CNN
F 2 "" H 1500 3100 50  0001 C CNN
F 3 "" H 1500 3100 50  0001 C CNN
	1    1500 3100
	1    0    0    -1  
$EndComp
$Comp
L A5C:DFFCOO UAR352
U 1 1 604D6A4A
P 2250 3100
F 0 "UAR352" H 2250 3465 50  0000 C CNN
F 1 "DFFCOO" H 2250 3374 50  0000 C CNN
F 2 "" H 2250 3100 50  0001 C CNN
F 3 "" H 2250 3100 50  0001 C CNN
	1    2250 3100
	1    0    0    -1  
$EndComp
$Comp
L A5C:AO22 UAN?
U 1 1 603BEBFA
P 8450 2900
AR Path="/60BA673A/603BEBFA" Ref="UAN?"  Part="1" 
AR Path="/6428BC4C/603BEBFA" Ref="UAN?"  Part="1" 
AR Path="/620F934F/603BEBFA" Ref="UAN?"  Part="1" 
AR Path="/603749E8/603BEBFA" Ref="UAN324"  Part="1" 
AR Path="/5FC1A6C6/5FC1AD94/603BEBFA" Ref="UAN324"  Part="1" 
F 0 "UAN324" H 8475 3217 50  0000 C CNN
F 1 "AO22" H 8475 3126 50  0000 C CNN
F 2 "" H 8600 2900 50  0001 C CNN
F 3 "" H 8600 2900 50  0001 C CNN
	1    8450 2900
	1    0    0    -1  
$EndComp
$Comp
L A5C:AO22 UAL?
U 1 1 603BEC00
P 8450 6300
AR Path="/60BA673A/603BEC00" Ref="UAL?"  Part="1" 
AR Path="/6428BC4C/603BEC00" Ref="UAL?"  Part="1" 
AR Path="/620F934F/603BEC00" Ref="UAL?"  Part="1" 
AR Path="/603749E8/603BEC00" Ref="UAL324"  Part="1" 
AR Path="/5FC1A6C6/5FC1AD94/603BEC00" Ref="UAL324"  Part="1" 
F 0 "UAL324" H 8475 6617 50  0000 C CNN
F 1 "AO22" H 8475 6526 50  0000 C CNN
F 2 "" H 8600 6300 50  0001 C CNN
F 3 "" H 8600 6300 50  0001 C CNN
	1    8450 6300
	1    0    0    -1  
$EndComp
$Comp
L A5C:AO22 UAO?
U 1 1 603BEC06
P 8450 9700
AR Path="/60BA673A/603BEC06" Ref="UAO?"  Part="1" 
AR Path="/6428BC4C/603BEC06" Ref="UAO?"  Part="1" 
AR Path="/620F934F/603BEC06" Ref="UAO?"  Part="1" 
AR Path="/603749E8/603BEC06" Ref="UAO324"  Part="1" 
AR Path="/5FC1A6C6/5FC1AD94/603BEC06" Ref="UAO324"  Part="1" 
F 0 "UAO324" H 8475 10017 50  0000 C CNN
F 1 "AO22" H 8475 9926 50  0000 C CNN
F 2 "" H 8600 9700 50  0001 C CNN
F 3 "" H 8600 9700 50  0001 C CNN
	1    8450 9700
	1    0    0    -1  
$EndComp
$Comp
L A5C:AO22 UAM?
U 1 1 603BEC0C
P 8450 13100
AR Path="/60BA673A/603BEC0C" Ref="UAM?"  Part="1" 
AR Path="/6428BC4C/603BEC0C" Ref="UAM?"  Part="1" 
AR Path="/620F934F/603BEC0C" Ref="UAM?"  Part="1" 
AR Path="/603749E8/603BEC0C" Ref="UAM324"  Part="1" 
AR Path="/5FC1A6C6/5FC1AD94/603BEC0C" Ref="UAM324"  Part="1" 
F 0 "UAM324" H 8475 13417 50  0000 C CNN
F 1 "AO22" H 8475 13326 50  0000 C CNN
F 2 "" H 8600 13100 50  0001 C CNN
F 3 "" H 8600 13100 50  0001 C CNN
	1    8450 13100
	1    0    0    -1  
$EndComp
$Comp
L A5C:L8G UAL?
U 1 1 603BEC12
P 4000 3200
AR Path="/6428BC4C/603BEC12" Ref="UAL?"  Part="1" 
AR Path="/620F934F/603BEC12" Ref="UAL?"  Part="1" 
AR Path="/603749E8/603BEC12" Ref="UAL327"  Part="1" 
AR Path="/5FC1A6C6/5FC1AD94/603BEC12" Ref="UAL327"  Part="1" 
F 0 "UAL327" H 4000 3865 50  0000 C CNN
F 1 "L8G" H 4000 3774 50  0000 C CNN
F 2 "" H 3950 3500 50  0001 C CNN
F 3 "" H 3950 3500 50  0001 C CNN
	1    4000 3200
	1    0    0    -1  
$EndComp
$Comp
L A5C:L8G UAN?
U 1 1 603BEC18
P 4000 4900
AR Path="/6428BC4C/603BEC18" Ref="UAN?"  Part="1" 
AR Path="/620F934F/603BEC18" Ref="UAN?"  Part="1" 
AR Path="/603749E8/603BEC18" Ref="UAN327"  Part="1" 
AR Path="/5FC1A6C6/5FC1AD94/603BEC18" Ref="UAN327"  Part="1" 
F 0 "UAN327" H 4000 5565 50  0000 C CNN
F 1 "L8G" H 4000 5474 50  0000 C CNN
F 2 "" H 3950 5200 50  0001 C CNN
F 3 "" H 3950 5200 50  0001 C CNN
	1    4000 4900
	1    0    0    -1  
$EndComp
$Comp
L A5C:L8G UAE?
U 1 1 603BEC1E
P 4000 6600
AR Path="/6428BC4C/603BEC1E" Ref="UAE?"  Part="1" 
AR Path="/620F934F/603BEC1E" Ref="UAE?"  Part="1" 
AR Path="/603749E8/603BEC1E" Ref="UAE327"  Part="1" 
AR Path="/5FC1A6C6/5FC1AD94/603BEC1E" Ref="UAE327"  Part="1" 
F 0 "UAE327" H 4000 7265 50  0000 C CNN
F 1 "L8G" H 4000 7174 50  0000 C CNN
F 2 "" H 3950 6900 50  0001 C CNN
F 3 "" H 3950 6900 50  0001 C CNN
	1    4000 6600
	1    0    0    -1  
$EndComp
$Comp
L A5C:L8G UAH?
U 1 1 603BEC24
P 4000 8300
AR Path="/6428BC4C/603BEC24" Ref="UAH?"  Part="1" 
AR Path="/620F934F/603BEC24" Ref="UAH?"  Part="1" 
AR Path="/603749E8/603BEC24" Ref="UAG327"  Part="1" 
AR Path="/5FC1A6C6/5FC1AD94/603BEC24" Ref="UAG327"  Part="1" 
F 0 "UAG327" H 4000 8965 50  0000 C CNN
F 1 "L8G" H 4000 8874 50  0000 C CNN
F 2 "" H 3950 8600 50  0001 C CNN
F 3 "" H 3950 8600 50  0001 C CNN
	1    4000 8300
	1    0    0    -1  
$EndComp
$Comp
L A5C:L8G UAL?
U 1 1 603BEC2A
P 4000 10000
AR Path="/6428BC4C/603BEC2A" Ref="UAL?"  Part="1" 
AR Path="/620F934F/603BEC2A" Ref="UAL?"  Part="1" 
AR Path="/603749E8/603BEC2A" Ref="UAL288"  Part="1" 
AR Path="/5FC1A6C6/5FC1AD94/603BEC2A" Ref="UAL288"  Part="1" 
F 0 "UAL288" H 4000 10665 50  0000 C CNN
F 1 "L8G" H 4000 10574 50  0000 C CNN
F 2 "" H 3950 10300 50  0001 C CNN
F 3 "" H 3950 10300 50  0001 C CNN
	1    4000 10000
	1    0    0    -1  
$EndComp
$Comp
L A5C:L8G UAN?
U 1 1 603BEC30
P 4000 11700
AR Path="/6428BC4C/603BEC30" Ref="UAN?"  Part="1" 
AR Path="/620F934F/603BEC30" Ref="UAN?"  Part="1" 
AR Path="/603749E8/603BEC30" Ref="UAN288"  Part="1" 
AR Path="/5FC1A6C6/5FC1AD94/603BEC30" Ref="UAN288"  Part="1" 
F 0 "UAN288" H 4000 12365 50  0000 C CNN
F 1 "L8G" H 4000 12274 50  0000 C CNN
F 2 "" H 3950 12000 50  0001 C CNN
F 3 "" H 3950 12000 50  0001 C CNN
	1    4000 11700
	1    0    0    -1  
$EndComp
$Comp
L A5C:L8G UAE?
U 1 1 603BEC36
P 4000 13400
AR Path="/6428BC4C/603BEC36" Ref="UAE?"  Part="1" 
AR Path="/620F934F/603BEC36" Ref="UAE?"  Part="1" 
AR Path="/603749E8/603BEC36" Ref="UAE288"  Part="1" 
AR Path="/5FC1A6C6/5FC1AD94/603BEC36" Ref="UAE288"  Part="1" 
F 0 "UAE288" H 4000 14065 50  0000 C CNN
F 1 "L8G" H 4000 13974 50  0000 C CNN
F 2 "" H 3950 13700 50  0001 C CNN
F 3 "" H 3950 13700 50  0001 C CNN
	1    4000 13400
	1    0    0    -1  
$EndComp
$Comp
L A5C:L8G UAH?
U 1 1 603BEC3C
P 4000 15100
AR Path="/6428BC4C/603BEC3C" Ref="UAH?"  Part="1" 
AR Path="/620F934F/603BEC3C" Ref="UAH?"  Part="1" 
AR Path="/603749E8/603BEC3C" Ref="UAG288"  Part="1" 
AR Path="/5FC1A6C6/5FC1AD94/603BEC3C" Ref="UAG288"  Part="1" 
F 0 "UAG288" H 4000 15765 50  0000 C CNN
F 1 "L8G" H 4000 15674 50  0000 C CNN
F 2 "" H 3950 15400 50  0001 C CNN
F 3 "" H 3950 15400 50  0001 C CNN
	1    4000 15100
	1    0    0    -1  
$EndComp
$Comp
L A5C:L8G UAM?
U 1 1 603BEC42
P 5100 3200
AR Path="/6428BC4C/603BEC42" Ref="UAM?"  Part="1" 
AR Path="/620F934F/603BEC42" Ref="UAM?"  Part="1" 
AR Path="/603749E8/603BEC42" Ref="UAM327"  Part="1" 
AR Path="/5FC1A6C6/5FC1AD94/603BEC42" Ref="UAM327"  Part="1" 
F 0 "UAM327" H 5100 3865 50  0000 C CNN
F 1 "L8G" H 5100 3774 50  0000 C CNN
F 2 "" H 5050 3500 50  0001 C CNN
F 3 "" H 5050 3500 50  0001 C CNN
	1    5100 3200
	1    0    0    -1  
$EndComp
$Comp
L A5C:L8G UAO?
U 1 1 603BEC48
P 5100 4900
AR Path="/6428BC4C/603BEC48" Ref="UAO?"  Part="1" 
AR Path="/620F934F/603BEC48" Ref="UAO?"  Part="1" 
AR Path="/603749E8/603BEC48" Ref="UAO327"  Part="1" 
AR Path="/5FC1A6C6/5FC1AD94/603BEC48" Ref="UAO327"  Part="1" 
F 0 "UAO327" H 5100 5565 50  0000 C CNN
F 1 "L8G" H 5100 5474 50  0000 C CNN
F 2 "" H 5050 5200 50  0001 C CNN
F 3 "" H 5050 5200 50  0001 C CNN
	1    5100 4900
	1    0    0    -1  
$EndComp
$Comp
L A5C:L8G UAF?
U 1 1 603BEC4E
P 5100 6600
AR Path="/6428BC4C/603BEC4E" Ref="UAF?"  Part="1" 
AR Path="/620F934F/603BEC4E" Ref="UAF?"  Part="1" 
AR Path="/603749E8/603BEC4E" Ref="UAF327"  Part="1" 
AR Path="/5FC1A6C6/5FC1AD94/603BEC4E" Ref="UAF327"  Part="1" 
F 0 "UAF327" H 5100 7265 50  0000 C CNN
F 1 "L8G" H 5100 7174 50  0000 C CNN
F 2 "" H 5050 6900 50  0001 C CNN
F 3 "" H 5050 6900 50  0001 C CNN
	1    5100 6600
	1    0    0    -1  
$EndComp
$Comp
L A5C:L8G UAI?
U 1 1 603BEC54
P 5100 8300
AR Path="/6428BC4C/603BEC54" Ref="UAI?"  Part="1" 
AR Path="/620F934F/603BEC54" Ref="UAI?"  Part="1" 
AR Path="/603749E8/603BEC54" Ref="UAI327"  Part="1" 
AR Path="/5FC1A6C6/5FC1AD94/603BEC54" Ref="UAI327"  Part="1" 
F 0 "UAI327" H 5100 8965 50  0000 C CNN
F 1 "L8G" H 5100 8874 50  0000 C CNN
F 2 "" H 5050 8600 50  0001 C CNN
F 3 "" H 5050 8600 50  0001 C CNN
	1    5100 8300
	1    0    0    -1  
$EndComp
$Comp
L A5C:L8G UAM?
U 1 1 603BEC5A
P 5100 10000
AR Path="/6428BC4C/603BEC5A" Ref="UAM?"  Part="1" 
AR Path="/620F934F/603BEC5A" Ref="UAM?"  Part="1" 
AR Path="/603749E8/603BEC5A" Ref="UAM288"  Part="1" 
AR Path="/5FC1A6C6/5FC1AD94/603BEC5A" Ref="UAM288"  Part="1" 
F 0 "UAM288" H 5100 10665 50  0000 C CNN
F 1 "L8G" H 5100 10574 50  0000 C CNN
F 2 "" H 5050 10300 50  0001 C CNN
F 3 "" H 5050 10300 50  0001 C CNN
	1    5100 10000
	1    0    0    -1  
$EndComp
$Comp
L A5C:L8G UAO?
U 1 1 603BEC60
P 5100 11700
AR Path="/6428BC4C/603BEC60" Ref="UAO?"  Part="1" 
AR Path="/620F934F/603BEC60" Ref="UAO?"  Part="1" 
AR Path="/603749E8/603BEC60" Ref="UAO288"  Part="1" 
AR Path="/5FC1A6C6/5FC1AD94/603BEC60" Ref="UAO288"  Part="1" 
F 0 "UAO288" H 5100 12365 50  0000 C CNN
F 1 "L8G" H 5100 12274 50  0000 C CNN
F 2 "" H 5050 12000 50  0001 C CNN
F 3 "" H 5050 12000 50  0001 C CNN
	1    5100 11700
	1    0    0    -1  
$EndComp
$Comp
L A5C:L8G UAF?
U 1 1 603BEC66
P 5100 13400
AR Path="/6428BC4C/603BEC66" Ref="UAF?"  Part="1" 
AR Path="/620F934F/603BEC66" Ref="UAF?"  Part="1" 
AR Path="/603749E8/603BEC66" Ref="UAF288"  Part="1" 
AR Path="/5FC1A6C6/5FC1AD94/603BEC66" Ref="UAF288"  Part="1" 
F 0 "UAF288" H 5100 14065 50  0000 C CNN
F 1 "L8G" H 5100 13974 50  0000 C CNN
F 2 "" H 5050 13700 50  0001 C CNN
F 3 "" H 5050 13700 50  0001 C CNN
	1    5100 13400
	1    0    0    -1  
$EndComp
$Comp
L A5C:L8G UAI?
U 1 1 603BEC6C
P 5100 15100
AR Path="/6428BC4C/603BEC6C" Ref="UAI?"  Part="1" 
AR Path="/620F934F/603BEC6C" Ref="UAI?"  Part="1" 
AR Path="/603749E8/603BEC6C" Ref="UAI288"  Part="1" 
AR Path="/5FC1A6C6/5FC1AD94/603BEC6C" Ref="UAI288"  Part="1" 
F 0 "UAI288" H 5100 15765 50  0000 C CNN
F 1 "L8G" H 5100 15674 50  0000 C CNN
F 2 "" H 5050 15400 50  0001 C CNN
F 3 "" H 5050 15400 50  0001 C CNN
	1    5100 15100
	1    0    0    -1  
$EndComp
$Comp
L A5C:M198C UAP?
U 1 1 603BEC72
P 7050 3050
AR Path="/6428BC4C/603BEC72" Ref="UAP?"  Part="1" 
AR Path="/620F934F/603BEC72" Ref="UAP?"  Part="1" 
AR Path="/603749E8/603BEC72" Ref="UAP325"  Part="1" 
AR Path="/5FC1A6C6/5FC1AD94/603BEC72" Ref="UAP325"  Part="1" 
F 0 "UAP325" H 7200 1877 50  0000 C CNN
F 1 "M198C" H 7200 1786 50  0000 C CNN
F 2 "" H 7050 3050 50  0001 C CNN
F 3 "" H 7050 3050 50  0001 C CNN
	1    7050 3050
	1    0    0    -1  
$EndComp
$Comp
L A5C:M198C UAJ?
U 1 1 603BEC78
P 7050 6450
AR Path="/6428BC4C/603BEC78" Ref="UAJ?"  Part="1" 
AR Path="/620F934F/603BEC78" Ref="UAJ?"  Part="1" 
AR Path="/603749E8/603BEC78" Ref="UAI325"  Part="1" 
AR Path="/5FC1A6C6/5FC1AD94/603BEC78" Ref="UAI325"  Part="1" 
F 0 "UAI325" H 7200 5277 50  0000 C CNN
F 1 "M198C" H 7200 5186 50  0000 C CNN
F 2 "" H 7050 6450 50  0001 C CNN
F 3 "" H 7050 6450 50  0001 C CNN
	1    7050 6450
	1    0    0    -1  
$EndComp
$Comp
L A5C:M198C UAP?
U 1 1 603BEC7E
P 7050 9850
AR Path="/6428BC4C/603BEC7E" Ref="UAP?"  Part="1" 
AR Path="/620F934F/603BEC7E" Ref="UAP?"  Part="1" 
AR Path="/603749E8/603BEC7E" Ref="UAP287"  Part="1" 
AR Path="/5FC1A6C6/5FC1AD94/603BEC7E" Ref="UAP287"  Part="1" 
F 0 "UAP287" H 7200 8677 50  0000 C CNN
F 1 "M198C" H 7200 8586 50  0000 C CNN
F 2 "" H 7050 9850 50  0001 C CNN
F 3 "" H 7050 9850 50  0001 C CNN
	1    7050 9850
	1    0    0    -1  
$EndComp
$Comp
L A5C:M198C UAJ?
U 1 1 603BEC84
P 7050 13250
AR Path="/6428BC4C/603BEC84" Ref="UAJ?"  Part="1" 
AR Path="/620F934F/603BEC84" Ref="UAJ?"  Part="1" 
AR Path="/603749E8/603BEC84" Ref="UAI287"  Part="1" 
AR Path="/5FC1A6C6/5FC1AD94/603BEC84" Ref="UAI287"  Part="1" 
F 0 "UAI287" H 7200 12077 50  0000 C CNN
F 1 "M198C" H 7200 11986 50  0000 C CNN
F 2 "" H 7050 13250 50  0001 C CNN
F 3 "" H 7050 13250 50  0001 C CNN
	1    7050 13250
	1    0    0    -1  
$EndComp
NoConn ~ 2500 3100
NoConn ~ 1750 3100
Wire Bus Line
	3100 2900 3100 3950
Wire Bus Line
	3100 3950 3100 5100
Wire Bus Line
	3100 6300 3100 7350
Wire Bus Line
	3100 7350 3100 8500
Wire Bus Line
	3100 9700 3100 10750
Wire Bus Line
	3100 10750 3100 11900
Wire Bus Line
	3100 13100 3100 14150
Wire Bus Line
	3100 14150 3100 15300
$EndSCHEMATC
