EESchema Schematic File Version 4
EELAYER 30 0
EELAYER END
$Descr A2 16535 23386 portrait
encoding utf-8
Sheet 47 69
Title ""
Date "2020-11-26"
Rev ""
Comp ""
Comment1 "Licence: CC-BY"
Comment2 "Author: Loïc *WydD* Petit"
Comment3 ""
Comment4 ""
$EndDescr
Connection ~ 10200 3550
Connection ~ 10200 3050
Connection ~ 9000 4150
Connection ~ 10200 4050
Connection ~ 9000 4650
Connection ~ 11300 18850
Connection ~ 11300 18950
Connection ~ 11300 17300
Connection ~ 11300 17400
Connection ~ 10200 4550
Connection ~ 9000 6050
Connection ~ 10200 5200
Connection ~ 10200 5950
Connection ~ 10200 6650
Connection ~ 9000 7350
Connection ~ 8900 5400
Connection ~ 8900 6750
Connection ~ 8900 7450
Connection ~ 8900 3150
Connection ~ 8900 3650
Connection ~ 12450 11000
Connection ~ 12450 11900
Connection ~ 3450 12800
Connection ~ 12450 11100
Connection ~ 3450 12900
Connection ~ 10100 6250
Connection ~ 9000 5200
Connection ~ 8800 3250
Connection ~ 12450 12000
Connection ~ 8900 10200
Connection ~ 9000 9700
Connection ~ 8800 10700
Connection ~ 8700 11200
Connection ~ 10850 10200
Connection ~ 8700 4850
Connection ~ 8700 5600
Connection ~ 8700 7650
Connection ~ 10100 6850
Connection ~ 8800 7150
Connection ~ 10100 7150
Connection ~ 8700 6550
Connection ~ 10000 6550
Connection ~ 10000 4750
Connection ~ 10000 4250
Connection ~ 10000 3650
Connection ~ 8800 3850
Connection ~ 8600 11700
Connection ~ 10550 10300
Connection ~ 10650 10500
Connection ~ 10950 10000
Connection ~ 10550 12500
Connection ~ 10650 12400
Connection ~ 10750 12300
Connection ~ 10850 12200
Connection ~ 10950 11600
Connection ~ 8500 12200
Connection ~ 8400 12700
Connection ~ 10350 12700
Connection ~ 8300 13200
Connection ~ 8800 8950
Connection ~ 8900 8450
Connection ~ 11350 10600
Connection ~ 3500 11000
Connection ~ 3500 11100
Connection ~ 3450 16200
Connection ~ 3450 16300
Connection ~ 3450 17900
Connection ~ 3450 17800
Connection ~ 3450 17700
Connection ~ 3450 16100
Connection ~ 3450 14600
Connection ~ 3450 14700
Connection ~ 3650 10800
Connection ~ 3850 10600
Connection ~ 3500 7600
Connection ~ 3500 7500
Connection ~ 3500 7400
Connection ~ 3500 7300
Connection ~ 3850 7100
Connection ~ 3500 5950
Connection ~ 3500 5850
Connection ~ 3500 5750
Connection ~ 3500 5650
Connection ~ 3500 5550
Connection ~ 3950 10500
Connection ~ 8800 2300
Connection ~ 8900 1750
Connection ~ 3750 12500
Connection ~ 3500 9150
Connection ~ 3500 9250
Connection ~ 3850 8750
Connection ~ 7900 10500
Connection ~ 8000 10600
Connection ~ 8100 10700
Connection ~ 3650 9550
Connection ~ 8100 8850
Connection ~ 7800 15600
Connection ~ 7900 7000
Connection ~ 3750 10700
Connection ~ 7800 10400
Connection ~ 7700 10300
Connection ~ 4050 10400
Connection ~ 4050 8550
Connection ~ 4050 14000
Connection ~ 3750 14300
Connection ~ 3750 15900
Connection ~ 8000 17400
Connection ~ 8000 15800
Connection ~ 7900 15700
Connection ~ 7900 17300
Connection ~ 7700 12100
Connection ~ 3950 12300
Connection ~ 4050 12200
Connection ~ 7700 8450
Connection ~ 7700 21150
Connection ~ 7800 21250
Connection ~ 7900 21350
Connection ~ 8000 21450
Connection ~ 7700 18350
Connection ~ 7600 21050
Connection ~ 7700 17100
Connection ~ 7700 13900
Connection ~ 7700 6800
Connection ~ 7700 15500
Connection ~ 7700 19250
Connection ~ 7600 10200
Connection ~ 4250 10200
Connection ~ 7600 17000
Connection ~ 7600 15400
Connection ~ 7600 13800
Connection ~ 7600 19350
Connection ~ 7600 6700
Connection ~ 7500 19450
Connection ~ 7500 13700
Connection ~ 7500 10100
Connection ~ 4350 10100
Connection ~ 4350 11900
Connection ~ 4250 12000
Connection ~ 7500 20950
Connection ~ 7500 15300
Connection ~ 7500 16900
Connection ~ 7500 6600
Connection ~ 7400 13600
Connection ~ 7400 10000
Connection ~ 4450 10000
Connection ~ 4450 11800
Connection ~ 7400 19550
Connection ~ 7400 6500
Connection ~ 7400 20850
Connection ~ 7400 15200
Connection ~ 7400 16800
Connection ~ 7200 9900
Connection ~ 7200 18950
Connection ~ 7200 20750
Connection ~ 4550 13500
Connection ~ 4550 9900
Connection ~ 4550 6400
Connection ~ 4550 16700
Connection ~ 4550 15100
Connection ~ 4550 11700
Connection ~ 4550 8050
Connection ~ 4550 18750
Connection ~ 11650 10100
Connection ~ 10750 10400
Connection ~ 12150 9900
Connection ~ 10250 13300
Connection ~ 10350 13200
Connection ~ 10450 13100
Connection ~ 10250 13650
Connection ~ 10350 13750
Connection ~ 10450 13850
Connection ~ 10550 13950
Connection ~ 10650 14050
Connection ~ 10750 14150
Connection ~ 10850 14250
Connection ~ 10250 12100
Connection ~ 8300 15000
Connection ~ 8400 14900
Connection ~ 8500 14800
Connection ~ 8600 14700
Connection ~ 8300 9100
Connection ~ 8400 9200
Connection ~ 8500 9300
Connection ~ 11350 9300
Connection ~ 11450 9200
Connection ~ 11550 9100
Connection ~ 10950 9700
Connection ~ 10750 10700
Connection ~ 10650 11200
Connection ~ 10550 11700
Connection ~ 10450 12200
Connection ~ 10250 13200
Connection ~ 14050 12300
Connection ~ 13950 12100
Connection ~ 13850 13200
Connection ~ 7400 3750
Connection ~ 7500 3850
Connection ~ 7600 3950
Connection ~ 7700 4050
Connection ~ 7800 4150
Connection ~ 7900 4250
Connection ~ 4550 4750
Connection ~ 7400 4850
Connection ~ 7500 4950
Connection ~ 7600 5050
Connection ~ 7700 5150
Connection ~ 3950 8650
Connection ~ 4050 6900
Connection ~ 3850 12400
Connection ~ 8300 16400
Connection ~ 8300 17950
Connection ~ 8300 20750
Connection ~ 8400 16500
Connection ~ 8400 18050
Connection ~ 8400 20850
Connection ~ 8500 16600
Connection ~ 8500 18150
Connection ~ 8500 20950
Connection ~ 8600 16700
Connection ~ 8600 18250
Connection ~ 8600 21050
Connection ~ 8700 16800
Connection ~ 8700 18350
Connection ~ 8700 21150
Connection ~ 8800 16900
Connection ~ 8800 18450
Connection ~ 8800 21250
Connection ~ 8900 17000
Connection ~ 8900 18550
Connection ~ 8900 19650
Connection ~ 9000 17100
Connection ~ 9000 18650
Connection ~ 9000 19750
Connection ~ 5200 22350
Connection ~ 8100 22150
Connection ~ 11800 20350
NoConn ~ 11900 16900
NoConn ~ 11900 18450
NoConn ~ 1150 6100
Entry Wire Line
	3700 20650 3800 20750
Entry Wire Line
	3700 20750 3800 20850
Entry Wire Line
	3700 20850 3800 20950
Entry Wire Line
	3700 20950 3800 21050
Entry Wire Line
	3700 21050 3800 21150
Entry Wire Line
	3700 21150 3800 21250
Entry Wire Line
	3700 21250 3800 21350
Entry Wire Line
	3700 21350 3800 21450
Entry Wire Line
	3700 22050 3800 22150
Entry Wire Line
	3700 22150 3800 22250
Entry Wire Line
	3700 22250 3800 22350
Entry Wire Line
	3700 22350 3800 22450
Entry Wire Line
	11800 19750 11700 19650
Entry Wire Line
	11800 19850 11700 19750
Entry Wire Line
	11800 19950 11700 19850
Entry Wire Line
	11800 20050 11700 19950
Entry Wire Line
	11800 20450 11700 20550
Entry Wire Line
	11800 20550 11700 20650
Entry Wire Line
	11800 20650 11700 20750
Entry Wire Line
	11800 20750 11700 20850
Entry Wire Line
	11800 20850 11700 20950
Entry Wire Line
	11800 20950 11700 21050
Entry Wire Line
	11800 21050 11700 21150
Entry Wire Line
	11800 21150 11700 21250
Wire Wire Line
	1100 19000 1450 19000
Wire Wire Line
	1750 4050 1450 4050
Wire Wire Line
	1850 12300 2250 12300
Wire Wire Line
	1900 8650 2300 8650
Wire Wire Line
	1900 10500 2300 10500
Wire Wire Line
	2050 18550 2200 18550
Wire Wire Line
	2050 18850 2050 18550
Wire Wire Line
	2050 18950 7200 18950
Wire Wire Line
	2050 19050 2150 19050
Wire Wire Line
	2050 19700 2050 19150
Wire Wire Line
	2050 19700 2450 19700
Wire Wire Line
	2150 19050 2150 19500
Wire Wire Line
	2150 19500 2250 19500
Wire Wire Line
	2250 15700 1700 15700
Wire Wire Line
	2250 17300 1700 17300
Wire Wire Line
	2300 4350 2300 4100
Wire Wire Line
	2300 4350 2850 4350
Wire Wire Line
	2300 6050 2300 5350
Wire Wire Line
	2300 6150 2300 7000
Wire Wire Line
	2850 14100 2300 14100
Wire Wire Line
	3450 11700 4550 11700
Wire Wire Line
	3450 11800 4450 11800
Wire Wire Line
	3450 12000 4250 12000
Wire Wire Line
	3450 12100 7700 12100
Wire Wire Line
	3450 12300 3950 12300
Wire Wire Line
	3450 12400 3850 12400
Wire Wire Line
	3450 12500 3750 12500
Wire Wire Line
	3450 12800 3450 12700
Wire Wire Line
	3450 12900 3450 12800
Wire Wire Line
	3450 13500 4550 13500
Wire Wire Line
	3450 13600 7400 13600
Wire Wire Line
	3450 13700 7500 13700
Wire Wire Line
	3450 13800 7600 13800
Wire Wire Line
	3450 13900 7700 13900
Wire Wire Line
	3450 14100 3950 14100
Wire Wire Line
	3450 14200 3850 14200
Wire Wire Line
	3450 14300 3750 14300
Wire Wire Line
	3450 14600 3450 14500
Wire Wire Line
	3450 14700 3450 14600
Wire Wire Line
	3450 15100 4550 15100
Wire Wire Line
	3450 15200 7400 15200
Wire Wire Line
	3450 15300 7500 15300
Wire Wire Line
	3450 15400 7600 15400
Wire Wire Line
	3450 15500 7700 15500
Wire Wire Line
	3450 15600 7800 15600
Wire Wire Line
	3450 15700 7900 15700
Wire Wire Line
	3450 15800 8000 15800
Wire Wire Line
	3450 16100 3450 16000
Wire Wire Line
	3450 16200 3450 16100
Wire Wire Line
	3450 16300 3450 16200
Wire Wire Line
	3450 16700 4550 16700
Wire Wire Line
	3450 16800 7400 16800
Wire Wire Line
	3450 16900 7500 16900
Wire Wire Line
	3450 17000 7600 17000
Wire Wire Line
	3450 17100 7700 17100
Wire Wire Line
	3450 17200 4050 17200
Wire Wire Line
	3450 17300 7900 17300
Wire Wire Line
	3450 17400 8000 17400
Wire Wire Line
	3450 17700 3450 17600
Wire Wire Line
	3450 17800 3450 17700
Wire Wire Line
	3450 17900 3450 17800
Wire Wire Line
	3450 19250 7700 19250
Wire Wire Line
	3450 19350 7600 19350
Wire Wire Line
	3450 19450 7500 19450
Wire Wire Line
	3450 19550 7400 19550
Wire Wire Line
	3450 19750 4000 19750
Wire Wire Line
	3500 3750 7400 3750
Wire Wire Line
	3500 3850 7500 3850
Wire Wire Line
	3500 3950 7600 3950
Wire Wire Line
	3500 4050 7700 4050
Wire Wire Line
	3500 4150 7800 4150
Wire Wire Line
	3500 4250 7900 4250
Wire Wire Line
	3500 4350 3850 4350
Wire Wire Line
	3500 4850 7400 4850
Wire Wire Line
	3500 4950 7500 4950
Wire Wire Line
	3500 5050 7600 5050
Wire Wire Line
	3500 5150 7700 5150
Wire Wire Line
	3500 5350 3950 5350
Wire Wire Line
	3500 5550 3500 5450
Wire Wire Line
	3500 5650 3500 5550
Wire Wire Line
	3500 5750 3500 5650
Wire Wire Line
	3500 5850 3500 5750
Wire Wire Line
	3500 5950 3500 5850
Wire Wire Line
	3500 6500 7400 6500
Wire Wire Line
	3500 6600 7500 6600
Wire Wire Line
	3500 6700 7600 6700
Wire Wire Line
	3500 6800 7700 6800
Wire Wire Line
	3500 6900 4050 6900
Wire Wire Line
	3500 7000 7900 7000
Wire Wire Line
	3500 7100 3850 7100
Wire Wire Line
	3500 7300 3500 7200
Wire Wire Line
	3500 7400 3500 7300
Wire Wire Line
	3500 7500 3500 7400
Wire Wire Line
	3500 7600 3500 7500
Wire Wire Line
	3500 8050 4550 8050
Wire Wire Line
	3500 8550 4050 8550
Wire Wire Line
	3500 8650 3950 8650
Wire Wire Line
	3500 8850 8100 8850
Wire Wire Line
	3500 9150 3500 9050
Wire Wire Line
	3500 9250 3500 9150
Wire Wire Line
	3500 9900 4550 9900
Wire Wire Line
	3500 10000 4450 10000
Wire Wire Line
	3500 10100 4350 10100
Wire Wire Line
	3500 10300 7700 10300
Wire Wire Line
	3500 10500 3950 10500
Wire Wire Line
	3500 10600 3850 10600
Wire Wire Line
	3500 10700 3750 10700
Wire Wire Line
	3500 10900 3500 11000
Wire Wire Line
	3500 11000 3500 11100
Wire Wire Line
	3550 12900 3450 12900
Wire Wire Line
	3550 14700 3450 14700
Wire Wire Line
	3550 16300 3450 16300
Wire Wire Line
	3550 17900 3450 17900
Wire Wire Line
	3600 5950 3500 5950
Wire Wire Line
	3600 7600 3500 7600
Wire Wire Line
	3600 9250 3500 9250
Wire Wire Line
	3600 11100 3500 11100
Wire Wire Line
	3650 8950 3500 8950
Wire Wire Line
	3650 9550 3350 9550
Wire Wire Line
	3650 9550 3650 8950
Wire Wire Line
	3650 10800 3500 10800
Wire Wire Line
	3650 10800 3650 9550
Wire Wire Line
	3650 10800 3650 14400
Wire Wire Line
	3650 14400 3450 14400
Wire Wire Line
	3750 12500 3750 10700
Wire Wire Line
	3750 12500 3750 14300
Wire Wire Line
	3750 14300 3750 15900
Wire Wire Line
	3750 15900 3450 15900
Wire Wire Line
	3750 15900 3750 17500
Wire Wire Line
	3750 17500 3450 17500
Wire Wire Line
	3850 4350 3850 7100
Wire Wire Line
	3850 7100 3850 8750
Wire Wire Line
	3850 8750 3500 8750
Wire Wire Line
	3850 8750 3850 10600
Wire Wire Line
	3850 10600 3850 12400
Wire Wire Line
	3850 10600 5650 10600
Wire Wire Line
	3850 12400 3850 14200
Wire Wire Line
	3950 5350 3950 8650
Wire Wire Line
	3950 8650 3950 10500
Wire Wire Line
	3950 10500 3950 12300
Wire Wire Line
	3950 12300 3950 14100
Wire Wire Line
	4050 5250 3500 5250
Wire Wire Line
	4050 6900 4050 5250
Wire Wire Line
	4050 6900 4050 8550
Wire Wire Line
	4050 8550 4050 10400
Wire Wire Line
	4050 10400 3500 10400
Wire Wire Line
	4050 10400 4050 12200
Wire Wire Line
	4050 12200 3450 12200
Wire Wire Line
	4050 12200 4050 14000
Wire Wire Line
	4050 14000 3450 14000
Wire Wire Line
	4050 17200 4050 14000
Wire Wire Line
	4200 20750 3800 20750
Wire Wire Line
	4200 20850 3800 20850
Wire Wire Line
	4200 20950 3800 20950
Wire Wire Line
	4200 21050 3800 21050
Wire Wire Line
	4200 21150 3800 21150
Wire Wire Line
	4200 21250 3800 21250
Wire Wire Line
	4200 21350 3800 21350
Wire Wire Line
	4200 21450 3800 21450
Wire Wire Line
	4200 22150 3800 22150
Wire Wire Line
	4200 22250 3800 22250
Wire Wire Line
	4200 22350 3800 22350
Wire Wire Line
	4200 22450 3800 22450
Wire Wire Line
	4250 8350 3500 8350
Wire Wire Line
	4250 10200 3500 10200
Wire Wire Line
	4250 10200 4250 8350
Wire Wire Line
	4250 10200 5350 10200
Wire Wire Line
	4250 12000 4250 10200
Wire Wire Line
	4250 12000 4250 18450
Wire Wire Line
	4250 18450 3450 18450
Wire Wire Line
	4350 8250 3500 8250
Wire Wire Line
	4350 10100 4350 8250
Wire Wire Line
	4350 10100 4350 11900
Wire Wire Line
	4350 11900 3450 11900
Wire Wire Line
	4350 11900 4350 18550
Wire Wire Line
	4350 18550 3450 18550
Wire Wire Line
	4450 8150 3500 8150
Wire Wire Line
	4450 10000 4450 8150
Wire Wire Line
	4450 10000 5950 10000
Wire Wire Line
	4450 11800 4450 10000
Wire Wire Line
	4450 11800 4450 18650
Wire Wire Line
	4450 18650 3450 18650
Wire Wire Line
	4550 3650 3500 3650
Wire Wire Line
	4550 3650 4550 4750
Wire Wire Line
	4550 4750 3500 4750
Wire Wire Line
	4550 4750 4550 6400
Wire Wire Line
	4550 6400 3500 6400
Wire Wire Line
	4550 8050 4550 6400
Wire Wire Line
	4550 9900 4550 8050
Wire Wire Line
	4550 9900 4550 11700
Wire Wire Line
	4550 11700 4550 13500
Wire Wire Line
	4550 13500 4550 15100
Wire Wire Line
	4550 15100 4550 16700
Wire Wire Line
	4550 16700 4550 18750
Wire Wire Line
	4550 18750 3450 18750
Wire Wire Line
	4550 18750 4550 19650
Wire Wire Line
	4550 19650 3450 19650
Wire Wire Line
	4650 12600 3450 12600
Wire Wire Line
	4700 18350 3450 18350
Wire Wire Line
	5200 20750 7200 20750
Wire Wire Line
	5200 20850 7400 20850
Wire Wire Line
	5200 20950 7500 20950
Wire Wire Line
	5200 21150 7700 21150
Wire Wire Line
	5200 21350 7900 21350
Wire Wire Line
	5200 21450 8000 21450
Wire Wire Line
	5200 22150 8100 22150
Wire Wire Line
	5200 22350 5200 22450
Wire Wire Line
	5200 22350 5500 22350
Wire Wire Line
	5200 22600 5300 22600
Wire Wire Line
	5300 18350 7700 18350
Wire Wire Line
	5300 21650 5200 21650
Wire Wire Line
	5350 10700 3750 10700
Wire Wire Line
	5500 22250 5200 22250
Wire Wire Line
	5550 12600 5250 12600
Wire Wire Line
	5650 10100 4350 10100
Wire Wire Line
	5950 10200 7600 10200
Wire Wire Line
	5950 10500 3950 10500
Wire Wire Line
	5950 10700 8100 10700
Wire Wire Line
	6250 9900 4550 9900
Wire Wire Line
	6250 10100 7500 10100
Wire Wire Line
	6250 10400 4050 10400
Wire Wire Line
	6250 10600 8000 10600
Wire Wire Line
	6500 1200 9000 1200
Wire Wire Line
	6500 1300 8900 1300
Wire Wire Line
	6500 1400 8800 1400
Wire Wire Line
	6500 1500 8700 1500
Wire Wire Line
	6500 1600 8600 1600
Wire Wire Line
	6500 1700 8500 1700
Wire Wire Line
	6500 1800 8400 1800
Wire Wire Line
	6500 1900 8300 1900
Wire Wire Line
	6500 2000 8100 2000
Wire Wire Line
	6500 2100 8000 2100
Wire Wire Line
	6500 2200 7900 2200
Wire Wire Line
	6500 2300 7800 2300
Wire Wire Line
	6500 2400 7700 2400
Wire Wire Line
	6500 2500 7600 2500
Wire Wire Line
	6500 2600 7500 2600
Wire Wire Line
	6500 2700 7400 2700
Wire Wire Line
	6500 2800 7200 2800
Wire Wire Line
	6550 10000 7400 10000
Wire Wire Line
	6550 10500 7900 10500
Wire Wire Line
	6850 9900 7200 9900
Wire Wire Line
	6850 10400 7800 10400
Wire Wire Line
	7200 2800 7200 9900
Wire Wire Line
	7200 9900 7200 18950
Wire Wire Line
	7200 18950 7200 20750
Wire Wire Line
	7200 20750 7200 22700
Wire Wire Line
	7400 2700 7400 3750
Wire Wire Line
	7400 3750 7400 4850
Wire Wire Line
	7400 4850 7400 6500
Wire Wire Line
	7400 6500 7400 10000
Wire Wire Line
	7400 10000 7400 13600
Wire Wire Line
	7400 13600 7400 15200
Wire Wire Line
	7400 15200 7400 16800
Wire Wire Line
	7400 16800 7400 19550
Wire Wire Line
	7400 19550 7400 20850
Wire Wire Line
	7400 20850 7400 22700
Wire Wire Line
	7500 2600 7500 3850
Wire Wire Line
	7500 3850 7500 4950
Wire Wire Line
	7500 4950 7500 6600
Wire Wire Line
	7500 6600 7500 10100
Wire Wire Line
	7500 10100 7500 13700
Wire Wire Line
	7500 13700 7500 15300
Wire Wire Line
	7500 15300 7500 16900
Wire Wire Line
	7500 16900 7500 19450
Wire Wire Line
	7500 19450 7500 20950
Wire Wire Line
	7500 20950 7500 22700
Wire Wire Line
	7600 2500 7600 3950
Wire Wire Line
	7600 3950 7600 5050
Wire Wire Line
	7600 5050 7600 6700
Wire Wire Line
	7600 6700 7600 10200
Wire Wire Line
	7600 10200 7600 13800
Wire Wire Line
	7600 13800 7600 15400
Wire Wire Line
	7600 15400 7600 17000
Wire Wire Line
	7600 17000 7600 19350
Wire Wire Line
	7600 19350 7600 21050
Wire Wire Line
	7600 21050 5200 21050
Wire Wire Line
	7600 21050 7600 22700
Wire Wire Line
	7700 2400 7700 4050
Wire Wire Line
	7700 4050 7700 5150
Wire Wire Line
	7700 5150 7700 6800
Wire Wire Line
	7700 6800 7700 8450
Wire Wire Line
	7700 8450 3500 8450
Wire Wire Line
	7700 8450 7700 10300
Wire Wire Line
	7700 10300 7700 12100
Wire Wire Line
	7700 12100 7700 13900
Wire Wire Line
	7700 13900 7700 15500
Wire Wire Line
	7700 15500 7700 17100
Wire Wire Line
	7700 17100 7700 18350
Wire Wire Line
	7700 18350 7700 19250
Wire Wire Line
	7700 19250 7700 21150
Wire Wire Line
	7700 21150 7700 22700
Wire Wire Line
	7800 2300 7800 4150
Wire Wire Line
	7800 4150 7800 10400
Wire Wire Line
	7800 10400 7800 15600
Wire Wire Line
	7800 15600 7800 21250
Wire Wire Line
	7800 21250 5200 21250
Wire Wire Line
	7800 21250 7800 22700
Wire Wire Line
	7900 2200 7900 4250
Wire Wire Line
	7900 4250 7900 7000
Wire Wire Line
	7900 7000 7900 10500
Wire Wire Line
	7900 10500 7900 15700
Wire Wire Line
	7900 15700 7900 17300
Wire Wire Line
	7900 17300 7900 21350
Wire Wire Line
	7900 21350 7900 22700
Wire Wire Line
	8000 2100 8000 10600
Wire Wire Line
	8000 10600 8000 15800
Wire Wire Line
	8000 15800 8000 17400
Wire Wire Line
	8000 17400 8000 21450
Wire Wire Line
	8000 21450 8000 22700
Wire Wire Line
	8100 2000 8100 8850
Wire Wire Line
	8100 8850 8100 10700
Wire Wire Line
	8100 10700 8100 22150
Wire Wire Line
	8100 22150 8100 22700
Wire Wire Line
	8300 1900 8300 9100
Wire Wire Line
	8300 9100 8300 13200
Wire Wire Line
	8300 9100 11550 9100
Wire Wire Line
	8300 13200 8300 15000
Wire Wire Line
	8300 15000 8300 16400
Wire Wire Line
	8300 15000 12450 15000
Wire Wire Line
	8300 16400 8300 17950
Wire Wire Line
	8300 17950 8300 20750
Wire Wire Line
	8300 17950 11300 17950
Wire Wire Line
	8300 20750 8300 22700
Wire Wire Line
	8300 20750 10300 20750
Wire Wire Line
	8400 1800 8400 9200
Wire Wire Line
	8400 9200 8400 12700
Wire Wire Line
	8400 9200 11450 9200
Wire Wire Line
	8400 12700 8400 14900
Wire Wire Line
	8400 14900 8400 16500
Wire Wire Line
	8400 14900 12450 14900
Wire Wire Line
	8400 16500 8400 18050
Wire Wire Line
	8400 18050 8400 20850
Wire Wire Line
	8400 18050 11300 18050
Wire Wire Line
	8400 20850 8400 22700
Wire Wire Line
	8500 1700 8500 9300
Wire Wire Line
	8500 9300 8500 12200
Wire Wire Line
	8500 9300 11350 9300
Wire Wire Line
	8500 12200 8500 14800
Wire Wire Line
	8500 14800 8500 16600
Wire Wire Line
	8500 14800 12450 14800
Wire Wire Line
	8500 16600 8500 18150
Wire Wire Line
	8500 18150 8500 20950
Wire Wire Line
	8500 18150 11300 18150
Wire Wire Line
	8500 20950 8500 22700
Wire Wire Line
	8500 20950 10300 20950
Wire Wire Line
	8600 1600 8600 11700
Wire Wire Line
	8600 11700 8600 14700
Wire Wire Line
	8600 14700 8600 16700
Wire Wire Line
	8600 14700 12450 14700
Wire Wire Line
	8600 16700 8600 18250
Wire Wire Line
	8600 16700 11300 16700
Wire Wire Line
	8600 18250 8600 21050
Wire Wire Line
	8600 21050 8600 22700
Wire Wire Line
	8700 1500 8700 4850
Wire Wire Line
	8700 4850 8700 5600
Wire Wire Line
	8700 5600 8700 6550
Wire Wire Line
	8700 6550 8700 7650
Wire Wire Line
	8700 7650 8700 11200
Wire Wire Line
	8700 11200 8700 16800
Wire Wire Line
	8700 16800 8700 18350
Wire Wire Line
	8700 16800 11300 16800
Wire Wire Line
	8700 18350 8700 21150
Wire Wire Line
	8700 18350 11300 18350
Wire Wire Line
	8700 21150 8700 22700
Wire Wire Line
	8800 1400 8800 2300
Wire Wire Line
	8800 2300 8800 3250
Wire Wire Line
	8800 3250 8800 3850
Wire Wire Line
	8800 3850 8800 7150
Wire Wire Line
	8800 3850 9900 3850
Wire Wire Line
	8800 7150 8800 8950
Wire Wire Line
	8800 8950 8800 10700
Wire Wire Line
	8800 10700 8800 16900
Wire Wire Line
	8800 16900 8800 18450
Wire Wire Line
	8800 16900 11300 16900
Wire Wire Line
	8800 18450 8800 21250
Wire Wire Line
	8800 18450 11300 18450
Wire Wire Line
	8800 21250 8800 22700
Wire Wire Line
	8900 1300 8900 1750
Wire Wire Line
	8900 1750 8900 3150
Wire Wire Line
	8900 3150 8900 3650
Wire Wire Line
	8900 3650 8900 5400
Wire Wire Line
	8900 5400 8900 6750
Wire Wire Line
	8900 6750 8900 7450
Wire Wire Line
	8900 7450 8900 8450
Wire Wire Line
	8900 8450 8900 10200
Wire Wire Line
	8900 10200 8900 17000
Wire Wire Line
	8900 17000 8900 18550
Wire Wire Line
	8900 17000 11300 17000
Wire Wire Line
	8900 18550 8900 19650
Wire Wire Line
	8900 18550 11300 18550
Wire Wire Line
	8900 19650 8900 22700
Wire Wire Line
	9000 1200 9000 4150
Wire Wire Line
	9000 4150 9000 4650
Wire Wire Line
	9000 4650 9000 5200
Wire Wire Line
	9000 5200 9000 6050
Wire Wire Line
	9000 6050 9000 7350
Wire Wire Line
	9000 7350 9000 9700
Wire Wire Line
	9000 9700 9000 17100
Wire Wire Line
	9000 9700 9300 9700
Wire Wire Line
	9000 17100 9000 18650
Wire Wire Line
	9000 17100 11300 17100
Wire Wire Line
	9000 18650 9000 19750
Wire Wire Line
	9000 18650 11300 18650
Wire Wire Line
	9000 19750 9000 22700
Wire Wire Line
	9150 18250 8600 18250
Wire Wire Line
	9200 16600 8500 16600
Wire Wire Line
	9300 3650 8900 3650
Wire Wire Line
	9300 5200 9000 5200
Wire Wire Line
	9300 6550 8700 6550
Wire Wire Line
	9300 7150 8800 7150
Wire Wire Line
	9300 8450 8900 8450
Wire Wire Line
	9300 8950 8800 8950
Wire Wire Line
	9300 10200 8900 10200
Wire Wire Line
	9300 10700 8800 10700
Wire Wire Line
	9300 11200 8700 11200
Wire Wire Line
	9300 11700 8600 11700
Wire Wire Line
	9300 12200 8500 12200
Wire Wire Line
	9300 12700 8400 12700
Wire Wire Line
	9300 13200 8300 13200
Wire Wire Line
	9600 15850 10000 15850
Wire Wire Line
	9600 15950 10000 15950
Wire Wire Line
	9700 16500 8400 16500
Wire Wire Line
	9750 17850 11300 17850
Wire Wire Line
	9750 18250 11300 18250
Wire Wire Line
	9750 19850 10300 19850
Wire Wire Line
	9750 19950 10300 19950
Wire Wire Line
	9800 16600 11300 16600
Wire Wire Line
	9900 3650 10000 3650
Wire Wire Line
	9900 3750 10300 3750
Wire Wire Line
	9900 3850 9900 3750
Wire Wire Line
	9900 5200 10100 5200
Wire Wire Line
	9900 6550 10000 6550
Wire Wire Line
	9900 7150 10100 7150
Wire Wire Line
	9900 7950 10200 7950
Wire Wire Line
	9900 9700 10950 9700
Wire Wire Line
	9900 10200 10850 10200
Wire Wire Line
	9900 10700 10750 10700
Wire Wire Line
	9900 11200 10650 11200
Wire Wire Line
	9900 11700 10550 11700
Wire Wire Line
	9900 12200 10450 12200
Wire Wire Line
	9900 12700 10350 12700
Wire Wire Line
	9900 13200 10250 13200
Wire Wire Line
	10000 3650 10300 3650
Wire Wire Line
	10000 4250 10000 3650
Wire Wire Line
	10000 4250 10300 4250
Wire Wire Line
	10000 4750 10000 4250
Wire Wire Line
	10000 4750 10300 4750
Wire Wire Line
	10000 6150 10000 4750
Wire Wire Line
	10000 6350 10300 6350
Wire Wire Line
	10000 6550 10000 6350
Wire Wire Line
	10000 6550 10000 6950
Wire Wire Line
	10000 6950 10300 6950
Wire Wire Line
	10100 5200 10100 5300
Wire Wire Line
	10100 5300 10300 5300
Wire Wire Line
	10100 5500 10100 6250
Wire Wire Line
	10100 6250 10100 6850
Wire Wire Line
	10100 7150 10100 6850
Wire Wire Line
	10100 7550 10100 7150
Wire Wire Line
	10100 7550 10300 7550
Wire Wire Line
	10200 2900 10200 3050
Wire Wire Line
	10200 3050 10300 3050
Wire Wire Line
	10200 3550 10200 3050
Wire Wire Line
	10200 3550 10200 4050
Wire Wire Line
	10200 3550 10300 3550
Wire Wire Line
	10200 4050 10200 4550
Wire Wire Line
	10200 5200 10200 4550
Wire Wire Line
	10200 5950 10200 5200
Wire Wire Line
	10200 6650 10200 5950
Wire Wire Line
	10200 7250 10200 6650
Wire Wire Line
	10200 7950 10200 8350
Wire Wire Line
	10200 8350 10300 8350
Wire Wire Line
	10200 8550 10200 8950
Wire Wire Line
	10200 8950 9900 8950
Wire Wire Line
	10200 16400 8300 16400
Wire Wire Line
	10200 20100 10300 20100
Wire Wire Line
	10200 21450 10200 20100
Wire Wire Line
	10250 12100 10250 9600
Wire Wire Line
	10250 12100 10250 13200
Wire Wire Line
	10250 12100 12450 12100
Wire Wire Line
	10250 13200 10250 13300
Wire Wire Line
	10250 13300 10250 13650
Wire Wire Line
	10250 13650 10250 14450
Wire Wire Line
	10300 3150 8900 3150
Wire Wire Line
	10300 3250 8800 3250
Wire Wire Line
	10300 4050 10200 4050
Wire Wire Line
	10300 4150 9000 4150
Wire Wire Line
	10300 4550 10200 4550
Wire Wire Line
	10300 4650 9000 4650
Wire Wire Line
	10300 4850 8700 4850
Wire Wire Line
	10300 5200 10200 5200
Wire Wire Line
	10300 5400 8900 5400
Wire Wire Line
	10300 5500 10100 5500
Wire Wire Line
	10300 5600 8700 5600
Wire Wire Line
	10300 5950 10200 5950
Wire Wire Line
	10300 6050 9000 6050
Wire Wire Line
	10300 6150 10000 6150
Wire Wire Line
	10300 6250 10100 6250
Wire Wire Line
	10300 6650 10200 6650
Wire Wire Line
	10300 6750 8900 6750
Wire Wire Line
	10300 6850 10100 6850
Wire Wire Line
	10300 7250 10200 7250
Wire Wire Line
	10300 7350 9000 7350
Wire Wire Line
	10300 7450 8900 7450
Wire Wire Line
	10300 7650 8700 7650
Wire Wire Line
	10300 8450 9900 8450
Wire Wire Line
	10300 8550 10200 8550
Wire Wire Line
	10300 16500 11300 16500
Wire Wire Line
	10300 19650 8900 19650
Wire Wire Line
	10300 19750 9000 19750
Wire Wire Line
	10300 20550 9750 20550
Wire Wire Line
	10300 20650 9750 20650
Wire Wire Line
	10300 20850 8400 20850
Wire Wire Line
	10300 21050 8600 21050
Wire Wire Line
	10300 21150 8700 21150
Wire Wire Line
	10300 21250 8800 21250
Wire Wire Line
	10300 21450 10200 21450
Wire Wire Line
	10350 12700 10350 9600
Wire Wire Line
	10350 12700 10350 13200
Wire Wire Line
	10350 13200 10350 13750
Wire Wire Line
	10350 13750 10350 14450
Wire Wire Line
	10450 9600 10450 12200
Wire Wire Line
	10450 12200 10450 13100
Wire Wire Line
	10450 13100 10450 13850
Wire Wire Line
	10450 13850 10450 14450
Wire Wire Line
	10450 13850 12450 13850
Wire Wire Line
	10550 9600 10550 10300
Wire Wire Line
	10550 10300 10550 11700
Wire Wire Line
	10550 11700 10550 12500
Wire Wire Line
	10550 12500 10550 13950
Wire Wire Line
	10550 13950 10550 14450
Wire Wire Line
	10650 1200 9000 1200
Wire Wire Line
	10650 1750 8900 1750
Wire Wire Line
	10650 2300 8800 2300
Wire Wire Line
	10650 9600 10650 10500
Wire Wire Line
	10650 10500 10650 11200
Wire Wire Line
	10650 10500 12450 10500
Wire Wire Line
	10650 11200 10650 12400
Wire Wire Line
	10650 12400 10650 14050
Wire Wire Line
	10650 12400 12450 12400
Wire Wire Line
	10650 14050 10650 14450
Wire Wire Line
	10650 14050 12450 14050
Wire Wire Line
	10750 10400 10750 9600
Wire Wire Line
	10750 10400 10750 10700
Wire Wire Line
	10750 10700 10750 12300
Wire Wire Line
	10750 12300 10750 14150
Wire Wire Line
	10750 12300 12450 12300
Wire Wire Line
	10750 14150 10750 14450
Wire Wire Line
	10750 14150 12450 14150
Wire Wire Line
	10800 16400 11300 16400
Wire Wire Line
	10850 10200 10850 9600
Wire Wire Line
	10850 10200 10850 12200
Wire Wire Line
	10850 10200 12450 10200
Wire Wire Line
	10850 12200 10850 14250
Wire Wire Line
	10850 12200 12450 12200
Wire Wire Line
	10850 14250 10850 14450
Wire Wire Line
	10850 14250 12450 14250
Wire Wire Line
	10950 9600 10950 9700
Wire Wire Line
	10950 9700 10950 10000
Wire Wire Line
	10950 10000 10950 11600
Wire Wire Line
	10950 10000 12450 10000
Wire Wire Line
	10950 11600 10950 14450
Wire Wire Line
	10950 11600 12450 11600
Wire Wire Line
	11150 15900 11200 15900
Wire Wire Line
	11200 15900 11200 16300
Wire Wire Line
	11200 16300 11300 16300
Wire Wire Line
	11200 17400 11300 17400
Wire Wire Line
	11200 18950 11300 18950
Wire Wire Line
	11300 17300 11300 17200
Wire Wire Line
	11300 17400 11300 17300
Wire Wire Line
	11300 17500 11300 17400
Wire Wire Line
	11300 18850 11300 18750
Wire Wire Line
	11300 18950 11300 18850
Wire Wire Line
	11300 19050 11300 18950
Wire Wire Line
	11300 19650 11700 19650
Wire Wire Line
	11300 19750 11700 19750
Wire Wire Line
	11300 19850 11700 19850
Wire Wire Line
	11300 19950 11700 19950
Wire Wire Line
	11300 20550 11700 20550
Wire Wire Line
	11300 20650 11700 20650
Wire Wire Line
	11300 20750 11700 20750
Wire Wire Line
	11300 20850 11700 20850
Wire Wire Line
	11300 20950 11700 20950
Wire Wire Line
	11300 21050 11700 21050
Wire Wire Line
	11300 21150 11700 21150
Wire Wire Line
	11300 21250 11700 21250
Wire Wire Line
	11350 9300 11350 10600
Wire Wire Line
	11350 9300 13150 9300
Wire Wire Line
	11350 10600 11350 12600
Wire Wire Line
	11450 9200 11450 10700
Wire Wire Line
	11450 9200 13250 9200
Wire Wire Line
	11450 10700 12450 10700
Wire Wire Line
	11550 9100 11550 10800
Wire Wire Line
	11550 9100 13350 9100
Wire Wire Line
	11650 9000 11150 9000
Wire Wire Line
	11650 10100 11650 9000
Wire Wire Line
	11650 10100 12450 10100
Wire Wire Line
	11650 11500 11650 10100
Wire Wire Line
	12050 9900 12150 9900
Wire Wire Line
	12150 9900 12450 9900
Wire Wire Line
	12150 11700 12150 9900
Wire Wire Line
	12150 11700 12450 11700
Wire Wire Line
	12250 14500 12450 14500
Wire Wire Line
	12350 12000 12450 12000
Wire Wire Line
	12450 10300 10550 10300
Wire Wire Line
	12450 10400 10750 10400
Wire Wire Line
	12450 10600 11350 10600
Wire Wire Line
	12450 10800 11550 10800
Wire Wire Line
	12450 11000 12450 10900
Wire Wire Line
	12450 11100 12300 11100
Wire Wire Line
	12450 11100 12450 11000
Wire Wire Line
	12450 11500 11650 11500
Wire Wire Line
	12450 11900 12450 11800
Wire Wire Line
	12450 12000 12450 11900
Wire Wire Line
	12450 12500 10550 12500
Wire Wire Line
	12450 12600 11350 12600
Wire Wire Line
	12450 12700 10350 12700
Wire Wire Line
	12450 13100 10450 13100
Wire Wire Line
	12450 13200 10350 13200
Wire Wire Line
	12450 13300 10250 13300
Wire Wire Line
	12450 13650 10250 13650
Wire Wire Line
	12450 13750 10350 13750
Wire Wire Line
	12450 13950 10550 13950
Wire Wire Line
	12450 14500 12450 14350
Wire Wire Line
	13050 14850 13650 14850
Wire Wire Line
	13150 10400 13150 9300
Wire Wire Line
	13250 9200 13250 10300
Wire Wire Line
	13250 10300 13450 10300
Wire Wire Line
	13350 10200 13350 9100
Wire Wire Line
	13450 10200 13350 10200
Wire Wire Line
	13450 10400 13150 10400
Wire Wire Line
	13450 10500 13050 10500
Wire Wire Line
	13650 14000 13650 14750
Wire Wire Line
	13850 12200 14300 12200
Wire Wire Line
	13850 13200 13000 13200
Wire Wire Line
	13850 13200 13850 12200
Wire Wire Line
	13950 12100 13650 12100
Wire Wire Line
	13950 13100 13950 12100
Wire Wire Line
	14050 10350 14050 12300
Wire Wire Line
	14050 12300 14300 12300
Wire Wire Line
	14050 13000 14050 12300
Wire Wire Line
	14300 12100 13950 12100
Wire Wire Line
	14300 13000 14050 13000
Wire Wire Line
	14300 13100 13950 13100
Wire Wire Line
	14300 13200 13850 13200
Wire Wire Line
	14300 13400 14300 13300
Wire Bus Line
	3700 20550 3550 20550
Wire Bus Line
	11800 20350 11950 20350
Text Notes 950  7750 0    100  ~ 0
REALLY???\nYou don't use those?\nI mapped this for nothing?
Text Notes 1750 17400 0    50   ~ 0
Useless...
Text Notes 1850 12400 0    50   ~ 0
Useless...
Text Notes 1850 18500 0    50   ~ 0
0-15
Text Notes 1900 8750 0    50   ~ 0
Useless...
Text Notes 2050 10650 0    50   ~ 0
16
Text Notes 2200 19100 0    50   ~ 0
241-255
Text Notes 2200 19800 0    50   ~ 0
16
Text Notes 2250 18900 0    50   ~ 0
256-261
Text Notes 2350 3550 0    50   ~ 0
252-253
Text Notes 2350 4500 0    50   ~ 0
254-254
Text Notes 2350 14200 0    50   ~ 0
/240
Text Notes 2350 16100 0    50   ~ 0
254-254
Text Notes 3650 19850 0    50   ~ 0
/240
Text Notes 11450 3250 0    50   ~ 0
12-13, 14-15\nLoop at 16
Text Notes 11450 3700 0    50   ~ 0
8-9, 10-11\nLoop at 16
Text Notes 11850 1250 0    50   ~ 0
2-3\nLoop at 4
Text Notes 11850 2350 0    50   ~ 0
8-15\nLoop at 16
Text Notes 12000 1800 0    50   ~ 0
4-7\nLoop at 8
Text Notes 12050 17900 0    100  ~ 0
REALLY???\nYou don't use those?\nI mapped this for nothing?
Text Notes 12350 4800 0    50   ~ 0
18-19, 26-27\nLoop at 32
Text Notes 12400 4200 0    50   ~ 0
2-3\nLoop at 8
Text Notes 12450 6750 0    50   ~ 0
4-5, 5-6\nLoop at 32
Text Notes 12450 7400 0    50   ~ 0
22-23\nLoop at 32
Text Notes 12650 8450 0    50   ~ 0
0-1, 2-3\nLoop at 16
Text Notes 12900 5450 0    50   ~ 0
20-21\nLoop at 32
Text Notes 12900 6100 0    50   ~ 0
2-3\nLoop at 32
Text Notes 13100 10650 0    50   ~ 0
/ 448
Text Notes 13100 12450 0    50   ~ 0
64
Text Notes 13100 13150 0    50   ~ 0
0-63
Text Notes 13100 14300 0    50   ~ 0
0-3
Text Notes 13100 15050 0    50   ~ 0
480-511
Text Notes 14100 10700 0    50   ~ 0
449-511
Text Notes 14550 6550 0    50   ~ 0
TOP MATRIX BUS\n0: MAIN-~RESETI\n1: CLK8M\n2: UBD337-Q (SERIAL-CHNL)\n3: UAA254-Q (SERIAL-LOAD)\n4: UBD383-Q (GFX-CHNL)\n\n5: BPD0 (P129)\n6: BPD1 (P130)\n7: BPD2 (P131)\n8: BPD3 (P132)\n9: BPD4 (P133)\n10: BPD5 (P134)\n11: BPD6 (P135)\n12: BPD7 (P136)\n\n13: APD0 (P137)\n14: APD1 (P138)\n15: APD2 (P139)\n16: APD3 (P140)\n17: APD4 (P141)\n18: APD5 (P142)\n19: APD6 (P143)\n20: APD7 (P144)\n\n21: DPD0 (P145)\n22: DPD1 (P146)\n23: DPD2 (P147)\n24: DPD3 (P148)\n25: DPD4 (P149)\n26: DPD5 (P150)\n27: DPD6 (P151)\n28: DPD7 (P152)\n\n29: CPD0 (P137)\n30: CPD1 (P138)\n31: CPD2 (P139)\n32: CPD3 (P140)\n33: CPD4 (P141)\n34: CPD5 (P142)\n35: CPD6 (P143)\n36: CPD7 (P144)
Text Label 1450 19000 2    50   ~ 0
~VBLANK
Text Label 1700 15700 0    50   ~ 0
UCR388-Q
Text Label 1700 17300 0    50   ~ 0
UCL375-Q
Text Label 1850 12300 0    50   ~ 0
UCO328-Q
Text Label 1900 8650 0    50   ~ 0
UCJ328-Q
Text Label 1900 10500 0    50   ~ 0
UCJ337-Q
Text Label 2050 19700 0    50   ~ 0
UCJ337-Q
Text Label 2300 14100 0    50   ~ 0
UCR332-Q
Text Label 2850 4350 2    50   ~ 0
UCR388-Q
Text Label 3450 9550 0    50   ~ 0
FLIP
Text Label 4000 19750 2    50   ~ 0
UCR332-Q
Text Label 4100 20750 2    50   ~ 0
TD0
Text Label 4100 20850 2    50   ~ 0
TD1
Text Label 4100 20950 2    50   ~ 0
TD2
Text Label 4100 21050 2    50   ~ 0
TD3
Text Label 4100 21150 2    50   ~ 0
TD4
Text Label 4100 21250 2    50   ~ 0
TD5
Text Label 4100 21350 2    50   ~ 0
TD6
Text Label 4100 21450 2    50   ~ 0
TD7
Text Label 4100 22150 2    50   ~ 0
TD8
Text Label 4100 22250 2    50   ~ 0
TD9
Text Label 4100 22350 2    50   ~ 0
TD10
Text Label 4100 22450 2    50   ~ 0
TD11
Text Label 5250 12600 0    50   ~ 0
FLIP
Text Label 9300 7950 2    50   ~ 0
~CLK4M
Text Label 9600 2900 2    50   ~ 0
~CLK4M
Text Label 9600 15850 0    50   ~ 0
UCJ328-Q
Text Label 9600 15950 0    50   ~ 0
UCO328-Q
Text Label 9750 17850 0    50   ~ 0
UCL375-Q
Text Label 11150 9000 0    50   ~ 0
FLIP
Text Label 11400 19650 0    50   ~ 0
TD8
Text Label 11400 19750 0    50   ~ 0
TD9
Text Label 11400 19850 0    50   ~ 0
TD10
Text Label 11400 19950 0    50   ~ 0
TD11
Text Label 11400 20550 0    50   ~ 0
TD0
Text Label 11400 20650 0    50   ~ 0
TD1
Text Label 11400 20750 0    50   ~ 0
TD2
Text Label 11400 20850 0    50   ~ 0
TD3
Text Label 11400 20950 0    50   ~ 0
TD4
Text Label 11400 21050 0    50   ~ 0
TD5
Text Label 11400 21150 0    50   ~ 0
TD6
Text Label 11400 21250 0    50   ~ 0
TD7
Text Label 13700 13400 2    50   ~ 0
~VBLANK
Text HLabel 1100 19000 0    50   Output ~ 0
~VBLANK
Text HLabel 1450 4050 0    50   Output ~ 0
VSYNC
Text HLabel 3350 9550 0    50   Input ~ 0
FLIP
Text HLabel 3550 20550 0    50   3State ~ 0
TD[0..11]
Text HLabel 5500 22250 2    50   Input ~ 0
FI
Text HLabel 9750 19850 0    50   Input ~ 0
~CLK4M
Text HLabel 9750 20550 0    50   Input ~ 0
LI
Text HLabel 9750 20650 0    50   Input ~ 0
FI
Text HLabel 10850 3150 2    50   Output ~ 0
LOAD-XPD2
Text HLabel 10850 3650 2    50   Output ~ 0
LOAD-XPD1
Text HLabel 10900 4700 2    50   Output ~ 0
SERIAL-LOAD-XPD4
Text HLabel 10900 6800 2    50   Output ~ 0
LOAD-XPD4
Text HLabel 11250 1200 2    50   Output ~ 0
GFX-CHNL
Text HLabel 11250 1750 2    50   Output ~ 0
GFX-OUT-LMSB
Text HLabel 11250 2300 2    50   Output ~ 0
SERIAL-CHNL
Text HLabel 11450 4150 2    50   Output ~ 0
SERIAL-LOAD
Text HLabel 11450 8450 2    50   Output ~ 0
LOAD-XPD3
Text HLabel 11550 5400 2    50   Output ~ 0
STARS1-LOAD
Text HLabel 11550 6150 2    50   Output ~ 0
STARS-SERIAL
Text HLabel 11550 7450 2    50   Output ~ 0
STARS2-LOAD
Text HLabel 11950 20350 2    50   3State ~ 0
TD[0..11]
Text HLabel 12050 9900 0    50   Input ~ 0
~CLK4M
Text HLabel 14200 14800 2    50   Output ~ 0
HSYNC
Text HLabel 14900 12200 2    50   Output ~ 0
~HBLANK
Text HLabel 15500 13150 2    50   Output ~ 0
BLANK
$Comp
L power:VCC #PWR?
U 1 1 602C0A16
P 3550 12900
AR Path="/5F7A979F/602C0A16" Ref="#PWR?"  Part="1" 
AR Path="/5F93CF8E/602C0A16" Ref="#PWR?"  Part="1" 
AR Path="/5FC16B93/5FC17148/602C0A16" Ref="#PWR0175"  Part="1" 
F 0 "#PWR0175" H 3550 12750 50  0001 C CNN
F 1 "VCC" H 3565 13073 50  0000 C CNN
F 2 "" H 3550 12900 50  0001 C CNN
F 3 "" H 3550 12900 50  0001 C CNN
	1    3550 12900
	-1   0    0    -1  
$EndComp
$Comp
L power:VCC #PWR?
U 1 1 60B970E2
P 3550 14700
AR Path="/5F7A979F/60B970E2" Ref="#PWR?"  Part="1" 
AR Path="/5F93CF8E/60B970E2" Ref="#PWR?"  Part="1" 
AR Path="/5FC16B93/5FC17148/60B970E2" Ref="#PWR0176"  Part="1" 
F 0 "#PWR0176" H 3550 14550 50  0001 C CNN
F 1 "VCC" H 3565 14873 50  0000 C CNN
F 2 "" H 3550 14700 50  0001 C CNN
F 3 "" H 3550 14700 50  0001 C CNN
	1    3550 14700
	-1   0    0    -1  
$EndComp
$Comp
L power:VCC #PWR?
U 1 1 60A752B1
P 3550 16300
AR Path="/5F7A979F/60A752B1" Ref="#PWR?"  Part="1" 
AR Path="/5F93CF8E/60A752B1" Ref="#PWR?"  Part="1" 
AR Path="/5FC16B93/5FC17148/60A752B1" Ref="#PWR0177"  Part="1" 
F 0 "#PWR0177" H 3550 16150 50  0001 C CNN
F 1 "VCC" H 3565 16473 50  0000 C CNN
F 2 "" H 3550 16300 50  0001 C CNN
F 3 "" H 3550 16300 50  0001 C CNN
	1    3550 16300
	-1   0    0    -1  
$EndComp
$Comp
L power:VCC #PWR?
U 1 1 60AB15BA
P 3550 17900
AR Path="/5F7A979F/60AB15BA" Ref="#PWR?"  Part="1" 
AR Path="/5F93CF8E/60AB15BA" Ref="#PWR?"  Part="1" 
AR Path="/5FC16B93/5FC17148/60AB15BA" Ref="#PWR0178"  Part="1" 
F 0 "#PWR0178" H 3550 17750 50  0001 C CNN
F 1 "VCC" H 3565 18073 50  0000 C CNN
F 2 "" H 3550 17900 50  0001 C CNN
F 3 "" H 3550 17900 50  0001 C CNN
	1    3550 17900
	-1   0    0    -1  
$EndComp
$Comp
L power:VCC #PWR?
U 1 1 5FE5290B
P 3600 5950
AR Path="/5F7A979F/5FE5290B" Ref="#PWR?"  Part="1" 
AR Path="/5F93CF8E/5FE5290B" Ref="#PWR?"  Part="1" 
AR Path="/5FC16B93/5FC17148/5FE5290B" Ref="#PWR0179"  Part="1" 
F 0 "#PWR0179" H 3600 5800 50  0001 C CNN
F 1 "VCC" H 3615 6123 50  0000 C CNN
F 2 "" H 3600 5950 50  0001 C CNN
F 3 "" H 3600 5950 50  0001 C CNN
	1    3600 5950
	-1   0    0    -1  
$EndComp
$Comp
L power:VCC #PWR?
U 1 1 5FB31F28
P 3600 7600
AR Path="/5F7A979F/5FB31F28" Ref="#PWR?"  Part="1" 
AR Path="/5F93CF8E/5FB31F28" Ref="#PWR?"  Part="1" 
AR Path="/5FC16B93/5FC17148/5FB31F28" Ref="#PWR0180"  Part="1" 
F 0 "#PWR0180" H 3600 7450 50  0001 C CNN
F 1 "VCC" H 3615 7773 50  0000 C CNN
F 2 "" H 3600 7600 50  0001 C CNN
F 3 "" H 3600 7600 50  0001 C CNN
	1    3600 7600
	-1   0    0    -1  
$EndComp
$Comp
L power:VCC #PWR?
U 1 1 6086B158
P 3600 9250
AR Path="/5F7A979F/6086B158" Ref="#PWR?"  Part="1" 
AR Path="/5F93CF8E/6086B158" Ref="#PWR?"  Part="1" 
AR Path="/5FC16B93/5FC17148/6086B158" Ref="#PWR0181"  Part="1" 
F 0 "#PWR0181" H 3600 9100 50  0001 C CNN
F 1 "VCC" H 3615 9423 50  0000 C CNN
F 2 "" H 3600 9250 50  0001 C CNN
F 3 "" H 3600 9250 50  0001 C CNN
	1    3600 9250
	-1   0    0    -1  
$EndComp
$Comp
L power:VCC #PWR?
U 1 1 5FA8E108
P 3600 11100
AR Path="/5F7A979F/5FA8E108" Ref="#PWR?"  Part="1" 
AR Path="/5F93CF8E/5FA8E108" Ref="#PWR?"  Part="1" 
AR Path="/5FC16B93/5FC17148/5FA8E108" Ref="#PWR0182"  Part="1" 
F 0 "#PWR0182" H 3600 10950 50  0001 C CNN
F 1 "VCC" H 3615 11273 50  0000 C CNN
F 2 "" H 3600 11100 50  0001 C CNN
F 3 "" H 3600 11100 50  0001 C CNN
	1    3600 11100
	-1   0    0    -1  
$EndComp
$Comp
L power:VCC #PWR?
U 1 1 602B814D
P 11200 17400
AR Path="/5F7A979F/602B814D" Ref="#PWR?"  Part="1" 
AR Path="/5F93CF8E/602B814D" Ref="#PWR?"  Part="1" 
AR Path="/5FC16B93/5FC17148/602B814D" Ref="#PWR0183"  Part="1" 
F 0 "#PWR0183" H 11200 17250 50  0001 C CNN
F 1 "VCC" H 11215 17573 50  0000 C CNN
F 2 "" H 11200 17400 50  0001 C CNN
F 3 "" H 11200 17400 50  0001 C CNN
	1    11200 17400
	1    0    0    -1  
$EndComp
$Comp
L power:VCC #PWR?
U 1 1 602B3F65
P 11200 18950
AR Path="/5F7A979F/602B3F65" Ref="#PWR?"  Part="1" 
AR Path="/5F93CF8E/602B3F65" Ref="#PWR?"  Part="1" 
AR Path="/5FC16B93/5FC17148/602B3F65" Ref="#PWR0184"  Part="1" 
F 0 "#PWR0184" H 11200 18800 50  0001 C CNN
F 1 "VCC" H 11215 19123 50  0000 C CNN
F 2 "" H 11200 18950 50  0001 C CNN
F 3 "" H 11200 18950 50  0001 C CNN
	1    11200 18950
	1    0    0    -1  
$EndComp
$Comp
L power:VCC #PWR?
U 1 1 602D2128
P 12250 14500
AR Path="/5F7A979F/602D2128" Ref="#PWR?"  Part="1" 
AR Path="/5F93CF8E/602D2128" Ref="#PWR?"  Part="1" 
AR Path="/5FC16B93/5FC17148/602D2128" Ref="#PWR0185"  Part="1" 
F 0 "#PWR0185" H 12250 14350 50  0001 C CNN
F 1 "VCC" H 12265 14673 50  0000 C CNN
F 2 "" H 12250 14500 50  0001 C CNN
F 3 "" H 12250 14500 50  0001 C CNN
	1    12250 14500
	1    0    0    -1  
$EndComp
$Comp
L power:VCC #PWR?
U 1 1 602C926A
P 12300 11100
AR Path="/5F7A979F/602C926A" Ref="#PWR?"  Part="1" 
AR Path="/5F93CF8E/602C926A" Ref="#PWR?"  Part="1" 
AR Path="/5FC16B93/5FC17148/602C926A" Ref="#PWR0186"  Part="1" 
F 0 "#PWR0186" H 12300 10950 50  0001 C CNN
F 1 "VCC" H 12315 11273 50  0000 C CNN
F 2 "" H 12300 11100 50  0001 C CNN
F 3 "" H 12300 11100 50  0001 C CNN
	1    12300 11100
	1    0    0    -1  
$EndComp
$Comp
L power:VCC #PWR?
U 1 1 602C4D61
P 12350 12000
AR Path="/5F7A979F/602C4D61" Ref="#PWR?"  Part="1" 
AR Path="/5F93CF8E/602C4D61" Ref="#PWR?"  Part="1" 
AR Path="/5FC16B93/5FC17148/602C4D61" Ref="#PWR0187"  Part="1" 
F 0 "#PWR0187" H 12350 11850 50  0001 C CNN
F 1 "VCC" H 12365 12173 50  0000 C CNN
F 2 "" H 12350 12000 50  0001 C CNN
F 3 "" H 12350 12000 50  0001 C CNN
	1    12350 12000
	1    0    0    -1  
$EndComp
$Comp
L power:GND #PWR?
U 1 1 66F91E14
P 5500 22350
AR Path="/66F91E14" Ref="#PWR?"  Part="1" 
AR Path="/5F93CF8E/66F91E14" Ref="#PWR?"  Part="1" 
AR Path="/5FC16B93/5FC17148/66F91E14" Ref="#PWR0188"  Part="1" 
F 0 "#PWR0188" H 5500 22100 50  0001 C CNN
F 1 "GND" H 5505 22180 50  0000 C CNN
F 2 "" H 5500 22350 50  0001 C CNN
F 3 "" H 5500 22350 50  0001 C CNN
	1    5500 22350
	1    0    0    -1  
$EndComp
$Comp
L power:GND #PWR?
U 1 1 63330C28
P 9750 19950
AR Path="/63330C28" Ref="#PWR?"  Part="1" 
AR Path="/5F93CF8E/63330C28" Ref="#PWR?"  Part="1" 
AR Path="/5FC16B93/5FC17148/63330C28" Ref="#PWR0189"  Part="1" 
F 0 "#PWR0189" H 9750 19700 50  0001 C CNN
F 1 "GND" H 9755 19780 50  0000 C CNN
F 2 "" H 9750 19950 50  0001 C CNN
F 3 "" H 9750 19950 50  0001 C CNN
	1    9750 19950
	1    0    0    -1  
$EndComp
$Comp
L A5C:NOR02 UCR385
U 1 1 674FA179
P 2050 4050
AR Path="/5F93CF8E/674FA179" Ref="UCR385"  Part="1" 
AR Path="/5FC16B93/5FC17148/674FA179" Ref="UCR385"  Part="1" 
F 0 "UCR385" H 2075 4317 50  0000 C CNN
F 1 "NOR02" H 2075 4226 50  0000 C CNN
F 2 "" H 2050 4050 50  0001 C CNN
F 3 "" H 2050 4050 50  0001 C CNN
	1    2050 4050
	-1   0    0    -1  
$EndComp
$Comp
L A5C:NOR02 UCT405
U 1 1 67A649DE
P 2050 6100
AR Path="/5F93CF8E/67A649DE" Ref="UCT405"  Part="1" 
AR Path="/5FC16B93/5FC17148/67A649DE" Ref="UCT405"  Part="1" 
F 0 "UCT405" H 2075 6367 50  0000 C CNN
F 1 "NOR02" H 2075 6276 50  0000 C CNN
F 2 "" H 2050 6100 50  0001 C CNN
F 3 "" H 2050 6100 50  0001 C CNN
	1    2050 6100
	-1   0    0    -1  
$EndComp
$Comp
L A5C:NOR02 UCR329
U 1 1 63838010
P 10250 15900
AR Path="/5F93CF8E/63838010" Ref="UCR329"  Part="1" 
AR Path="/5FC16B93/5FC17148/63838010" Ref="UCR329"  Part="1" 
F 0 "UCR329" H 10275 16167 50  0000 C CNN
F 1 "NOR02" H 10275 16076 50  0000 C CNN
F 2 "" H 10250 15900 50  0001 C CNN
F 3 "" H 10250 15900 50  0001 C CNN
	1    10250 15900
	1    0    0    -1  
$EndComp
$Comp
L A5C:NOR02 UCC332
U 1 1 647698AE
P 13900 14800
AR Path="/5F93CF8E/647698AE" Ref="UCC332"  Part="1" 
AR Path="/5FC16B93/5FC17148/647698AE" Ref="UCC332"  Part="1" 
F 0 "UCC332" H 13925 15067 50  0000 C CNN
F 1 "NOR02" H 13925 14976 50  0000 C CNN
F 2 "" H 13900 14800 50  0001 C CNN
F 3 "" H 13900 14800 50  0001 C CNN
	1    13900 14800
	1    0    0    -1  
$EndComp
$Comp
L A5C:AND03 UBD?
U 1 1 5FB816F0
P 10550 3150
AR Path="/5FB816F0" Ref="UBD?"  Part="1" 
AR Path="/5F93CF8E/5FB816F0" Ref="UBD333"  Part="1" 
AR Path="/5FC16B93/5FC17148/5FB816F0" Ref="UBD333"  Part="1" 
F 0 "UBD333" H 10575 3441 50  0000 C CNN
F 1 "AND03" H 10575 3350 50  0000 C CNN
F 2 "" H 10550 3150 50  0001 C CNN
F 3 "" H 10550 3150 50  0001 C CNN
	1    10550 3150
	1    0    0    -1  
$EndComp
$Comp
L A5C:AND03 UBD?
U 1 1 5FB816EA
P 10550 3650
AR Path="/5FB816EA" Ref="UBD?"  Part="1" 
AR Path="/5F93CF8E/5FB816EA" Ref="UBD330"  Part="1" 
AR Path="/5FC16B93/5FC17148/5FB816EA" Ref="UBD330"  Part="1" 
F 0 "UBD330" H 10575 3941 50  0000 C CNN
F 1 "AND03" H 10575 3850 50  0000 C CNN
F 2 "" H 10550 3650 50  0001 C CNN
F 3 "" H 10550 3650 50  0001 C CNN
	1    10550 3650
	1    0    0    -1  
$EndComp
$Comp
L A5C:AND03 UBD?
U 1 1 5FB816E4
P 10550 4150
AR Path="/5FB816E4" Ref="UBD?"  Part="1" 
AR Path="/5F93CF8E/5FB816E4" Ref="UBD328"  Part="1" 
AR Path="/5FC16B93/5FC17148/5FB816E4" Ref="UBD328"  Part="1" 
F 0 "UBD328" H 10575 4441 50  0000 C CNN
F 1 "AND03" H 10575 4350 50  0000 C CNN
F 2 "" H 10550 4150 50  0001 C CNN
F 3 "" H 10550 4150 50  0001 C CNN
	1    10550 4150
	1    0    0    -1  
$EndComp
$Comp
L A5C:NAND03 UBK416
U 1 1 5FC4234E
P 10550 8450
AR Path="/5F93CF8E/5FC4234E" Ref="UBK416"  Part="1" 
AR Path="/5FC16B93/5FC17148/5FC4234E" Ref="UBK416"  Part="1" 
F 0 "UBK416" H 10575 8742 50  0000 C CNN
F 1 "NAND03" H 10575 8651 50  0000 C CNN
F 2 "" H 10550 8450 50  0001 C CNN
F 3 "" H 10550 8450 50  0001 C CNN
	1    10550 8450
	1    0    0    -1  
$EndComp
$Comp
L A5C:AND03 UCL256
U 1 1 60B58421
P 12700 13200
AR Path="/5F93CF8E/60B58421" Ref="UCL256"  Part="1" 
AR Path="/5FC16B93/5FC17148/60B58421" Ref="UCL256"  Part="1" 
F 0 "UCL256" H 12725 13492 50  0000 C CNN
F 1 "AND03" H 12725 13401 50  0000 C CNN
F 2 "" H 12700 13200 50  0001 C CNN
F 3 "" H 12700 13200 50  0001 C CNN
	1    12700 13200
	1    0    0    -1  
$EndComp
$Comp
L A5C:INV01 UCT?
U 1 1 67C103EB
P 1450 6100
AR Path="/67C103EB" Ref="UCT?"  Part="1" 
AR Path="/5F93CF8E/67C103EB" Ref="UCT404"  Part="1" 
AR Path="/5FC16B93/5FC17148/67C103EB" Ref="UCT404"  Part="1" 
F 0 "UCT404" H 1450 6416 50  0000 C CNN
F 1 "INV01" H 1450 6325 50  0000 C CNN
F 2 "" H 1450 5900 50  0001 C CNN
F 3 "" H 1450 5900 50  0001 C CNN
	1    1450 6100
	-1   0    0    -1  
$EndComp
$Comp
L A5C:INV01 UCT?
U 1 1 624A4A26
P 2500 18550
AR Path="/624A4A26" Ref="UCT?"  Part="1" 
AR Path="/5F93CF8E/624A4A26" Ref="UCT330"  Part="1" 
AR Path="/5FC16B93/5FC17148/624A4A26" Ref="UCT330"  Part="1" 
F 0 "UCT330" H 2500 18866 50  0000 C CNN
F 1 "INV01" H 2500 18775 50  0000 C CNN
F 2 "" H 2500 18350 50  0001 C CNN
F 3 "" H 2500 18350 50  0001 C CNN
	1    2500 18550
	-1   0    0    -1  
$EndComp
$Comp
L A5C:INV01 UCR?
U 1 1 67CF5D67
P 2550 12300
AR Path="/67CF5D67" Ref="UCR?"  Part="1" 
AR Path="/5F93CF8E/67CF5D67" Ref="UCO328"  Part="1" 
AR Path="/5FC16B93/5FC17148/67CF5D67" Ref="UCO328"  Part="1" 
F 0 "UCO328" H 2550 12616 50  0000 C CNN
F 1 "INV01" H 2550 12525 50  0000 C CNN
F 2 "" H 2550 12100 50  0001 C CNN
F 3 "" H 2550 12100 50  0001 C CNN
	1    2550 12300
	-1   0    0    -1  
$EndComp
$Comp
L A5C:INV01 UCL?
U 1 1 674FDD40
P 2550 15700
AR Path="/674FDD40" Ref="UCL?"  Part="1" 
AR Path="/5F93CF8E/674FDD40" Ref="UCR388"  Part="1" 
AR Path="/5FC16B93/5FC17148/674FDD40" Ref="UCR388"  Part="1" 
F 0 "UCR388" H 2550 16016 50  0000 C CNN
F 1 "INV01" H 2550 15925 50  0000 C CNN
F 2 "" H 2550 15500 50  0001 C CNN
F 3 "" H 2550 15500 50  0001 C CNN
	1    2550 15700
	-1   0    0    -1  
$EndComp
$Comp
L A5C:INV01 UCL?
U 1 1 634078DB
P 2550 17300
AR Path="/634078DB" Ref="UCL?"  Part="1" 
AR Path="/5F93CF8E/634078DB" Ref="UCL375"  Part="1" 
AR Path="/5FC16B93/5FC17148/634078DB" Ref="UCL375"  Part="1" 
F 0 "UCL375" H 2550 17616 50  0000 C CNN
F 1 "INV01" H 2550 17525 50  0000 C CNN
F 2 "" H 2550 17100 50  0001 C CNN
F 3 "" H 2550 17100 50  0001 C CNN
	1    2550 17300
	-1   0    0    -1  
$EndComp
$Comp
L A5C:INV01 UCJ?
U 1 1 6249CD8F
P 2550 19500
AR Path="/6249CD8F" Ref="UCJ?"  Part="1" 
AR Path="/5F93CF8E/6249CD8F" Ref="UCT340"  Part="1" 
AR Path="/5FC16B93/5FC17148/6249CD8F" Ref="UCT340"  Part="1" 
F 0 "UCT340" H 2550 19816 50  0000 C CNN
F 1 "INV01" H 2550 19725 50  0000 C CNN
F 2 "" H 2550 19300 50  0001 C CNN
F 3 "" H 2550 19300 50  0001 C CNN
	1    2550 19500
	-1   0    0    -1  
$EndComp
$Comp
L A5C:INV01 UCJ?
U 1 1 674F2481
P 2600 4000
AR Path="/674F2481" Ref="UCJ?"  Part="1" 
AR Path="/5F93CF8E/674F2481" Ref="UCT388"  Part="1" 
AR Path="/5FC16B93/5FC17148/674F2481" Ref="UCT388"  Part="1" 
F 0 "UCT388" H 2600 4316 50  0000 C CNN
F 1 "INV01" H 2600 4225 50  0000 C CNN
F 2 "" H 2600 3800 50  0001 C CNN
F 3 "" H 2600 3800 50  0001 C CNN
	1    2600 4000
	-1   0    0    -1  
$EndComp
$Comp
L A5C:INV01 UCT?
U 1 1 67A60D06
P 2600 5350
AR Path="/67A60D06" Ref="UCT?"  Part="1" 
AR Path="/5F93CF8E/67A60D06" Ref="UCR404"  Part="1" 
AR Path="/5FC16B93/5FC17148/67A60D06" Ref="UCR404"  Part="1" 
F 0 "UCR404" H 2600 5666 50  0000 C CNN
F 1 "INV01" H 2600 5575 50  0000 C CNN
F 2 "" H 2600 5150 50  0001 C CNN
F 3 "" H 2600 5150 50  0001 C CNN
	1    2600 5350
	-1   0    0    -1  
$EndComp
$Comp
L A5C:INV01 UCT?
U 1 1 67777D20
P 2600 7000
AR Path="/67777D20" Ref="UCT?"  Part="1" 
AR Path="/5F93CF8E/67777D20" Ref="UCT393"  Part="1" 
AR Path="/5FC16B93/5FC17148/67777D20" Ref="UCT393"  Part="1" 
F 0 "UCT393" H 2600 7316 50  0000 C CNN
F 1 "INV01" H 2600 7225 50  0000 C CNN
F 2 "" H 2600 6800 50  0001 C CNN
F 3 "" H 2600 6800 50  0001 C CNN
	1    2600 7000
	-1   0    0    -1  
$EndComp
$Comp
L A5C:INV01 UCL?
U 1 1 6361D733
P 2600 8650
AR Path="/6361D733" Ref="UCL?"  Part="1" 
AR Path="/5F93CF8E/6361D733" Ref="UCJ328"  Part="1" 
AR Path="/5FC16B93/5FC17148/6361D733" Ref="UCJ328"  Part="1" 
F 0 "UCJ328" H 2600 8966 50  0000 C CNN
F 1 "INV01" H 2600 8875 50  0000 C CNN
F 2 "" H 2600 8450 50  0001 C CNN
F 3 "" H 2600 8450 50  0001 C CNN
	1    2600 8650
	-1   0    0    -1  
$EndComp
$Comp
L A5C:INV01 UCR?
U 1 1 62679F41
P 2600 10500
AR Path="/62679F41" Ref="UCR?"  Part="1" 
AR Path="/5F93CF8E/62679F41" Ref="UCJ337"  Part="1" 
AR Path="/5FC16B93/5FC17148/62679F41" Ref="UCJ337"  Part="1" 
F 0 "UCJ337" H 2600 10816 50  0000 C CNN
F 1 "INV01" H 2600 10725 50  0000 C CNN
F 2 "" H 2600 10300 50  0001 C CNN
F 3 "" H 2600 10300 50  0001 C CNN
	1    2600 10500
	-1   0    0    -1  
$EndComp
$Comp
L A5C:INV01 UCO?
U 1 1 67DD90F9
P 4950 12600
AR Path="/67DD90F9" Ref="UCO?"  Part="1" 
AR Path="/5F93CF8E/67DD90F9" Ref="UCL321"  Part="1" 
AR Path="/5FC16B93/5FC17148/67DD90F9" Ref="UCL321"  Part="1" 
F 0 "UCL321" H 4950 12916 50  0000 C CNN
F 1 "INV01" H 4950 12825 50  0000 C CNN
F 2 "" H 4950 12400 50  0001 C CNN
F 3 "" H 4950 12400 50  0001 C CNN
	1    4950 12600
	-1   0    0    -1  
$EndComp
$Comp
L A5C:INV01 UCR?
U 1 1 613E75F6
P 5000 18350
AR Path="/613E75F6" Ref="UCR?"  Part="1" 
AR Path="/5F93CF8E/613E75F6" Ref="UCJ302"  Part="1" 
AR Path="/5FC16B93/5FC17148/613E75F6" Ref="UCJ302"  Part="1" 
F 0 "UCJ302" H 5000 18666 50  0000 C CNN
F 1 "INV01" H 5000 18575 50  0000 C CNN
F 2 "" H 5000 18150 50  0001 C CNN
F 3 "" H 5000 18150 50  0001 C CNN
	1    5000 18350
	-1   0    0    -1  
$EndComp
$Comp
L A5C:INV01 UCJ?
U 1 1 60C51A7F
P 5650 10200
AR Path="/60C51A7F" Ref="UCJ?"  Part="1" 
AR Path="/5F93CF8E/60C51A7F" Ref="UCL291"  Part="1" 
AR Path="/5FC16B93/5FC17148/60C51A7F" Ref="UCL291"  Part="1" 
F 0 "UCL291" H 5650 10516 50  0000 C CNN
F 1 "INV01" H 5650 10425 50  0000 C CNN
F 2 "" H 5650 10000 50  0001 C CNN
F 3 "" H 5650 10000 50  0001 C CNN
	1    5650 10200
	-1   0    0    -1  
$EndComp
$Comp
L A5C:INV01 UCJ?
U 1 1 5FA0389B
P 5650 10700
AR Path="/5FA0389B" Ref="UCJ?"  Part="1" 
AR Path="/5F93CF8E/5FA0389B" Ref="UCJ306"  Part="1" 
AR Path="/5FC16B93/5FC17148/5FA0389B" Ref="UCJ306"  Part="1" 
F 0 "UCJ306" H 5650 11016 50  0000 C CNN
F 1 "INV01" H 5650 10925 50  0000 C CNN
F 2 "" H 5650 10500 50  0001 C CNN
F 3 "" H 5650 10500 50  0001 C CNN
	1    5650 10700
	-1   0    0    -1  
$EndComp
$Comp
L A5C:INV01 UCL?
U 1 1 61B5E7C0
P 5950 10100
AR Path="/61B5E7C0" Ref="UCL?"  Part="1" 
AR Path="/5F93CF8E/61B5E7C0" Ref="UCO322"  Part="1" 
AR Path="/5FC16B93/5FC17148/61B5E7C0" Ref="UCO322"  Part="1" 
F 0 "UCO322" H 5950 10416 50  0000 C CNN
F 1 "INV01" H 5950 10325 50  0000 C CNN
F 2 "" H 5950 9900 50  0001 C CNN
F 3 "" H 5950 9900 50  0001 C CNN
	1    5950 10100
	-1   0    0    -1  
$EndComp
$Comp
L A5C:INV01 UCJ?
U 1 1 5FA9A80F
P 5950 10600
AR Path="/5FA9A80F" Ref="UCJ?"  Part="1" 
AR Path="/5F93CF8E/5FA9A80F" Ref="UCR375"  Part="1" 
AR Path="/5FC16B93/5FC17148/5FA9A80F" Ref="UCR375"  Part="1" 
F 0 "UCR375" H 5950 10916 50  0000 C CNN
F 1 "INV01" H 5950 10825 50  0000 C CNN
F 2 "" H 5950 10400 50  0001 C CNN
F 3 "" H 5950 10400 50  0001 C CNN
	1    5950 10600
	-1   0    0    -1  
$EndComp
$Comp
L A5C:INV01 UCO?
U 1 1 61F6F23F
P 6250 10000
AR Path="/61F6F23F" Ref="UCO?"  Part="1" 
AR Path="/5F93CF8E/61F6F23F" Ref="UCR297"  Part="1" 
AR Path="/5FC16B93/5FC17148/61F6F23F" Ref="UCR297"  Part="1" 
F 0 "UCR297" H 6250 10316 50  0000 C CNN
F 1 "INV01" H 6250 10225 50  0000 C CNN
F 2 "" H 6250 9800 50  0001 C CNN
F 3 "" H 6250 9800 50  0001 C CNN
	1    6250 10000
	-1   0    0    -1  
$EndComp
$Comp
L A5C:INV01 UCJ?
U 1 1 5FDA6B13
P 6250 10500
AR Path="/5FDA6B13" Ref="UCJ?"  Part="1" 
AR Path="/5F93CF8E/5FDA6B13" Ref="UCR384"  Part="1" 
AR Path="/5FC16B93/5FC17148/5FDA6B13" Ref="UCR384"  Part="1" 
F 0 "UCR384" H 6250 10816 50  0000 C CNN
F 1 "INV01" H 6250 10725 50  0000 C CNN
F 2 "" H 6250 10300 50  0001 C CNN
F 3 "" H 6250 10300 50  0001 C CNN
	1    6250 10500
	-1   0    0    -1  
$EndComp
$Comp
L A5C:INV01 UCR?
U 1 1 6243CC80
P 6550 9900
AR Path="/6243CC80" Ref="UCR?"  Part="1" 
AR Path="/5F93CF8E/6243CC80" Ref="UCT345"  Part="1" 
AR Path="/5FC16B93/5FC17148/6243CC80" Ref="UCT345"  Part="1" 
F 0 "UCT345" H 6550 10216 50  0000 C CNN
F 1 "INV01" H 6550 10125 50  0000 C CNN
F 2 "" H 6550 9700 50  0001 C CNN
F 3 "" H 6550 9700 50  0001 C CNN
	1    6550 9900
	-1   0    0    -1  
$EndComp
$Comp
L A5C:INV01 UCJ?
U 1 1 60B83FF5
P 6550 10400
AR Path="/60B83FF5" Ref="UCJ?"  Part="1" 
AR Path="/5F93CF8E/60B83FF5" Ref="UCO372"  Part="1" 
AR Path="/5FC16B93/5FC17148/60B83FF5" Ref="UCO372"  Part="1" 
F 0 "UCO372" H 6550 10716 50  0000 C CNN
F 1 "INV01" H 6550 10625 50  0000 C CNN
F 2 "" H 6550 10200 50  0001 C CNN
F 3 "" H 6550 10200 50  0001 C CNN
	1    6550 10400
	-1   0    0    -1  
$EndComp
$Comp
L A5C:INV01 UCL?
U 1 1 60A455AF
P 9450 18250
AR Path="/60A455AF" Ref="UCL?"  Part="1" 
AR Path="/5F93CF8E/60A455AF" Ref="UCL344"  Part="1" 
AR Path="/5FC16B93/5FC17148/60A455AF" Ref="UCL344"  Part="1" 
F 0 "UCL344" H 9450 18566 50  0000 C CNN
F 1 "INV01" H 9450 18475 50  0000 C CNN
F 2 "" H 9450 18050 50  0001 C CNN
F 3 "" H 9450 18050 50  0001 C CNN
	1    9450 18250
	1    0    0    -1  
$EndComp
$Comp
L A5C:INV01 UCL?
U 1 1 60B7A7CA
P 9500 16600
AR Path="/60B7A7CA" Ref="UCL?"  Part="1" 
AR Path="/5F93CF8E/60B7A7CA" Ref="UCL322"  Part="1" 
AR Path="/5FC16B93/5FC17148/60B7A7CA" Ref="UCL322"  Part="1" 
F 0 "UCL322" H 9500 16916 50  0000 C CNN
F 1 "INV01" H 9500 16825 50  0000 C CNN
F 2 "" H 9500 16400 50  0001 C CNN
F 3 "" H 9500 16400 50  0001 C CNN
	1    9500 16600
	1    0    0    -1  
$EndComp
$Comp
L A5C:INV01 UBH?
U 1 1 601EE7FD
P 9600 3650
AR Path="/601EE7FD" Ref="UBH?"  Part="1" 
AR Path="/5F93CF8E/601EE7FD" Ref="UBD370"  Part="1" 
AR Path="/5FC16B93/5FC17148/601EE7FD" Ref="UBD370"  Part="1" 
F 0 "UBD370" H 9600 3966 50  0000 C CNN
F 1 "INV01" H 9600 3875 50  0000 C CNN
F 2 "" H 9600 3450 50  0001 C CNN
F 3 "" H 9600 3450 50  0001 C CNN
	1    9600 3650
	1    0    0    -1  
$EndComp
$Comp
L A5C:INV01 UCJ?
U 1 1 5FBE8CF6
P 9600 5200
AR Path="/5FBE8CF6" Ref="UCJ?"  Part="1" 
AR Path="/5F93CF8E/5FBE8CF6" Ref="UBH375"  Part="1" 
AR Path="/5FC16B93/5FC17148/5FBE8CF6" Ref="UBH375"  Part="1" 
F 0 "UBH375" H 9600 5516 50  0000 C CNN
F 1 "INV01" H 9600 5425 50  0000 C CNN
F 2 "" H 9600 5000 50  0001 C CNN
F 3 "" H 9600 5000 50  0001 C CNN
	1    9600 5200
	1    0    0    -1  
$EndComp
$Comp
L A5C:INV01 UBH?
U 1 1 6093F350
P 9600 6550
AR Path="/6093F350" Ref="UBH?"  Part="1" 
AR Path="/5F93CF8E/6093F350" Ref="UBK383"  Part="1" 
AR Path="/5FC16B93/5FC17148/6093F350" Ref="UBK383"  Part="1" 
F 0 "UBK383" H 9600 6866 50  0000 C CNN
F 1 "INV01" H 9600 6775 50  0000 C CNN
F 2 "" H 9600 6350 50  0001 C CNN
F 3 "" H 9600 6350 50  0001 C CNN
	1    9600 6550
	1    0    0    -1  
$EndComp
$Comp
L A5C:INV01 UBH?
U 1 1 6037C949
P 9600 7150
AR Path="/6037C949" Ref="UBH?"  Part="1" 
AR Path="/5F93CF8E/6037C949" Ref="UBH377"  Part="1" 
AR Path="/5FC16B93/5FC17148/6037C949" Ref="UBH377"  Part="1" 
F 0 "UBH377" H 9600 7466 50  0000 C CNN
F 1 "INV01" H 9600 7375 50  0000 C CNN
F 2 "" H 9600 6950 50  0001 C CNN
F 3 "" H 9600 6950 50  0001 C CNN
	1    9600 7150
	1    0    0    -1  
$EndComp
$Comp
L A5C:INV01 UBK?
U 1 1 5FC44D15
P 9600 7950
AR Path="/5FC44D15" Ref="UBK?"  Part="1" 
AR Path="/5F93CF8E/5FC44D15" Ref="UBK414"  Part="1" 
AR Path="/5FC16B93/5FC17148/5FC44D15" Ref="UBK414"  Part="1" 
F 0 "UBK414" H 9600 8266 50  0000 C CNN
F 1 "INV01" H 9600 8175 50  0000 C CNN
F 2 "" H 9600 7750 50  0001 C CNN
F 3 "" H 9600 7750 50  0001 C CNN
	1    9600 7950
	1    0    0    -1  
$EndComp
$Comp
L A5C:INV01 UBH?
U 1 1 5FC3A6C5
P 9600 8450
AR Path="/5FC3A6C5" Ref="UBH?"  Part="1" 
AR Path="/5F93CF8E/5FC3A6C5" Ref="UBK420"  Part="1" 
AR Path="/5FC16B93/5FC17148/5FC3A6C5" Ref="UBK420"  Part="1" 
F 0 "UBK420" H 9600 8766 50  0000 C CNN
F 1 "INV01" H 9600 8675 50  0000 C CNN
F 2 "" H 9600 8250 50  0001 C CNN
F 3 "" H 9600 8250 50  0001 C CNN
	1    9600 8450
	1    0    0    -1  
$EndComp
$Comp
L A5C:INV01 UBK?
U 1 1 5FC42518
P 9600 8950
AR Path="/5FC42518" Ref="UBK?"  Part="1" 
AR Path="/5F93CF8E/5FC42518" Ref="UBK419"  Part="1" 
AR Path="/5FC16B93/5FC17148/5FC42518" Ref="UBK419"  Part="1" 
F 0 "UBK419" H 9600 9266 50  0000 C CNN
F 1 "INV01" H 9600 9175 50  0000 C CNN
F 2 "" H 9600 8750 50  0001 C CNN
F 3 "" H 9600 8750 50  0001 C CNN
	1    9600 8950
	1    0    0    -1  
$EndComp
$Comp
L A5C:INV01 UBK?
U 1 1 5FBB03F9
P 9600 9700
AR Path="/5FBB03F9" Ref="UBK?"  Part="1" 
AR Path="/5F93CF8E/5FBB03F9" Ref="UCJ277"  Part="1" 
AR Path="/5FC16B93/5FC17148/5FBB03F9" Ref="UCJ277"  Part="1" 
F 0 "UCJ277" H 9600 10016 50  0000 C CNN
F 1 "INV01" H 9600 9925 50  0000 C CNN
F 2 "" H 9600 9500 50  0001 C CNN
F 3 "" H 9600 9500 50  0001 C CNN
	1    9600 9700
	1    0    0    -1  
$EndComp
$Comp
L A5C:INV01 UCJ?
U 1 1 6021A3E7
P 9600 10200
AR Path="/6021A3E7" Ref="UCJ?"  Part="1" 
AR Path="/5F93CF8E/6021A3E7" Ref="UCJ266"  Part="1" 
AR Path="/5FC16B93/5FC17148/6021A3E7" Ref="UCJ266"  Part="1" 
F 0 "UCJ266" H 9600 10516 50  0000 C CNN
F 1 "INV01" H 9600 10425 50  0000 C CNN
F 2 "" H 9600 10000 50  0001 C CNN
F 3 "" H 9600 10000 50  0001 C CNN
	1    9600 10200
	1    0    0    -1  
$EndComp
$Comp
L A5C:INV01 UCJ?
U 1 1 6031A4DA
P 9600 10700
AR Path="/6031A4DA" Ref="UCJ?"  Part="1" 
AR Path="/5F93CF8E/6031A4DA" Ref="UCL261"  Part="1" 
AR Path="/5FC16B93/5FC17148/6031A4DA" Ref="UCL261"  Part="1" 
F 0 "UCL261" H 9600 11016 50  0000 C CNN
F 1 "INV01" H 9600 10925 50  0000 C CNN
F 2 "" H 9600 10500 50  0001 C CNN
F 3 "" H 9600 10500 50  0001 C CNN
	1    9600 10700
	1    0    0    -1  
$EndComp
$Comp
L A5C:INV01 UCL?
U 1 1 60725C55
P 9600 11200
AR Path="/60725C55" Ref="UCL?"  Part="1" 
AR Path="/5F93CF8E/60725C55" Ref="UCL280"  Part="1" 
AR Path="/5FC16B93/5FC17148/60725C55" Ref="UCL280"  Part="1" 
F 0 "UCL280" H 9600 11516 50  0000 C CNN
F 1 "INV01" H 9600 11425 50  0000 C CNN
F 2 "" H 9600 11000 50  0001 C CNN
F 3 "" H 9600 11000 50  0001 C CNN
	1    9600 11200
	1    0    0    -1  
$EndComp
$Comp
L A5C:INV01 UCL?
U 1 1 60A5F6FA
P 9600 11700
AR Path="/60A5F6FA" Ref="UCL?"  Part="1" 
AR Path="/5F93CF8E/60A5F6FA" Ref="UCL255"  Part="1" 
AR Path="/5FC16B93/5FC17148/60A5F6FA" Ref="UCL255"  Part="1" 
F 0 "UCL255" H 9600 12016 50  0000 C CNN
F 1 "INV01" H 9600 11925 50  0000 C CNN
F 2 "" H 9600 11500 50  0001 C CNN
F 3 "" H 9600 11500 50  0001 C CNN
	1    9600 11700
	1    0    0    -1  
$EndComp
$Comp
L A5C:INV01 UCL?
U 1 1 60B276E6
P 9600 12200
AR Path="/60B276E6" Ref="UCL?"  Part="1" 
AR Path="/5F93CF8E/60B276E6" Ref="UCL252"  Part="1" 
AR Path="/5FC16B93/5FC17148/60B276E6" Ref="UCL252"  Part="1" 
F 0 "UCL252" H 9600 12516 50  0000 C CNN
F 1 "INV01" H 9600 12425 50  0000 C CNN
F 2 "" H 9600 12000 50  0001 C CNN
F 3 "" H 9600 12000 50  0001 C CNN
	1    9600 12200
	1    0    0    -1  
$EndComp
$Comp
L A5C:INV01 UCL?
U 1 1 60BF16AB
P 9600 12700
AR Path="/60BF16AB" Ref="UCL?"  Part="1" 
AR Path="/5F93CF8E/60BF16AB" Ref="UCG262"  Part="1" 
AR Path="/5FC16B93/5FC17148/60BF16AB" Ref="UCG262"  Part="1" 
F 0 "UCG262" H 9600 13016 50  0000 C CNN
F 1 "INV01" H 9600 12925 50  0000 C CNN
F 2 "" H 9600 12500 50  0001 C CNN
F 3 "" H 9600 12500 50  0001 C CNN
	1    9600 12700
	1    0    0    -1  
$EndComp
$Comp
L A5C:INV01 UCG?
U 1 1 60DE7CAC
P 9600 13200
AR Path="/60DE7CAC" Ref="UCG?"  Part="1" 
AR Path="/5F93CF8E/60DE7CAC" Ref="UCL253"  Part="1" 
AR Path="/5FC16B93/5FC17148/60DE7CAC" Ref="UCL253"  Part="1" 
F 0 "UCL253" H 9600 13516 50  0000 C CNN
F 1 "INV01" H 9600 13425 50  0000 C CNN
F 2 "" H 9600 13000 50  0001 C CNN
F 3 "" H 9600 13000 50  0001 C CNN
	1    9600 13200
	1    0    0    -1  
$EndComp
$Comp
L A5C:INV01 UBK?
U 1 1 5FB816DE
P 9900 2900
AR Path="/5FB816DE" Ref="UBK?"  Part="1" 
AR Path="/5F93CF8E/5FB816DE" Ref="UBK330"  Part="1" 
AR Path="/5FC16B93/5FC17148/5FB816DE" Ref="UBK330"  Part="1" 
F 0 "UBK330" H 9900 3216 50  0000 C CNN
F 1 "INV01" H 9900 3125 50  0000 C CNN
F 2 "" H 9900 2700 50  0001 C CNN
F 3 "" H 9900 2700 50  0001 C CNN
	1    9900 2900
	1    0    0    -1  
$EndComp
$Comp
L A5C:INV01 UCL?
U 1 1 60C76E3E
P 10000 16500
AR Path="/60C76E3E" Ref="UCL?"  Part="1" 
AR Path="/5F93CF8E/60C76E3E" Ref="UCJ332"  Part="1" 
AR Path="/5FC16B93/5FC17148/60C76E3E" Ref="UCJ332"  Part="1" 
F 0 "UCJ332" H 10000 16816 50  0000 C CNN
F 1 "INV01" H 10000 16725 50  0000 C CNN
F 2 "" H 10000 16300 50  0001 C CNN
F 3 "" H 10000 16300 50  0001 C CNN
	1    10000 16500
	1    0    0    -1  
$EndComp
$Comp
L A5C:INV01 UCJ?
U 1 1 60CA4A21
P 10500 16400
AR Path="/60CA4A21" Ref="UCJ?"  Part="1" 
AR Path="/5F93CF8E/60CA4A21" Ref="UCJ329"  Part="1" 
AR Path="/5FC16B93/5FC17148/60CA4A21" Ref="UCJ329"  Part="1" 
F 0 "UCJ329" H 10500 16716 50  0000 C CNN
F 1 "INV01" H 10500 16625 50  0000 C CNN
F 2 "" H 10500 16200 50  0001 C CNN
F 3 "" H 10500 16200 50  0001 C CNN
	1    10500 16400
	1    0    0    -1  
$EndComp
$Comp
L A5C:INV01 UCJ?
U 1 1 60CA4C23
P 10850 15900
AR Path="/60CA4C23" Ref="UCJ?"  Part="1" 
AR Path="/5F93CF8E/60CA4C23" Ref="UCR322"  Part="1" 
AR Path="/5FC16B93/5FC17148/60CA4C23" Ref="UCR322"  Part="1" 
F 0 "UCR322" H 10850 16216 50  0000 C CNN
F 1 "INV01" H 10850 16125 50  0000 C CNN
F 2 "" H 10850 15700 50  0001 C CNN
F 3 "" H 10850 15700 50  0001 C CNN
	1    10850 15900
	1    0    0    -1  
$EndComp
$Comp
L A5C:BUF12 UBD?
U 1 1 60561C75
P 10950 1200
AR Path="/60561C75" Ref="UBD?"  Part="1" 
AR Path="/5F93CF8E/60561C75" Ref="UBD383"  Part="1" 
AR Path="/5FC16B93/5FC17148/60561C75" Ref="UBD383"  Part="1" 
F 0 "UBD383" H 10950 1516 50  0000 C CNN
F 1 "BUF12" H 10950 1425 50  0000 C CNN
F 2 "" H 10950 1200 50  0001 C CNN
F 3 "" H 10950 1200 50  0001 C CNN
	1    10950 1200
	1    0    0    -1  
$EndComp
$Comp
L A5C:BUF12 UBK?
U 1 1 6068E2AF
P 10950 1750
AR Path="/6068E2AF" Ref="UBK?"  Part="1" 
AR Path="/5F93CF8E/6068E2AF" Ref="UBK433"  Part="1" 
AR Path="/5FC16B93/5FC17148/6068E2AF" Ref="UBK433"  Part="1" 
F 0 "UBK433" H 10950 2067 50  0000 C CNN
F 1 "BUF12" H 10950 1976 50  0000 C CNN
F 2 "" H 10950 1750 50  0001 C CNN
F 3 "" H 10950 1750 50  0001 C CNN
	1    10950 1750
	1    0    0    -1  
$EndComp
$Comp
L A5C:BUF12 UBK?
U 1 1 606A13C6
P 10950 2300
AR Path="/606A13C6" Ref="UBK?"  Part="1" 
AR Path="/5F93CF8E/606A13C6" Ref="UBD337"  Part="1" 
AR Path="/5FC16B93/5FC17148/606A13C6" Ref="UBD337"  Part="1" 
F 0 "UBD337" H 10950 2617 50  0000 C CNN
F 1 "BUF12" H 10950 2526 50  0000 C CNN
F 2 "" H 10950 2300 50  0001 C CNN
F 3 "" H 10950 2300 50  0001 C CNN
	1    10950 2300
	1    0    0    -1  
$EndComp
$Comp
L A5C:BUF12 UBK?
U 1 1 6497D532
P 11150 4150
AR Path="/6497D532" Ref="UBK?"  Part="1" 
AR Path="/5F93CF8E/6497D532" Ref="UAA254"  Part="1" 
AR Path="/5FC16B93/5FC17148/6497D532" Ref="UAA254"  Part="1" 
F 0 "UAA254" H 11150 4467 50  0000 C CNN
F 1 "BUF12" H 11150 4376 50  0000 C CNN
F 2 "" H 11150 4150 50  0001 C CNN
F 3 "" H 11150 4150 50  0001 C CNN
	1    11150 4150
	1    0    0    -1  
$EndComp
$Comp
L A5C:INV01 UBH?
U 1 1 67F2707B
P 11150 8450
AR Path="/67F2707B" Ref="UBH?"  Part="1" 
AR Path="/5F93CF8E/67F2707B" Ref="UBD407"  Part="1" 
AR Path="/5FC16B93/5FC17148/67F2707B" Ref="UBD407"  Part="1" 
F 0 "UBD407" H 11150 8766 50  0000 C CNN
F 1 "INV01" H 11150 8675 50  0000 C CNN
F 2 "" H 11150 8250 50  0001 C CNN
F 3 "" H 11150 8250 50  0001 C CNN
	1    11150 8450
	1    0    0    -1  
$EndComp
$Comp
L A5C:INV01 UBK?
U 1 1 682CC4DC
P 11250 5400
AR Path="/682CC4DC" Ref="UBK?"  Part="1" 
AR Path="/5F93CF8E/682CC4DC" Ref="UBK322"  Part="1" 
AR Path="/5FC16B93/5FC17148/682CC4DC" Ref="UBK322"  Part="1" 
F 0 "UBK322" H 11250 5716 50  0000 C CNN
F 1 "INV01" H 11250 5625 50  0000 C CNN
F 2 "" H 11250 5200 50  0001 C CNN
F 3 "" H 11250 5200 50  0001 C CNN
	1    11250 5400
	1    0    0    -1  
$EndComp
$Comp
L A5C:INV01 UBH?
U 1 1 683AD216
P 11250 6150
AR Path="/683AD216" Ref="UBH?"  Part="1" 
AR Path="/5F93CF8E/683AD216" Ref="UBN260"  Part="1" 
AR Path="/5FC16B93/5FC17148/683AD216" Ref="UBN260"  Part="1" 
F 0 "UBN260" H 11250 6466 50  0000 C CNN
F 1 "INV01" H 11250 6375 50  0000 C CNN
F 2 "" H 11250 5950 50  0001 C CNN
F 3 "" H 11250 5950 50  0001 C CNN
	1    11250 6150
	1    0    0    -1  
$EndComp
$Comp
L A5C:INV01 UBH?
U 1 1 67FC38CF
P 11250 7450
AR Path="/67FC38CF" Ref="UBH?"  Part="1" 
AR Path="/5F93CF8E/67FC38CF" Ref="UBH476"  Part="1" 
AR Path="/5FC16B93/5FC17148/67FC38CF" Ref="UBH476"  Part="1" 
F 0 "UBH476" H 11250 7766 50  0000 C CNN
F 1 "INV01" H 11250 7675 50  0000 C CNN
F 2 "" H 11250 7250 50  0001 C CNN
F 3 "" H 11250 7250 50  0001 C CNN
	1    11250 7450
	1    0    0    -1  
$EndComp
$Comp
L A5C:INV01 UCJ?
U 1 1 6513B5CF
P 13350 12100
AR Path="/6513B5CF" Ref="UCJ?"  Part="1" 
AR Path="/5F93CF8E/6513B5CF" Ref="UCL345"  Part="1" 
AR Path="/5FC16B93/5FC17148/6513B5CF" Ref="UCL345"  Part="1" 
F 0 "UCL345" H 13350 12416 50  0000 C CNN
F 1 "INV01" H 13350 12325 50  0000 C CNN
F 2 "" H 13350 11900 50  0001 C CNN
F 3 "" H 13350 11900 50  0001 C CNN
	1    13350 12100
	1    0    0    -1  
$EndComp
$Comp
L A5C:INV01 UCJ?
U 1 1 647D74AF
P 13350 14000
AR Path="/647D74AF" Ref="UCJ?"  Part="1" 
AR Path="/5F93CF8E/647D74AF" Ref="UCJ291"  Part="1" 
AR Path="/5FC16B93/5FC17148/647D74AF" Ref="UCJ291"  Part="1" 
F 0 "UCJ291" H 13350 14316 50  0000 C CNN
F 1 "INV01" H 13350 14225 50  0000 C CNN
F 2 "" H 13350 13800 50  0001 C CNN
F 3 "" H 13350 13800 50  0001 C CNN
	1    13350 14000
	1    0    0    -1  
$EndComp
$Comp
L A5C:INV01 UCL?
U 1 1 660AB12A
P 14000 13400
AR Path="/660AB12A" Ref="UCL?"  Part="1" 
AR Path="/5F93CF8E/660AB12A" Ref="UCL347"  Part="1" 
AR Path="/5FC16B93/5FC17148/660AB12A" Ref="UCL347"  Part="1" 
F 0 "UCL347" H 14000 13716 50  0000 C CNN
F 1 "INV01" H 14000 13625 50  0000 C CNN
F 2 "" H 14000 13200 50  0001 C CNN
F 3 "" H 14000 13200 50  0001 C CNN
	1    14000 13400
	1    0    0    1   
$EndComp
$Comp
L A5C:NOR03 UCL348
U 1 1 6513B9E2
P 14600 12200
AR Path="/5F93CF8E/6513B9E2" Ref="UCL348"  Part="1" 
AR Path="/5FC16B93/5FC17148/6513B9E2" Ref="UCL348"  Part="1" 
F 0 "UCL348" H 14600 12517 50  0000 C CNN
F 1 "NOR03" H 14600 12426 50  0000 C CNN
F 2 "" H 14600 12200 50  0001 C CNN
F 3 "" H 14600 12200 50  0001 C CNN
	1    14600 12200
	1    0    0    -1  
$EndComp
$Comp
L A5C:INV01 UCL?
U 1 1 6719D862
P 15200 13150
AR Path="/6719D862" Ref="UCL?"  Part="1" 
AR Path="/5F93CF8E/6719D862" Ref="UCG402"  Part="1" 
AR Path="/5FC16B93/5FC17148/6719D862" Ref="UCG402"  Part="1" 
F 0 "UCG402" H 15200 13466 50  0000 C CNN
F 1 "INV01" H 15200 13375 50  0000 C CNN
F 2 "" H 15200 12950 50  0001 C CNN
F 3 "" H 15200 12950 50  0001 C CNN
	1    15200 13150
	1    0    0    -1  
$EndComp
$Comp
L A5C:NOR04 UCT341
U 1 1 6249CB7D
P 1750 19000
AR Path="/5F93CF8E/6249CB7D" Ref="UCT341"  Part="1" 
AR Path="/5FC16B93/5FC17148/6249CB7D" Ref="UCT341"  Part="1" 
F 0 "UCT341" H 1750 19342 50  0000 C CNN
F 1 "NOR04" H 1750 19251 50  0000 C CNN
F 2 "" H 1750 19000 50  0001 C CNN
F 3 "" H 1750 19000 50  0001 C CNN
	1    1750 19000
	-1   0    0    -1  
$EndComp
$Comp
L A5C:AND04 UBH328
U 1 1 5FB8F63A
P 10600 4700
AR Path="/5F93CF8E/5FB8F63A" Ref="UBH328"  Part="1" 
AR Path="/5FC16B93/5FC17148/5FB8F63A" Ref="UBH328"  Part="1" 
F 0 "UBH328" H 10600 5042 50  0000 C CNN
F 1 "AND04" H 10600 4951 50  0000 C CNN
F 2 "" H 10600 4450 50  0001 C CNN
F 3 "" H 10600 4450 50  0001 C CNN
	1    10600 4700
	1    0    0    -1  
$EndComp
$Comp
L A5C:AND04 UBH393
U 1 1 5FC25D70
P 10600 6800
AR Path="/5F93CF8E/5FC25D70" Ref="UBH393"  Part="1" 
AR Path="/5FC16B93/5FC17148/5FC25D70" Ref="UBH393"  Part="1" 
F 0 "UBH393" H 10600 7142 50  0000 C CNN
F 1 "AND04" H 10600 7051 50  0000 C CNN
F 2 "" H 10600 6550 50  0001 C CNN
F 3 "" H 10600 6550 50  0001 C CNN
	1    10600 6800
	1    0    0    -1  
$EndComp
$Comp
L A5C:AND04 UCC329
U 1 1 60A1D325
P 12750 14850
AR Path="/5F93CF8E/60A1D325" Ref="UCC329"  Part="1" 
AR Path="/5FC16B93/5FC17148/60A1D325" Ref="UCC329"  Part="1" 
F 0 "UCC329" H 12750 15192 50  0000 C CNN
F 1 "AND04" H 12750 15101 50  0000 C CNN
F 2 "" H 12750 14600 50  0001 C CNN
F 3 "" H 12750 14600 50  0001 C CNN
	1    12750 14850
	1    0    0    -1  
$EndComp
$Comp
L A5C:AND04 UCJ333
U 1 1 60B9E2A9
P 13750 10350
AR Path="/5F93CF8E/60B9E2A9" Ref="UCJ333"  Part="1" 
AR Path="/5FC16B93/5FC17148/60B9E2A9" Ref="UCJ333"  Part="1" 
F 0 "UCJ333" H 13750 10692 50  0000 C CNN
F 1 "AND04" H 13750 10601 50  0000 C CNN
F 2 "" H 13750 10100 50  0001 C CNN
F 3 "" H 13750 10100 50  0001 C CNN
	1    13750 10350
	1    0    0    -1  
$EndComp
$Comp
L A5C:NOR04 UCL350
U 1 1 66842457
P 14600 13150
AR Path="/5F93CF8E/66842457" Ref="UCL350"  Part="1" 
AR Path="/5FC16B93/5FC17148/66842457" Ref="UCL350"  Part="1" 
F 0 "UCL350" H 14600 13492 50  0000 C CNN
F 1 "NOR04" H 14600 13401 50  0000 C CNN
F 2 "" H 14600 13150 50  0001 C CNN
F 3 "" H 14600 13150 50  0001 C CNN
	1    14600 13150
	1    0    0    -1  
$EndComp
$Comp
L A5C:NAND05 UCJ303
U 1 1 613E346B
P 3150 18550
AR Path="/5F93CF8E/613E346B" Ref="UCJ303"  Part="1" 
AR Path="/5FC16B93/5FC17148/613E346B" Ref="UCJ303"  Part="1" 
F 0 "UCJ303" H 3175 18940 50  0000 C CNN
F 1 "NAND05" H 3175 18849 50  0000 C CNN
F 2 "" H 3150 18250 50  0001 C CNN
F 3 "" H 3150 18250 50  0001 C CNN
	1    3150 18550
	-1   0    0    -1  
$EndComp
$Comp
L A5C:NAND05 UBH366
U 1 1 5FC0C6C7
P 10600 5400
AR Path="/5F93CF8E/5FC0C6C7" Ref="UBH366"  Part="1" 
AR Path="/5FC16B93/5FC17148/5FC0C6C7" Ref="UBH366"  Part="1" 
F 0 "UBH366" H 10625 5790 50  0000 C CNN
F 1 "NAND05" H 10625 5699 50  0000 C CNN
F 2 "" H 10600 5100 50  0001 C CNN
F 3 "" H 10600 5100 50  0001 C CNN
	1    10600 5400
	1    0    0    -1  
$EndComp
$Comp
L A5C:NAND05 UBH383
U 1 1 5FC1B2BC
P 10600 6150
AR Path="/5F93CF8E/5FC1B2BC" Ref="UBH383"  Part="1" 
AR Path="/5FC16B93/5FC17148/5FC1B2BC" Ref="UBH383"  Part="1" 
F 0 "UBH383" H 10625 6540 50  0000 C CNN
F 1 "NAND05" H 10625 6449 50  0000 C CNN
F 2 "" H 10600 5850 50  0001 C CNN
F 3 "" H 10600 5850 50  0001 C CNN
	1    10600 6150
	1    0    0    -1  
$EndComp
$Comp
L A5C:NAND05 UBH430
U 1 1 5FC2D45D
P 10600 7450
AR Path="/5F93CF8E/5FC2D45D" Ref="UBH430"  Part="1" 
AR Path="/5FC16B93/5FC17148/5FC2D45D" Ref="UBH430"  Part="1" 
F 0 "UBH430" H 10625 7840 50  0000 C CNN
F 1 "NAND05" H 10625 7749 50  0000 C CNN
F 2 "" H 10600 7150 50  0001 C CNN
F 3 "" H 10600 7150 50  0001 C CNN
	1    10600 7450
	1    0    0    -1  
$EndComp
$Comp
L A5C:NAND06 UCT335
U 1 1 6165F1A6
P 3150 19500
AR Path="/5F93CF8E/6165F1A6" Ref="UCT335"  Part="1" 
AR Path="/5FC16B93/5FC17148/6165F1A6" Ref="UCT335"  Part="1" 
F 0 "UCT335" H 3150 19940 50  0000 C CNN
F 1 "NAND06" H 3150 19849 50  0000 C CNN
F 2 "" H 3100 19600 50  0001 C CNN
F 3 "" H 3100 19600 50  0001 C CNN
	1    3150 19500
	-1   0    0    -1  
$EndComp
$Comp
L A5C:NAND08 UCT373
U 1 1 5FCF78FF
P 3200 4000
AR Path="/5F93CF8E/5FCF78FF" Ref="UCT373"  Part="1" 
AR Path="/5FC16B93/5FC17148/5FCF78FF" Ref="UCT373"  Part="1" 
F 0 "UCT373" H 3200 4540 50  0000 C CNN
F 1 "NAND08" H 3200 4449 50  0000 C CNN
F 2 "" H 3150 4200 50  0001 C CNN
F 3 "" H 3150 4200 50  0001 C CNN
	1    3200 4000
	-1   0    0    -1  
$EndComp
$Comp
L A5C:NAND08 UCL262
U 1 1 602987E3
P 12750 14000
AR Path="/5F93CF8E/602987E3" Ref="UCL262"  Part="1" 
AR Path="/5FC16B93/5FC17148/602987E3" Ref="UCL262"  Part="1" 
F 0 "UCL262" H 12750 14540 50  0000 C CNN
F 1 "NAND08" H 12750 14449 50  0000 C CNN
F 2 "" H 12700 14200 50  0001 C CNN
F 3 "" H 12700 14200 50  0001 C CNN
	1    12750 14000
	1    0    0    -1  
$EndComp
$Comp
L A5C:M367C UBN344
U 1 1 66EB0566
P 4700 22400
AR Path="/5F93CF8E/66EB0566" Ref="UBN344"  Part="1" 
AR Path="/5FC16B93/5FC17148/66EB0566" Ref="UBN344"  Part="1" 
F 0 "UBN344" H 4700 22915 50  0000 C CNN
F 1 "M367C" H 4700 22824 50  0000 C CNN
F 2 "" H 5000 22200 50  0001 C CNN
F 3 "" H 5000 22200 50  0001 C CNN
	1    4700 22400
	-1   0    0    -1  
$EndComp
$Comp
L A5C:M367C UBH356
U 1 1 5FBE4273
P 10800 19900
AR Path="/5F93CF8E/5FBE4273" Ref="UBH356"  Part="1" 
AR Path="/5FC16B93/5FC17148/5FBE4273" Ref="UBH356"  Part="1" 
F 0 "UBH356" H 10800 20415 50  0000 C CNN
F 1 "M367C" H 10800 20324 50  0000 C CNN
F 2 "" H 11100 19700 50  0001 C CNN
F 3 "" H 11100 19700 50  0001 C CNN
	1    10800 19900
	1    0    0    -1  
$EndComp
$Comp
L A5C:NAND13 UCL313
U 1 1 6027FC73
P 3150 12300
AR Path="/5F93CF8E/6027FC73" Ref="UCL313"  Part="1" 
AR Path="/5FC16B93/5FC17148/6027FC73" Ref="UCL313"  Part="1" 
F 0 "UCL313" H 3150 13090 50  0000 C CNN
F 1 "NAND13" H 3150 12999 50  0000 C CNN
F 2 "" H 3100 12750 50  0001 C CNN
F 3 "" H 3100 12750 50  0001 C CNN
	1    3150 12300
	-1   0    0    -1  
$EndComp
$Comp
L A5C:NAND13 UCR332
U 1 1 60B970D9
P 3150 14100
AR Path="/5F93CF8E/60B970D9" Ref="UCR332"  Part="1" 
AR Path="/5FC16B93/5FC17148/60B970D9" Ref="UCR332"  Part="1" 
F 0 "UCR332" H 3150 14890 50  0000 C CNN
F 1 "NAND13" H 3150 14799 50  0000 C CNN
F 2 "" H 3100 14550 50  0001 C CNN
F 3 "" H 3100 14550 50  0001 C CNN
	1    3150 14100
	-1   0    0    -1  
$EndComp
$Comp
L A5C:NAND13 UCL383
U 1 1 60A752A8
P 3150 15700
AR Path="/5F93CF8E/60A752A8" Ref="UCL383"  Part="1" 
AR Path="/5FC16B93/5FC17148/60A752A8" Ref="UCL383"  Part="1" 
F 0 "UCL383" H 3150 16490 50  0000 C CNN
F 1 "NAND13" H 3150 16399 50  0000 C CNN
F 2 "" H 3100 16150 50  0001 C CNN
F 3 "" H 3100 16150 50  0001 C CNN
	1    3150 15700
	-1   0    0    -1  
$EndComp
$Comp
L A5C:NAND13 UCL391
U 1 1 60AB15B1
P 3150 17300
AR Path="/5F93CF8E/60AB15B1" Ref="UCL391"  Part="1" 
AR Path="/5FC16B93/5FC17148/60AB15B1" Ref="UCL391"  Part="1" 
F 0 "UCL391" H 3150 18090 50  0000 C CNN
F 1 "NAND13" H 3150 17999 50  0000 C CNN
F 2 "" H 3100 17750 50  0001 C CNN
F 3 "" H 3100 17750 50  0001 C CNN
	1    3150 17300
	-1   0    0    -1  
$EndComp
$Comp
L A5C:NAND13 UCR389
U 1 1 5FE52914
P 3200 5350
AR Path="/5F93CF8E/5FE52914" Ref="UCR389"  Part="1" 
AR Path="/5FC16B93/5FC17148/5FE52914" Ref="UCR389"  Part="1" 
F 0 "UCR389" H 3200 6140 50  0000 C CNN
F 1 "NAND13" H 3200 6049 50  0000 C CNN
F 2 "" H 3150 5800 50  0001 C CNN
F 3 "" H 3150 5800 50  0001 C CNN
	1    3200 5350
	-1   0    0    -1  
$EndComp
$Comp
L A5C:NAND13 UCT365
U 1 1 5FB31F31
P 3200 7000
AR Path="/5F93CF8E/5FB31F31" Ref="UCT365"  Part="1" 
AR Path="/5FC16B93/5FC17148/5FB31F31" Ref="UCT365"  Part="1" 
F 0 "UCT365" H 3200 7790 50  0000 C CNN
F 1 "NAND13" H 3200 7699 50  0000 C CNN
F 2 "" H 3150 7450 50  0001 C CNN
F 3 "" H 3150 7450 50  0001 C CNN
	1    3200 7000
	-1   0    0    -1  
$EndComp
$Comp
L A5C:NAND13 UCJ315
U 1 1 607DAAA8
P 3200 8650
AR Path="/5F93CF8E/607DAAA8" Ref="UCJ315"  Part="1" 
AR Path="/5FC16B93/5FC17148/607DAAA8" Ref="UCJ315"  Part="1" 
F 0 "UCJ315" H 3200 9440 50  0000 C CNN
F 1 "NAND13" H 3200 9349 50  0000 C CNN
F 2 "" H 3150 9100 50  0001 C CNN
F 3 "" H 3150 9100 50  0001 C CNN
	1    3200 8650
	-1   0    0    -1  
$EndComp
$Comp
L A5C:NAND13 UCJ307
U 1 1 5FA0297D
P 3200 10500
AR Path="/5F93CF8E/5FA0297D" Ref="UCJ307"  Part="1" 
AR Path="/5FC16B93/5FC17148/5FA0297D" Ref="UCJ307"  Part="1" 
F 0 "UCJ307" H 3200 11290 50  0000 C CNN
F 1 "NAND13" H 3200 11199 50  0000 C CNN
F 2 "" H 3150 10950 50  0001 C CNN
F 3 "" H 3150 10950 50  0001 C CNN
	1    3200 10500
	-1   0    0    -1  
$EndComp
$Comp
L A5C:NAND13 UCL328
U 1 1 5FBBE279
P 11600 16900
AR Path="/5F93CF8E/5FBBE279" Ref="UCL328"  Part="1" 
AR Path="/5FC16B93/5FC17148/5FBBE279" Ref="UCL328"  Part="1" 
F 0 "UCL328" H 11600 17690 50  0000 C CNN
F 1 "NAND13" H 11600 17599 50  0000 C CNN
F 2 "" H 11550 17350 50  0001 C CNN
F 3 "" H 11550 17350 50  0001 C CNN
	1    11600 16900
	1    0    0    -1  
$EndComp
$Comp
L A5C:NAND13 UCL336
U 1 1 5FBBE27F
P 11600 18450
AR Path="/5F93CF8E/5FBBE27F" Ref="UCL336"  Part="1" 
AR Path="/5FC16B93/5FC17148/5FBBE27F" Ref="UCL336"  Part="1" 
F 0 "UCL336" H 11600 19240 50  0000 C CNN
F 1 "NAND13" H 11600 19149 50  0000 C CNN
F 2 "" H 11550 18900 50  0001 C CNN
F 3 "" H 11550 18900 50  0001 C CNN
	1    11600 18450
	1    0    0    -1  
$EndComp
$Comp
L A5C:NAND13 UCJ257
U 1 1 5F947733
P 12750 10500
AR Path="/5F93CF8E/5F947733" Ref="UCJ257"  Part="1" 
AR Path="/5FC16B93/5FC17148/5F947733" Ref="UCJ257"  Part="1" 
F 0 "UCJ257" H 12750 11290 50  0000 C CNN
F 1 "NAND13" H 12750 11199 50  0000 C CNN
F 2 "" H 12700 10950 50  0001 C CNN
F 3 "" H 12700 10950 50  0001 C CNN
	1    12750 10500
	1    0    0    -1  
$EndComp
$Comp
L A5C:NAND13 UCL272
U 1 1 60224DF7
P 12750 12100
AR Path="/5F93CF8E/60224DF7" Ref="UCL272"  Part="1" 
AR Path="/5FC16B93/5FC17148/60224DF7" Ref="UCL272"  Part="1" 
F 0 "UCL272" H 12750 12890 50  0000 C CNN
F 1 "NAND13" H 12750 12799 50  0000 C CNN
F 2 "" H 12700 12550 50  0001 C CNN
F 3 "" H 12700 12550 50  0001 C CNN
	1    12750 12100
	1    0    0    -1  
$EndComp
$Comp
L A5C:M541C UCL354
U 1 1 5F9E997E
P 4700 21200
AR Path="/5F93CF8E/5F9E997E" Ref="UCL354"  Part="1" 
AR Path="/5FC16B93/5FC17148/5F9E997E" Ref="UCL354"  Part="1" 
F 0 "UCL354" H 4700 21915 50  0000 C CNN
F 1 "M541C" H 4700 21824 50  0000 C CNN
F 2 "" H 5000 21200 50  0001 C CNN
F 3 "" H 5000 21200 50  0001 C CNN
	1    4700 21200
	-1   0    0    -1  
$EndComp
$Comp
L A5C:M541C UCC334
U 1 1 603569CB
P 10800 21000
AR Path="/5F93CF8E/603569CB" Ref="UCC334"  Part="1" 
AR Path="/5FC16B93/5FC17148/603569CB" Ref="UCC334"  Part="1" 
F 0 "UCC334" H 10800 21715 50  0000 C CNN
F 1 "M541C" H 10800 21624 50  0000 C CNN
F 2 "" H 11100 21000 50  0001 C CNN
F 3 "" H 11100 21000 50  0001 C CNN
	1    10800 21000
	1    0    0    -1  
$EndComp
Wire Wire Line
	5300 21650 5300 22600
Wire Wire Line
	5300 22600 6000 22600
Connection ~ 5300 22600
Text HLabel 9900 21450 0    50   Input ~ 0
~DEBUG-LO
Text HLabel 6000 22600 2    50   Input ~ 0
~DEBUG-HI
Wire Wire Line
	10200 21450 9900 21450
Connection ~ 10200 21450
Text Notes 14450 11700 0    50   ~ 0
Active section in the counter 65-448\nTotal active columns 384
Text Notes 550  19500 0    50   ~ 0
Active section in the counter 17-240\nTotal active lines 224
Connection ~ 9000 1200
Text Label 6600 1200 0    50   ~ 0
COL1
Text Label 6600 1300 0    50   ~ 0
COL2
Text Label 6600 1400 0    50   ~ 0
COL3
Text Label 6600 1500 0    50   ~ 0
COL4
Text Label 6600 1600 0    50   ~ 0
COL5
Text Label 6600 1700 0    50   ~ 0
COL6
Text Label 6600 1800 0    50   ~ 0
COL7
Text Label 6600 1900 0    50   ~ 0
COL8
Text Label 6600 2000 0    50   ~ 0
LINE0
Text Label 6600 2100 0    50   ~ 0
LINE1
Text Label 6600 2200 0    50   ~ 0
LINE2
Text Label 6600 2300 0    50   ~ 0
LINE3
Text Label 6600 2400 0    50   ~ 0
LINE4
Text Label 6600 2500 0    50   ~ 0
LINE5
Text Label 6600 2600 0    50   ~ 0
LINE6
Text Label 6600 2700 0    50   ~ 0
LINE7
Text Label 6600 2800 0    50   ~ 0
LINE8
Entry Wire Line
	6400 1100 6500 1200
Entry Wire Line
	6400 1200 6500 1300
Entry Wire Line
	6400 1300 6500 1400
Entry Wire Line
	6400 1400 6500 1500
Entry Wire Line
	6400 1500 6500 1600
Entry Wire Line
	6400 1600 6500 1700
Entry Wire Line
	6400 1700 6500 1800
Entry Wire Line
	6400 2900 6500 2800
Entry Wire Line
	6400 2800 6500 2700
Entry Wire Line
	6400 2700 6500 2600
Entry Wire Line
	6400 2600 6500 2500
Entry Wire Line
	6400 2500 6500 2400
Entry Wire Line
	6400 2400 6500 2300
Entry Wire Line
	6400 2300 6500 2200
Entry Wire Line
	6400 2200 6500 2100
Entry Wire Line
	6400 2100 6500 2000
Entry Wire Line
	6400 1800 6500 1900
Wire Bus Line
	6400 3000 6300 3000
Wire Bus Line
	6400 1000 6300 1000
Text HLabel 6300 1000 0    50   Input ~ 0
COL[1..8]
Text HLabel 6300 3000 0    50   Input ~ 0
LINE[0..8]
Wire Bus Line
	11800 19750 11800 20350
Wire Bus Line
	6400 1000 6400 1800
Wire Bus Line
	11800 20350 11800 21150
Wire Bus Line
	3700 20550 3700 22350
Wire Bus Line
	6400 2100 6400 3000
$EndSCHEMATC
