EESchema Schematic File Version 4
EELAYER 30 0
EELAYER END
$Descr A4 11693 8268
encoding utf-8
Sheet 24 83
Title "CPS Reverse Engineering: DL-0311"
Date "2021-09-12"
Rev ""
Comp ""
Comment1 ""
Comment2 ""
Comment3 "Licence: CC-BY"
Comment4 "Author: Loïc *WydD* Petit"
$EndDescr
Connection ~ 5400 5950
Connection ~ 3650 1000
Connection ~ 7450 5950
Connection ~ 1600 1000
Entry Wire Line
	1600 1450 1700 1550
Entry Wire Line
	1600 2000 1700 2100
Entry Wire Line
	1600 2550 1700 2650
Entry Wire Line
	1600 3100 1700 3200
Entry Wire Line
	1600 3650 1700 3750
Entry Wire Line
	1600 4200 1700 4300
Entry Wire Line
	1600 4750 1700 4850
Entry Wire Line
	1600 5300 1700 5400
Entry Wire Line
	3250 1550 3350 1650
Entry Wire Line
	3250 2100 3350 2200
Entry Wire Line
	3250 2650 3350 2750
Entry Wire Line
	3250 3200 3350 3300
Entry Wire Line
	3250 3750 3350 3850
Entry Wire Line
	3250 4300 3350 4400
Entry Wire Line
	3250 4850 3350 4950
Entry Wire Line
	3250 5400 3350 5500
Entry Wire Line
	3650 1450 3750 1550
Entry Wire Line
	3650 2000 3750 2100
Entry Wire Line
	3650 2550 3750 2650
Entry Wire Line
	3650 3100 3750 3200
Entry Wire Line
	3650 3650 3750 3750
Entry Wire Line
	3650 4200 3750 4300
Entry Wire Line
	3650 4750 3750 4850
Entry Wire Line
	3650 5300 3750 5400
Entry Wire Line
	5300 1550 5400 1650
Entry Wire Line
	5300 2100 5400 2200
Entry Wire Line
	5300 2650 5400 2750
Entry Wire Line
	5300 3200 5400 3300
Entry Wire Line
	5300 3750 5400 3850
Entry Wire Line
	5300 4300 5400 4400
Entry Wire Line
	5300 4850 5400 4950
Entry Wire Line
	5300 5400 5400 5500
Entry Wire Line
	5700 1450 5800 1550
Entry Wire Line
	5700 2000 5800 2100
Entry Wire Line
	5700 2550 5800 2650
Entry Wire Line
	5700 3100 5800 3200
Entry Wire Line
	5700 3650 5800 3750
Entry Wire Line
	5700 4200 5800 4300
Entry Wire Line
	5700 4750 5800 4850
Entry Wire Line
	7350 1550 7450 1650
Entry Wire Line
	7350 2100 7450 2200
Entry Wire Line
	7350 2650 7450 2750
Entry Wire Line
	7350 3200 7450 3300
Entry Wire Line
	7350 3750 7450 3850
Entry Wire Line
	7350 4300 7450 4400
Entry Wire Line
	7350 4850 7450 4950
Entry Wire Line
	8800 1450 8900 1550
Entry Wire Line
	8800 1950 8900 2050
Entry Wire Line
	8800 2450 8900 2550
Entry Wire Line
	8800 2950 8900 3050
Entry Wire Line
	8800 3450 8900 3550
Entry Wire Line
	8800 4750 8900 4850
Entry Wire Line
	8800 5250 8900 5350
Entry Wire Line
	10100 1650 10000 1550
Entry Wire Line
	10100 2150 10000 2050
Entry Wire Line
	10100 2650 10000 2550
Entry Wire Line
	10100 3150 10000 3050
Entry Wire Line
	10100 3650 10000 3550
Entry Wire Line
	10100 4950 10000 4850
Entry Wire Line
	10100 5450 10000 5350
Wire Wire Line
	1700 1550 2150 1550
Wire Wire Line
	1700 2100 2150 2100
Wire Wire Line
	1700 2650 2150 2650
Wire Wire Line
	1700 3200 2150 3200
Wire Wire Line
	1700 3750 2150 3750
Wire Wire Line
	1700 4300 2150 4300
Wire Wire Line
	1700 4850 2150 4850
Wire Wire Line
	1700 5400 2150 5400
Wire Wire Line
	2750 1550 3250 1550
Wire Wire Line
	2750 2100 3250 2100
Wire Wire Line
	2750 2650 3250 2650
Wire Wire Line
	2750 3200 3250 3200
Wire Wire Line
	2750 3750 3250 3750
Wire Wire Line
	2750 4300 3250 4300
Wire Wire Line
	2750 4850 3250 4850
Wire Wire Line
	2750 5400 3250 5400
Wire Wire Line
	3750 1550 4200 1550
Wire Wire Line
	3750 2100 4200 2100
Wire Wire Line
	3750 2650 4200 2650
Wire Wire Line
	3750 3200 4200 3200
Wire Wire Line
	3750 3750 4200 3750
Wire Wire Line
	3750 4300 4200 4300
Wire Wire Line
	3750 4850 4200 4850
Wire Wire Line
	3750 5400 4200 5400
Wire Wire Line
	4800 1550 5300 1550
Wire Wire Line
	4800 2100 5300 2100
Wire Wire Line
	4800 2650 5300 2650
Wire Wire Line
	4800 3200 5300 3200
Wire Wire Line
	4800 3750 5300 3750
Wire Wire Line
	4800 4300 5300 4300
Wire Wire Line
	4800 4850 5300 4850
Wire Wire Line
	4800 5400 5300 5400
Wire Wire Line
	5800 1550 6250 1550
Wire Wire Line
	5800 2100 6250 2100
Wire Wire Line
	5800 2650 6250 2650
Wire Wire Line
	5800 3200 6250 3200
Wire Wire Line
	5800 3750 6250 3750
Wire Wire Line
	5800 4300 6250 4300
Wire Wire Line
	5800 4850 6250 4850
Wire Wire Line
	6850 1550 7350 1550
Wire Wire Line
	6850 2100 7350 2100
Wire Wire Line
	6850 2650 7350 2650
Wire Wire Line
	6850 3200 7350 3200
Wire Wire Line
	6850 3750 7350 3750
Wire Wire Line
	6850 4300 7350 4300
Wire Wire Line
	6850 4850 7350 4850
Wire Wire Line
	9150 1550 8900 1550
Wire Wire Line
	9150 2050 8900 2050
Wire Wire Line
	9150 2550 8900 2550
Wire Wire Line
	9150 3050 8900 3050
Wire Wire Line
	9150 3550 8900 3550
Wire Wire Line
	9150 4850 8900 4850
Wire Wire Line
	9150 5350 8900 5350
Wire Wire Line
	9750 1550 10000 1550
Wire Wire Line
	9750 2050 10000 2050
Wire Wire Line
	9750 2550 10000 2550
Wire Wire Line
	9750 3050 10000 3050
Wire Wire Line
	9750 3550 10000 3550
Wire Wire Line
	9750 4850 10000 4850
Wire Wire Line
	9750 5350 10000 5350
Wire Bus Line
	1400 1000 1600 1000
Wire Bus Line
	3350 5950 5400 5950
Wire Bus Line
	3650 1000 1600 1000
Wire Bus Line
	5400 5950 7450 5950
Wire Bus Line
	5700 1000 3650 1000
Wire Bus Line
	7650 5950 7450 5950
Wire Bus Line
	8800 1300 8650 1300
Wire Bus Line
	8800 4600 8700 4600
Wire Bus Line
	10100 3800 10250 3800
Wire Bus Line
	10100 5600 10200 5600
Text Label 2100 1550 2    50   ~ 0
ROMA0
Text Label 2100 2100 2    50   ~ 0
ROMA1
Text Label 2100 2650 2    50   ~ 0
ROMA2
Text Label 2100 3200 2    50   ~ 0
ROMA3
Text Label 2100 3750 2    50   ~ 0
ROMA4
Text Label 2100 4300 2    50   ~ 0
ROMA5
Text Label 2100 4850 2    50   ~ 0
ROMA6
Text Label 2100 5400 2    50   ~ 0
ROMA7
Text Label 2800 1550 0    50   ~ 0
_ROMA0
Text Label 2800 2100 0    50   ~ 0
_ROMA1
Text Label 2800 2650 0    50   ~ 0
_ROMA2
Text Label 2800 3200 0    50   ~ 0
_ROMA3
Text Label 2800 3750 0    50   ~ 0
_ROMA4
Text Label 2800 4300 0    50   ~ 0
_ROMA5
Text Label 2800 4850 0    50   ~ 0
_ROMA6
Text Label 2800 5400 0    50   ~ 0
_ROMA7
Text Label 4150 1550 2    50   ~ 0
ROMA8
Text Label 4150 2100 2    50   ~ 0
ROMA9
Text Label 4150 2650 2    50   ~ 0
ROMA10
Text Label 4150 3200 2    50   ~ 0
ROMA11
Text Label 4150 3750 2    50   ~ 0
ROMA12
Text Label 4150 4300 2    50   ~ 0
ROMA13
Text Label 4150 4850 2    50   ~ 0
ROMA14
Text Label 4150 5400 2    50   ~ 0
ROMA15
Text Label 4850 1550 0    50   ~ 0
_ROMA8
Text Label 4850 2100 0    50   ~ 0
_ROMA9
Text Label 4850 2650 0    50   ~ 0
_ROMA10
Text Label 4850 3200 0    50   ~ 0
_ROMA11
Text Label 4850 3750 0    50   ~ 0
_ROMA12
Text Label 4850 4300 0    50   ~ 0
_ROMA13
Text Label 4850 4850 0    50   ~ 0
_ROMA14
Text Label 4850 5400 0    50   ~ 0
_ROMA15
Text Label 6200 1550 2    50   ~ 0
ROMA16
Text Label 6200 2100 2    50   ~ 0
ROMA17
Text Label 6200 2650 2    50   ~ 0
ROMA18
Text Label 6200 3200 2    50   ~ 0
ROMA19
Text Label 6200 3750 2    50   ~ 0
ROMA20
Text Label 6200 4300 2    50   ~ 0
ROMA21
Text Label 6200 4850 2    50   ~ 0
ROMA22
Text Label 6900 1550 0    50   ~ 0
_ROMA16
Text Label 6900 2100 0    50   ~ 0
_ROMA17
Text Label 6900 2650 0    50   ~ 0
_ROMA18
Text Label 6900 3200 0    50   ~ 0
_ROMA19
Text Label 6900 3750 0    50   ~ 0
_ROMA20
Text Label 6900 4300 0    50   ~ 0
_ROMA21
Text Label 6900 4850 0    50   ~ 0
_ROMA22
Text Label 9150 1550 2    50   ~ 0
CB0
Text Label 9150 2050 2    50   ~ 0
CB1
Text Label 9150 2550 2    50   ~ 0
CB2
Text Label 9150 3050 2    50   ~ 0
CB3
Text Label 9150 3550 2    50   ~ 0
CB4
Text Label 9150 4850 2    50   ~ 0
CPC0
Text Label 9150 5350 2    50   ~ 0
CPC1
Text Label 9750 1550 0    50   ~ 0
_CB0
Text Label 9750 2050 0    50   ~ 0
_CB1
Text Label 9750 2550 0    50   ~ 0
_CB2
Text Label 9750 3050 0    50   ~ 0
_CB3
Text Label 9750 3550 0    50   ~ 0
_CB4
Text Label 9750 4850 0    50   ~ 0
_CPC0
Text Label 9750 5350 0    50   ~ 0
_CPC1
Text HLabel 1400 1000 0    50   Input ~ 0
ROMA[0..22]
Text HLabel 7650 5950 2    50   Output ~ 0
_ROMA[0..22]
Text HLabel 8650 1300 0    50   Input ~ 0
CB[0..4]
Text HLabel 8700 4600 0    50   Input ~ 0
CPC[0..1]
Text HLabel 9150 4200 0    50   Input ~ 0
CDEN
Text HLabel 9150 5950 0    50   Input ~ 0
XSEL
Text HLabel 9750 4200 2    50   Output ~ 0
_CDEN
Text HLabel 9750 5950 2    50   Output ~ 0
_XSEL
Text HLabel 10200 5600 2    50   Output ~ 0
_CPC[0..1]
Text HLabel 10250 3800 2    50   Output ~ 0
_CB[0..4]
$Comp
L A5C:BUF12 UEI254
U 1 1 65345F07
P 2450 1550
F 0 "UEI254" H 2450 1867 50  0000 C CNN
F 1 "BUF12" H 2450 1776 50  0000 C CNN
F 2 "" H 2450 1550 50  0001 C CNN
F 3 "" H 2450 1550 50  0001 C CNN
	1    2450 1550
	1    0    0    -1  
$EndComp
$Comp
L A5C:BUF12 UEK324
U 1 1 65347467
P 2450 2100
F 0 "UEK324" H 2450 2417 50  0000 C CNN
F 1 "BUF12" H 2450 2326 50  0000 C CNN
F 2 "" H 2450 2100 50  0001 C CNN
F 3 "" H 2450 2100 50  0001 C CNN
	1    2450 2100
	1    0    0    -1  
$EndComp
$Comp
L A5C:BUF12 UEI281
U 1 1 6534916E
P 2450 2650
F 0 "UEI281" H 2450 2967 50  0000 C CNN
F 1 "BUF12" H 2450 2876 50  0000 C CNN
F 2 "" H 2450 2650 50  0001 C CNN
F 3 "" H 2450 2650 50  0001 C CNN
	1    2450 2650
	1    0    0    -1  
$EndComp
$Comp
L A5C:BUF12 UEK333
U 1 1 65349174
P 2450 3200
F 0 "UEK333" H 2450 3517 50  0000 C CNN
F 1 "BUF12" H 2450 3426 50  0000 C CNN
F 2 "" H 2450 3200 50  0001 C CNN
F 3 "" H 2450 3200 50  0001 C CNN
	1    2450 3200
	1    0    0    -1  
$EndComp
$Comp
L A5C:BUF12 UEK297
U 1 1 6534A03E
P 2450 3750
F 0 "UEK297" H 2450 4067 50  0000 C CNN
F 1 "BUF12" H 2450 3976 50  0000 C CNN
F 2 "" H 2450 3750 50  0001 C CNN
F 3 "" H 2450 3750 50  0001 C CNN
	1    2450 3750
	1    0    0    -1  
$EndComp
$Comp
L A5C:BUF12 UEK284
U 1 1 6534A044
P 2450 4300
F 0 "UEK284" H 2450 4617 50  0000 C CNN
F 1 "BUF12" H 2450 4526 50  0000 C CNN
F 2 "" H 2450 4300 50  0001 C CNN
F 3 "" H 2450 4300 50  0001 C CNN
	1    2450 4300
	1    0    0    -1  
$EndComp
$Comp
L A5C:BUF12 UEK300
U 1 1 6534A04A
P 2450 4850
F 0 "UEK300" H 2450 5167 50  0000 C CNN
F 1 "BUF12" H 2450 5076 50  0000 C CNN
F 2 "" H 2450 4850 50  0001 C CNN
F 3 "" H 2450 4850 50  0001 C CNN
	1    2450 4850
	1    0    0    -1  
$EndComp
$Comp
L A5C:BUF12 UEJ284
U 1 1 6534A050
P 2450 5400
F 0 "UEJ284" H 2450 5717 50  0000 C CNN
F 1 "BUF12" H 2450 5626 50  0000 C CNN
F 2 "" H 2450 5400 50  0001 C CNN
F 3 "" H 2450 5400 50  0001 C CNN
	1    2450 5400
	1    0    0    -1  
$EndComp
$Comp
L A5C:BUF12 UEI278
U 1 1 6535305E
P 4500 1550
F 0 "UEI278" H 4500 1867 50  0000 C CNN
F 1 "BUF12" H 4500 1776 50  0000 C CNN
F 2 "" H 4500 1550 50  0001 C CNN
F 3 "" H 4500 1550 50  0001 C CNN
	1    4500 1550
	1    0    0    -1  
$EndComp
$Comp
L A5C:BUF12 UEG262
U 1 1 65353064
P 4500 2100
F 0 "UEG262" H 4500 2417 50  0000 C CNN
F 1 "BUF12" H 4500 2326 50  0000 C CNN
F 2 "" H 4500 2100 50  0001 C CNN
F 3 "" H 4500 2100 50  0001 C CNN
	1    4500 2100
	1    0    0    -1  
$EndComp
$Comp
L A5C:BUF12 UEG266
U 1 1 6535306A
P 4500 2650
F 0 "UEG266" H 4500 2967 50  0000 C CNN
F 1 "BUF12" H 4500 2876 50  0000 C CNN
F 2 "" H 4500 2650 50  0001 C CNN
F 3 "" H 4500 2650 50  0001 C CNN
	1    4500 2650
	1    0    0    -1  
$EndComp
$Comp
L A5C:BUF12 UEH263
U 1 1 65353070
P 4500 3200
F 0 "UEH263" H 4500 3517 50  0000 C CNN
F 1 "BUF12" H 4500 3426 50  0000 C CNN
F 2 "" H 4500 3200 50  0001 C CNN
F 3 "" H 4500 3200 50  0001 C CNN
	1    4500 3200
	1    0    0    -1  
$EndComp
$Comp
L A5C:BUF12 UEE333
U 1 1 65353076
P 4500 3750
F 0 "UEE333" H 4500 4067 50  0000 C CNN
F 1 "BUF12" H 4500 3976 50  0000 C CNN
F 2 "" H 4500 3750 50  0001 C CNN
F 3 "" H 4500 3750 50  0001 C CNN
	1    4500 3750
	1    0    0    -1  
$EndComp
$Comp
L A5C:BUF12 UED333
U 1 1 6535307C
P 4500 4300
F 0 "UED333" H 4500 4617 50  0000 C CNN
F 1 "BUF12" H 4500 4526 50  0000 C CNN
F 2 "" H 4500 4300 50  0001 C CNN
F 3 "" H 4500 4300 50  0001 C CNN
	1    4500 4300
	1    0    0    -1  
$EndComp
$Comp
L A5C:BUF12 UEB333
U 1 1 65353082
P 4500 4850
F 0 "UEB333" H 4500 5167 50  0000 C CNN
F 1 "BUF12" H 4500 5076 50  0000 C CNN
F 2 "" H 4500 4850 50  0001 C CNN
F 3 "" H 4500 4850 50  0001 C CNN
	1    4500 4850
	1    0    0    -1  
$EndComp
$Comp
L A5C:BUF12 UEB330
U 1 1 65353088
P 4500 5400
F 0 "UEB330" H 4500 5717 50  0000 C CNN
F 1 "BUF12" H 4500 5626 50  0000 C CNN
F 2 "" H 4500 5400 50  0001 C CNN
F 3 "" H 4500 5400 50  0001 C CNN
	1    4500 5400
	1    0    0    -1  
$EndComp
$Comp
L A5C:BUF12 UCC401
U 1 1 65375E99
P 6550 1550
F 0 "UCC401" H 6550 1867 50  0000 C CNN
F 1 "BUF12" H 6550 1776 50  0000 C CNN
F 2 "" H 6550 1550 50  0001 C CNN
F 3 "" H 6550 1550 50  0001 C CNN
	1    6550 1550
	1    0    0    -1  
$EndComp
$Comp
L A5C:BUF12 UCC448
U 1 1 65375E9F
P 6550 2100
F 0 "UCC448" H 6550 2417 50  0000 C CNN
F 1 "BUF12" H 6550 2326 50  0000 C CNN
F 2 "" H 6550 2100 50  0001 C CNN
F 3 "" H 6550 2100 50  0001 C CNN
	1    6550 2100
	1    0    0    -1  
$EndComp
$Comp
L A5C:BUF12 UCC501
U 1 1 65375EA5
P 6550 2650
F 0 "UCC501" H 6550 2967 50  0000 C CNN
F 1 "BUF12" H 6550 2876 50  0000 C CNN
F 2 "" H 6550 2650 50  0001 C CNN
F 3 "" H 6550 2650 50  0001 C CNN
	1    6550 2650
	1    0    0    -1  
$EndComp
$Comp
L A5C:BUF12 UCC325
U 1 1 65375EAB
P 6550 3200
F 0 "UCC325" H 6550 3517 50  0000 C CNN
F 1 "BUF12" H 6550 3426 50  0000 C CNN
F 2 "" H 6550 3200 50  0001 C CNN
F 3 "" H 6550 3200 50  0001 C CNN
	1    6550 3200
	1    0    0    -1  
$EndComp
$Comp
L A5C:BUF12 UCB420
U 1 1 65375EB1
P 6550 3750
F 0 "UCB420" H 6550 4067 50  0000 C CNN
F 1 "BUF12" H 6550 3976 50  0000 C CNN
F 2 "" H 6550 3750 50  0001 C CNN
F 3 "" H 6550 3750 50  0001 C CNN
	1    6550 3750
	1    0    0    -1  
$EndComp
$Comp
L A5C:BUF12 UCA401
U 1 1 65375EB7
P 6550 4300
F 0 "UCA401" H 6550 4617 50  0000 C CNN
F 1 "BUF12" H 6550 4526 50  0000 C CNN
F 2 "" H 6550 4300 50  0001 C CNN
F 3 "" H 6550 4300 50  0001 C CNN
	1    6550 4300
	1    0    0    -1  
$EndComp
$Comp
L A5C:BUF12 UEF255
U 1 1 65375EBD
P 6550 4850
F 0 "UEF255" H 6550 5167 50  0000 C CNN
F 1 "BUF12" H 6550 5076 50  0000 C CNN
F 2 "" H 6550 4850 50  0001 C CNN
F 3 "" H 6550 4850 50  0001 C CNN
	1    6550 4850
	1    0    0    -1  
$EndComp
$Comp
L A5C:BUF12 UCA?
U 1 1 6174842A
P 9450 1550
AR Path="/6174842A" Ref="UCA?"  Part="1" 
AR Path="/651E67D1/6174842A" Ref="UCA524"  Part="1" 
F 0 "UCA524" H 9450 1867 50  0000 C CNN
F 1 "BUF12" H 9450 1776 50  0000 C CNN
F 2 "" H 9450 1550 50  0001 C CNN
F 3 "" H 9450 1550 50  0001 C CNN
	1    9450 1550
	1    0    0    -1  
$EndComp
$Comp
L A5C:BUF12 UBI?
U 1 1 61748448
P 9450 2050
AR Path="/61748448" Ref="UBI?"  Part="1" 
AR Path="/651E67D1/61748448" Ref="UBI89"  Part="1" 
F 0 "UBI89" H 9450 2367 50  0000 C CNN
F 1 "BUF12" H 9450 2276 50  0000 C CNN
F 2 "" H 9450 2050 50  0001 C CNN
F 3 "" H 9450 2050 50  0001 C CNN
	1    9450 2050
	1    0    0    -1  
$EndComp
$Comp
L A5C:BUF12 UBH?
U 1 1 61748430
P 9450 2550
AR Path="/61748430" Ref="UBH?"  Part="1" 
AR Path="/651E67D1/61748430" Ref="UBH97"  Part="1" 
F 0 "UBH97" H 9450 2867 50  0000 C CNN
F 1 "BUF12" H 9450 2776 50  0000 C CNN
F 2 "" H 9450 2550 50  0001 C CNN
F 3 "" H 9450 2550 50  0001 C CNN
	1    9450 2550
	1    0    0    -1  
$EndComp
$Comp
L A5C:BUF12 UBH?
U 1 1 6174844E
P 9450 3050
AR Path="/6174844E" Ref="UBH?"  Part="1" 
AR Path="/651E67D1/6174844E" Ref="UBH53"  Part="1" 
F 0 "UBH53" H 9450 3367 50  0000 C CNN
F 1 "BUF12" H 9450 3276 50  0000 C CNN
F 2 "" H 9450 3050 50  0001 C CNN
F 3 "" H 9450 3050 50  0001 C CNN
	1    9450 3050
	1    0    0    -1  
$EndComp
$Comp
L A5C:BUF12 UCB?
U 1 1 61748436
P 9450 3550
AR Path="/61748436" Ref="UCB?"  Part="1" 
AR Path="/651E67D1/61748436" Ref="UCB524"  Part="1" 
F 0 "UCB524" H 9450 3867 50  0000 C CNN
F 1 "BUF12" H 9450 3776 50  0000 C CNN
F 2 "" H 9450 3550 50  0001 C CNN
F 3 "" H 9450 3550 50  0001 C CNN
	1    9450 3550
	1    0    0    -1  
$EndComp
$Comp
L A5C:BUF12 UEI?
U 1 1 6174843C
P 9450 4200
AR Path="/6174843C" Ref="UEI?"  Part="1" 
AR Path="/651E67D1/6174843C" Ref="UEI21"  Part="1" 
F 0 "UEI21" H 9450 4517 50  0000 C CNN
F 1 "BUF12" H 9450 4426 50  0000 C CNN
F 2 "" H 9450 4200 50  0001 C CNN
F 3 "" H 9450 4200 50  0001 C CNN
	1    9450 4200
	1    0    0    -1  
$EndComp
$Comp
L A5C:BUF12 UEJ?
U 1 1 61748442
P 9450 4850
AR Path="/61748442" Ref="UEJ?"  Part="1" 
AR Path="/651E67D1/61748442" Ref="UEJ216"  Part="1" 
F 0 "UEJ216" H 9450 5167 50  0000 C CNN
F 1 "BUF12" H 9450 5076 50  0000 C CNN
F 2 "" H 9450 4850 50  0001 C CNN
F 3 "" H 9450 4850 50  0001 C CNN
	1    9450 4850
	1    0    0    -1  
$EndComp
$Comp
L A5C:BUF12 UEH?
U 1 1 6174841E
P 9450 5350
AR Path="/6174841E" Ref="UEH?"  Part="1" 
AR Path="/651E67D1/6174841E" Ref="UEH142"  Part="1" 
F 0 "UEH142" H 9450 5667 50  0000 C CNN
F 1 "BUF12" H 9450 5576 50  0000 C CNN
F 2 "" H 9450 5350 50  0001 C CNN
F 3 "" H 9450 5350 50  0001 C CNN
	1    9450 5350
	1    0    0    -1  
$EndComp
$Comp
L A5C:BUF12 UEK?
U 1 1 61748424
P 9450 5950
AR Path="/61748424" Ref="UEK?"  Part="1" 
AR Path="/651E67D1/61748424" Ref="UEK181"  Part="1" 
F 0 "UEK181" H 9450 6267 50  0000 C CNN
F 1 "BUF12" H 9450 6176 50  0000 C CNN
F 2 "" H 9450 5950 50  0001 C CNN
F 3 "" H 9450 5950 50  0001 C CNN
	1    9450 5950
	1    0    0    -1  
$EndComp
Wire Bus Line
	8800 4600 8800 5250
Wire Bus Line
	10100 4950 10100 5600
Wire Bus Line
	8800 1300 8800 3450
Wire Bus Line
	10100 1650 10100 3800
Wire Bus Line
	5700 1000 5700 4750
Wire Bus Line
	7450 1650 7450 5950
Wire Bus Line
	1600 1000 1600 5300
Wire Bus Line
	3350 1650 3350 5950
Wire Bus Line
	3650 1000 3650 5300
Wire Bus Line
	5400 1650 5400 5950
$EndSCHEMATC
