EESchema Schematic File Version 4
EELAYER 30 0
EELAYER END
$Descr A3 16535 11693
encoding utf-8
Sheet 12 83
Title "CPS Reverse Engineering: DL-0311"
Date "2021-09-12"
Rev ""
Comp ""
Comment1 ""
Comment2 ""
Comment3 "Licence: CC-BY"
Comment4 "Author: Loïc *WydD* Petit"
$EndDescr
Connection ~ 11400 3700
Connection ~ 11400 4400
Connection ~ 9700 3700
Connection ~ 11400 2850
Connection ~ 9700 2900
Connection ~ 2750 8750
Connection ~ 4450 7900
Connection ~ 4450 8750
Connection ~ 4450 9450
Connection ~ 2750 7950
Connection ~ 9700 8750
Connection ~ 9700 7950
Connection ~ 11400 7900
Connection ~ 11400 9450
Connection ~ 11400 8750
Connection ~ 4450 2850
Connection ~ 4450 5350
Connection ~ 4450 3900
Connection ~ 2750 4800
Connection ~ 2750 2900
Connection ~ 2750 3950
Connection ~ 2750 9450
Connection ~ 9700 9450
Connection ~ 9700 4400
Connection ~ 2850 950 
Connection ~ 4950 5350
Connection ~ 13050 9750
NoConn ~ 10850 4200
NoConn ~ 10850 3500
NoConn ~ 3900 9250
NoConn ~ 3900 8550
NoConn ~ 10850 9250
NoConn ~ 10850 8550
NoConn ~ 4050 4600
Entry Wire Line
	2850 1250 2950 1350
Entry Wire Line
	2850 1350 2950 1450
Entry Wire Line
	2850 1450 2950 1550
Entry Wire Line
	2850 1550 2950 1650
Entry Wire Line
	2850 2300 2950 2400
Entry Wire Line
	2850 2400 2950 2500
Entry Wire Line
	2850 2500 2950 2600
Entry Wire Line
	2850 2600 2950 2700
Entry Wire Line
	2850 3350 2950 3450
Entry Wire Line
	2850 3450 2950 3550
Entry Wire Line
	2850 3550 2950 3650
Entry Wire Line
	2850 3650 2950 3750
Entry Wire Line
	2850 4500 2950 4600
Entry Wire Line
	2850 6300 2950 6400
Entry Wire Line
	2850 6400 2950 6500
Entry Wire Line
	2850 6500 2950 6600
Entry Wire Line
	2850 6600 2950 6700
Entry Wire Line
	2850 7350 2950 7450
Entry Wire Line
	2850 7450 2950 7550
Entry Wire Line
	2850 7550 2950 7650
Entry Wire Line
	2850 7650 2950 7750
Entry Wire Line
	2850 8450 2950 8550
Entry Wire Line
	2850 9150 2950 9250
Entry Wire Line
	6000 1350 6100 1450
Entry Wire Line
	6000 1450 6100 1550
Entry Wire Line
	6000 1550 6100 1650
Entry Wire Line
	6000 1650 6100 1750
Entry Wire Line
	6000 2400 6100 2500
Entry Wire Line
	6000 2500 6100 2600
Entry Wire Line
	6000 2600 6100 2700
Entry Wire Line
	6000 2700 6100 2800
Entry Wire Line
	6000 3450 6100 3550
Entry Wire Line
	6000 3550 6100 3650
Entry Wire Line
	6000 3650 6100 3750
Entry Wire Line
	6000 3750 6100 3850
Entry Wire Line
	6000 4700 6100 4800
Entry Wire Line
	6000 6400 6100 6500
Entry Wire Line
	6000 6500 6100 6600
Entry Wire Line
	6000 6600 6100 6700
Entry Wire Line
	6000 6700 6100 6800
Entry Wire Line
	6000 7450 6100 7550
Entry Wire Line
	6000 7550 6100 7650
Entry Wire Line
	6000 7650 6100 7750
Entry Wire Line
	6000 7750 6100 7850
Entry Wire Line
	6000 8650 6100 8750
Entry Wire Line
	6000 9350 6100 9450
Entry Wire Line
	9800 1250 9900 1350
Entry Wire Line
	9800 1350 9900 1450
Entry Wire Line
	9800 1450 9900 1550
Entry Wire Line
	9800 1550 9900 1650
Entry Wire Line
	9800 2300 9900 2400
Entry Wire Line
	9800 2400 9900 2500
Entry Wire Line
	9800 2500 9900 2600
Entry Wire Line
	9800 2600 9900 2700
Entry Wire Line
	9800 3400 9900 3500
Entry Wire Line
	9800 4100 9900 4200
Entry Wire Line
	9800 6300 9900 6400
Entry Wire Line
	9800 6400 9900 6500
Entry Wire Line
	9800 6500 9900 6600
Entry Wire Line
	9800 6600 9900 6700
Entry Wire Line
	9800 7350 9900 7450
Entry Wire Line
	9800 7450 9900 7550
Entry Wire Line
	9800 7550 9900 7650
Entry Wire Line
	9800 7650 9900 7750
Entry Wire Line
	9800 8450 9900 8550
Entry Wire Line
	9800 9150 9900 9250
Entry Wire Line
	12950 1350 13050 1450
Entry Wire Line
	12950 1450 13050 1550
Entry Wire Line
	12950 1550 13050 1650
Entry Wire Line
	12950 1650 13050 1750
Entry Wire Line
	12950 2400 13050 2500
Entry Wire Line
	12950 2500 13050 2600
Entry Wire Line
	12950 2600 13050 2700
Entry Wire Line
	12950 2700 13050 2800
Entry Wire Line
	12950 3600 13050 3700
Entry Wire Line
	12950 4300 13050 4400
Entry Wire Line
	12950 6400 13050 6500
Entry Wire Line
	12950 6500 13050 6600
Entry Wire Line
	12950 6600 13050 6700
Entry Wire Line
	12950 6700 13050 6800
Entry Wire Line
	12950 7450 13050 7550
Entry Wire Line
	12950 7550 13050 7650
Entry Wire Line
	12950 7650 13050 7750
Entry Wire Line
	12950 7750 13050 7850
Entry Wire Line
	12950 8650 13050 8750
Entry Wire Line
	12950 9350 13050 9450
Wire Wire Line
	2750 1850 2750 2900
Wire Wire Line
	2750 2900 2750 3950
Wire Wire Line
	2750 3950 3550 3950
Wire Wire Line
	2750 4800 2750 3950
Wire Wire Line
	2750 6900 2750 7950
Wire Wire Line
	2750 6900 3550 6900
Wire Wire Line
	2750 7950 2750 8750
Wire Wire Line
	2750 7950 3550 7950
Wire Wire Line
	2750 8750 2750 9450
Wire Wire Line
	2750 8750 3400 8750
Wire Wire Line
	2750 9450 3400 9450
Wire Wire Line
	2950 1350 3550 1350
Wire Wire Line
	2950 1450 3550 1450
Wire Wire Line
	2950 1550 3550 1550
Wire Wire Line
	2950 1650 3550 1650
Wire Wire Line
	2950 2400 3550 2400
Wire Wire Line
	2950 2500 3550 2500
Wire Wire Line
	2950 2600 3550 2600
Wire Wire Line
	2950 2700 3550 2700
Wire Wire Line
	2950 3450 3550 3450
Wire Wire Line
	2950 3550 3550 3550
Wire Wire Line
	2950 3650 3550 3650
Wire Wire Line
	2950 3750 3550 3750
Wire Wire Line
	2950 4600 3550 4600
Wire Wire Line
	2950 6400 3550 6400
Wire Wire Line
	2950 6500 3550 6500
Wire Wire Line
	2950 6600 3550 6600
Wire Wire Line
	2950 6700 3550 6700
Wire Wire Line
	2950 7450 3550 7450
Wire Wire Line
	2950 7550 3550 7550
Wire Wire Line
	2950 7650 3550 7650
Wire Wire Line
	2950 7750 3550 7750
Wire Wire Line
	2950 8550 3400 8550
Wire Wire Line
	2950 9250 3400 9250
Wire Wire Line
	3400 2100 3550 2100
Wire Wire Line
	3400 3150 3550 3150
Wire Wire Line
	3400 4200 3550 4200
Wire Wire Line
	3400 7150 3550 7150
Wire Wire Line
	3400 8200 3550 8200
Wire Wire Line
	3550 1850 2750 1850
Wire Wire Line
	3550 2100 3550 1950
Wire Wire Line
	3550 2900 2750 2900
Wire Wire Line
	3550 3150 3550 3000
Wire Wire Line
	3550 4200 3550 4050
Wire Wire Line
	3550 4800 2750 4800
Wire Wire Line
	3550 7150 3550 7000
Wire Wire Line
	3550 8200 3550 8050
Wire Wire Line
	4200 8750 4450 8750
Wire Wire Line
	4200 9450 4450 9450
Wire Wire Line
	4300 8650 6000 8650
Wire Wire Line
	4300 9350 6000 9350
Wire Wire Line
	4300 9650 4450 9650
Wire Wire Line
	4350 1350 4550 1350
Wire Wire Line
	4350 1450 4550 1450
Wire Wire Line
	4350 1550 4550 1550
Wire Wire Line
	4350 1650 4550 1650
Wire Wire Line
	4350 2400 4550 2400
Wire Wire Line
	4350 2500 4550 2500
Wire Wire Line
	4350 2600 4550 2600
Wire Wire Line
	4350 2700 4550 2700
Wire Wire Line
	4350 3450 4550 3450
Wire Wire Line
	4350 3550 4550 3550
Wire Wire Line
	4350 3650 4550 3650
Wire Wire Line
	4350 3750 4550 3750
Wire Wire Line
	4350 6400 4550 6400
Wire Wire Line
	4350 6500 4550 6500
Wire Wire Line
	4350 6700 4550 6700
Wire Wire Line
	4350 7450 4550 7450
Wire Wire Line
	4350 7550 4550 7550
Wire Wire Line
	4350 7750 4550 7750
Wire Wire Line
	4450 1800 4450 2850
Wire Wire Line
	4450 1800 4550 1800
Wire Wire Line
	4450 2850 4450 3900
Wire Wire Line
	4450 2850 4550 2850
Wire Wire Line
	4450 3900 4450 5350
Wire Wire Line
	4450 5350 4950 5350
Wire Wire Line
	4450 6850 4450 7900
Wire Wire Line
	4450 7900 4450 8750
Wire Wire Line
	4450 8750 4450 9450
Wire Wire Line
	4450 9450 4450 9650
Wire Wire Line
	4550 3900 4450 3900
Wire Wire Line
	4550 4700 4050 4700
Wire Wire Line
	4550 6600 4350 6600
Wire Wire Line
	4550 6850 4450 6850
Wire Wire Line
	4550 7650 4350 7650
Wire Wire Line
	4550 7900 4450 7900
Wire Wire Line
	4850 4800 4950 4800
Wire Wire Line
	4950 4700 6000 4700
Wire Wire Line
	4950 4800 4950 5350
Wire Wire Line
	5050 5350 4950 5350
Wire Wire Line
	5550 7750 6000 7750
Wire Wire Line
	6000 1350 5550 1350
Wire Wire Line
	6000 1450 5550 1450
Wire Wire Line
	6000 1550 5550 1550
Wire Wire Line
	6000 1650 5550 1650
Wire Wire Line
	6000 2400 5550 2400
Wire Wire Line
	6000 2500 5550 2500
Wire Wire Line
	6000 2600 5550 2600
Wire Wire Line
	6000 2700 5550 2700
Wire Wire Line
	6000 3450 5550 3450
Wire Wire Line
	6000 3550 5550 3550
Wire Wire Line
	6000 3650 5550 3650
Wire Wire Line
	6000 3750 5550 3750
Wire Wire Line
	6000 6400 5550 6400
Wire Wire Line
	6000 6500 5550 6500
Wire Wire Line
	6000 6600 5550 6600
Wire Wire Line
	6000 6700 5550 6700
Wire Wire Line
	6000 7450 5550 7450
Wire Wire Line
	6000 7550 5550 7550
Wire Wire Line
	6000 7650 5550 7650
Wire Wire Line
	9700 1850 9700 2900
Wire Wire Line
	9700 1850 10500 1850
Wire Wire Line
	9700 2900 9700 3700
Wire Wire Line
	9700 2900 10500 2900
Wire Wire Line
	9700 3700 9700 4400
Wire Wire Line
	9700 3700 10350 3700
Wire Wire Line
	9700 4400 10350 4400
Wire Wire Line
	9700 6900 9700 7950
Wire Wire Line
	9700 6900 10500 6900
Wire Wire Line
	9700 7950 9700 8750
Wire Wire Line
	9700 7950 10500 7950
Wire Wire Line
	9700 8750 9700 9450
Wire Wire Line
	9700 8750 10350 8750
Wire Wire Line
	9700 9450 10350 9450
Wire Wire Line
	9900 1350 10500 1350
Wire Wire Line
	9900 1450 10500 1450
Wire Wire Line
	9900 1550 10500 1550
Wire Wire Line
	9900 1650 10500 1650
Wire Wire Line
	9900 2400 10500 2400
Wire Wire Line
	9900 2500 10500 2500
Wire Wire Line
	9900 2600 10500 2600
Wire Wire Line
	9900 2700 10500 2700
Wire Wire Line
	9900 3500 10350 3500
Wire Wire Line
	9900 4200 10350 4200
Wire Wire Line
	9900 6400 10500 6400
Wire Wire Line
	9900 6500 10500 6500
Wire Wire Line
	9900 6600 10500 6600
Wire Wire Line
	9900 6700 10500 6700
Wire Wire Line
	9900 7450 10500 7450
Wire Wire Line
	9900 7550 10500 7550
Wire Wire Line
	9900 7650 10500 7650
Wire Wire Line
	9900 7750 10500 7750
Wire Wire Line
	9900 8550 10350 8550
Wire Wire Line
	9900 9250 10350 9250
Wire Wire Line
	10350 2100 10500 2100
Wire Wire Line
	10350 3150 10500 3150
Wire Wire Line
	10350 7150 10500 7150
Wire Wire Line
	10350 8200 10500 8200
Wire Wire Line
	10500 2100 10500 1950
Wire Wire Line
	10500 3150 10500 3000
Wire Wire Line
	10500 7150 10500 7000
Wire Wire Line
	10500 8200 10500 8050
Wire Wire Line
	11150 3700 11400 3700
Wire Wire Line
	11150 4400 11400 4400
Wire Wire Line
	11150 8750 11400 8750
Wire Wire Line
	11150 9450 11400 9450
Wire Wire Line
	11250 3600 12950 3600
Wire Wire Line
	11250 4300 12950 4300
Wire Wire Line
	11250 4600 11400 4600
Wire Wire Line
	11250 8650 12950 8650
Wire Wire Line
	11250 9350 12950 9350
Wire Wire Line
	11250 9650 11400 9650
Wire Wire Line
	11300 1350 11500 1350
Wire Wire Line
	11300 1450 11500 1450
Wire Wire Line
	11300 1650 11500 1650
Wire Wire Line
	11300 2400 11500 2400
Wire Wire Line
	11300 2500 11500 2500
Wire Wire Line
	11300 2700 11500 2700
Wire Wire Line
	11300 6400 11500 6400
Wire Wire Line
	11300 6500 11500 6500
Wire Wire Line
	11300 6700 11500 6700
Wire Wire Line
	11300 7450 11500 7450
Wire Wire Line
	11300 7550 11500 7550
Wire Wire Line
	11300 7750 11500 7750
Wire Wire Line
	11400 1800 11400 2850
Wire Wire Line
	11400 2850 11400 3700
Wire Wire Line
	11400 3700 11400 4400
Wire Wire Line
	11400 4400 11400 4600
Wire Wire Line
	11400 6850 11400 7900
Wire Wire Line
	11400 7900 11400 8750
Wire Wire Line
	11400 8750 11400 9450
Wire Wire Line
	11400 9450 11400 9650
Wire Wire Line
	11500 1550 11300 1550
Wire Wire Line
	11500 1800 11400 1800
Wire Wire Line
	11500 2600 11300 2600
Wire Wire Line
	11500 2850 11400 2850
Wire Wire Line
	11500 6600 11300 6600
Wire Wire Line
	11500 6850 11400 6850
Wire Wire Line
	11500 7650 11300 7650
Wire Wire Line
	11500 7900 11400 7900
Wire Wire Line
	12950 1350 12500 1350
Wire Wire Line
	12950 1450 12500 1450
Wire Wire Line
	12950 1550 12500 1550
Wire Wire Line
	12950 1650 12500 1650
Wire Wire Line
	12950 2400 12500 2400
Wire Wire Line
	12950 2500 12500 2500
Wire Wire Line
	12950 2600 12500 2600
Wire Wire Line
	12950 2700 12500 2700
Wire Wire Line
	12950 6400 12500 6400
Wire Wire Line
	12950 6500 12500 6500
Wire Wire Line
	12950 6600 12500 6600
Wire Wire Line
	12950 6700 12500 6700
Wire Wire Line
	12950 7450 12500 7450
Wire Wire Line
	12950 7550 12500 7550
Wire Wire Line
	12950 7650 12500 7650
Wire Wire Line
	12950 7750 12500 7750
Wire Bus Line
	2850 950  2650 950 
Wire Bus Line
	6100 9750 13050 9750
Wire Bus Line
	9800 950  2850 950 
Wire Bus Line
	13050 9750 13250 9750
Text Notes 3100 847  0    197  ~ 0
ROWSCROLL BASE
Text Notes 3500 5900 0    197  ~ 0
SCROLL2 BASE
Text Notes 10200 5900 0    197  ~ 0
SCROLL3 BASE
Text Notes 10350 850  0    197  ~ 0
SCROLL1 BASE
Text Label 3000 1350 0    50   ~ 0
BUS-DATA15
Text Label 3000 1450 0    50   ~ 0
BUS-DATA14
Text Label 3000 1550 0    50   ~ 0
BUS-DATA13
Text Label 3000 1650 0    50   ~ 0
BUS-DATA12
Text Label 3000 2400 0    50   ~ 0
BUS-DATA11
Text Label 3000 2500 0    50   ~ 0
BUS-DATA10
Text Label 3000 2600 0    50   ~ 0
BUS-DATA9
Text Label 3000 2700 0    50   ~ 0
BUS-DATA8
Text Label 3000 3450 0    50   ~ 0
BUS-DATA7
Text Label 3000 3550 0    50   ~ 0
BUS-DATA6
Text Label 3000 3650 0    50   ~ 0
BUS-DATA5
Text Label 3000 3750 0    50   ~ 0
BUS-DATA4
Text Label 3000 4600 0    50   ~ 0
BUS-DATA3
Text Label 3000 6400 0    50   ~ 0
BUS-DATA15
Text Label 3000 6500 0    50   ~ 0
BUS-DATA14
Text Label 3000 6600 0    50   ~ 0
BUS-DATA13
Text Label 3000 6700 0    50   ~ 0
BUS-DATA12
Text Label 3000 7450 0    50   ~ 0
BUS-DATA11
Text Label 3000 7550 0    50   ~ 0
BUS-DATA10
Text Label 3000 7650 0    50   ~ 0
BUS-DATA9
Text Label 3000 7750 0    50   ~ 0
BUS-DATA8
Text Label 3400 8550 2    50   ~ 0
BUS-DATA7
Text Label 3400 9250 2    50   ~ 0
BUS-DATA6
Text Label 5900 1350 2    50   ~ 0
ADDR23
Text Label 5900 1450 2    50   ~ 0
ADDR22
Text Label 5900 1550 2    50   ~ 0
ADDR21
Text Label 5900 1650 2    50   ~ 0
ADDR20
Text Label 5900 2400 2    50   ~ 0
ADDR19
Text Label 5900 2500 2    50   ~ 0
ADDR18
Text Label 5900 2600 2    50   ~ 0
ADDR17
Text Label 5900 2700 2    50   ~ 0
ADDR16
Text Label 5900 3450 2    50   ~ 0
ADDR15
Text Label 5900 3550 2    50   ~ 0
ADDR14
Text Label 5900 3650 2    50   ~ 0
ADDR13
Text Label 5900 3750 2    50   ~ 0
ADDR12
Text Label 5900 4700 2    50   ~ 0
ADDR11
Text Label 5900 6400 2    50   ~ 0
ADDR23
Text Label 5900 6500 2    50   ~ 0
ADDR22
Text Label 5900 6600 2    50   ~ 0
ADDR21
Text Label 5900 6700 2    50   ~ 0
ADDR20
Text Label 5900 7450 2    50   ~ 0
ADDR19
Text Label 5900 7550 2    50   ~ 0
ADDR18
Text Label 5900 7650 2    50   ~ 0
ADDR17
Text Label 5900 7750 2    50   ~ 0
ADDR16
Text Label 5900 8650 2    50   ~ 0
ADDR15
Text Label 5900 9350 2    50   ~ 0
ADDR14
Text Label 9950 1350 0    50   ~ 0
BUS-DATA15
Text Label 9950 1450 0    50   ~ 0
BUS-DATA14
Text Label 9950 1550 0    50   ~ 0
BUS-DATA13
Text Label 9950 1650 0    50   ~ 0
BUS-DATA12
Text Label 9950 2400 0    50   ~ 0
BUS-DATA11
Text Label 9950 2500 0    50   ~ 0
BUS-DATA10
Text Label 9950 2600 0    50   ~ 0
BUS-DATA9
Text Label 9950 2700 0    50   ~ 0
BUS-DATA8
Text Label 9950 6400 0    50   ~ 0
BUS-DATA15
Text Label 9950 6500 0    50   ~ 0
BUS-DATA14
Text Label 9950 6600 0    50   ~ 0
BUS-DATA13
Text Label 9950 6700 0    50   ~ 0
BUS-DATA12
Text Label 9950 7450 0    50   ~ 0
BUS-DATA11
Text Label 9950 7550 0    50   ~ 0
BUS-DATA10
Text Label 9950 7650 0    50   ~ 0
BUS-DATA9
Text Label 9950 7750 0    50   ~ 0
BUS-DATA8
Text Label 10350 3500 2    50   ~ 0
BUS-DATA7
Text Label 10350 4200 2    50   ~ 0
BUS-DATA6
Text Label 10350 8550 2    50   ~ 0
BUS-DATA7
Text Label 10350 9250 2    50   ~ 0
BUS-DATA6
Text Label 12850 1350 2    50   ~ 0
ADDR23
Text Label 12850 1450 2    50   ~ 0
ADDR22
Text Label 12850 1550 2    50   ~ 0
ADDR21
Text Label 12850 1650 2    50   ~ 0
ADDR20
Text Label 12850 2400 2    50   ~ 0
ADDR19
Text Label 12850 2500 2    50   ~ 0
ADDR18
Text Label 12850 2600 2    50   ~ 0
ADDR17
Text Label 12850 2700 2    50   ~ 0
ADDR16
Text Label 12850 3600 2    50   ~ 0
ADDR15
Text Label 12850 4300 2    50   ~ 0
ADDR14
Text Label 12850 6400 2    50   ~ 0
ADDR23
Text Label 12850 6500 2    50   ~ 0
ADDR22
Text Label 12850 6600 2    50   ~ 0
ADDR21
Text Label 12850 6700 2    50   ~ 0
ADDR20
Text Label 12850 7450 2    50   ~ 0
ADDR19
Text Label 12850 7550 2    50   ~ 0
ADDR18
Text Label 12850 7650 2    50   ~ 0
ADDR17
Text Label 12850 7750 2    50   ~ 0
ADDR16
Text Label 12850 8650 2    50   ~ 0
ADDR15
Text Label 12850 9350 2    50   ~ 0
ADDR14
Text HLabel 2200 4750 0    50   Input ~ 0
~ROWSCROLL-BASE
Text HLabel 2200 4850 0    50   Input ~ 0
~CLK4M
Text HLabel 2200 9400 0    50   Input ~ 0
~SCROLL2-BASE
Text HLabel 2200 9500 0    50   Input ~ 0
~CLK4M
Text HLabel 2650 950  0    50   Input ~ 0
BUS-DATA[3..15]
Text HLabel 3900 5300 0    50   Input ~ 0
~BUS-ROWSCROLL
Text HLabel 3900 5400 0    50   Input ~ 0
BUS-READY
Text HLabel 4300 9650 0    50   Input ~ 0
~BUS-SCROLL2
Text HLabel 5050 5350 2    50   Output ~ 0
~ROWSCROLL-READY
Text HLabel 9150 4350 0    50   Input ~ 0
~SCROLL1-BASE
Text HLabel 9150 4450 0    50   Input ~ 0
~CLK4M
Text HLabel 9150 9400 0    50   Input ~ 0
~SCROLL3-BASE
Text HLabel 9150 9500 0    50   Input ~ 0
~CLK4M
Text HLabel 11250 4600 0    50   Input ~ 0
~BUS-SCROLL1
Text HLabel 11250 9650 0    50   Input ~ 0
~BUS-SCROLL3
Text HLabel 13250 9750 2    50   3State ~ 0
ADDR[11..23]
$Comp
L power:VCC #PWR0133
U 1 1 61118D38
P 3400 2100
F 0 "#PWR0133" H 3400 1950 50  0001 C CNN
F 1 "VCC" H 3415 2273 50  0000 C CNN
F 2 "" H 3400 2100 50  0001 C CNN
F 3 "" H 3400 2100 50  0001 C CNN
	1    3400 2100
	1    0    0    -1  
$EndComp
$Comp
L power:VCC #PWR0134
U 1 1 61118D37
P 3400 3150
F 0 "#PWR0134" H 3400 3000 50  0001 C CNN
F 1 "VCC" H 3415 3323 50  0000 C CNN
F 2 "" H 3400 3150 50  0001 C CNN
F 3 "" H 3400 3150 50  0001 C CNN
	1    3400 3150
	1    0    0    -1  
$EndComp
$Comp
L power:VCC #PWR0135
U 1 1 61118D41
P 3400 4200
F 0 "#PWR0135" H 3400 4050 50  0001 C CNN
F 1 "VCC" H 3415 4373 50  0000 C CNN
F 2 "" H 3400 4200 50  0001 C CNN
F 3 "" H 3400 4200 50  0001 C CNN
	1    3400 4200
	1    0    0    -1  
$EndComp
$Comp
L power:VCC #PWR0127
U 1 1 7E1C0BDB
P 3400 7150
F 0 "#PWR0127" H 3400 7000 50  0001 C CNN
F 1 "VCC" H 3415 7323 50  0000 C CNN
F 2 "" H 3400 7150 50  0001 C CNN
F 3 "" H 3400 7150 50  0001 C CNN
	1    3400 7150
	1    0    0    -1  
$EndComp
$Comp
L power:VCC #PWR0128
U 1 1 7E699863
P 3400 8200
F 0 "#PWR0128" H 3400 8050 50  0001 C CNN
F 1 "VCC" H 3415 8373 50  0000 C CNN
F 2 "" H 3400 8200 50  0001 C CNN
F 3 "" H 3400 8200 50  0001 C CNN
	1    3400 8200
	1    0    0    -1  
$EndComp
$Comp
L power:VCC #PWR0131
U 1 1 61118D32
P 10350 2100
F 0 "#PWR0131" H 10350 1950 50  0001 C CNN
F 1 "VCC" H 10365 2273 50  0000 C CNN
F 2 "" H 10350 2100 50  0001 C CNN
F 3 "" H 10350 2100 50  0001 C CNN
	1    10350 2100
	1    0    0    -1  
$EndComp
$Comp
L power:VCC #PWR0132
U 1 1 61118D35
P 10350 3150
F 0 "#PWR0132" H 10350 3000 50  0001 C CNN
F 1 "VCC" H 10365 3323 50  0000 C CNN
F 2 "" H 10350 3150 50  0001 C CNN
F 3 "" H 10350 3150 50  0001 C CNN
	1    10350 3150
	1    0    0    -1  
$EndComp
$Comp
L power:VCC #PWR0129
U 1 1 61118CCB
P 10350 7150
F 0 "#PWR0129" H 10350 7000 50  0001 C CNN
F 1 "VCC" H 10365 7323 50  0000 C CNN
F 2 "" H 10350 7150 50  0001 C CNN
F 3 "" H 10350 7150 50  0001 C CNN
	1    10350 7150
	1    0    0    -1  
$EndComp
$Comp
L power:VCC #PWR0130
U 1 1 61118CCA
P 10350 8200
F 0 "#PWR0130" H 10350 8050 50  0001 C CNN
F 1 "VCC" H 10365 8373 50  0000 C CNN
F 2 "" H 10350 8200 50  0001 C CNN
F 3 "" H 10350 8200 50  0001 C CNN
	1    10350 8200
	1    0    0    -1  
$EndComp
$Comp
L A5C:TINVBF UAD246
U 1 1 6512A171
P 4100 8650
AR Path="/6113F606/6512A171" Ref="UAD246"  Part="1" 
AR Path="/61111462/612E0C41/6512A171" Ref="UAD246"  Part="1" 
F 0 "UAD246" H 4100 8915 50  0000 C CNN
F 1 "TINVBF" H 4100 8824 50  0000 C CNN
F 2 "" H 3600 8600 50  0001 C CNN
F 3 "" H 3600 8600 50  0001 C CNN
	1    4100 8650
	1    0    0    -1  
$EndComp
$Comp
L A5C:TINVBF UAA273
U 1 1 652D6BDC
P 4100 9350
AR Path="/6113F606/652D6BDC" Ref="UAA273"  Part="1" 
AR Path="/61111462/612E0C41/652D6BDC" Ref="UAA273"  Part="1" 
F 0 "UAA273" H 4100 9615 50  0000 C CNN
F 1 "TINVBF" H 4100 9524 50  0000 C CNN
F 2 "" H 3600 9300 50  0001 C CNN
F 3 "" H 3600 9300 50  0001 C CNN
	1    4100 9350
	1    0    0    -1  
$EndComp
$Comp
L A5C:TINVBF UBG95
U 1 1 61118D42
P 4750 4700
AR Path="/6113F606/61118D42" Ref="UBG95"  Part="1" 
AR Path="/61111462/612E0C41/61118D42" Ref="UBG95"  Part="1" 
F 0 "UBG95" H 4750 4965 50  0000 C CNN
F 1 "TINVBF" H 4750 4874 50  0000 C CNN
F 2 "" H 4250 4650 50  0001 C CNN
F 3 "" H 4250 4650 50  0001 C CNN
	1    4750 4700
	1    0    0    -1  
$EndComp
$Comp
L A5C:TINVBF UAA288
U 1 1 61118D3B
P 11050 3600
AR Path="/6113F606/61118D3B" Ref="UAA288"  Part="1" 
AR Path="/61111462/612E0C41/61118D3B" Ref="UAA288"  Part="1" 
F 0 "UAA288" H 11050 3865 50  0000 C CNN
F 1 "TINVBF" H 11050 3774 50  0000 C CNN
F 2 "" H 10550 3550 50  0001 C CNN
F 3 "" H 10550 3550 50  0001 C CNN
	1    11050 3600
	1    0    0    -1  
$EndComp
$Comp
L A5C:TINVBF UAA231
U 1 1 61118D3C
P 11050 4300
AR Path="/6113F606/61118D3C" Ref="UAA231"  Part="1" 
AR Path="/61111462/612E0C41/61118D3C" Ref="UAA231"  Part="1" 
F 0 "UAA231" H 11050 4565 50  0000 C CNN
F 1 "TINVBF" H 11050 4474 50  0000 C CNN
F 2 "" H 10550 4250 50  0001 C CNN
F 3 "" H 10550 4250 50  0001 C CNN
	1    11050 4300
	1    0    0    -1  
$EndComp
$Comp
L A5C:TINVBF UAB242
U 1 1 61118CCD
P 11050 8650
AR Path="/6113F606/61118CCD" Ref="UAB242"  Part="1" 
AR Path="/61111462/612E0C41/61118CCD" Ref="UAB242"  Part="1" 
F 0 "UAB242" H 11050 8915 50  0000 C CNN
F 1 "TINVBF" H 11050 8824 50  0000 C CNN
F 2 "" H 10550 8600 50  0001 C CNN
F 3 "" H 10550 8600 50  0001 C CNN
	1    11050 8650
	1    0    0    -1  
$EndComp
$Comp
L A5C:TINVBF UAB257
U 1 1 61118CCC
P 11050 9350
AR Path="/6113F606/61118CCC" Ref="UAB257"  Part="1" 
AR Path="/61111462/612E0C41/61118CCC" Ref="UAB257"  Part="1" 
F 0 "UAB257" H 11050 9615 50  0000 C CNN
F 1 "TINVBF" H 11050 9524 50  0000 C CNN
F 2 "" H 10550 9300 50  0001 C CNN
F 3 "" H 10550 9300 50  0001 C CNN
	1    11050 9350
	1    0    0    -1  
$EndComp
$Comp
L A5C:OR02 UCA412
U 1 1 61118D40
P 2450 4800
AR Path="/6113F606/61118D40" Ref="UCA412"  Part="1" 
AR Path="/61111462/612E0C41/61118D40" Ref="UCA412"  Part="1" 
F 0 "UCA412" H 2475 5067 50  0000 C CNN
F 1 "OR02" H 2475 4976 50  0000 C CNN
F 2 "" H 2500 4800 50  0001 C CNN
F 3 "" H 2500 4800 50  0001 C CNN
	1    2450 4800
	1    0    0    -1  
$EndComp
$Comp
L A5C:OR02 UCC277
U 1 1 63DF99F0
P 2450 9450
AR Path="/6113F606/63DF99F0" Ref="UCC277"  Part="1" 
AR Path="/61111462/612E0C41/63DF99F0" Ref="UCC277"  Part="1" 
F 0 "UCC277" H 2475 9717 50  0000 C CNN
F 1 "OR02" H 2475 9626 50  0000 C CNN
F 2 "" H 2500 9450 50  0001 C CNN
F 3 "" H 2500 9450 50  0001 C CNN
	1    2450 9450
	1    0    0    -1  
$EndComp
$Comp
L A5C:AND02 UBI81
U 1 1 61118D3E
P 4150 5350
AR Path="/6113F606/61118D3E" Ref="UBI81"  Part="1" 
AR Path="/61111462/612E0C41/61118D3E" Ref="UBI81"  Part="1" 
F 0 "UBI81" H 4175 5617 50  0000 C CNN
F 1 "AND02" H 4175 5526 50  0000 C CNN
F 2 "" H 4150 5350 50  0001 C CNN
F 3 "" H 4150 5350 50  0001 C CNN
	1    4150 5350
	1    0    0    -1  
$EndComp
$Comp
L A5C:OR02 UCA272
U 1 1 61118CFB
P 9400 4400
AR Path="/6113F606/61118CFB" Ref="UCA272"  Part="1" 
AR Path="/61111462/612E0C41/61118CFB" Ref="UCA272"  Part="1" 
F 0 "UCA272" H 9425 4667 50  0000 C CNN
F 1 "OR02" H 9425 4576 50  0000 C CNN
F 2 "" H 9450 4400 50  0001 C CNN
F 3 "" H 9450 4400 50  0001 C CNN
	1    9400 4400
	1    0    0    -1  
$EndComp
$Comp
L A5C:OR02 UCC30
U 1 1 61118CFF
P 9400 9450
AR Path="/6113F606/61118CFF" Ref="UCC30"  Part="1" 
AR Path="/61111462/612E0C41/61118CFF" Ref="UCC30"  Part="1" 
F 0 "UCC30" H 9425 9717 50  0000 C CNN
F 1 "OR02" H 9425 9626 50  0000 C CNN
F 2 "" H 9450 9450 50  0001 C CNN
F 3 "" H 9450 9450 50  0001 C CNN
	1    9400 9450
	1    0    0    -1  
$EndComp
$Comp
L A5C:DFFCOO UAC251
U 1 1 65572DDA
P 3650 8650
AR Path="/6113F606/65572DDA" Ref="UAC251"  Part="1" 
AR Path="/61111462/612E0C41/65572DDA" Ref="UAC251"  Part="1" 
F 0 "UAC251" H 3650 9015 50  0000 C CNN
F 1 "DFFCOO" H 3650 8924 50  0000 C CNN
F 2 "" H 3650 8650 50  0001 C CNN
F 3 "" H 3650 8650 50  0001 C CNN
	1    3650 8650
	1    0    0    -1  
$EndComp
$Comp
L A5C:DFFCOO UAA275
U 1 1 65ED618C
P 3650 9350
AR Path="/6113F606/65ED618C" Ref="UAA275"  Part="1" 
AR Path="/61111462/612E0C41/65ED618C" Ref="UAA275"  Part="1" 
F 0 "UAA275" H 3650 9715 50  0000 C CNN
F 1 "DFFCOO" H 3650 9624 50  0000 C CNN
F 2 "" H 3650 9350 50  0001 C CNN
F 3 "" H 3650 9350 50  0001 C CNN
	1    3650 9350
	1    0    0    -1  
$EndComp
$Comp
L A5C:DFFCOO UBH93
U 1 1 61118D3F
P 3800 4700
AR Path="/6113F606/61118D3F" Ref="UBH93"  Part="1" 
AR Path="/61111462/612E0C41/61118D3F" Ref="UBH93"  Part="1" 
F 0 "UBH93" H 3800 5065 50  0000 C CNN
F 1 "DFFCOO" H 3800 4974 50  0000 C CNN
F 2 "" H 3800 4700 50  0001 C CNN
F 3 "" H 3800 4700 50  0001 C CNN
	1    3800 4700
	1    0    0    -1  
$EndComp
$Comp
L A5C:DFFCOO UAA290
U 1 1 61118D3A
P 10600 3600
AR Path="/6113F606/61118D3A" Ref="UAA290"  Part="1" 
AR Path="/61111462/612E0C41/61118D3A" Ref="UAA290"  Part="1" 
F 0 "UAA290" H 10600 3965 50  0000 C CNN
F 1 "DFFCOO" H 10600 3874 50  0000 C CNN
F 2 "" H 10600 3600 50  0001 C CNN
F 3 "" H 10600 3600 50  0001 C CNN
	1    10600 3600
	1    0    0    -1  
$EndComp
$Comp
L A5C:DFFCOO UAA222
U 1 1 61118D39
P 10600 4300
AR Path="/6113F606/61118D39" Ref="UAA222"  Part="1" 
AR Path="/61111462/612E0C41/61118D39" Ref="UAA222"  Part="1" 
F 0 "UAA222" H 10600 4665 50  0000 C CNN
F 1 "DFFCOO" H 10600 4574 50  0000 C CNN
F 2 "" H 10600 4300 50  0001 C CNN
F 3 "" H 10600 4300 50  0001 C CNN
	1    10600 4300
	1    0    0    -1  
$EndComp
$Comp
L A5C:DFFCOO UAB246
U 1 1 61118CC9
P 10600 8650
AR Path="/6113F606/61118CC9" Ref="UAB246"  Part="1" 
AR Path="/61111462/612E0C41/61118CC9" Ref="UAB246"  Part="1" 
F 0 "UAB246" H 10600 9015 50  0000 C CNN
F 1 "DFFCOO" H 10600 8924 50  0000 C CNN
F 2 "" H 10600 8650 50  0001 C CNN
F 3 "" H 10600 8650 50  0001 C CNN
	1    10600 8650
	1    0    0    -1  
$EndComp
$Comp
L A5C:DFFCOO UAB259
U 1 1 61118CC8
P 10600 9350
AR Path="/6113F606/61118CC8" Ref="UAB259"  Part="1" 
AR Path="/61111462/612E0C41/61118CC8" Ref="UAB259"  Part="1" 
F 0 "UAB259" H 10600 9715 50  0000 C CNN
F 1 "DFFCOO" H 10600 9624 50  0000 C CNN
F 2 "" H 10600 9350 50  0001 C CNN
F 3 "" H 10600 9350 50  0001 C CNN
	1    10600 9350
	1    0    0    -1  
$EndComp
$Comp
L A5C:M175CL UBH137
U 1 1 61118D8A
P 3950 1650
AR Path="/6113F606/61118D8A" Ref="UBH137"  Part="1" 
AR Path="/61111462/612E0C41/61118D8A" Ref="UBH137"  Part="1" 
F 0 "UBH137" H 3950 2215 50  0000 C CNN
F 1 "M175CL" H 3950 2124 50  0000 C CNN
F 2 "" H 3950 1450 50  0001 C CNN
F 3 "" H 3950 1450 50  0001 C CNN
	1    3950 1650
	1    0    0    -1  
$EndComp
$Comp
L A5C:M175CL UEE287
U 1 1 61118D36
P 3950 2700
AR Path="/6113F606/61118D36" Ref="UEE287"  Part="1" 
AR Path="/61111462/612E0C41/61118D36" Ref="UEE287"  Part="1" 
F 0 "UEE287" H 3950 3265 50  0000 C CNN
F 1 "M175CL" H 3950 3174 50  0000 C CNN
F 2 "" H 3950 2500 50  0001 C CNN
F 3 "" H 3950 2500 50  0001 C CNN
	1    3950 2700
	1    0    0    -1  
$EndComp
$Comp
L A5C:M175CL UED292
U 1 1 61118D3D
P 3950 3750
AR Path="/6113F606/61118D3D" Ref="UED292"  Part="1" 
AR Path="/61111462/612E0C41/61118D3D" Ref="UED292"  Part="1" 
F 0 "UED292" H 3950 4315 50  0000 C CNN
F 1 "M175CL" H 3950 4224 50  0000 C CNN
F 2 "" H 3950 3550 50  0001 C CNN
F 3 "" H 3950 3550 50  0001 C CNN
	1    3950 3750
	1    0    0    -1  
$EndComp
$Comp
L A5C:M175CL UBJ95
U 1 1 6E6F941F
P 3950 6700
AR Path="/6113F606/6E6F941F" Ref="UBJ95"  Part="1" 
AR Path="/61111462/612E0C41/6E6F941F" Ref="UBJ95"  Part="1" 
F 0 "UBJ95" H 3950 7265 50  0000 C CNN
F 1 "M175CL" H 3950 7174 50  0000 C CNN
F 2 "" H 3950 6500 50  0001 C CNN
F 3 "" H 3950 6500 50  0001 C CNN
	1    3950 6700
	1    0    0    -1  
$EndComp
$Comp
L A5C:M175CL UEG282
U 1 1 7204BB47
P 3950 7750
AR Path="/6113F606/7204BB47" Ref="UEG282"  Part="1" 
AR Path="/61111462/612E0C41/7204BB47" Ref="UEG282"  Part="1" 
F 0 "UEG282" H 3950 8315 50  0000 C CNN
F 1 "M175CL" H 3950 8224 50  0000 C CNN
F 2 "" H 3950 7550 50  0001 C CNN
F 3 "" H 3950 7550 50  0001 C CNN
	1    3950 7750
	1    0    0    -1  
$EndComp
$Comp
L A5C:M175CL UBJ75
U 1 1 61118D34
P 10900 1650
AR Path="/6113F606/61118D34" Ref="UBJ75"  Part="1" 
AR Path="/61111462/612E0C41/61118D34" Ref="UBJ75"  Part="1" 
F 0 "UBJ75" H 10900 2215 50  0000 C CNN
F 1 "M175CL" H 10900 2124 50  0000 C CNN
F 2 "" H 10900 1450 50  0001 C CNN
F 3 "" H 10900 1450 50  0001 C CNN
	1    10900 1650
	1    0    0    -1  
$EndComp
$Comp
L A5C:M175CL UEH282
U 1 1 61118D33
P 10900 2700
AR Path="/6113F606/61118D33" Ref="UEH282"  Part="1" 
AR Path="/61111462/612E0C41/61118D33" Ref="UEH282"  Part="1" 
F 0 "UEH282" H 10900 3265 50  0000 C CNN
F 1 "M175CL" H 10900 3174 50  0000 C CNN
F 2 "" H 10900 2500 50  0001 C CNN
F 3 "" H 10900 2500 50  0001 C CNN
	1    10900 2700
	1    0    0    -1  
$EndComp
$Comp
L A5C:M175CL UBI110
U 1 1 7FFFFFFF
P 10900 6700
AR Path="/6113F606/7FFFFFFF" Ref="UBI110"  Part="1" 
AR Path="/61111462/612E0C41/7FFFFFFF" Ref="UBI110"  Part="1" 
F 0 "UBI110" H 10900 7265 50  0000 C CNN
F 1 "M175CL" H 10900 7174 50  0000 C CNN
F 2 "" H 10900 6500 50  0001 C CNN
F 3 "" H 10900 6500 50  0001 C CNN
	1    10900 6700
	1    0    0    -1  
$EndComp
$Comp
L A5C:M175CL UEF259
U 1 1 61118CCE
P 10900 7750
AR Path="/6113F606/61118CCE" Ref="UEF259"  Part="1" 
AR Path="/61111462/612E0C41/61118CCE" Ref="UEF259"  Part="1" 
F 0 "UEF259" H 10900 8315 50  0000 C CNN
F 1 "M175CL" H 10900 8224 50  0000 C CNN
F 2 "" H 10900 7550 50  0001 C CNN
F 3 "" H 10900 7550 50  0001 C CNN
	1    10900 7750
	1    0    0    -1  
$EndComp
$Comp
L A5C:M368C UBG?
U 1 1 69079A1B
P 5050 1600
AR Path="/604B5523/69079A1B" Ref="UBG?"  Part="1" 
AR Path="/69079A1B" Ref="UBH174"  Part="1" 
AR Path="/6113F606/69079A1B" Ref="UBH174"  Part="1" 
AR Path="/61111462/612E0C41/69079A1B" Ref="UBH174"  Part="1" 
F 0 "UBH174" H 5050 2110 50  0000 C CNN
F 1 "M368C" H 5050 2020 50  0000 C CNN
F 2 "" H 5350 1400 50  0001 C CNN
F 3 "" H 5350 1400 50  0001 C CNN
	1    5050 1600
	1    0    0    -1  
$EndComp
$Comp
L A5C:M368C UBG?
U 1 1 6AE265FC
P 5050 2650
AR Path="/604B5523/6AE265FC" Ref="UBG?"  Part="1" 
AR Path="/6AE265FC" Ref="UED283"  Part="1" 
AR Path="/6113F606/6AE265FC" Ref="UED283"  Part="1" 
AR Path="/61111462/612E0C41/6AE265FC" Ref="UED283"  Part="1" 
F 0 "UED283" H 5050 3160 50  0000 C CNN
F 1 "M368C" H 5050 3070 50  0000 C CNN
F 2 "" H 5350 2450 50  0001 C CNN
F 3 "" H 5350 2450 50  0001 C CNN
	1    5050 2650
	1    0    0    -1  
$EndComp
$Comp
L A5C:M368C UED?
U 1 1 7DB53092
P 5050 3700
AR Path="/604B5523/7DB53092" Ref="UED?"  Part="1" 
AR Path="/7DB53092" Ref="UEC291"  Part="1" 
AR Path="/6113F606/7DB53092" Ref="UEC291"  Part="1" 
AR Path="/61111462/612E0C41/7DB53092" Ref="UEC291"  Part="1" 
F 0 "UEC291" H 5050 4210 50  0000 C CNN
F 1 "M368C" H 5050 4120 50  0000 C CNN
F 2 "" H 5350 3500 50  0001 C CNN
F 3 "" H 5350 3500 50  0001 C CNN
	1    5050 3700
	1    0    0    -1  
$EndComp
$Comp
L A5C:M368C UCB?
U 1 1 6555B275
P 5050 6650
AR Path="/604B5523/6555B275" Ref="UCB?"  Part="1" 
AR Path="/6555B275" Ref="UBI93"  Part="1" 
AR Path="/6113F606/6555B275" Ref="UBI93"  Part="1" 
AR Path="/61111462/612E0C41/6555B275" Ref="UBI93"  Part="1" 
F 0 "UBI93" H 5050 7160 50  0000 C CNN
F 1 "M368C" H 5050 7070 50  0000 C CNN
F 2 "" H 5350 6450 50  0001 C CNN
F 3 "" H 5350 6450 50  0001 C CNN
	1    5050 6650
	1    0    0    -1  
$EndComp
$Comp
L A5C:M368C UBI?
U 1 1 65634751
P 5050 7700
AR Path="/604B5523/65634751" Ref="UBI?"  Part="1" 
AR Path="/65634751" Ref="UEF287"  Part="1" 
AR Path="/6113F606/65634751" Ref="UEF287"  Part="1" 
AR Path="/61111462/612E0C41/65634751" Ref="UEF287"  Part="1" 
F 0 "UEF287" H 5050 8210 50  0000 C CNN
F 1 "M368C" H 5050 8120 50  0000 C CNN
F 2 "" H 5350 7500 50  0001 C CNN
F 3 "" H 5350 7500 50  0001 C CNN
	1    5050 7700
	1    0    0    -1  
$EndComp
$Comp
L A5C:M368C UCB?
U 1 1 61118D30
P 12000 1600
AR Path="/604B5523/61118D30" Ref="UCB?"  Part="1" 
AR Path="/61118D30" Ref="UBH78"  Part="1" 
AR Path="/6113F606/61118D30" Ref="UBH78"  Part="1" 
AR Path="/61111462/612E0C41/61118D30" Ref="UBH78"  Part="1" 
F 0 "UBH78" H 12000 2110 50  0000 C CNN
F 1 "M368C" H 12000 2020 50  0000 C CNN
F 2 "" H 12300 1400 50  0001 C CNN
F 3 "" H 12300 1400 50  0001 C CNN
	1    12000 1600
	1    0    0    -1  
$EndComp
$Comp
L A5C:M368C UBI?
U 1 1 61118D31
P 12000 2650
AR Path="/604B5523/61118D31" Ref="UBI?"  Part="1" 
AR Path="/61118D31" Ref="UEH328"  Part="1" 
AR Path="/6113F606/61118D31" Ref="UEH328"  Part="1" 
AR Path="/61111462/612E0C41/61118D31" Ref="UEH328"  Part="1" 
F 0 "UEH328" H 12000 3160 50  0000 C CNN
F 1 "M368C" H 12000 3070 50  0000 C CNN
F 2 "" H 12300 2450 50  0001 C CNN
F 3 "" H 12300 2450 50  0001 C CNN
	1    12000 2650
	1    0    0    -1  
$EndComp
$Comp
L A5C:M368C UCB?
U 1 1 61118CCF
P 12000 6650
AR Path="/604B5523/61118CCF" Ref="UCB?"  Part="1" 
AR Path="/61118CCF" Ref="UBH85"  Part="1" 
AR Path="/6113F606/61118CCF" Ref="UBH85"  Part="1" 
AR Path="/61111462/612E0C41/61118CCF" Ref="UBH85"  Part="1" 
F 0 "UBH85" H 12000 7160 50  0000 C CNN
F 1 "M368C" H 12000 7070 50  0000 C CNN
F 2 "" H 12300 6450 50  0001 C CNN
F 3 "" H 12300 6450 50  0001 C CNN
	1    12000 6650
	1    0    0    -1  
$EndComp
$Comp
L A5C:M368C UBI?
U 1 1 61118CD0
P 12000 7700
AR Path="/604B5523/61118CD0" Ref="UBI?"  Part="1" 
AR Path="/61118CD0" Ref="UEF280"  Part="1" 
AR Path="/6113F606/61118CD0" Ref="UEF280"  Part="1" 
AR Path="/61111462/612E0C41/61118CD0" Ref="UEF280"  Part="1" 
F 0 "UEF280" H 12000 8210 50  0000 C CNN
F 1 "M368C" H 12000 8120 50  0000 C CNN
F 2 "" H 12300 7500 50  0001 C CNN
F 3 "" H 12300 7500 50  0001 C CNN
	1    12000 7700
	1    0    0    -1  
$EndComp
Wire Bus Line
	2850 950  2850 9150
Wire Bus Line
	6100 1450 6100 9750
Wire Bus Line
	9800 950  9800 9150
Wire Bus Line
	13050 1450 13050 9750
$EndSCHEMATC
