EESchema Schematic File Version 4
EELAYER 30 0
EELAYER END
$Descr A4 11693 8268
encoding utf-8
Sheet 2 69
Title ""
Date "2020-11-26"
Rev ""
Comp ""
Comment1 "Licence: CC-BY"
Comment2 "Author: Loïc *WydD* Petit"
Comment3 ""
Comment4 ""
$EndDescr
Connection ~ 7300 5950
Connection ~ 7300 5050
Connection ~ 3850 1900
Connection ~ 3850 1000
Connection ~ 3850 1450
Connection ~ 3850 5500
Connection ~ 3850 5950
Connection ~ 3850 4600
Connection ~ 3850 6850
Connection ~ 3850 6400
Connection ~ 3850 5050
Connection ~ 3850 3700
Connection ~ 3850 3250
Connection ~ 3850 2800
Connection ~ 3850 2350
Connection ~ 3850 4150
Connection ~ 7300 4100
Connection ~ 2350 4050
Connection ~ 3850 7300
Connection ~ 5950 4050
Connection ~ 9250 4250
Connection ~ 4650 4050
Connection ~ 6650 6250
Entry Wire Line
	2450 650  2350 750 
Entry Wire Line
	2450 1100 2350 1200
Entry Wire Line
	2450 1550 2350 1650
Entry Wire Line
	2450 2000 2350 2100
Entry Wire Line
	2450 2450 2350 2550
Entry Wire Line
	2450 2900 2350 3000
Entry Wire Line
	2450 3350 2350 3450
Entry Wire Line
	2450 3800 2350 3900
Entry Wire Line
	2450 4250 2350 4150
Entry Wire Line
	2450 4700 2350 4600
Entry Wire Line
	2450 5150 2350 5050
Entry Wire Line
	2450 5600 2350 5500
Entry Wire Line
	2450 6050 2350 5950
Entry Wire Line
	2450 6500 2350 6400
Entry Wire Line
	2450 6950 2350 6850
Entry Wire Line
	2450 7400 2350 7300
Entry Wire Line
	4550 700  4650 800 
Entry Wire Line
	4550 1150 4650 1250
Entry Wire Line
	4550 1600 4650 1700
Entry Wire Line
	4550 2050 4650 2150
Entry Wire Line
	4550 2500 4650 2600
Entry Wire Line
	4550 2950 4650 3050
Entry Wire Line
	4550 3400 4650 3500
Entry Wire Line
	4550 3850 4650 3950
Entry Wire Line
	4550 4200 4650 4100
Entry Wire Line
	4550 4650 4650 4550
Entry Wire Line
	4550 5100 4650 5000
Entry Wire Line
	4550 5550 4650 5450
Entry Wire Line
	4550 6000 4650 5900
Entry Wire Line
	4550 6450 4650 6350
Entry Wire Line
	4550 6900 4650 6800
Entry Wire Line
	4550 7350 4650 7250
Entry Wire Line
	9150 2750 9250 2850
Entry Wire Line
	9150 2850 9250 2950
Entry Wire Line
	9150 2950 9250 3050
Entry Wire Line
	9150 3050 9250 3150
Entry Wire Line
	9150 3650 9250 3750
Entry Wire Line
	9150 3750 9250 3850
Entry Wire Line
	9150 3850 9250 3950
Entry Wire Line
	9150 3950 9250 4050
Entry Wire Line
	9150 4600 9250 4500
Entry Wire Line
	9150 4700 9250 4600
Entry Wire Line
	9150 4800 9250 4700
Entry Wire Line
	9150 4900 9250 4800
Entry Wire Line
	9150 5500 9250 5400
Entry Wire Line
	9150 5600 9250 5500
Entry Wire Line
	9150 5700 9250 5600
Entry Wire Line
	9150 5800 9250 5700
Wire Wire Line
	2450 650  3250 650 
Wire Wire Line
	2450 1100 3250 1100
Wire Wire Line
	2450 1550 3250 1550
Wire Wire Line
	2450 2000 3250 2000
Wire Wire Line
	2450 2450 3250 2450
Wire Wire Line
	2450 2900 3250 2900
Wire Wire Line
	2450 3350 3250 3350
Wire Wire Line
	2450 3800 3250 3800
Wire Wire Line
	2450 4250 3250 4250
Wire Wire Line
	2450 4700 3250 4700
Wire Wire Line
	2450 5150 3250 5150
Wire Wire Line
	2450 5600 3250 5600
Wire Wire Line
	2450 6050 3250 6050
Wire Wire Line
	2450 6500 3250 6500
Wire Wire Line
	2450 6950 3250 6950
Wire Wire Line
	2450 7400 3250 7400
Wire Wire Line
	3550 550  3850 550 
Wire Wire Line
	3550 5950 3850 5950
Wire Wire Line
	3650 650  4550 650 
Wire Wire Line
	3650 1100 4550 1100
Wire Wire Line
	3650 1550 4550 1550
Wire Wire Line
	3650 2000 4550 2000
Wire Wire Line
	3650 2450 4550 2450
Wire Wire Line
	3650 2900 4550 2900
Wire Wire Line
	3650 3350 4550 3350
Wire Wire Line
	3650 3800 4550 3800
Wire Wire Line
	3650 4250 4550 4250
Wire Wire Line
	3650 4700 4550 4700
Wire Wire Line
	3650 5150 4550 5150
Wire Wire Line
	3650 5600 4550 5600
Wire Wire Line
	3650 6050 4550 6050
Wire Wire Line
	3650 6500 4550 6500
Wire Wire Line
	3650 6950 4550 6950
Wire Wire Line
	3650 7400 4550 7400
Wire Wire Line
	3850 1000 3550 1000
Wire Wire Line
	3850 1000 3850 550 
Wire Wire Line
	3850 1450 3550 1450
Wire Wire Line
	3850 1450 3850 1000
Wire Wire Line
	3850 1900 3550 1900
Wire Wire Line
	3850 1900 3850 1450
Wire Wire Line
	3850 2350 3550 2350
Wire Wire Line
	3850 2350 3850 1900
Wire Wire Line
	3850 2800 3550 2800
Wire Wire Line
	3850 2800 3850 2350
Wire Wire Line
	3850 3250 3550 3250
Wire Wire Line
	3850 3250 3850 2800
Wire Wire Line
	3850 3700 3550 3700
Wire Wire Line
	3850 3700 3850 3250
Wire Wire Line
	3850 4150 3550 4150
Wire Wire Line
	3850 4150 3850 3700
Wire Wire Line
	3850 4600 3550 4600
Wire Wire Line
	3850 4600 3850 4150
Wire Wire Line
	3850 5050 3550 5050
Wire Wire Line
	3850 5050 3850 4600
Wire Wire Line
	3850 5500 3550 5500
Wire Wire Line
	3850 5500 3850 5050
Wire Wire Line
	3850 5950 3850 5500
Wire Wire Line
	3850 6400 3550 6400
Wire Wire Line
	3850 6400 3850 5950
Wire Wire Line
	3850 6850 3550 6850
Wire Wire Line
	3850 6850 3850 6400
Wire Wire Line
	3850 7300 3550 7300
Wire Wire Line
	3850 7300 3850 6850
Wire Wire Line
	3850 7300 3850 7650
Wire Wire Line
	3850 7650 5800 7650
Wire Wire Line
	4550 650  5850 650 
Wire Wire Line
	4550 700  4550 650 
Wire Wire Line
	4550 1100 5750 1100
Wire Wire Line
	4550 1150 4550 1100
Wire Wire Line
	4550 1600 4550 1550
Wire Wire Line
	4550 2050 4550 2000
Wire Wire Line
	4550 2500 4550 2450
Wire Wire Line
	4550 2900 5350 2900
Wire Wire Line
	4550 2950 4550 2900
Wire Wire Line
	4550 3350 6050 3350
Wire Wire Line
	4550 3400 4550 3350
Wire Wire Line
	4550 3800 5350 3800
Wire Wire Line
	4550 3850 4550 3800
Wire Wire Line
	4550 4200 4550 4250
Wire Wire Line
	4550 4250 5350 4250
Wire Wire Line
	4550 4650 4550 4700
Wire Wire Line
	4550 4700 6050 4700
Wire Wire Line
	4550 5100 4550 5150
Wire Wire Line
	4550 5550 4550 5600
Wire Wire Line
	4550 5600 5450 5600
Wire Wire Line
	4550 6000 4550 6050
Wire Wire Line
	4550 6450 4550 6500
Wire Wire Line
	4550 6900 4550 6950
Wire Wire Line
	4550 6950 5750 6950
Wire Wire Line
	4550 7350 4550 7400
Wire Wire Line
	5350 2900 5350 3250
Wire Wire Line
	5350 3250 6050 3250
Wire Wire Line
	5350 3450 6050 3450
Wire Wire Line
	5350 3800 5350 3450
Wire Wire Line
	5350 4250 5350 4600
Wire Wire Line
	5350 4600 6050 4600
Wire Wire Line
	5350 4800 5350 5150
Wire Wire Line
	5350 5150 4550 5150
Wire Wire Line
	5450 2450 4550 2450
Wire Wire Line
	5450 2450 5450 3150
Wire Wire Line
	5450 4900 6050 4900
Wire Wire Line
	5450 5600 5450 4900
Wire Wire Line
	5550 2000 4550 2000
Wire Wire Line
	5550 2000 5550 3050
Wire Wire Line
	5550 5000 5550 6050
Wire Wire Line
	5550 6050 4550 6050
Wire Wire Line
	5650 1550 4550 1550
Wire Wire Line
	5650 1550 5650 2950
Wire Wire Line
	5650 5100 5650 6500
Wire Wire Line
	5650 6500 4550 6500
Wire Wire Line
	5750 1100 5750 2850
Wire Wire Line
	5750 5200 6050 5200
Wire Wire Line
	5750 6950 5750 5200
Wire Wire Line
	5800 4050 5950 4050
Wire Wire Line
	5850 650  5850 2750
Wire Wire Line
	5850 5300 5850 7400
Wire Wire Line
	5850 7400 4550 7400
Wire Wire Line
	5950 3700 5950 4050
Wire Wire Line
	5950 3700 6050 3700
Wire Wire Line
	5950 4050 5950 5550
Wire Wire Line
	5950 5550 6050 5550
Wire Wire Line
	6050 2750 5850 2750
Wire Wire Line
	6050 2850 5750 2850
Wire Wire Line
	6050 2950 5650 2950
Wire Wire Line
	6050 3050 5550 3050
Wire Wire Line
	6050 3150 5450 3150
Wire Wire Line
	6050 4800 5350 4800
Wire Wire Line
	6050 5000 5550 5000
Wire Wire Line
	6050 5100 5650 5100
Wire Wire Line
	6050 5300 5850 5300
Wire Wire Line
	6550 6250 6650 6250
Wire Wire Line
	6650 2750 7400 2750
Wire Wire Line
	6650 2850 7400 2850
Wire Wire Line
	6650 2950 7400 2950
Wire Wire Line
	6650 3050 7400 3050
Wire Wire Line
	6650 3150 7150 3150
Wire Wire Line
	6650 3350 6950 3350
Wire Wire Line
	6650 4600 7400 4600
Wire Wire Line
	6650 4700 7400 4700
Wire Wire Line
	6650 4800 7400 4800
Wire Wire Line
	6650 4900 7400 4900
Wire Wire Line
	6650 5000 7150 5000
Wire Wire Line
	6650 5200 6950 5200
Wire Wire Line
	6650 6250 6650 7600
Wire Wire Line
	6650 6250 6700 6250
Wire Wire Line
	6650 7600 6350 7600
Wire Wire Line
	6850 3450 6650 3450
Wire Wire Line
	6850 3950 6850 3450
Wire Wire Line
	6850 3950 7400 3950
Wire Wire Line
	6850 5300 6650 5300
Wire Wire Line
	6850 5800 6850 5300
Wire Wire Line
	6850 5800 7400 5800
Wire Wire Line
	6950 3350 6950 3850
Wire Wire Line
	6950 3850 7400 3850
Wire Wire Line
	6950 5200 6950 5700
Wire Wire Line
	6950 5700 7400 5700
Wire Wire Line
	7050 3250 6650 3250
Wire Wire Line
	7050 3750 7050 3250
Wire Wire Line
	7050 3750 7400 3750
Wire Wire Line
	7050 5100 6650 5100
Wire Wire Line
	7050 5600 7050 5100
Wire Wire Line
	7050 5600 7400 5600
Wire Wire Line
	7150 3150 7150 3650
Wire Wire Line
	7150 3650 7400 3650
Wire Wire Line
	7150 5000 7150 5500
Wire Wire Line
	7150 5500 7400 5500
Wire Wire Line
	7300 3200 7300 4100
Wire Wire Line
	7300 4100 7300 5050
Wire Wire Line
	7300 4100 7400 4100
Wire Wire Line
	7300 5050 7300 5950
Wire Wire Line
	7300 5050 7400 5050
Wire Wire Line
	7300 5950 7400 5950
Wire Wire Line
	7300 6250 7300 5950
Wire Wire Line
	7400 3200 7300 3200
Wire Bus Line
	2350 4050 1800 4050
Wire Bus Line
	4650 4050 4900 4050
Wire Bus Line
	9250 4250 9800 4250
Text Notes 6050 2250 0    50   ~ 0
WARNING!\nThe latches are inverted, it's really easy to miss in the reading
Text Label 3200 650  2    50   ~ 0
BUS-DATA0
Text Label 3200 1100 2    50   ~ 0
BUS-DATA1
Text Label 3200 1550 2    50   ~ 0
BUS-DATA2
Text Label 3200 2000 2    50   ~ 0
BUS-DATA3
Text Label 3200 2450 2    50   ~ 0
BUS-DATA4
Text Label 3200 2900 2    50   ~ 0
BUS-DATA5
Text Label 3200 3350 2    50   ~ 0
BUS-DATA6
Text Label 3200 3800 2    50   ~ 0
BUS-DATA7
Text Label 3200 4250 2    50   ~ 0
BUS-DATA8
Text Label 3200 4700 2    50   ~ 0
BUS-DATA9
Text Label 3200 5150 2    50   ~ 0
BUS-DATA10
Text Label 3200 5600 2    50   ~ 0
BUS-DATA11
Text Label 3200 6050 2    50   ~ 0
BUS-DATA12
Text Label 3200 6500 2    50   ~ 0
BUS-DATA13
Text Label 3200 6950 2    50   ~ 0
BUS-DATA14
Text Label 3200 7400 2    50   ~ 0
BUS-DATA15
Text HLabel 1800 4050 0    50   3State ~ 0
BUS-DATA[0..15]
Text HLabel 4900 4050 2    50   BiDi ~ 0
CD[0..15]
Text HLabel 5800 4050 0    50   Input ~ 0
IN-LE
Text HLabel 6350 7700 2    50   Input ~ 0
MUTE-OUT
Text HLabel 6550 6250 0    50   Input ~ 0
IN-RD
$Comp
L A5C:OUTTRI UCT292
U 1 1 62881E93
P 3450 650
F 0 "UCT292" H 3450 900 50  0000 C CNN
F 1 "OUTTRI" H 3450 800 50  0000 C CNN
F 2 "" H 3500 650 50  0001 C CNN
F 3 "" H 3500 650 50  0001 C CNN
	1    3450 650 
	1    0    0    1   
$EndComp
$Comp
L A5C:OUTTRI UCT296
U 1 1 62881E8D
P 3450 1100
F 0 "UCT296" H 3450 1350 50  0000 C CNN
F 1 "OUTTRI" H 3450 1250 50  0000 C CNN
F 2 "" H 3500 1100 50  0001 C CNN
F 3 "" H 3500 1100 50  0001 C CNN
	1    3450 1100
	1    0    0    1   
$EndComp
$Comp
L A5C:OUTTRI UCT301
U 1 1 62881E87
P 3450 1550
F 0 "UCT301" H 3450 1800 50  0000 C CNN
F 1 "OUTTRI" H 3450 1700 50  0000 C CNN
F 2 "" H 3500 1550 50  0001 C CNN
F 3 "" H 3500 1550 50  0001 C CNN
	1    3450 1550
	1    0    0    1   
$EndComp
$Comp
L A5C:OUTTRI UCT305
U 1 1 62881E81
P 3450 2000
F 0 "UCT305" H 3450 2250 50  0000 C CNN
F 1 "OUTTRI" H 3450 2150 50  0000 C CNN
F 2 "" H 3500 2000 50  0001 C CNN
F 3 "" H 3500 2000 50  0001 C CNN
	1    3450 2000
	1    0    0    1   
$EndComp
$Comp
L A5C:OUTTRI UCT317
U 1 1 627FE7E8
P 3450 2450
F 0 "UCT317" H 3450 2700 50  0000 C CNN
F 1 "OUTTRI" H 3450 2600 50  0000 C CNN
F 2 "" H 3500 2450 50  0001 C CNN
F 3 "" H 3500 2450 50  0001 C CNN
	1    3450 2450
	1    0    0    1   
$EndComp
$Comp
L A5C:OUTTRI UCT331
U 1 1 627FE7E2
P 3450 2900
F 0 "UCT331" H 3450 3150 50  0000 C CNN
F 1 "OUTTRI" H 3450 3050 50  0000 C CNN
F 2 "" H 3500 2900 50  0001 C CNN
F 3 "" H 3500 2900 50  0001 C CNN
	1    3450 2900
	1    0    0    1   
$EndComp
$Comp
L A5C:OUTTRI UCT346
U 1 1 5EF71064
P 3450 3350
F 0 "UCT346" H 3450 3600 50  0000 C CNN
F 1 "OUTTRI" H 3450 3500 50  0000 C CNN
F 2 "" H 3500 3350 50  0001 C CNN
F 3 "" H 3500 3350 50  0001 C CNN
	1    3450 3350
	1    0    0    1   
$EndComp
$Comp
L A5C:OUTTRI UCT359
U 1 1 5EF7105E
P 3450 3800
F 0 "UCT359" H 3450 4050 50  0000 C CNN
F 1 "OUTTRI" H 3450 3950 50  0000 C CNN
F 2 "" H 3500 3800 50  0001 C CNN
F 3 "" H 3500 3800 50  0001 C CNN
	1    3450 3800
	1    0    0    1   
$EndComp
$Comp
L A5C:OUTTRI UCT383
U 1 1 5EF71058
P 3450 4250
F 0 "UCT383" H 3450 4500 50  0000 C CNN
F 1 "OUTTRI" H 3450 4400 50  0000 C CNN
F 2 "" H 3500 4250 50  0001 C CNN
F 3 "" H 3500 4250 50  0001 C CNN
	1    3450 4250
	1    0    0    1   
$EndComp
$Comp
L A5C:OUTTRI UCT389
U 1 1 5EF71052
P 3450 4700
F 0 "UCT389" H 3450 4950 50  0000 C CNN
F 1 "OUTTRI" H 3450 4850 50  0000 C CNN
F 2 "" H 3500 4700 50  0001 C CNN
F 3 "" H 3500 4700 50  0001 C CNN
	1    3450 4700
	1    0    0    1   
$EndComp
$Comp
L A5C:OUTTRI UCT399
U 1 1 627FDA37
P 3450 5150
F 0 "UCT399" H 3450 5400 50  0000 C CNN
F 1 "OUTTRI" H 3450 5300 50  0000 C CNN
F 2 "" H 3500 5150 50  0001 C CNN
F 3 "" H 3500 5150 50  0001 C CNN
	1    3450 5150
	1    0    0    1   
$EndComp
$Comp
L A5C:OUTTRI UCT432
U 1 1 627FC864
P 3450 5600
F 0 "UCT432" H 3450 5850 50  0000 C CNN
F 1 "OUTTRI" H 3450 5750 50  0000 C CNN
F 2 "" H 3500 5600 50  0001 C CNN
F 3 "" H 3500 5600 50  0001 C CNN
	1    3450 5600
	1    0    0    1   
$EndComp
$Comp
L A5C:OUTTRI UCR427
U 1 1 5EF7109E
P 3450 6050
F 0 "UCR427" H 3450 6300 50  0000 C CNN
F 1 "OUTTRI" H 3450 6200 50  0000 C CNN
F 2 "" H 3500 6050 50  0001 C CNN
F 3 "" H 3500 6050 50  0001 C CNN
	1    3450 6050
	1    0    0    1   
$EndComp
$Comp
L A5C:OUTTRI UCR446
U 1 1 5EF71076
P 3450 6500
F 0 "UCR446" H 3450 6750 50  0000 C CNN
F 1 "OUTTRI" H 3450 6650 50  0000 C CNN
F 2 "" H 3500 6500 50  0001 C CNN
F 3 "" H 3500 6500 50  0001 C CNN
	1    3450 6500
	1    0    0    1   
$EndComp
$Comp
L A5C:OUTTRI UCT447
U 1 1 5EF71070
P 3450 6950
F 0 "UCT447" H 3450 7200 50  0000 C CNN
F 1 "OUTTRI" H 3450 7100 50  0000 C CNN
F 2 "" H 3500 6950 50  0001 C CNN
F 3 "" H 3500 6950 50  0001 C CNN
	1    3450 6950
	1    0    0    1   
$EndComp
$Comp
L A5C:OUTTRI UCT452
U 1 1 5EF7106A
P 3450 7400
F 0 "UCT452" H 3450 7650 50  0000 C CNN
F 1 "OUTTRI" H 3450 7550 50  0000 C CNN
F 2 "" H 3500 7400 50  0001 C CNN
F 3 "" H 3500 7400 50  0001 C CNN
	1    3450 7400
	1    0    0    1   
$EndComp
$Comp
L A5C:OR02 UCR?
U 1 1 60BC9AD8
P 6100 7650
AR Path="/60BC9AD8" Ref="UCR?"  Part="1" 
AR Path="/5FB062CA/60BC9AD8" Ref="UCR298"  Part="1" 
F 0 "UCR298" H 6125 7917 50  0000 C CNN
F 1 "OR02" H 6125 7826 50  0000 C CNN
F 2 "" H 6150 7650 50  0001 C CNN
F 3 "" H 6150 7650 50  0001 C CNN
	1    6100 7650
	-1   0    0    -1  
$EndComp
$Comp
L A5C:INV01 UCG291
U 1 1 73CC799E
P 7000 6250
F 0 "UCG291" H 7000 6567 50  0000 C CNN
F 1 "INV01" H 7000 6476 50  0000 C CNN
F 2 "" H 7000 6050 50  0001 C CNN
F 3 "" H 7000 6050 50  0001 C CNN
	1    7000 6250
	1    0    0    -1  
$EndComp
$Comp
L A5C:M368C UCG174
U 1 1 6B12BA1E
P 7900 3000
F 0 "UCG174" H 7900 3515 50  0000 C CNN
F 1 "M368C" H 7900 3424 50  0000 C CNN
F 2 "" H 8200 2800 50  0001 C CNN
F 3 "" H 8200 2800 50  0001 C CNN
	1    7900 3000
	1    0    0    -1  
$EndComp
$Comp
L A5C:M368C UCG239
U 1 1 6D6C1278
P 7900 3900
F 0 "UCG239" H 7900 4415 50  0000 C CNN
F 1 "M368C" H 7900 4324 50  0000 C CNN
F 2 "" H 8200 3700 50  0001 C CNN
F 3 "" H 8200 3700 50  0001 C CNN
	1    7900 3900
	1    0    0    -1  
$EndComp
$Comp
L A5C:M368C UCL235
U 1 1 6B3D5FAB
P 7900 4850
F 0 "UCL235" H 7900 5365 50  0000 C CNN
F 1 "M368C" H 7900 5274 50  0000 C CNN
F 2 "" H 8200 4650 50  0001 C CNN
F 3 "" H 8200 4650 50  0001 C CNN
	1    7900 4850
	1    0    0    -1  
$EndComp
$Comp
L A5C:M368C UCL292
U 1 1 6FCF93B7
P 7900 5750
F 0 "UCL292" H 7900 6265 50  0000 C CNN
F 1 "M368C" H 7900 6174 50  0000 C CNN
F 2 "" H 8200 5550 50  0001 C CNN
F 3 "" H 8200 5550 50  0001 C CNN
	1    7900 5750
	1    0    0    -1  
$EndComp
$Comp
L A5C:L8L UCJ233
U 1 1 5F910BF1
P 6350 3150
F 0 "UCJ233" H 6350 3811 50  0000 C CNN
F 1 "L8L" H 6350 3720 50  0000 C CNN
F 2 "" H 6300 3450 50  0001 C CNN
F 3 "" H 6300 3450 50  0001 C CNN
F 4 "UCJ232;UCJ236;UCJ239;UCJ242;UCJ245;UCJ247;UCJ250;UCJ253" H 6350 3150 50  0001 C CNN "MiscRef"
	1    6350 3150
	1    0    0    -1  
$EndComp
$Comp
L A5C:L8L UCO293
U 1 1 5F912201
P 6350 5000
F 0 "UCO293" H 6350 5661 50  0000 C CNN
F 1 "L8L" H 6350 5570 50  0000 C CNN
F 2 "" H 6300 5300 50  0001 C CNN
F 3 "" H 6300 5300 50  0001 C CNN
F 4 "UCO291;UCO296;UCO298;UCO301;UCO304;UCO307;UCO309;UCO312" H 6350 5000 50  0001 C CNN "MiscRef"
	1    6350 5000
	1    0    0    -1  
$EndComp
Text HLabel 9800 4250 2    50   3State ~ 0
BUS-DATA[0..15]
Text Label 8450 5800 0    50   ~ 0
BUS-DATA15
Text Label 8450 5700 0    50   ~ 0
BUS-DATA14
Text Label 8450 5600 0    50   ~ 0
BUS-DATA13
Text Label 8450 5500 0    50   ~ 0
BUS-DATA12
Text Label 8450 4900 0    50   ~ 0
BUS-DATA11
Text Label 8450 4800 0    50   ~ 0
BUS-DATA10
Text Label 8450 4700 0    50   ~ 0
BUS-DATA9
Text Label 8450 4600 0    50   ~ 0
BUS-DATA8
Text Label 8450 3950 0    50   ~ 0
BUS-DATA7
Text Label 8450 3850 0    50   ~ 0
BUS-DATA6
Text Label 8450 3750 0    50   ~ 0
BUS-DATA5
Text Label 8450 3650 0    50   ~ 0
BUS-DATA4
Text Label 8450 3050 0    50   ~ 0
BUS-DATA3
Text Label 8450 2950 0    50   ~ 0
BUS-DATA2
Text Label 8450 2850 0    50   ~ 0
BUS-DATA1
Text Label 8450 2750 0    50   ~ 0
BUS-DATA0
Wire Wire Line
	8400 5800 9150 5800
Wire Wire Line
	8400 5700 9150 5700
Wire Wire Line
	8400 5600 9150 5600
Wire Wire Line
	8400 5500 9150 5500
Wire Wire Line
	8400 4900 9150 4900
Wire Wire Line
	8400 4800 9150 4800
Wire Wire Line
	8400 4700 9150 4700
Wire Wire Line
	8400 4600 9150 4600
Wire Wire Line
	8400 3950 9150 3950
Wire Wire Line
	8400 3850 9150 3850
Wire Wire Line
	8400 3750 9150 3750
Wire Wire Line
	8400 3650 9150 3650
Wire Wire Line
	8400 3050 9150 3050
Wire Wire Line
	8400 2950 9150 2950
Wire Wire Line
	8400 2850 9150 2850
Wire Wire Line
	8400 2750 9150 2750
Connection ~ 4550 650 
Connection ~ 4550 1100
Connection ~ 4550 1550
Connection ~ 4550 2000
Connection ~ 4550 2450
Connection ~ 4550 2900
Connection ~ 4550 3350
Connection ~ 4550 3800
Connection ~ 4550 4250
Connection ~ 4550 4700
Connection ~ 4550 5150
Connection ~ 4550 5600
Connection ~ 4550 6050
Connection ~ 4550 6500
Connection ~ 4550 6950
Connection ~ 4550 7400
Text Label 4100 650  0    50   ~ 0
CD0
Text Label 4100 1100 0    50   ~ 0
CD1
Text Label 4100 1550 0    50   ~ 0
CD2
Text Label 4100 2000 0    50   ~ 0
CD3
Text Label 4100 2450 0    50   ~ 0
CD4
Text Label 4100 2900 0    50   ~ 0
CD5
Text Label 4100 3350 0    50   ~ 0
CD6
Text Label 4100 3800 0    50   ~ 0
CD7
Text Label 4100 4250 0    50   ~ 0
CD8
Text Label 4100 4700 0    50   ~ 0
CD9
Text Label 4100 5150 0    50   ~ 0
CD10
Text Label 4100 5600 0    50   ~ 0
CD11
Text Label 4100 6050 0    50   ~ 0
CD12
Text Label 4100 6500 0    50   ~ 0
CD13
Text Label 4100 6950 0    50   ~ 0
CD14
Text Label 4100 7400 0    50   ~ 0
CD15
Wire Bus Line
	9250 4250 9250 5700
Wire Bus Line
	9250 2850 9250 4250
Wire Bus Line
	4650 4050 4650 7250
Wire Bus Line
	4650 800  4650 4050
Wire Bus Line
	2350 4050 2350 7300
Wire Bus Line
	2350 750  2350 4050
$EndSCHEMATC
