EESchema Schematic File Version 4
EELAYER 30 0
EELAYER END
$Descr A4 11693 8268
encoding utf-8
Sheet 48 83
Title "CPS Reverse Engineering: DL-0311"
Date "2021-09-12"
Rev ""
Comp ""
Comment1 ""
Comment2 ""
Comment3 "Licence: CC-BY"
Comment4 "Author: Loïc *WydD* Petit"
$EndDescr
Connection ~ 5650 4150
Connection ~ 5650 3100
Connection ~ 5650 2050
Connection ~ 1900 4200
Connection ~ 1900 3150
Connection ~ 1900 2100
Connection ~ 9150 2050
Connection ~ 5650 1250
Connection ~ 7300 5300
NoConn ~ 5250 4450
NoConn ~ 3650 5250
NoConn ~ 3650 4950
NoConn ~ 3650 5150
NoConn ~ 3650 5350
NoConn ~ 3650 5450
NoConn ~ 6750 4000
Entry Wire Line
	2250 1600 2150 1500
Entry Wire Line
	2250 1700 2150 1600
Entry Wire Line
	2250 1800 2150 1700
Entry Wire Line
	2250 1900 2150 1800
Entry Wire Line
	2250 2650 2150 2550
Entry Wire Line
	2250 2750 2150 2650
Entry Wire Line
	2250 2850 2150 2750
Entry Wire Line
	2250 2950 2150 2850
Entry Wire Line
	2250 3700 2150 3600
Entry Wire Line
	2250 3800 2150 3700
Entry Wire Line
	2250 3900 2150 3800
Entry Wire Line
	2250 4000 2150 3900
Entry Wire Line
	2250 4850 2150 4750
Entry Wire Line
	2250 4950 2150 4850
Entry Wire Line
	2250 5050 2150 4950
Entry Wire Line
	2250 5150 2150 5050
Entry Wire Line
	3000 6050 2900 6150
Entry Wire Line
	3000 6150 2900 6250
Entry Wire Line
	3000 6250 2900 6350
Entry Wire Line
	3000 6350 2900 6450
Entry Wire Line
	7300 1700 7200 1600
Entry Wire Line
	7300 1800 7200 1700
Entry Wire Line
	7300 1900 7200 1800
Entry Wire Line
	7300 2000 7200 1900
Entry Wire Line
	7300 2750 7200 2650
Entry Wire Line
	7300 2850 7200 2750
Entry Wire Line
	7300 2950 7200 2850
Entry Wire Line
	7300 3050 7200 2950
Entry Wire Line
	7300 3800 7200 3700
Entry Wire Line
	7300 3900 7200 3800
Entry Wire Line
	7300 4000 7200 3900
Entry Wire Line
	7300 4700 7200 4600
Entry Wire Line
	7300 4800 7200 4700
Entry Wire Line
	7300 4900 7200 4800
Entry Wire Line
	7300 5000 7200 4900
Entry Wire Line
	8650 1600 8550 1700
Entry Wire Line
	8650 1700 8550 1800
Entry Wire Line
	8650 1800 8550 1900
Entry Wire Line
	8650 1900 8550 2000
Entry Wire Line
	8650 2500 8550 2600
Entry Wire Line
	8650 2600 8550 2700
Entry Wire Line
	8650 2700 8550 2800
Entry Wire Line
	8650 2800 8550 2900
Entry Wire Line
	10800 1700 10700 1600
Entry Wire Line
	10800 1800 10700 1700
Entry Wire Line
	10800 1900 10700 1800
Entry Wire Line
	10800 2000 10700 1900
Entry Wire Line
	10800 2600 10700 2500
Entry Wire Line
	10800 2700 10700 2600
Entry Wire Line
	10800 2800 10700 2700
Entry Wire Line
	10800 2900 10700 2800
Wire Wire Line
	1900 2100 1900 3150
Wire Wire Line
	1900 3150 1900 4200
Wire Wire Line
	1900 4200 1900 5450
Wire Wire Line
	2250 1600 2850 1600
Wire Wire Line
	2250 1700 2850 1700
Wire Wire Line
	2250 1800 2850 1800
Wire Wire Line
	2250 1900 2850 1900
Wire Wire Line
	2250 2650 2850 2650
Wire Wire Line
	2250 2750 2850 2750
Wire Wire Line
	2250 2850 2850 2850
Wire Wire Line
	2250 2950 2850 2950
Wire Wire Line
	2250 3700 2850 3700
Wire Wire Line
	2250 3800 2850 3800
Wire Wire Line
	2250 3900 2850 3900
Wire Wire Line
	2250 4000 2850 4000
Wire Wire Line
	2250 4850 2850 4850
Wire Wire Line
	2250 4950 2850 4950
Wire Wire Line
	2250 5050 2850 5050
Wire Wire Line
	2250 5150 2850 5150
Wire Wire Line
	2650 2400 2850 2400
Wire Wire Line
	2650 3450 2850 3450
Wire Wire Line
	2650 4500 2850 4500
Wire Wire Line
	2650 5750 2850 5750
Wire Wire Line
	2850 2100 1900 2100
Wire Wire Line
	2850 2400 2850 2200
Wire Wire Line
	2850 3150 1900 3150
Wire Wire Line
	2850 3450 2850 3250
Wire Wire Line
	2850 4200 1900 4200
Wire Wire Line
	2850 4500 2850 4300
Wire Wire Line
	2850 5450 1900 5450
Wire Wire Line
	2850 5550 2850 5750
Wire Wire Line
	3000 6050 4050 6050
Wire Wire Line
	3000 6150 4150 6150
Wire Wire Line
	3000 6250 4250 6250
Wire Wire Line
	3000 6350 5450 6350
Wire Wire Line
	3650 1600 5750 1600
Wire Wire Line
	3650 1700 5750 1700
Wire Wire Line
	3650 1800 5750 1800
Wire Wire Line
	3650 1900 5750 1900
Wire Wire Line
	3650 2650 5750 2650
Wire Wire Line
	3650 2750 5750 2750
Wire Wire Line
	3650 2850 5750 2850
Wire Wire Line
	3650 2950 5750 2950
Wire Wire Line
	3650 3700 5750 3700
Wire Wire Line
	3650 3800 5750 3800
Wire Wire Line
	3650 3900 5750 3900
Wire Wire Line
	3650 4000 3750 4000
Wire Wire Line
	3650 5550 3650 5750
Wire Wire Line
	3650 5750 3550 5750
Wire Wire Line
	3750 4000 3750 4750
Wire Wire Line
	3750 4750 4450 4750
Wire Wire Line
	3750 5050 3650 5050
Wire Wire Line
	3750 5050 3750 5600
Wire Wire Line
	3750 5600 4450 5600
Wire Wire Line
	4050 4450 4450 4450
Wire Wire Line
	4050 6050 4050 4450
Wire Wire Line
	4150 4550 4150 6150
Wire Wire Line
	4250 5400 4250 6250
Wire Wire Line
	4250 5400 4450 5400
Wire Wire Line
	4450 4550 4150 4550
Wire Wire Line
	4450 4850 3650 4850
Wire Wire Line
	5050 5400 5250 5400
Wire Wire Line
	5250 4700 5750 4700
Wire Wire Line
	5250 4850 5250 5400
Wire Wire Line
	5350 4800 5350 5500
Wire Wire Line
	5350 5500 5050 5500
Wire Wire Line
	5450 4900 5450 6350
Wire Wire Line
	5450 4900 5750 4900
Wire Wire Line
	5550 1250 5650 1250
Wire Wire Line
	5650 1250 9150 1250
Wire Wire Line
	5650 2050 5650 1250
Wire Wire Line
	5650 2050 5650 3100
Wire Wire Line
	5650 3100 5650 4150
Wire Wire Line
	5650 4150 5650 5050
Wire Wire Line
	5650 5050 5750 5050
Wire Wire Line
	5750 2050 5650 2050
Wire Wire Line
	5750 3100 5650 3100
Wire Wire Line
	5750 4150 5650 4150
Wire Wire Line
	5750 4600 5250 4600
Wire Wire Line
	5750 4800 5350 4800
Wire Wire Line
	7200 1600 6750 1600
Wire Wire Line
	7200 1700 6750 1700
Wire Wire Line
	7200 1800 6750 1800
Wire Wire Line
	7200 1900 6750 1900
Wire Wire Line
	7200 2650 6750 2650
Wire Wire Line
	7200 2750 6750 2750
Wire Wire Line
	7200 2850 6750 2850
Wire Wire Line
	7200 2950 6750 2950
Wire Wire Line
	7200 3700 6750 3700
Wire Wire Line
	7200 3800 6750 3800
Wire Wire Line
	7200 3900 6750 3900
Wire Wire Line
	7200 4600 6750 4600
Wire Wire Line
	7200 4700 6750 4700
Wire Wire Line
	7200 4800 6750 4800
Wire Wire Line
	7200 4900 6750 4900
Wire Wire Line
	9150 1250 9150 2050
Wire Wire Line
	9150 2050 9250 2050
Wire Wire Line
	9150 2950 9150 2050
Wire Wire Line
	9250 1600 8650 1600
Wire Wire Line
	9250 1700 8650 1700
Wire Wire Line
	9250 1800 8650 1800
Wire Wire Line
	9250 1900 8650 1900
Wire Wire Line
	9250 2500 8650 2500
Wire Wire Line
	9250 2600 8650 2600
Wire Wire Line
	9250 2700 8650 2700
Wire Wire Line
	9250 2800 8650 2800
Wire Wire Line
	9250 2950 9150 2950
Wire Wire Line
	10700 1600 10250 1600
Wire Wire Line
	10700 1700 10250 1700
Wire Wire Line
	10700 1800 10250 1800
Wire Wire Line
	10700 1900 10250 1900
Wire Wire Line
	10700 2500 10250 2500
Wire Wire Line
	10700 2600 10250 2600
Wire Wire Line
	10700 2700 10250 2700
Wire Wire Line
	10700 2800 10250 2800
Wire Bus Line
	2150 1350 2050 1350
Wire Bus Line
	2800 6550 2900 6550
Wire Bus Line
	7300 5300 7200 5300
Wire Bus Line
	7300 5300 10800 5300
Wire Bus Line
	8450 3050 8550 3050
Text Label 2300 1600 0    50   ~ 0
BUS-DATA15
Text Label 2300 1700 0    50   ~ 0
BUS-DATA14
Text Label 2300 1800 0    50   ~ 0
BUS-DATA13
Text Label 2300 1900 0    50   ~ 0
BUS-DATA12
Text Label 2300 2650 0    50   ~ 0
BUS-DATA11
Text Label 2300 2750 0    50   ~ 0
BUS-DATA10
Text Label 2300 2850 0    50   ~ 0
BUS-DATA9
Text Label 2300 2950 0    50   ~ 0
BUS-DATA8
Text Label 2300 3700 0    50   ~ 0
BUS-DATA7
Text Label 2300 3800 0    50   ~ 0
BUS-DATA6
Text Label 2300 3900 0    50   ~ 0
BUS-DATA5
Text Label 2300 4000 0    50   ~ 0
BUS-DATA4
Text Label 2300 4850 0    50   ~ 0
BUS-DATA3
Text Label 2300 4950 0    50   ~ 0
BUS-DATA2
Text Label 2300 5050 0    50   ~ 0
BUS-DATA1
Text Label 2300 5150 0    50   ~ 0
BUS-DATA0
Text Label 3050 6050 0    50   ~ 0
LUT-CNT11
Text Label 3050 6150 0    50   ~ 0
LUT-CNT10
Text Label 3050 6250 0    50   ~ 0
LUT-CNT9
Text Label 3050 6350 0    50   ~ 0
LUT-CNT8
Text Label 7100 1600 2    50   ~ 0
ADDR23
Text Label 7100 1700 2    50   ~ 0
ADDR22
Text Label 7100 1800 2    50   ~ 0
ADDR21
Text Label 7100 1900 2    50   ~ 0
ADDR20
Text Label 7100 2650 2    50   ~ 0
ADDR19
Text Label 7100 2750 2    50   ~ 0
ADDR18
Text Label 7100 2850 2    50   ~ 0
ADDR17
Text Label 7100 2950 2    50   ~ 0
ADDR16
Text Label 7100 3700 2    50   ~ 0
ADDR15
Text Label 7100 3800 2    50   ~ 0
ADDR14
Text Label 7100 3900 2    50   ~ 0
ADDR13
Text Label 7100 4600 2    50   ~ 0
ADDR12
Text Label 7100 4700 2    50   ~ 0
ADDR11
Text Label 7100 4800 2    50   ~ 0
ADDR10
Text Label 7100 4900 2    50   ~ 0
ADDR9
Text Label 8700 1600 0    50   ~ 0
~LUT-CNT4
Text Label 8700 1700 0    50   ~ 0
~LUT-CNT5
Text Label 8700 1800 0    50   ~ 0
~LUT-CNT6
Text Label 8700 1900 0    50   ~ 0
~LUT-CNT7
Text Label 8700 2500 0    50   ~ 0
~LUT-CNT0
Text Label 8700 2600 0    50   ~ 0
~LUT-CNT1
Text Label 8700 2700 0    50   ~ 0
~LUT-CNT2
Text Label 8700 2800 0    50   ~ 0
~LUT-CNT3
Text Label 10600 1600 2    50   ~ 0
ADDR5
Text Label 10600 1700 2    50   ~ 0
ADDR6
Text Label 10600 1800 2    50   ~ 0
ADDR7
Text Label 10600 1900 2    50   ~ 0
ADDR8
Text Label 10600 2500 2    50   ~ 0
ADDR1
Text Label 10600 2600 2    50   ~ 0
ADDR2
Text Label 10600 2700 2    50   ~ 0
ADDR3
Text Label 10600 2800 2    50   ~ 0
ADDR4
Text HLabel 1350 2050 0    50   Input ~ 0
~PALETTE-BASE
Text HLabel 1350 2150 0    50   Input ~ 0
~CLK4M
Text HLabel 2050 1350 0    50   Input ~ 0
BUS-DATA[0..15]
Text HLabel 2800 6550 0    50   Input ~ 0
LUT-CNT[8..11]
Text HLabel 3550 5750 0    50   Output ~ 0
~PALETTE-BASE0
Text HLabel 5550 1250 0    50   Input ~ 0
~BUS-WSTLUT
Text HLabel 7200 5300 0    50   3State ~ 0
ADDR[1..23]
Text HLabel 8450 3050 0    50   Input ~ 0
~LUT-CNT[0..7]
$Comp
L power:VCC #PWR0169
U 1 1 61118E36
P 2650 2400
F 0 "#PWR0169" H 2650 2250 50  0001 C CNN
F 1 "VCC" H 2665 2573 50  0000 C CNN
F 2 "" H 2650 2400 50  0001 C CNN
F 3 "" H 2650 2400 50  0001 C CNN
	1    2650 2400
	1    0    0    -1  
$EndComp
$Comp
L power:VCC #PWR0170
U 1 1 61118E2E
P 2650 3450
F 0 "#PWR0170" H 2650 3300 50  0001 C CNN
F 1 "VCC" H 2665 3623 50  0000 C CNN
F 2 "" H 2650 3450 50  0001 C CNN
F 3 "" H 2650 3450 50  0001 C CNN
	1    2650 3450
	1    0    0    -1  
$EndComp
$Comp
L power:VCC #PWR0171
U 1 1 61118E2F
P 2650 4500
F 0 "#PWR0171" H 2650 4350 50  0001 C CNN
F 1 "VCC" H 2665 4673 50  0000 C CNN
F 2 "" H 2650 4500 50  0001 C CNN
F 3 "" H 2650 4500 50  0001 C CNN
	1    2650 4500
	1    0    0    -1  
$EndComp
$Comp
L power:VCC #PWR0172
U 1 1 61118E2C
P 2650 5750
F 0 "#PWR0172" H 2650 5600 50  0001 C CNN
F 1 "VCC" H 2665 5923 50  0000 C CNN
F 2 "" H 2650 5750 50  0001 C CNN
F 3 "" H 2650 5750 50  0001 C CNN
	1    2650 5750
	1    0    0    -1  
$EndComp
$Comp
L power:GND #PWR0173
U 1 1 61118E32
P 5750 4000
F 0 "#PWR0173" H 5750 3750 50  0001 C CNN
F 1 "GND" H 5755 3827 50  0001 C CNN
F 2 "" H 5750 4000 50  0001 C CNN
F 3 "" H 5750 4000 50  0001 C CNN
	1    5750 4000
	1    0    0    -1  
$EndComp
$Comp
L A5C:OR02 UBG73
U 1 1 7680C493
P 1600 2100
AR Path="/60F0D3B3/611C3AC2/7680C493" Ref="UBG73"  Part="1" 
AR Path="/611EDEE5/7680C493" Ref="UBG73"  Part="1" 
AR Path="/612FA445/612FA810/7680C493" Ref="UBG73"  Part="1" 
F 0 "UBG73" H 1625 2367 50  0000 C CNN
F 1 "OR02" H 1625 2276 50  0000 C CNN
F 2 "" H 1650 2100 50  0001 C CNN
F 3 "" H 1650 2100 50  0001 C CNN
	1    1600 2100
	1    0    0    -1  
$EndComp
$Comp
L A5C:HA1 UEC312
U 1 1 61118E35
P 4750 5500
AR Path="/60F0D3B3/611C3AC2/61118E35" Ref="UEC312"  Part="1" 
AR Path="/611EDEE5/61118E35" Ref="UEC312"  Part="1" 
AR Path="/612FA445/612FA810/61118E35" Ref="UEC312"  Part="1" 
F 0 "UEC312" H 4750 5865 50  0000 C CNN
F 1 "HA1" H 4750 5774 50  0000 C CNN
F 2 "" H 4700 5500 50  0001 C CNN
F 3 "" H 4700 5500 50  0001 C CNN
	1    4750 5500
	1    0    0    -1  
$EndComp
$Comp
L A5C:FA2 UED315
U 1 1 61118E34
P 4850 4750
AR Path="/60F0D3B3/611C3AC2/61118E34" Ref="UED315"  Part="1" 
AR Path="/611EDEE5/61118E34" Ref="UED315"  Part="1" 
AR Path="/612FA445/612FA810/61118E34" Ref="UED315"  Part="1" 
F 0 "UED315" H 4850 5315 50  0000 C CNN
F 1 "FA2" H 4850 5224 50  0000 C CNN
F 2 "" H 4700 4950 50  0001 C CNN
F 3 "" H 4700 4950 50  0001 C CNN
	1    4850 4750
	1    0    0    -1  
$EndComp
$Comp
L A5C:M175CL UBH104
U 1 1 61118E37
P 3250 1900
AR Path="/60F0D3B3/611C3AC2/61118E37" Ref="UBH104"  Part="1" 
AR Path="/611EDEE5/61118E37" Ref="UBH104"  Part="1" 
AR Path="/612FA445/612FA810/61118E37" Ref="UBH104"  Part="1" 
F 0 "UBH104" H 3250 2465 50  0000 C CNN
F 1 "M175CL" H 3250 2374 50  0000 C CNN
F 2 "" H 3250 1700 50  0001 C CNN
F 3 "" H 3250 1700 50  0001 C CNN
	1    3250 1900
	1    0    0    -1  
$EndComp
$Comp
L A5C:M175CL UEH306
U 1 1 61118E38
P 3250 2950
AR Path="/60F0D3B3/611C3AC2/61118E38" Ref="UEH306"  Part="1" 
AR Path="/611EDEE5/61118E38" Ref="UEH306"  Part="1" 
AR Path="/612FA445/612FA810/61118E38" Ref="UEH306"  Part="1" 
F 0 "UEH306" H 3250 3515 50  0000 C CNN
F 1 "M175CL" H 3250 3424 50  0000 C CNN
F 2 "" H 3250 2750 50  0001 C CNN
F 3 "" H 3250 2750 50  0001 C CNN
	1    3250 2950
	1    0    0    -1  
$EndComp
$Comp
L A5C:M175C UEE311
U 1 1 61118E30
P 3250 4000
AR Path="/60F0D3B3/611C3AC2/61118E30" Ref="UEE311"  Part="1" 
AR Path="/611EDEE5/61118E30" Ref="UEE311"  Part="1" 
AR Path="/612FA445/612FA810/61118E30" Ref="UEE311"  Part="1" 
F 0 "UEE311" H 3250 4565 50  0000 C CNN
F 1 "M175C" H 3250 4474 50  0000 C CNN
F 2 "" H 3250 3800 50  0001 C CNN
F 3 "" H 3250 3800 50  0001 C CNN
	1    3250 4000
	1    0    0    -1  
$EndComp
$Comp
L A5C:M367C UBH130
U 1 1 61118E39
P 6250 1850
AR Path="/60F0D3B3/611C3AC2/61118E39" Ref="UBH130"  Part="1" 
AR Path="/611EDEE5/61118E39" Ref="UBH130"  Part="1" 
AR Path="/612FA445/612FA810/61118E39" Ref="UBH130"  Part="1" 
F 0 "UBH130" H 6250 2365 50  0000 C CNN
F 1 "M367C" H 6250 2274 50  0000 C CNN
F 2 "" H 6550 1650 50  0001 C CNN
F 3 "" H 6550 1650 50  0001 C CNN
	1    6250 1850
	1    0    0    -1  
$EndComp
$Comp
L A5C:M368C UEC?
U 1 1 61118E3A
P 6250 2900
AR Path="/604B5523/61118E3A" Ref="UEC?"  Part="1" 
AR Path="/61118E3A" Ref="UEJ328"  Part="1" 
AR Path="/60F0D3B3/61118E3A" Ref="UEJ328"  Part="1" 
AR Path="/60F0D3B3/611C3AC2/61118E3A" Ref="UEJ328"  Part="1" 
AR Path="/611EDEE5/61118E3A" Ref="UEJ328"  Part="1" 
AR Path="/612FA445/612FA810/61118E3A" Ref="UEJ328"  Part="1" 
F 0 "UEJ328" H 6250 3410 50  0000 C CNN
F 1 "M368C" H 6250 3320 50  0000 C CNN
F 2 "" H 6550 2700 50  0001 C CNN
F 3 "" H 6550 2700 50  0001 C CNN
	1    6250 2900
	1    0    0    -1  
$EndComp
$Comp
L A5C:M367C UEF324
U 1 1 61118E31
P 6250 3950
AR Path="/60F0D3B3/611C3AC2/61118E31" Ref="UEF324"  Part="1" 
AR Path="/611EDEE5/61118E31" Ref="UEF324"  Part="1" 
AR Path="/612FA445/612FA810/61118E31" Ref="UEF324"  Part="1" 
F 0 "UEF324" H 6250 4465 50  0000 C CNN
F 1 "M367C" H 6250 4374 50  0000 C CNN
F 2 "" H 6550 3750 50  0001 C CNN
F 3 "" H 6550 3750 50  0001 C CNN
	1    6250 3950
	1    0    0    -1  
$EndComp
$Comp
L A5C:M367C UEC316
U 1 1 61118E33
P 6250 4850
AR Path="/60F0D3B3/611C3AC2/61118E33" Ref="UEC316"  Part="1" 
AR Path="/611EDEE5/61118E33" Ref="UEC316"  Part="1" 
AR Path="/612FA445/612FA810/61118E33" Ref="UEC316"  Part="1" 
F 0 "UEC316" H 6250 5365 50  0000 C CNN
F 1 "M367C" H 6250 5274 50  0000 C CNN
F 2 "" H 6550 4650 50  0001 C CNN
F 3 "" H 6550 4650 50  0001 C CNN
	1    6250 4850
	1    0    0    -1  
$EndComp
$Comp
L A5C:M368C UBF155
U 1 1 682BF1CC
P 9750 1850
AR Path="/60F0D3B3/611C3AC2/682BF1CC" Ref="UBF155"  Part="1" 
AR Path="/611EDEE5/682BF1CC" Ref="UBF155"  Part="1" 
AR Path="/612FA445/612FA810/682BF1CC" Ref="UBF155"  Part="1" 
F 0 "UBF155" H 9750 2365 50  0000 C CNN
F 1 "M368C" H 9750 2274 50  0000 C CNN
F 2 "" H 10050 1650 50  0001 C CNN
F 3 "" H 10050 1650 50  0001 C CNN
	1    9750 1850
	1    0    0    -1  
$EndComp
$Comp
L A5C:M368C UBC122
U 1 1 7B57DDF1
P 9750 2750
AR Path="/60F0D3B3/611C3AC2/7B57DDF1" Ref="UBC122"  Part="1" 
AR Path="/611EDEE5/7B57DDF1" Ref="UBC122"  Part="1" 
AR Path="/612FA445/612FA810/7B57DDF1" Ref="UBC122"  Part="1" 
F 0 "UBC122" H 9750 3265 50  0000 C CNN
F 1 "M368C" H 9750 3174 50  0000 C CNN
F 2 "" H 10050 2550 50  0001 C CNN
F 3 "" H 10050 2550 50  0001 C CNN
	1    9750 2750
	1    0    0    -1  
$EndComp
$Comp
L A5C:M175CLH UEK263
U 1 1 61118E2D
P 3250 5150
AR Path="/60F0D3B3/611C3AC2/61118E2D" Ref="UEK263"  Part="1" 
AR Path="/611EDEE5/61118E2D" Ref="UEK263"  Part="1" 
AR Path="/612FA445/612FA810/61118E2D" Ref="UEK263"  Part="1" 
F 0 "UEK263" H 3250 5715 50  0000 C CNN
F 1 "M175CLH" H 3250 5624 50  0000 C CNN
F 2 "" H 3250 4950 50  0001 C CNN
F 3 "" H 3250 4950 50  0001 C CNN
	1    3250 5150
	1    0    0    -1  
$EndComp
Wire Bus Line
	2900 6150 2900 6550
Wire Bus Line
	8550 1700 8550 3050
Wire Bus Line
	10800 1700 10800 5300
Wire Bus Line
	7300 1700 7300 5300
Wire Bus Line
	2150 1350 2150 5050
$EndSCHEMATC
