EESchema Schematic File Version 4
EELAYER 30 0
EELAYER END
$Descr A3 16535 11693
encoding utf-8
Sheet 66 69
Title ""
Date "2020-11-26"
Rev ""
Comp ""
Comment1 "Licence: CC-BY"
Comment2 "Author: Loïc *WydD* Petit"
Comment3 ""
Comment4 ""
$EndDescr
Connection ~ 6100 2750
Connection ~ 6100 4300
Connection ~ 8700 2750
Connection ~ 8700 4300
Connection ~ 4550 6550
Connection ~ 8700 6550
Connection ~ 8700 8100
Connection ~ 11300 6550
Connection ~ 11300 8100
Connection ~ 12800 4800
Connection ~ 7600 4800
Connection ~ 10200 4800
Connection ~ 10200 8600
Connection ~ 6000 4500
Connection ~ 8600 4500
Connection ~ 8600 6750
Connection ~ 11200 6750
Connection ~ 11200 4500
Connection ~ 8600 4900
Connection ~ 6000 4900
Connection ~ 3400 4500
Connection ~ 11300 2750
Connection ~ 11300 4300
Connection ~ 3500 2750
Connection ~ 3500 4300
Connection ~ 11300 7500
Connection ~ 11300 7600
Connection ~ 11300 5950
Connection ~ 11300 6050
Connection ~ 11300 6150
Connection ~ 11300 6250
Connection ~ 11300 5850
Connection ~ 11300 7400
Connection ~ 11200 4900
Connection ~ 5900 4600
Connection ~ 8500 4600
Connection ~ 11100 4600
Connection ~ 4350 6850
Connection ~ 8500 6850
Connection ~ 11100 6850
Connection ~ 3300 4600
Connection ~ 4550 7600
Connection ~ 4550 7700
Connection ~ 8300 7600
Connection ~ 8300 7500
Connection ~ 8400 7900
Connection ~ 11300 7700
Connection ~ 4450 6750
Connection ~ 4450 4900
Connection ~ 4550 7500
Connection ~ 4550 8100
Connection ~ 3500 4200
Connection ~ 6100 4200
Connection ~ 8700 4200
Connection ~ 11300 4200
NoConn ~ 4500 2650
NoConn ~ 4500 2750
NoConn ~ 4500 4200
NoConn ~ 4500 4300
NoConn ~ 7100 2650
NoConn ~ 7100 2750
NoConn ~ 7100 4200
NoConn ~ 7100 4300
NoConn ~ 9700 2650
NoConn ~ 9700 2750
NoConn ~ 9700 4200
NoConn ~ 9700 4300
NoConn ~ 12300 2650
NoConn ~ 12300 2750
NoConn ~ 12300 4200
NoConn ~ 12300 4300
NoConn ~ 5550 6450
NoConn ~ 5550 6550
NoConn ~ 5550 8000
NoConn ~ 5550 8100
NoConn ~ 9700 6450
NoConn ~ 9700 6550
NoConn ~ 9700 8000
NoConn ~ 9700 8100
NoConn ~ 12300 6450
NoConn ~ 12300 6550
NoConn ~ 12300 8000
NoConn ~ 12300 8100
NoConn ~ 4200 6550
NoConn ~ 8350 6550
Entry Wire Line
	2650 1950 2750 2050
Entry Wire Line
	2650 2050 2750 2150
Entry Wire Line
	2650 2150 2750 2250
Entry Wire Line
	2650 2250 2750 2350
Entry Wire Line
	2650 2350 2750 2450
Entry Wire Line
	2650 2450 2750 2550
Entry Wire Line
	2650 3500 2750 3600
Entry Wire Line
	2650 3600 2750 3700
Entry Wire Line
	2650 3700 2750 3800
Entry Wire Line
	2650 4000 2750 3900
Entry Wire Line
	2650 4100 2750 4000
Entry Wire Line
	2650 4800 2750 4900
Entry Wire Line
	2650 4900 2750 5000
Entry Wire Line
	2650 5000 2750 5100
Entry Wire Line
	2650 5100 2750 5200
Entry Wire Line
	2650 5200 2750 5300
Entry Wire Line
	2650 5300 2750 5400
Entry Wire Line
	2650 5400 2750 5500
Entry Wire Line
	2650 5750 2750 5850
Entry Wire Line
	2650 5850 2750 5950
Entry Wire Line
	2650 5950 2750 6050
Entry Wire Line
	2650 6050 2750 6150
Entry Wire Line
	2650 6150 2750 6250
Entry Wire Line
	2650 6250 2750 6350
Entry Wire Line
	2650 6350 2750 6450
Entry Wire Line
	4900 2050 5000 2150
Entry Wire Line
	4900 2150 5000 2250
Entry Wire Line
	4900 2250 5000 2350
Entry Wire Line
	4900 2350 5000 2450
Entry Wire Line
	4900 2450 5000 2550
Entry Wire Line
	4900 2550 5000 2650
Entry Wire Line
	4900 3600 5000 3700
Entry Wire Line
	4900 3700 5000 3800
Entry Wire Line
	4900 3800 5000 3900
Entry Wire Line
	4900 3900 5000 4000
Entry Wire Line
	4900 4000 5000 4100
Entry Wire Line
	4900 4100 5000 4200
Entry Wire Line
	5250 1950 5350 2050
Entry Wire Line
	5250 2050 5350 2150
Entry Wire Line
	5250 2150 5350 2250
Entry Wire Line
	5250 2250 5350 2350
Entry Wire Line
	5250 2350 5350 2450
Entry Wire Line
	5250 2450 5350 2550
Entry Wire Line
	5250 3500 5350 3600
Entry Wire Line
	5250 3600 5350 3700
Entry Wire Line
	5250 3700 5350 3800
Entry Wire Line
	5250 4000 5350 3900
Entry Wire Line
	5250 4100 5350 4000
Entry Wire Line
	5950 5850 6050 5950
Entry Wire Line
	5950 5950 6050 6050
Entry Wire Line
	5950 6050 6050 6150
Entry Wire Line
	5950 6150 6050 6250
Entry Wire Line
	5950 6250 6050 6350
Entry Wire Line
	5950 6350 6050 6450
Entry Wire Line
	5950 7400 6050 7500
Entry Wire Line
	5950 7500 6050 7600
Entry Wire Line
	5950 7600 6050 7700
Entry Wire Line
	5950 7700 6050 7800
Entry Wire Line
	5950 7800 6050 7900
Entry Wire Line
	5950 7900 6050 8000
Entry Wire Line
	6800 5750 6900 5850
Entry Wire Line
	6800 5850 6900 5950
Entry Wire Line
	6800 5950 6900 6050
Entry Wire Line
	6800 6050 6900 6150
Entry Wire Line
	6800 6150 6900 6250
Entry Wire Line
	6800 6250 6900 6350
Entry Wire Line
	6800 6350 6900 6450
Entry Wire Line
	7500 2050 7600 2150
Entry Wire Line
	7500 2150 7600 2250
Entry Wire Line
	7500 2250 7600 2350
Entry Wire Line
	7500 2350 7600 2450
Entry Wire Line
	7500 2450 7600 2550
Entry Wire Line
	7500 2550 7600 2650
Entry Wire Line
	7500 3600 7600 3700
Entry Wire Line
	7500 3700 7600 3800
Entry Wire Line
	7500 3800 7600 3900
Entry Wire Line
	7500 3900 7600 4000
Entry Wire Line
	7500 4000 7600 4100
Entry Wire Line
	7500 4100 7600 4200
Entry Wire Line
	7850 1950 7950 2050
Entry Wire Line
	7850 2050 7950 2150
Entry Wire Line
	7850 2150 7950 2250
Entry Wire Line
	7850 2250 7950 2350
Entry Wire Line
	7850 2350 7950 2450
Entry Wire Line
	7850 2450 7950 2550
Entry Wire Line
	7850 3500 7950 3600
Entry Wire Line
	7850 3600 7950 3700
Entry Wire Line
	7850 3700 7950 3800
Entry Wire Line
	7850 4000 7950 3900
Entry Wire Line
	7850 4100 7950 4000
Entry Wire Line
	10100 2050 10200 2150
Entry Wire Line
	10100 2150 10200 2250
Entry Wire Line
	10100 2250 10200 2350
Entry Wire Line
	10100 2350 10200 2450
Entry Wire Line
	10100 2450 10200 2550
Entry Wire Line
	10100 2550 10200 2650
Entry Wire Line
	10100 3600 10200 3700
Entry Wire Line
	10100 3700 10200 3800
Entry Wire Line
	10100 3800 10200 3900
Entry Wire Line
	10100 3900 10200 4000
Entry Wire Line
	10100 4000 10200 4100
Entry Wire Line
	10100 4100 10200 4200
Entry Wire Line
	10100 5850 10200 5950
Entry Wire Line
	10100 5950 10200 6050
Entry Wire Line
	10100 6050 10200 6150
Entry Wire Line
	10100 6150 10200 6250
Entry Wire Line
	10100 6250 10200 6350
Entry Wire Line
	10100 6350 10200 6450
Entry Wire Line
	10100 7400 10200 7500
Entry Wire Line
	10100 7500 10200 7600
Entry Wire Line
	10100 7600 10200 7700
Entry Wire Line
	10100 7700 10200 7800
Entry Wire Line
	10100 7800 10200 7900
Entry Wire Line
	10100 7900 10200 8000
Entry Wire Line
	10450 1950 10550 2050
Entry Wire Line
	10450 2050 10550 2150
Entry Wire Line
	10450 2150 10550 2250
Entry Wire Line
	10450 2250 10550 2350
Entry Wire Line
	10450 2350 10550 2450
Entry Wire Line
	10450 2450 10550 2550
Entry Wire Line
	10450 3500 10550 3600
Entry Wire Line
	10450 3600 10550 3700
Entry Wire Line
	10450 3700 10550 3800
Entry Wire Line
	10450 4000 10550 3900
Entry Wire Line
	10450 4100 10550 4000
Entry Wire Line
	12700 2050 12800 2150
Entry Wire Line
	12700 2150 12800 2250
Entry Wire Line
	12700 2250 12800 2350
Entry Wire Line
	12700 2350 12800 2450
Entry Wire Line
	12700 2450 12800 2550
Entry Wire Line
	12700 2550 12800 2650
Entry Wire Line
	12700 3600 12800 3700
Entry Wire Line
	12700 3700 12800 3800
Entry Wire Line
	12700 3800 12800 3900
Entry Wire Line
	12700 3900 12800 4000
Entry Wire Line
	12700 4000 12800 4100
Entry Wire Line
	12700 4100 12800 4200
Entry Wire Line
	12700 5850 12800 5950
Entry Wire Line
	12700 5950 12800 6050
Entry Wire Line
	12700 6050 12800 6150
Entry Wire Line
	12700 6150 12800 6250
Entry Wire Line
	12700 6250 12800 6350
Entry Wire Line
	12700 6350 12800 6450
Entry Wire Line
	12700 7400 12800 7500
Entry Wire Line
	12700 7500 12800 7600
Entry Wire Line
	12700 7600 12800 7700
Entry Wire Line
	12700 7700 12800 7800
Entry Wire Line
	12700 7800 12800 7900
Entry Wire Line
	12700 7900 12800 8000
Wire Wire Line
	2750 2050 3500 2050
Wire Wire Line
	2750 2150 3500 2150
Wire Wire Line
	2750 2250 3500 2250
Wire Wire Line
	2750 2350 3500 2350
Wire Wire Line
	2750 2450 3500 2450
Wire Wire Line
	2750 2550 3500 2550
Wire Wire Line
	2750 3600 3500 3600
Wire Wire Line
	2750 3700 3500 3700
Wire Wire Line
	2750 3800 3500 3800
Wire Wire Line
	2750 3900 3500 3900
Wire Wire Line
	2750 4000 3500 4000
Wire Wire Line
	2750 4900 3300 4900
Wire Wire Line
	2750 5000 5900 5000
Wire Wire Line
	2750 5100 8500 5100
Wire Wire Line
	2750 5200 11100 5200
Wire Wire Line
	2750 5300 4350 5300
Wire Wire Line
	2750 5400 8500 5400
Wire Wire Line
	2750 5500 11100 5500
Wire Wire Line
	2750 5850 3200 5850
Wire Wire Line
	2750 5950 3200 5950
Wire Wire Line
	2750 6050 3200 6050
Wire Wire Line
	2750 6150 3200 6150
Wire Wire Line
	2750 6250 3200 6250
Wire Wire Line
	2750 6350 3200 6350
Wire Wire Line
	2750 6450 3200 6450
Wire Wire Line
	2900 4500 3400 4500
Wire Wire Line
	3300 3050 3500 3050
Wire Wire Line
	3300 4600 3300 3050
Wire Wire Line
	3300 4600 3300 4900
Wire Wire Line
	3400 2950 3400 4500
Wire Wire Line
	3400 4500 3500 4500
Wire Wire Line
	3400 4900 3400 4500
Wire Wire Line
	3500 2650 3500 2750
Wire Wire Line
	3500 2950 3400 2950
Wire Wire Line
	3500 4100 3500 4200
Wire Wire Line
	3500 4200 3500 4300
Wire Wire Line
	3500 4600 3300 4600
Wire Wire Line
	4200 5850 4550 5850
Wire Wire Line
	4200 5950 4550 5950
Wire Wire Line
	4200 6050 4550 6050
Wire Wire Line
	4200 6150 4550 6150
Wire Wire Line
	4200 6250 4550 6250
Wire Wire Line
	4200 6350 4550 6350
Wire Wire Line
	4200 6450 4250 6450
Wire Wire Line
	4250 6450 4250 7400
Wire Wire Line
	4250 7400 4550 7400
Wire Wire Line
	4250 7500 4550 7500
Wire Wire Line
	4250 7900 4550 7900
Wire Wire Line
	4350 6850 4350 5300
Wire Wire Line
	4350 6850 4550 6850
Wire Wire Line
	4350 8400 4350 6850
Wire Wire Line
	4450 4900 3400 4900
Wire Wire Line
	4450 6750 4450 4900
Wire Wire Line
	4450 6750 4450 8300
Wire Wire Line
	4450 8300 4550 8300
Wire Wire Line
	4500 2050 4900 2050
Wire Wire Line
	4500 2150 4900 2150
Wire Wire Line
	4500 2250 4900 2250
Wire Wire Line
	4500 2350 4900 2350
Wire Wire Line
	4500 2450 4900 2450
Wire Wire Line
	4500 2550 4900 2550
Wire Wire Line
	4500 3600 4900 3600
Wire Wire Line
	4500 3700 4900 3700
Wire Wire Line
	4500 3800 4900 3800
Wire Wire Line
	4500 3900 4900 3900
Wire Wire Line
	4500 4000 4900 4000
Wire Wire Line
	4500 4100 4900 4100
Wire Wire Line
	4550 6450 4550 6550
Wire Wire Line
	4550 6750 4450 6750
Wire Wire Line
	4550 7500 4550 7600
Wire Wire Line
	4550 7600 4550 7700
Wire Wire Line
	4550 7700 4550 7800
Wire Wire Line
	4550 8000 4550 8100
Wire Wire Line
	4550 8400 4350 8400
Wire Wire Line
	5350 2050 6100 2050
Wire Wire Line
	5350 2150 6100 2150
Wire Wire Line
	5350 2250 6100 2250
Wire Wire Line
	5350 2350 6100 2350
Wire Wire Line
	5350 2450 6100 2450
Wire Wire Line
	5350 2550 6100 2550
Wire Wire Line
	5350 3600 6100 3600
Wire Wire Line
	5350 3700 6100 3700
Wire Wire Line
	5350 3800 6100 3800
Wire Wire Line
	5350 3900 6100 3900
Wire Wire Line
	5350 4000 6100 4000
Wire Wire Line
	5550 5850 5950 5850
Wire Wire Line
	5550 5950 5950 5950
Wire Wire Line
	5550 6050 5950 6050
Wire Wire Line
	5550 6150 5950 6150
Wire Wire Line
	5550 6250 5950 6250
Wire Wire Line
	5550 6350 5950 6350
Wire Wire Line
	5550 7400 5950 7400
Wire Wire Line
	5550 7500 5950 7500
Wire Wire Line
	5550 7600 5950 7600
Wire Wire Line
	5550 7700 5950 7700
Wire Wire Line
	5550 7800 5950 7800
Wire Wire Line
	5550 7900 5950 7900
Wire Wire Line
	5900 3050 6100 3050
Wire Wire Line
	5900 4600 5900 3050
Wire Wire Line
	5900 4600 5900 5000
Wire Wire Line
	6000 2950 6000 4500
Wire Wire Line
	6000 4500 6100 4500
Wire Wire Line
	6000 4900 4450 4900
Wire Wire Line
	6000 4900 6000 4500
Wire Wire Line
	6100 2650 6100 2750
Wire Wire Line
	6100 2950 6000 2950
Wire Wire Line
	6100 4100 6100 4200
Wire Wire Line
	6100 4200 6100 4300
Wire Wire Line
	6100 4600 5900 4600
Wire Wire Line
	6900 5850 7350 5850
Wire Wire Line
	6900 5950 7350 5950
Wire Wire Line
	6900 6050 7350 6050
Wire Wire Line
	6900 6150 7350 6150
Wire Wire Line
	6900 6250 7350 6250
Wire Wire Line
	6900 6350 7350 6350
Wire Wire Line
	6900 6450 7350 6450
Wire Wire Line
	7100 2050 7500 2050
Wire Wire Line
	7100 2150 7500 2150
Wire Wire Line
	7100 2250 7500 2250
Wire Wire Line
	7100 2350 7500 2350
Wire Wire Line
	7100 2450 7500 2450
Wire Wire Line
	7100 2550 7500 2550
Wire Wire Line
	7100 3600 7500 3600
Wire Wire Line
	7100 3700 7500 3700
Wire Wire Line
	7100 3800 7500 3800
Wire Wire Line
	7100 3900 7500 3900
Wire Wire Line
	7100 4000 7500 4000
Wire Wire Line
	7100 4100 7500 4100
Wire Wire Line
	7950 2050 8700 2050
Wire Wire Line
	7950 2150 8700 2150
Wire Wire Line
	7950 2250 8700 2250
Wire Wire Line
	7950 2350 8700 2350
Wire Wire Line
	7950 2450 8700 2450
Wire Wire Line
	7950 2550 8700 2550
Wire Wire Line
	7950 3600 8700 3600
Wire Wire Line
	7950 3700 8700 3700
Wire Wire Line
	7950 3800 8700 3800
Wire Wire Line
	7950 3900 8700 3900
Wire Wire Line
	7950 4000 8700 4000
Wire Wire Line
	8150 7500 8300 7500
Wire Wire Line
	8150 7900 8400 7900
Wire Wire Line
	8300 7500 8700 7500
Wire Wire Line
	8300 7600 8300 7500
Wire Wire Line
	8300 7800 8300 7600
Wire Wire Line
	8350 5850 8700 5850
Wire Wire Line
	8350 5950 8700 5950
Wire Wire Line
	8350 6050 8700 6050
Wire Wire Line
	8350 6150 8700 6150
Wire Wire Line
	8350 6250 8700 6250
Wire Wire Line
	8350 6350 8700 6350
Wire Wire Line
	8350 6450 8400 6450
Wire Wire Line
	8400 6450 8400 7400
Wire Wire Line
	8400 7400 8700 7400
Wire Wire Line
	8400 7700 8700 7700
Wire Wire Line
	8400 7900 8400 7700
Wire Wire Line
	8500 3050 8700 3050
Wire Wire Line
	8500 4600 8500 3050
Wire Wire Line
	8500 4600 8500 5100
Wire Wire Line
	8500 5400 8500 6850
Wire Wire Line
	8500 6850 8700 6850
Wire Wire Line
	8500 8400 8500 6850
Wire Wire Line
	8600 2950 8600 4500
Wire Wire Line
	8600 4500 8600 4900
Wire Wire Line
	8600 4500 8700 4500
Wire Wire Line
	8600 4900 6000 4900
Wire Wire Line
	8600 4900 8600 6750
Wire Wire Line
	8600 6750 8600 8300
Wire Wire Line
	8600 8300 8700 8300
Wire Wire Line
	8700 2650 8700 2750
Wire Wire Line
	8700 2950 8600 2950
Wire Wire Line
	8700 4100 8700 4200
Wire Wire Line
	8700 4200 8700 4300
Wire Wire Line
	8700 4600 8500 4600
Wire Wire Line
	8700 6450 8700 6550
Wire Wire Line
	8700 6750 8600 6750
Wire Wire Line
	8700 7600 8300 7600
Wire Wire Line
	8700 7800 8300 7800
Wire Wire Line
	8700 7900 8400 7900
Wire Wire Line
	8700 8000 8700 8100
Wire Wire Line
	8700 8400 8500 8400
Wire Wire Line
	9700 2050 10100 2050
Wire Wire Line
	9700 2150 10100 2150
Wire Wire Line
	9700 2250 10100 2250
Wire Wire Line
	9700 2350 10100 2350
Wire Wire Line
	9700 2450 10100 2450
Wire Wire Line
	9700 2550 10100 2550
Wire Wire Line
	9700 3600 10100 3600
Wire Wire Line
	9700 3700 10100 3700
Wire Wire Line
	9700 3800 10100 3800
Wire Wire Line
	9700 3900 10100 3900
Wire Wire Line
	9700 4000 10100 4000
Wire Wire Line
	9700 4100 10100 4100
Wire Wire Line
	9700 5850 10100 5850
Wire Wire Line
	9700 5950 10100 5950
Wire Wire Line
	9700 6050 10100 6050
Wire Wire Line
	9700 6150 10100 6150
Wire Wire Line
	9700 6250 10100 6250
Wire Wire Line
	9700 6350 10100 6350
Wire Wire Line
	9700 7400 10100 7400
Wire Wire Line
	9700 7500 10100 7500
Wire Wire Line
	9700 7600 10100 7600
Wire Wire Line
	9700 7700 10100 7700
Wire Wire Line
	9700 7800 10100 7800
Wire Wire Line
	9700 7900 10100 7900
Wire Wire Line
	10550 2050 11300 2050
Wire Wire Line
	10550 2150 11300 2150
Wire Wire Line
	10550 2250 11300 2250
Wire Wire Line
	10550 2350 11300 2350
Wire Wire Line
	10550 2450 11300 2450
Wire Wire Line
	10550 2550 11300 2550
Wire Wire Line
	10550 3600 11300 3600
Wire Wire Line
	10550 3700 11300 3700
Wire Wire Line
	10550 3800 11300 3800
Wire Wire Line
	10550 3900 11300 3900
Wire Wire Line
	10550 4000 11300 4000
Wire Wire Line
	11100 3050 11300 3050
Wire Wire Line
	11100 4600 11100 3050
Wire Wire Line
	11100 4600 11100 5200
Wire Wire Line
	11100 5500 11100 6850
Wire Wire Line
	11100 6850 11300 6850
Wire Wire Line
	11100 8400 11100 6850
Wire Wire Line
	11200 2950 11200 4500
Wire Wire Line
	11200 4500 11300 4500
Wire Wire Line
	11200 4900 8600 4900
Wire Wire Line
	11200 4900 11200 4500
Wire Wire Line
	11200 4900 11200 6750
Wire Wire Line
	11200 6750 11200 8300
Wire Wire Line
	11200 8300 11300 8300
Wire Wire Line
	11250 7700 11300 7700
Wire Wire Line
	11250 7900 11250 7700
Wire Wire Line
	11300 2650 11300 2750
Wire Wire Line
	11300 2950 11200 2950
Wire Wire Line
	11300 4100 11300 4200
Wire Wire Line
	11300 4200 11300 4300
Wire Wire Line
	11300 4600 11100 4600
Wire Wire Line
	11300 5950 11300 5850
Wire Wire Line
	11300 6050 11300 5950
Wire Wire Line
	11300 6150 11300 6050
Wire Wire Line
	11300 6250 11300 6150
Wire Wire Line
	11300 6350 11300 6250
Wire Wire Line
	11300 6450 11300 6550
Wire Wire Line
	11300 6750 11200 6750
Wire Wire Line
	11300 7500 11300 7400
Wire Wire Line
	11300 7600 11300 7500
Wire Wire Line
	11300 7700 11300 7600
Wire Wire Line
	11300 7800 10900 7800
Wire Wire Line
	11300 7900 11250 7900
Wire Wire Line
	11300 8000 11300 8100
Wire Wire Line
	11300 8400 11100 8400
Wire Wire Line
	12300 2050 12700 2050
Wire Wire Line
	12300 2150 12700 2150
Wire Wire Line
	12300 2250 12700 2250
Wire Wire Line
	12300 2350 12700 2350
Wire Wire Line
	12300 2450 12700 2450
Wire Wire Line
	12300 2550 12700 2550
Wire Wire Line
	12300 3600 12700 3600
Wire Wire Line
	12300 3700 12700 3700
Wire Wire Line
	12300 3800 12700 3800
Wire Wire Line
	12300 3900 12700 3900
Wire Wire Line
	12300 4000 12700 4000
Wire Wire Line
	12300 4100 12700 4100
Wire Wire Line
	12300 5850 12700 5850
Wire Wire Line
	12300 5950 12700 5950
Wire Wire Line
	12300 6050 12700 6050
Wire Wire Line
	12300 6150 12700 6150
Wire Wire Line
	12300 6250 12700 6250
Wire Wire Line
	12300 6350 12700 6350
Wire Wire Line
	12300 7400 12700 7400
Wire Wire Line
	12300 7500 12700 7500
Wire Wire Line
	12300 7600 12700 7600
Wire Wire Line
	12300 7700 12700 7700
Wire Wire Line
	12300 7800 12700 7800
Wire Wire Line
	12300 7900 12700 7900
Wire Bus Line
	2650 1800 2450 1800
Wire Bus Line
	2650 4650 2500 4650
Wire Bus Line
	2650 5600 2450 5600
Wire Bus Line
	2700 4200 2650 4200
Wire Bus Line
	5000 4800 7600 4800
Wire Bus Line
	5250 1800 5050 1800
Wire Bus Line
	5300 4200 5250 4200
Wire Bus Line
	6050 8600 10200 8600
Wire Bus Line
	6600 5600 6800 5600
Wire Bus Line
	7600 4800 10200 4800
Wire Bus Line
	7850 1800 7650 1800
Wire Bus Line
	7900 4200 7850 4200
Wire Bus Line
	10200 4800 12800 4800
Wire Bus Line
	10200 8600 12800 8600
Wire Bus Line
	10250 1800 10450 1800
Wire Bus Line
	10500 4200 10450 4200
Wire Bus Line
	12800 4800 13000 4800
Text Notes 3050 7150 0    50   ~ 0
STARS1, PALETTE ADDRESS\n1000 0xxx xxxx
Text Notes 7300 7150 0    50   ~ 0
STARS2, PALETTE ADDRESS\n1010 0xxx xxxx
Text Notes 10400 7200 0    50   ~ 0
1011 1111 1111
Text Label 2800 2050 0    50   ~ 0
ROW1-D0
Text Label 2800 2150 0    50   ~ 0
ROW1-D1
Text Label 2800 2250 0    50   ~ 0
ROW1-D2
Text Label 2800 2350 0    50   ~ 0
ROW1-D3
Text Label 2800 2450 0    50   ~ 0
ROW1-D4
Text Label 2800 2550 0    50   ~ 0
ROW1-D5
Text Label 2800 3600 0    50   ~ 0
ROW1-D6
Text Label 2800 3700 0    50   ~ 0
ROW1-D7
Text Label 2800 3800 0    50   ~ 0
ROW1-D8
Text Label 2800 3900 0    50   ~ 0
ROW1-S0
Text Label 2800 4000 0    50   ~ 0
ROW1-S1
Text Label 2800 5850 0    50   ~ 0
ROW5-D0
Text Label 2800 5950 0    50   ~ 0
ROW5-D1
Text Label 2800 6050 0    50   ~ 0
ROW5-D2
Text Label 2800 6150 0    50   ~ 0
ROW5-D3
Text Label 2800 6250 0    50   ~ 0
ROW5-D4
Text Label 2800 6350 0    50   ~ 0
ROW5-D5
Text Label 2800 6450 0    50   ~ 0
ROW5-D6
Text Label 2850 4900 0    50   ~ 0
~E1
Text Label 2850 5000 0    50   ~ 0
~E2
Text Label 2850 5100 0    50   ~ 0
~E3
Text Label 2850 5200 0    50   ~ 0
~E4
Text Label 2850 5300 0    50   ~ 0
~E5
Text Label 2850 5400 0    50   ~ 0
~E6
Text Label 2850 5500 0    50   ~ 0
~E7
Text Label 4600 2050 0    50   ~ 0
OUT0
Text Label 4600 2150 0    50   ~ 0
OUT1
Text Label 4600 2250 0    50   ~ 0
OUT2
Text Label 4600 2350 0    50   ~ 0
OUT3
Text Label 4600 2450 0    50   ~ 0
OUT4
Text Label 4600 2550 0    50   ~ 0
OUT5
Text Label 4600 3600 0    50   ~ 0
OUT6
Text Label 4600 3700 0    50   ~ 0
OUT7
Text Label 4600 3800 0    50   ~ 0
OUT8
Text Label 4600 3900 0    50   ~ 0
OUT9
Text Label 4600 4000 0    50   ~ 0
OUT10
Text Label 4600 4100 0    50   ~ 0
OUT11
Text Label 5400 2050 0    50   ~ 0
ROW2-D0
Text Label 5400 2150 0    50   ~ 0
ROW2-D1
Text Label 5400 2250 0    50   ~ 0
ROW2-D2
Text Label 5400 2350 0    50   ~ 0
ROW2-D3
Text Label 5400 2450 0    50   ~ 0
ROW2-D4
Text Label 5400 2550 0    50   ~ 0
ROW2-D5
Text Label 5400 3600 0    50   ~ 0
ROW2-D6
Text Label 5400 3700 0    50   ~ 0
ROW2-D7
Text Label 5400 3800 0    50   ~ 0
ROW2-D8
Text Label 5400 3900 0    50   ~ 0
ROW2-S0
Text Label 5400 4000 0    50   ~ 0
ROW2-S1
Text Label 5650 5850 0    50   ~ 0
OUT0
Text Label 5650 5950 0    50   ~ 0
OUT1
Text Label 5650 6050 0    50   ~ 0
OUT2
Text Label 5650 6150 0    50   ~ 0
OUT3
Text Label 5650 6250 0    50   ~ 0
OUT4
Text Label 5650 6350 0    50   ~ 0
OUT5
Text Label 5650 7400 0    50   ~ 0
OUT6
Text Label 5650 7500 0    50   ~ 0
OUT7
Text Label 5650 7600 0    50   ~ 0
OUT8
Text Label 5650 7700 0    50   ~ 0
OUT9
Text Label 5650 7800 0    50   ~ 0
OUT10
Text Label 5650 7900 0    50   ~ 0
OUT11
Text Label 6950 5850 0    50   ~ 0
ROW6-D0
Text Label 6950 5950 0    50   ~ 0
ROW6-D1
Text Label 6950 6050 0    50   ~ 0
ROW6-D2
Text Label 6950 6150 0    50   ~ 0
ROW6-D3
Text Label 6950 6250 0    50   ~ 0
ROW6-D4
Text Label 6950 6350 0    50   ~ 0
ROW6-D5
Text Label 6950 6450 0    50   ~ 0
ROW6-D6
Text Label 7200 2050 0    50   ~ 0
OUT0
Text Label 7200 2150 0    50   ~ 0
OUT1
Text Label 7200 2250 0    50   ~ 0
OUT2
Text Label 7200 2350 0    50   ~ 0
OUT3
Text Label 7200 2450 0    50   ~ 0
OUT4
Text Label 7200 2550 0    50   ~ 0
OUT5
Text Label 7200 3600 0    50   ~ 0
OUT6
Text Label 7200 3700 0    50   ~ 0
OUT7
Text Label 7200 3800 0    50   ~ 0
OUT8
Text Label 7200 3900 0    50   ~ 0
OUT9
Text Label 7200 4000 0    50   ~ 0
OUT10
Text Label 7200 4100 0    50   ~ 0
OUT11
Text Label 8000 2050 0    50   ~ 0
ROW3-D0
Text Label 8000 2150 0    50   ~ 0
ROW3-D1
Text Label 8000 2250 0    50   ~ 0
ROW3-D2
Text Label 8000 2350 0    50   ~ 0
ROW3-D3
Text Label 8000 2450 0    50   ~ 0
ROW3-D4
Text Label 8000 2550 0    50   ~ 0
ROW3-D5
Text Label 8000 3600 0    50   ~ 0
ROW3-D6
Text Label 8000 3700 0    50   ~ 0
ROW3-D7
Text Label 8000 3800 0    50   ~ 0
ROW3-D8
Text Label 8000 3900 0    50   ~ 0
ROW3-S0
Text Label 8000 4000 0    50   ~ 0
ROW3-S1
Text Label 9800 2050 0    50   ~ 0
OUT0
Text Label 9800 2150 0    50   ~ 0
OUT1
Text Label 9800 2250 0    50   ~ 0
OUT2
Text Label 9800 2350 0    50   ~ 0
OUT3
Text Label 9800 2450 0    50   ~ 0
OUT4
Text Label 9800 2550 0    50   ~ 0
OUT5
Text Label 9800 3600 0    50   ~ 0
OUT6
Text Label 9800 3700 0    50   ~ 0
OUT7
Text Label 9800 3800 0    50   ~ 0
OUT8
Text Label 9800 3900 0    50   ~ 0
OUT9
Text Label 9800 4000 0    50   ~ 0
OUT10
Text Label 9800 4100 0    50   ~ 0
OUT11
Text Label 9800 5850 0    50   ~ 0
OUT0
Text Label 9800 5950 0    50   ~ 0
OUT1
Text Label 9800 6050 0    50   ~ 0
OUT2
Text Label 9800 6150 0    50   ~ 0
OUT3
Text Label 9800 6250 0    50   ~ 0
OUT4
Text Label 9800 6350 0    50   ~ 0
OUT5
Text Label 9800 7400 0    50   ~ 0
OUT6
Text Label 9800 7500 0    50   ~ 0
OUT7
Text Label 9800 7600 0    50   ~ 0
OUT8
Text Label 9800 7700 0    50   ~ 0
OUT9
Text Label 9800 7800 0    50   ~ 0
OUT10
Text Label 9800 7900 0    50   ~ 0
OUT11
Text Label 10600 2050 0    50   ~ 0
ROW4-D0
Text Label 10600 2150 0    50   ~ 0
ROW4-D1
Text Label 10600 2250 0    50   ~ 0
ROW4-D2
Text Label 10600 2350 0    50   ~ 0
ROW4-D3
Text Label 10600 2450 0    50   ~ 0
ROW4-D4
Text Label 10600 2550 0    50   ~ 0
ROW4-D5
Text Label 10600 3600 0    50   ~ 0
ROW4-D6
Text Label 10600 3700 0    50   ~ 0
ROW4-D7
Text Label 10600 3800 0    50   ~ 0
ROW4-D8
Text Label 10600 3900 0    50   ~ 0
ROW4-S0
Text Label 10600 4000 0    50   ~ 0
ROW4-S1
Text Label 12400 2050 0    50   ~ 0
OUT0
Text Label 12400 2150 0    50   ~ 0
OUT1
Text Label 12400 2250 0    50   ~ 0
OUT2
Text Label 12400 2350 0    50   ~ 0
OUT3
Text Label 12400 2450 0    50   ~ 0
OUT4
Text Label 12400 2550 0    50   ~ 0
OUT5
Text Label 12400 3600 0    50   ~ 0
OUT6
Text Label 12400 3700 0    50   ~ 0
OUT7
Text Label 12400 3800 0    50   ~ 0
OUT8
Text Label 12400 3900 0    50   ~ 0
OUT9
Text Label 12400 4000 0    50   ~ 0
OUT10
Text Label 12400 4100 0    50   ~ 0
OUT11
Text Label 12400 5850 0    50   ~ 0
OUT0
Text Label 12400 5950 0    50   ~ 0
OUT1
Text Label 12400 6050 0    50   ~ 0
OUT2
Text Label 12400 6150 0    50   ~ 0
OUT3
Text Label 12400 6250 0    50   ~ 0
OUT4
Text Label 12400 6350 0    50   ~ 0
OUT5
Text Label 12400 7400 0    50   ~ 0
OUT6
Text Label 12400 7500 0    50   ~ 0
OUT7
Text Label 12400 7600 0    50   ~ 0
OUT8
Text Label 12400 7700 0    50   ~ 0
OUT9
Text Label 12400 7800 0    50   ~ 0
OUT10
Text Label 12400 7900 0    50   ~ 0
OUT11
Text HLabel 2450 1800 0    50   Input ~ 0
ROW1-D[0..8]
Text HLabel 2450 5600 0    50   Input ~ 0
ROW5-D[0..6]
Text HLabel 2500 4650 0    50   Input ~ 0
~E[1..7]
Text HLabel 2700 4200 2    50   Input ~ 0
ROW1-S[0..1]
Text HLabel 2900 4500 0    50   Input ~ 0
CLK
Text HLabel 5050 1800 0    50   Input ~ 0
ROW2-D[0..8]
Text HLabel 5300 4200 2    50   Input ~ 0
ROW2-S[0..1]
Text HLabel 6600 5600 0    50   Input ~ 0
ROW6-D[0..6]
Text HLabel 7650 1800 0    50   Input ~ 0
ROW3-D[0..8]
Text HLabel 7900 4200 2    50   Input ~ 0
ROW3-S[0..1]
Text HLabel 10250 1800 0    50   Input ~ 0
ROW4-D[0..8]
Text HLabel 10500 4200 2    50   Input ~ 0
ROW4-S[0..1]
Text HLabel 13000 4800 2    50   Output ~ 0
OUT[0..11]
$Comp
L power:VCC #PWR?
U 1 1 5FFFE78B
P 4250 7900
AR Path="/5F80FDF7/5FFFE78B" Ref="#PWR?"  Part="1" 
AR Path="/5FBEEC97/5FC01BF6/5FFFE78B" Ref="#PWR0222"  Part="1" 
F 0 "#PWR0222" H 4250 7750 50  0001 C CNN
F 1 "VCC" H 4265 8073 50  0000 C CNN
F 2 "" H 4250 7900 50  0001 C CNN
F 3 "" H 4250 7900 50  0001 C CNN
	1    4250 7900
	1    0    0    -1  
$EndComp
$Comp
L power:VCC #PWR?
U 1 1 602137C0
P 8150 7900
AR Path="/5F80FDF7/602137C0" Ref="#PWR?"  Part="1" 
AR Path="/5FBEEC97/5FC01BF6/602137C0" Ref="#PWR0223"  Part="1" 
F 0 "#PWR0223" H 8150 7750 50  0001 C CNN
F 1 "VCC" H 8165 8073 50  0000 C CNN
F 2 "" H 8150 7900 50  0001 C CNN
F 3 "" H 8150 7900 50  0001 C CNN
	1    8150 7900
	1    0    0    -1  
$EndComp
$Comp
L power:VCC #PWR?
U 1 1 607498A0
P 11300 5850
AR Path="/5F80FDF7/607498A0" Ref="#PWR?"  Part="1" 
AR Path="/5FBEEC97/5FC01BF6/607498A0" Ref="#PWR0224"  Part="1" 
F 0 "#PWR0224" H 11300 5700 50  0001 C CNN
F 1 "VCC" H 11315 6023 50  0000 C CNN
F 2 "" H 11300 5850 50  0001 C CNN
F 3 "" H 11300 5850 50  0001 C CNN
	1    11300 5850
	1    0    0    -1  
$EndComp
$Comp
L power:VCC #PWR?
U 1 1 60749A83
P 11300 7400
AR Path="/5F80FDF7/60749A83" Ref="#PWR?"  Part="1" 
AR Path="/5FBEEC97/5FC01BF6/60749A83" Ref="#PWR0225"  Part="1" 
F 0 "#PWR0225" H 11300 7250 50  0001 C CNN
F 1 "VCC" H 11315 7573 50  0000 C CNN
F 2 "" H 11300 7400 50  0001 C CNN
F 3 "" H 11300 7400 50  0001 C CNN
	1    11300 7400
	1    0    0    -1  
$EndComp
$Comp
L power:GND #PWR?
U 1 1 603F2054
P 3200 6550
AR Path="/5F80FDF7/603F2054" Ref="#PWR?"  Part="1" 
AR Path="/5FBEEC97/5FC01BF6/603F2054" Ref="#PWR0226"  Part="1" 
F 0 "#PWR0226" H 3200 6300 50  0001 C CNN
F 1 "GND" H 3205 6377 50  0001 C CNN
F 2 "" H 3200 6550 50  0001 C CNN
F 3 "" H 3200 6550 50  0001 C CNN
	1    3200 6550
	1    0    0    -1  
$EndComp
$Comp
L power:GND #PWR?
U 1 1 60A51334
P 3500 2750
AR Path="/5F80FDF7/60A51334" Ref="#PWR?"  Part="1" 
AR Path="/5FBEEC97/5FC01BF6/60A51334" Ref="#PWR0227"  Part="1" 
F 0 "#PWR0227" H 3500 2500 50  0001 C CNN
F 1 "GND" H 3505 2577 50  0001 C CNN
F 2 "" H 3500 2750 50  0001 C CNN
F 3 "" H 3500 2750 50  0001 C CNN
	1    3500 2750
	1    0    0    -1  
$EndComp
$Comp
L power:GND #PWR?
U 1 1 60A69EEA
P 3500 4300
AR Path="/5F80FDF7/60A69EEA" Ref="#PWR?"  Part="1" 
AR Path="/5FBEEC97/5FC01BF6/60A69EEA" Ref="#PWR0228"  Part="1" 
F 0 "#PWR0228" H 3500 4050 50  0001 C CNN
F 1 "GND" H 3505 4127 50  0001 C CNN
F 2 "" H 3500 4300 50  0001 C CNN
F 3 "" H 3500 4300 50  0001 C CNN
	1    3500 4300
	1    0    0    -1  
$EndComp
$Comp
L power:GND #PWR?
U 1 1 60F7ED17
P 4250 7500
AR Path="/5F80FDF7/60F7ED17" Ref="#PWR?"  Part="1" 
AR Path="/5FBEEC97/5FC01BF6/60F7ED17" Ref="#PWR0229"  Part="1" 
F 0 "#PWR0229" H 4250 7250 50  0001 C CNN
F 1 "GND" H 4255 7327 50  0001 C CNN
F 2 "" H 4250 7500 50  0001 C CNN
F 3 "" H 4250 7500 50  0001 C CNN
	1    4250 7500
	1    0    0    -1  
$EndComp
$Comp
L power:GND #PWR?
U 1 1 60F7ED0F
P 4550 6550
AR Path="/5F80FDF7/60F7ED0F" Ref="#PWR?"  Part="1" 
AR Path="/5FBEEC97/5FC01BF6/60F7ED0F" Ref="#PWR0230"  Part="1" 
F 0 "#PWR0230" H 4550 6300 50  0001 C CNN
F 1 "GND" H 4555 6377 50  0001 C CNN
F 2 "" H 4550 6550 50  0001 C CNN
F 3 "" H 4550 6550 50  0001 C CNN
	1    4550 6550
	1    0    0    -1  
$EndComp
$Comp
L power:GND #PWR?
U 1 1 6003F826
P 4550 8100
AR Path="/5F80FDF7/6003F826" Ref="#PWR?"  Part="1" 
AR Path="/5FBEEC97/5FC01BF6/6003F826" Ref="#PWR0231"  Part="1" 
F 0 "#PWR0231" H 4550 7850 50  0001 C CNN
F 1 "GND" H 4555 7927 50  0001 C CNN
F 2 "" H 4550 8100 50  0001 C CNN
F 3 "" H 4550 8100 50  0001 C CNN
	1    4550 8100
	1    0    0    -1  
$EndComp
$Comp
L power:GND #PWR?
U 1 1 60E2AD8A
P 6100 2750
AR Path="/5F80FDF7/60E2AD8A" Ref="#PWR?"  Part="1" 
AR Path="/5FBEEC97/5FC01BF6/60E2AD8A" Ref="#PWR0232"  Part="1" 
F 0 "#PWR0232" H 6100 2500 50  0001 C CNN
F 1 "GND" H 6105 2577 50  0001 C CNN
F 2 "" H 6100 2750 50  0001 C CNN
F 3 "" H 6100 2750 50  0001 C CNN
	1    6100 2750
	1    0    0    -1  
$EndComp
$Comp
L power:GND #PWR?
U 1 1 60E2AD92
P 6100 4300
AR Path="/5F80FDF7/60E2AD92" Ref="#PWR?"  Part="1" 
AR Path="/5FBEEC97/5FC01BF6/60E2AD92" Ref="#PWR0233"  Part="1" 
F 0 "#PWR0233" H 6100 4050 50  0001 C CNN
F 1 "GND" H 6105 4127 50  0001 C CNN
F 2 "" H 6100 4300 50  0001 C CNN
F 3 "" H 6100 4300 50  0001 C CNN
	1    6100 4300
	1    0    0    -1  
$EndComp
$Comp
L power:GND #PWR?
U 1 1 605C00F1
P 7350 6550
AR Path="/5F80FDF7/605C00F1" Ref="#PWR?"  Part="1" 
AR Path="/5FBEEC97/5FC01BF6/605C00F1" Ref="#PWR0234"  Part="1" 
F 0 "#PWR0234" H 7350 6300 50  0001 C CNN
F 1 "GND" H 7355 6377 50  0001 C CNN
F 2 "" H 7350 6550 50  0001 C CNN
F 3 "" H 7350 6550 50  0001 C CNN
	1    7350 6550
	1    0    0    -1  
$EndComp
$Comp
L power:GND #PWR?
U 1 1 601FE121
P 8150 7500
AR Path="/5F80FDF7/601FE121" Ref="#PWR?"  Part="1" 
AR Path="/5FBEEC97/5FC01BF6/601FE121" Ref="#PWR0235"  Part="1" 
F 0 "#PWR0235" H 8150 7250 50  0001 C CNN
F 1 "GND" H 8155 7327 50  0001 C CNN
F 2 "" H 8150 7500 50  0001 C CNN
F 3 "" H 8150 7500 50  0001 C CNN
	1    8150 7500
	1    0    0    -1  
$EndComp
$Comp
L power:GND #PWR?
U 1 1 60ECBAF9
P 8700 2750
AR Path="/5F80FDF7/60ECBAF9" Ref="#PWR?"  Part="1" 
AR Path="/5FBEEC97/5FC01BF6/60ECBAF9" Ref="#PWR0236"  Part="1" 
F 0 "#PWR0236" H 8700 2500 50  0001 C CNN
F 1 "GND" H 8705 2577 50  0001 C CNN
F 2 "" H 8700 2750 50  0001 C CNN
F 3 "" H 8700 2750 50  0001 C CNN
	1    8700 2750
	1    0    0    -1  
$EndComp
$Comp
L power:GND #PWR?
U 1 1 60ECBB01
P 8700 4300
AR Path="/5F80FDF7/60ECBB01" Ref="#PWR?"  Part="1" 
AR Path="/5FBEEC97/5FC01BF6/60ECBB01" Ref="#PWR0237"  Part="1" 
F 0 "#PWR0237" H 8700 4050 50  0001 C CNN
F 1 "GND" H 8705 4127 50  0001 C CNN
F 2 "" H 8700 4300 50  0001 C CNN
F 3 "" H 8700 4300 50  0001 C CNN
	1    8700 4300
	1    0    0    -1  
$EndComp
$Comp
L power:GND #PWR?
U 1 1 60F7ED75
P 8700 6550
AR Path="/5F80FDF7/60F7ED75" Ref="#PWR?"  Part="1" 
AR Path="/5FBEEC97/5FC01BF6/60F7ED75" Ref="#PWR0238"  Part="1" 
F 0 "#PWR0238" H 8700 6300 50  0001 C CNN
F 1 "GND" H 8705 6377 50  0001 C CNN
F 2 "" H 8700 6550 50  0001 C CNN
F 3 "" H 8700 6550 50  0001 C CNN
	1    8700 6550
	1    0    0    -1  
$EndComp
$Comp
L power:GND #PWR?
U 1 1 60F7ED7D
P 8700 8100
AR Path="/5F80FDF7/60F7ED7D" Ref="#PWR?"  Part="1" 
AR Path="/5FBEEC97/5FC01BF6/60F7ED7D" Ref="#PWR0239"  Part="1" 
F 0 "#PWR0239" H 8700 7850 50  0001 C CNN
F 1 "GND" H 8705 7927 50  0001 C CNN
F 2 "" H 8700 8100 50  0001 C CNN
F 3 "" H 8700 8100 50  0001 C CNN
	1    8700 8100
	1    0    0    -1  
$EndComp
$Comp
L power:GND #PWR?
U 1 1 6025F1D2
P 10900 7800
AR Path="/5F80FDF7/6025F1D2" Ref="#PWR?"  Part="1" 
AR Path="/5FBEEC97/5FC01BF6/6025F1D2" Ref="#PWR0240"  Part="1" 
F 0 "#PWR0240" H 10900 7550 50  0001 C CNN
F 1 "GND" H 10905 7627 50  0001 C CNN
F 2 "" H 10900 7800 50  0001 C CNN
F 3 "" H 10900 7800 50  0001 C CNN
	1    10900 7800
	1    0    0    -1  
$EndComp
$Comp
L power:GND #PWR?
U 1 1 60EFEF94
P 11300 2750
AR Path="/5F80FDF7/60EFEF94" Ref="#PWR?"  Part="1" 
AR Path="/5FBEEC97/5FC01BF6/60EFEF94" Ref="#PWR0241"  Part="1" 
F 0 "#PWR0241" H 11300 2500 50  0001 C CNN
F 1 "GND" H 11305 2577 50  0001 C CNN
F 2 "" H 11300 2750 50  0001 C CNN
F 3 "" H 11300 2750 50  0001 C CNN
	1    11300 2750
	1    0    0    -1  
$EndComp
$Comp
L power:GND #PWR?
U 1 1 60EFEF9C
P 11300 4300
AR Path="/5F80FDF7/60EFEF9C" Ref="#PWR?"  Part="1" 
AR Path="/5FBEEC97/5FC01BF6/60EFEF9C" Ref="#PWR0242"  Part="1" 
F 0 "#PWR0242" H 11300 4050 50  0001 C CNN
F 1 "GND" H 11305 4127 50  0001 C CNN
F 2 "" H 11300 4300 50  0001 C CNN
F 3 "" H 11300 4300 50  0001 C CNN
	1    11300 4300
	1    0    0    -1  
$EndComp
$Comp
L power:GND #PWR?
U 1 1 60F7EDDB
P 11300 6550
AR Path="/5F80FDF7/60F7EDDB" Ref="#PWR?"  Part="1" 
AR Path="/5FBEEC97/5FC01BF6/60F7EDDB" Ref="#PWR0243"  Part="1" 
F 0 "#PWR0243" H 11300 6300 50  0001 C CNN
F 1 "GND" H 11305 6377 50  0001 C CNN
F 2 "" H 11300 6550 50  0001 C CNN
F 3 "" H 11300 6550 50  0001 C CNN
	1    11300 6550
	1    0    0    -1  
$EndComp
$Comp
L power:GND #PWR?
U 1 1 60F7EDE3
P 11300 8100
AR Path="/5F80FDF7/60F7EDE3" Ref="#PWR?"  Part="1" 
AR Path="/5FBEEC97/5FC01BF6/60F7EDE3" Ref="#PWR0244"  Part="1" 
F 0 "#PWR0244" H 11300 7850 50  0001 C CNN
F 1 "GND" H 11305 7927 50  0001 C CNN
F 2 "" H 11300 8100 50  0001 C CNN
F 3 "" H 11300 8100 50  0001 C CNN
	1    11300 8100
	1    0    0    -1  
$EndComp
$Comp
L A5C:8BUF11 UBH101
U 1 1 606EF405
P 3700 6300
AR Path="/5F80FDF7/606EF405" Ref="UBH101"  Part="1" 
AR Path="/5FBEEC97/5FC01BF6/606EF405" Ref="UBH101"  Part="1" 
F 0 "UBH101" H 3700 7015 50  0000 C CNN
F 1 "8BUF11" H 3700 6924 50  0000 C CNN
F 2 "" H 4000 6300 50  0001 C CNN
F 3 "" H 4000 6300 50  0001 C CNN
F 4 "UBH103;UBH104;UBH106;UBH107;UBH109;UBH111" H 3700 6300 50  0001 C CNN "MiscRef"
	1    3700 6300
	1    0    0    -1  
$EndComp
$Comp
L A5C:8BUF11 UBF101
U 1 1 606F42DC
P 7850 6300
AR Path="/5F80FDF7/606F42DC" Ref="UBF101"  Part="1" 
AR Path="/5FBEEC97/5FC01BF6/606F42DC" Ref="UBF101"  Part="1" 
F 0 "UBF101" H 7850 7015 50  0000 C CNN
F 1 "8BUF11" H 7850 6924 50  0000 C CNN
F 2 "" H 8150 6300 50  0001 C CNN
F 3 "" H 8150 6300 50  0001 C CNN
F 4 "UBF103;UBF104;UBF106;UBF107;UBF109;UBF111" H 7850 6300 50  0001 C CNN "MiscRef"
	1    7850 6300
	1    0    0    -1  
$EndComp
$Comp
L A5C:M273CG UBN112
U 1 1 60EFEF6E
P 4000 2550
AR Path="/5F80FDF7/60EFEF6E" Ref="UBN112"  Part="1" 
AR Path="/5FBEEC97/5FC01BF6/60EFEF6E" Ref="UBN112"  Part="1" 
F 0 "UBN112" H 4000 3317 50  0000 C CNN
F 1 "M273CG" H 4000 3226 50  0000 C CNN
F 2 "" H 4000 2550 50  0001 C CNN
F 3 "" H 4000 2550 50  0001 C CNN
F 4 "UBN116;UBN118;UBN122;UBN124;UBN128;UBN129;UBN133;UBN135;UBN139;UBN140;UBN144;UBN146;UBN148" H 4000 2550 50  0001 C CNN "MiscRef"
	1    4000 2550
	1    0    0    -1  
$EndComp
$Comp
L A5C:M273CG UBN150
U 1 1 60EFEF75
P 4000 4100
AR Path="/5F80FDF7/60EFEF75" Ref="UBN150"  Part="1" 
AR Path="/5FBEEC97/5FC01BF6/60EFEF75" Ref="UBN150"  Part="1" 
F 0 "UBN150" H 4000 4867 50  0000 C CNN
F 1 "M273CG" H 4000 4776 50  0000 C CNN
F 2 "" H 4000 4100 50  0001 C CNN
F 3 "" H 4000 4100 50  0001 C CNN
F 4 "UBN154;UBN156;UBN160;UBN161;UBN165;UBN167;UBN171;UBN172;UBN176;UBN178;UBN182" H 4000 4100 50  0001 C CNN "MiscRef"
	1    4000 4100
	1    0    0    -1  
$EndComp
$Comp
L A5C:M273CG UBH112
U 1 1 60F7ECE9
P 5050 6350
AR Path="/5F80FDF7/60F7ECE9" Ref="UBH112"  Part="1" 
AR Path="/5FBEEC97/5FC01BF6/60F7ECE9" Ref="UBH112"  Part="1" 
F 0 "UBH112" H 5050 7117 50  0000 C CNN
F 1 "M273CG" H 5050 7026 50  0000 C CNN
F 2 "" H 5050 6350 50  0001 C CNN
F 3 "" H 5050 6350 50  0001 C CNN
F 4 "UBH116;UBH118;UBH122;UBH123;UBH127;UBH129;UBH133;UBH135;UBH139;UBH140;UBH144;UBH146;UBH148" H 5050 6350 50  0001 C CNN "MiscRef"
	1    5050 6350
	1    0    0    -1  
$EndComp
$Comp
L A5C:M273CG UBH150
U 1 1 60F7ECF0
P 5050 7900
AR Path="/5F80FDF7/60F7ECF0" Ref="UBH150"  Part="1" 
AR Path="/5FBEEC97/5FC01BF6/60F7ECF0" Ref="UBH150"  Part="1" 
F 0 "UBH150" H 5050 8667 50  0000 C CNN
F 1 "M273CG" H 5050 8576 50  0000 C CNN
F 2 "" H 5050 7900 50  0001 C CNN
F 3 "" H 5050 7900 50  0001 C CNN
F 4 "UBH154;UBH156;UBH160;UBH161;UBH165;UBH167;UBH171;UBH172;UBH176;UBH178;UBH182" H 5050 7900 50  0001 C CNN "MiscRef"
	1    5050 7900
	1    0    0    -1  
$EndComp
$Comp
L A5C:M273CG UBM112
U 1 1 60E2AD58
P 6600 2550
AR Path="/5F80FDF7/60E2AD58" Ref="UBM112"  Part="1" 
AR Path="/5FBEEC97/5FC01BF6/60E2AD58" Ref="UBM112"  Part="1" 
F 0 "UBM112" H 6600 3317 50  0000 C CNN
F 1 "M273CG" H 6600 3226 50  0000 C CNN
F 2 "" H 6600 2550 50  0001 C CNN
F 3 "" H 6600 2550 50  0001 C CNN
F 4 "UBM116;UBM118;UBM122;UBM124;UBM128;UBM129;UBM133;UBM135;UBM139;UBM140;UBM144;UBM146;UBM148" H 6600 2550 50  0001 C CNN "MiscRef"
	1    6600 2550
	1    0    0    -1  
$EndComp
$Comp
L A5C:M273CG UBM150
U 1 1 60E2AD5F
P 6600 4100
AR Path="/5F80FDF7/60E2AD5F" Ref="UBM150"  Part="1" 
AR Path="/5FBEEC97/5FC01BF6/60E2AD5F" Ref="UBM150"  Part="1" 
F 0 "UBM150" H 6600 4867 50  0000 C CNN
F 1 "M273CG" H 6600 4776 50  0000 C CNN
F 2 "" H 6600 4100 50  0001 C CNN
F 3 "" H 6600 4100 50  0001 C CNN
F 4 "UBM154;UBM156;UBM160;UBM161;UBM165;UBM167;UBM171;UBM172;UBM176;UBM178;UBM182" H 6600 4100 50  0001 C CNN "MiscRef"
	1    6600 4100
	1    0    0    -1  
$EndComp
$Comp
L A5C:M273CG UBK112
U 1 1 60ECBAD3
P 9200 2550
AR Path="/5F80FDF7/60ECBAD3" Ref="UBK112"  Part="1" 
AR Path="/5FBEEC97/5FC01BF6/60ECBAD3" Ref="UBK112"  Part="1" 
F 0 "UBK112" H 9200 3317 50  0000 C CNN
F 1 "M273CG" H 9200 3226 50  0000 C CNN
F 2 "" H 9200 2550 50  0001 C CNN
F 3 "" H 9200 2550 50  0001 C CNN
F 4 "UBK116;UBK118;UBK122;UBK124;UBK128;UBK129;UBK133;UBK135;UBK139;UBK140;UBK144;UBK146;UBK148" H 9200 2550 50  0001 C CNN "MiscRef"
	1    9200 2550
	1    0    0    -1  
$EndComp
$Comp
L A5C:M273CG UBK150
U 1 1 60ECBADA
P 9200 4100
AR Path="/5F80FDF7/60ECBADA" Ref="UBK150"  Part="1" 
AR Path="/5FBEEC97/5FC01BF6/60ECBADA" Ref="UBK150"  Part="1" 
F 0 "UBK150" H 9200 4867 50  0000 C CNN
F 1 "M273CG" H 9200 4776 50  0000 C CNN
F 2 "" H 9200 4100 50  0001 C CNN
F 3 "" H 9200 4100 50  0001 C CNN
F 4 "UBK154;UBK156;UBK160;UBK161;UBK165;UBK167;UBK171;UBK172;UBK176;UBK178;UBK182" H 9200 4100 50  0001 C CNN "MiscRef"
	1    9200 4100
	1    0    0    -1  
$EndComp
$Comp
L A5C:M273CG UBF112
U 1 1 60F7ED4F
P 9200 6350
AR Path="/5F80FDF7/60F7ED4F" Ref="UBF112"  Part="1" 
AR Path="/5FBEEC97/5FC01BF6/60F7ED4F" Ref="UBF112"  Part="1" 
F 0 "UBF112" H 9200 7117 50  0000 C CNN
F 1 "M273CG" H 9200 7026 50  0000 C CNN
F 2 "" H 9200 6350 50  0001 C CNN
F 3 "" H 9200 6350 50  0001 C CNN
F 4 "UBF116;UBF118;UBF122;UBF123;UBF127;UBF129;UBF133;UBF135;UBF139;UBF140;UBF144;UBF146;UBF148" H 9200 6350 50  0001 C CNN "MiscRef"
	1    9200 6350
	1    0    0    -1  
$EndComp
$Comp
L A5C:M273CG UBF150
U 1 1 60F7ED56
P 9200 7900
AR Path="/5F80FDF7/60F7ED56" Ref="UBF150"  Part="1" 
AR Path="/5FBEEC97/5FC01BF6/60F7ED56" Ref="UBF150"  Part="1" 
F 0 "UBF150" H 9200 8667 50  0000 C CNN
F 1 "M273CG" H 9200 8576 50  0000 C CNN
F 2 "" H 9200 7900 50  0001 C CNN
F 3 "" H 9200 7900 50  0001 C CNN
F 4 "UBF154;UBF156;UBF160;UBF161;UBF165;UBF167;UBF171;UBF172;UBF176;UBF178;UBF182" H 9200 7900 50  0001 C CNN "MiscRef"
	1    9200 7900
	1    0    0    -1  
$EndComp
$Comp
L A5C:M273CG UBI112
U 1 1 6066D973
P 11800 2550
AR Path="/5F80FDF7/6066D973" Ref="UBI112"  Part="1" 
AR Path="/5FBEEC97/5FC01BF6/6066D973" Ref="UBI112"  Part="1" 
F 0 "UBI112" H 11800 3317 50  0000 C CNN
F 1 "M273CG" H 11800 3226 50  0000 C CNN
F 2 "" H 11800 2550 50  0001 C CNN
F 3 "" H 11800 2550 50  0001 C CNN
F 4 "UBI116;UBI118;UBI122;UBI124;UBI127;UBI129;UBI133;UBI135;UBI139;UBI140;UBI144;UBI146;UBI148" H 11800 2550 50  0001 C CNN "MiscRef"
	1    11800 2550
	1    0    0    -1  
$EndComp
$Comp
L A5C:M273CG UBI150
U 1 1 60758591
P 11800 4100
AR Path="/5F80FDF7/60758591" Ref="UBI150"  Part="1" 
AR Path="/5FBEEC97/5FC01BF6/60758591" Ref="UBI150"  Part="1" 
F 0 "UBI150" H 11800 4867 50  0000 C CNN
F 1 "M273CG" H 11800 4776 50  0000 C CNN
F 2 "" H 11800 4100 50  0001 C CNN
F 3 "" H 11800 4100 50  0001 C CNN
F 4 "UBI154;UBI156;UBI160;UBI161;UBI165;UBI167;UBI171;UBI172;UBI176;UBI178;UBI182" H 11800 4100 50  0001 C CNN "MiscRef"
	1    11800 4100
	1    0    0    -1  
$EndComp
$Comp
L A5C:M273CG UBE112
U 1 1 60F7EDB5
P 11800 6350
AR Path="/5F80FDF7/60F7EDB5" Ref="UBE112"  Part="1" 
AR Path="/5FBEEC97/5FC01BF6/60F7EDB5" Ref="UBE112"  Part="1" 
F 0 "UBE112" H 11800 7117 50  0000 C CNN
F 1 "M273CG" H 11800 7026 50  0000 C CNN
F 2 "" H 11800 6350 50  0001 C CNN
F 3 "" H 11800 6350 50  0001 C CNN
F 4 "UBE116;UBE118;UBE122;UBE123;UBE127;UBE129;UBE133;UBE135;UBE139;UBE140;UBE144;UBE146;UBE148" H 11800 6350 50  0001 C CNN "MiscRef"
	1    11800 6350
	1    0    0    -1  
$EndComp
$Comp
L A5C:M273CG UBE150
U 1 1 60F7EDBC
P 11800 7900
AR Path="/5F80FDF7/60F7EDBC" Ref="UBE150"  Part="1" 
AR Path="/5FBEEC97/5FC01BF6/60F7EDBC" Ref="UBE150"  Part="1" 
F 0 "UBE150" H 11800 8667 50  0000 C CNN
F 1 "M273CG" H 11800 8576 50  0000 C CNN
F 2 "" H 11800 7900 50  0001 C CNN
F 3 "" H 11800 7900 50  0001 C CNN
F 4 "UBE154;UBE156;UBE160;UBE161;UBE165;UBE167;UBE171;UBE172;UBE176;UBE178;UBE182" H 11800 7900 50  0001 C CNN "MiscRef"
	1    11800 7900
	1    0    0    -1  
$EndComp
Wire Bus Line
	2650 4000 2650 4200
Wire Bus Line
	5250 4000 5250 4200
Wire Bus Line
	7850 4000 7850 4200
Wire Bus Line
	10450 4000 10450 4200
Wire Bus Line
	2650 4650 2650 5400
Wire Bus Line
	2650 5600 2650 6350
Wire Bus Line
	6800 5600 6800 6350
Wire Bus Line
	2650 1800 2650 3700
Wire Bus Line
	5250 1800 5250 3700
Wire Bus Line
	7850 1800 7850 3700
Wire Bus Line
	10450 1800 10450 3700
Wire Bus Line
	5000 2150 5000 4800
Wire Bus Line
	6050 5950 6050 8600
Wire Bus Line
	7600 2150 7600 4800
Wire Bus Line
	10200 2150 10200 4800
Wire Bus Line
	10200 5950 10200 8600
Wire Bus Line
	12800 2150 12800 4800
Wire Bus Line
	12800 4800 12800 8600
$EndSCHEMATC
