EESchema Schematic File Version 4
EELAYER 30 0
EELAYER END
$Descr A4 11693 8268
encoding utf-8
Sheet 4 8
Title ""
Date "2020-05-05"
Rev ""
Comp ""
Comment1 ""
Comment2 "Licence: CC-BY"
Comment3 "Author: Loic *WydD* Petit"
Comment4 "Project: CPS2 Reverse Engineering: DL-1927"
$EndDescr
Connection ~ 3200 750 
Connection ~ 3000 5600
Connection ~ 3000 4200
Connection ~ 3000 4900
Connection ~ 3000 2100
Connection ~ 3000 2800
Connection ~ 3000 3500
Connection ~ 5000 750 
Connection ~ 5850 1400
Connection ~ 5850 2100
Connection ~ 5850 2800
Connection ~ 5850 3500
Connection ~ 5850 4200
Connection ~ 5850 4900
Connection ~ 5850 5600
Connection ~ 5850 6300
Connection ~ 4050 1400
Connection ~ 4050 2100
Connection ~ 4050 2800
Connection ~ 4050 3500
Connection ~ 4050 4200
Connection ~ 4050 4900
Entry Wire Line
	3300 1150 3200 1050
Entry Wire Line
	3300 1850 3200 1750
Entry Wire Line
	3300 2550 3200 2450
Entry Wire Line
	3300 3250 3200 3150
Entry Wire Line
	3300 3950 3200 3850
Entry Wire Line
	3300 4650 3200 4550
Entry Wire Line
	5100 1150 5000 1050
Entry Wire Line
	5100 1850 5000 1750
Entry Wire Line
	5100 2550 5000 2450
Entry Wire Line
	5100 3250 5000 3150
Entry Wire Line
	5100 3950 5000 3850
Entry Wire Line
	5100 4650 5000 4550
Entry Wire Line
	5100 5350 5000 5250
Entry Wire Line
	5100 6050 5000 5950
Entry Wire Line
	6900 1150 6800 1050
Entry Wire Line
	6900 1850 6800 1750
Entry Wire Line
	6900 2550 6800 2450
Entry Wire Line
	6900 3250 6800 3150
Entry Wire Line
	6900 3950 6800 3850
Entry Wire Line
	6900 4650 6800 4550
Entry Wire Line
	6900 5350 6800 5250
Entry Wire Line
	6900 6050 6800 5950
Wire Wire Line
	3000 1400 3000 2100
Wire Wire Line
	3000 1400 4050 1400
Wire Wire Line
	3000 2100 3000 2800
Wire Wire Line
	3000 2100 4050 2100
Wire Wire Line
	3000 2800 3000 3500
Wire Wire Line
	3000 2800 4050 2800
Wire Wire Line
	3000 3500 3000 4200
Wire Wire Line
	3000 3500 4050 3500
Wire Wire Line
	3000 4200 3000 4900
Wire Wire Line
	3000 4200 4050 4200
Wire Wire Line
	3000 4900 3000 5600
Wire Wire Line
	3000 4900 4050 4900
Wire Wire Line
	3000 5600 3000 6300
Wire Wire Line
	3000 5600 5850 5600
Wire Wire Line
	3000 6300 5850 6300
Wire Wire Line
	3750 1150 3300 1150
Wire Wire Line
	3750 1850 3300 1850
Wire Wire Line
	3750 2550 3300 2550
Wire Wire Line
	3750 3250 3300 3250
Wire Wire Line
	3750 3950 3300 3950
Wire Wire Line
	3750 4650 3300 4650
Wire Wire Line
	4050 1400 5850 1400
Wire Wire Line
	4050 2100 5850 2100
Wire Wire Line
	4050 2800 5850 2800
Wire Wire Line
	4050 3500 5850 3500
Wire Wire Line
	4050 4200 5850 4200
Wire Wire Line
	4050 4900 5850 4900
Wire Wire Line
	5550 1150 5100 1150
Wire Wire Line
	5550 1850 5100 1850
Wire Wire Line
	5550 2550 5100 2550
Wire Wire Line
	5550 3250 5100 3250
Wire Wire Line
	5550 3950 5100 3950
Wire Wire Line
	5550 4650 5100 4650
Wire Wire Line
	5550 5350 5100 5350
Wire Wire Line
	5550 6050 5100 6050
Wire Wire Line
	5850 1400 7650 1400
Wire Wire Line
	5850 2100 7650 2100
Wire Wire Line
	5850 2800 7650 2800
Wire Wire Line
	5850 3500 7650 3500
Wire Wire Line
	5850 4200 7650 4200
Wire Wire Line
	5850 4900 7650 4900
Wire Wire Line
	5850 5600 7650 5600
Wire Wire Line
	5850 6300 7650 6300
Wire Wire Line
	7350 1150 6900 1150
Wire Wire Line
	7350 1850 6900 1850
Wire Wire Line
	7350 2550 6900 2550
Wire Wire Line
	7350 3250 6900 3250
Wire Wire Line
	7350 3950 6900 3950
Wire Wire Line
	7350 4650 6900 4650
Wire Wire Line
	7350 5350 6900 5350
Wire Wire Line
	7350 6050 6900 6050
Wire Bus Line
	3200 750  2850 750 
Wire Bus Line
	5000 750  3200 750 
Wire Bus Line
	5000 750  6800 750 
Text Label 3650 1150 2    50   ~ 0
DATA7
Text Label 3650 1850 2    50   ~ 0
DATA6
Text Label 3650 2550 2    50   ~ 0
DATA5
Text Label 3650 3250 2    50   ~ 0
DATA4
Text Label 3650 3950 2    50   ~ 0
DATA3
Text Label 3650 4650 2    50   ~ 0
DATA2
Text Label 5450 1150 2    50   ~ 0
DATA15
Text Label 5450 1850 2    50   ~ 0
DATA14
Text Label 5450 2550 2    50   ~ 0
DATA13
Text Label 5450 3250 2    50   ~ 0
DATA12
Text Label 5450 3950 2    50   ~ 0
DATA11
Text Label 5450 4650 2    50   ~ 0
DATA10
Text Label 5450 5350 2    50   ~ 0
DATA9
Text Label 5450 6050 2    50   ~ 0
DATA8
Text Label 7250 1150 2    50   ~ 0
DATA23
Text Label 7250 1850 2    50   ~ 0
DATA22
Text Label 7250 2550 2    50   ~ 0
DATA21
Text Label 7250 3250 2    50   ~ 0
DATA20
Text Label 7250 3950 2    50   ~ 0
DATA19
Text Label 7250 4650 2    50   ~ 0
DATA18
Text Label 7250 5350 2    50   ~ 0
DATA17
Text Label 7250 6050 2    50   ~ 0
DATA16
Text HLabel 2400 6300 0    50   Input ~ 0
~ENABLE
Text HLabel 2850 750  0    50   Input ~ 0
DATA[2..23]
Text HLabel 4350 1150 2    50   Output ~ 0
OUT7
Text HLabel 4350 1850 2    50   Output ~ 0
OUT6
Text HLabel 4350 2550 2    50   Output ~ 0
OUT5
Text HLabel 4350 3250 2    50   Output ~ 0
OUT4
Text HLabel 4350 3950 2    50   Output ~ 0
OUT3
Text HLabel 4350 4650 2    50   Output ~ 0
OUT2
Text HLabel 6150 1150 2    50   Output ~ 0
OUT15
Text HLabel 6150 1850 2    50   Output ~ 0
OUT14
Text HLabel 6150 2550 2    50   Output ~ 0
OUT13
Text HLabel 6150 3250 2    50   Output ~ 0
OUT12
Text HLabel 6150 3950 2    50   Output ~ 0
OUT11
Text HLabel 6150 4650 2    50   Output ~ 0
OUT10
Text HLabel 6150 5350 2    50   Output ~ 0
OUT9
Text HLabel 6150 6050 2    50   Output ~ 0
OUT8
Text HLabel 7950 1150 2    50   Output ~ 0
OUT23
Text HLabel 7950 1850 2    50   Output ~ 0
OUT22
Text HLabel 7950 2550 2    50   Output ~ 0
OUT21
Text HLabel 7950 3250 2    50   Output ~ 0
OUT20
Text HLabel 7950 3950 2    50   Output ~ 0
OUT19
Text HLabel 7950 4650 2    50   Output ~ 0
OUT18
Text HLabel 7950 5350 2    50   Output ~ 0
OUT17
Text HLabel 7950 6050 2    50   Output ~ 0
OUT16
$Comp
L CG24-cells:O4R U10R150
U 1 1 5EAF1CA1
P 4050 1150
F 0 "U10R150" H 4050 1467 50  0000 C CNN
F 1 "O4R" H 4050 1376 50  0000 C CNN
F 2 "" H 4050 1150 50  0001 C CNN
F 3 "" H 4050 1150 50  0001 C CNN
	1    4050 1150
	1    0    0    -1  
$EndComp
$Comp
L CG24-cells:O4R U8R148
U 1 1 5EAF1C89
P 4050 1850
F 0 "U8R148" H 4050 2167 50  0000 C CNN
F 1 "O4R" H 4050 2076 50  0000 C CNN
F 2 "" H 4050 1850 50  0001 C CNN
F 3 "" H 4050 1850 50  0001 C CNN
	1    4050 1850
	1    0    0    -1  
$EndComp
$Comp
L CG24-cells:O4R U12R150
U 1 1 5EAF1C94
P 4050 2550
F 0 "U12R150" H 4050 2867 50  0000 C CNN
F 1 "O4R" H 4050 2776 50  0000 C CNN
F 2 "" H 4050 2550 50  0001 C CNN
F 3 "" H 4050 2550 50  0001 C CNN
	1    4050 2550
	1    0    0    -1  
$EndComp
$Comp
L CG24-cells:O4R U14R150
U 1 1 5EAF1C98
P 4050 3250
F 0 "U14R150" H 4050 3567 50  0000 C CNN
F 1 "O4R" H 4050 3476 50  0000 C CNN
F 2 "" H 4050 3250 50  0001 C CNN
F 3 "" H 4050 3250 50  0001 C CNN
	1    4050 3250
	1    0    0    -1  
$EndComp
$Comp
L CG24-cells:O4R U22R150
U 1 1 5EAF1C9A
P 4050 3950
F 0 "U22R150" H 4050 4267 50  0000 C CNN
F 1 "O4R" H 4050 4176 50  0000 C CNN
F 2 "" H 4050 3950 50  0001 C CNN
F 3 "" H 4050 3950 50  0001 C CNN
	1    4050 3950
	1    0    0    -1  
$EndComp
$Comp
L CG24-cells:O4R U20R148
U 1 1 5EAF1C87
P 4050 4650
F 0 "U20R148" H 4050 4967 50  0000 C CNN
F 1 "O4R" H 4050 4876 50  0000 C CNN
F 2 "" H 4050 4650 50  0001 C CNN
F 3 "" H 4050 4650 50  0001 C CNN
	1    4050 4650
	1    0    0    -1  
$EndComp
$Comp
L CG24-cells:O4R U0R95
U 1 1 5EAF1C92
P 5850 1150
F 0 "U0R95" H 5850 1467 50  0000 C CNN
F 1 "O4R" H 5850 1376 50  0000 C CNN
F 2 "" H 5850 1150 50  0001 C CNN
F 3 "" H 5850 1150 50  0001 C CNN
	1    5850 1150
	1    0    0    -1  
$EndComp
$Comp
L CG24-cells:O4R U0R106
U 1 1 5EAF1C86
P 5850 1850
F 0 "U0R106" H 5850 2167 50  0000 C CNN
F 1 "O4R" H 5850 2076 50  0000 C CNN
F 2 "" H 5850 1850 50  0001 C CNN
F 3 "" H 5850 1850 50  0001 C CNN
	1    5850 1850
	1    0    0    -1  
$EndComp
$Comp
L CG24-cells:O4R U0R114
U 1 1 5EAF1C8A
P 5850 2550
F 0 "U0R114" H 5850 2867 50  0000 C CNN
F 1 "O4R" H 5850 2776 50  0000 C CNN
F 2 "" H 5850 2550 50  0001 C CNN
F 3 "" H 5850 2550 50  0001 C CNN
	1    5850 2550
	1    0    0    -1  
$EndComp
$Comp
L CG24-cells:O4R U0R146
U 1 1 5EAF1CA8
P 5850 3250
F 0 "U0R146" H 5850 3567 50  0000 C CNN
F 1 "O4R" H 5850 3476 50  0000 C CNN
F 2 "" H 5850 3250 50  0001 C CNN
F 3 "" H 5850 3250 50  0001 C CNN
	1    5850 3250
	1    0    0    -1  
$EndComp
$Comp
L CG24-cells:O4R U0R148
U 1 1 5EAF1C8C
P 5850 3950
F 0 "U0R148" H 5850 4267 50  0000 C CNN
F 1 "O4R" H 5850 4176 50  0000 C CNN
F 2 "" H 5850 3950 50  0001 C CNN
F 3 "" H 5850 3950 50  0001 C CNN
	1    5850 3950
	1    0    0    -1  
$EndComp
$Comp
L CG24-cells:O4R U2R150
U 1 1 5EAF1C9B
P 5850 4650
F 0 "U2R150" H 5850 4967 50  0000 C CNN
F 1 "O4R" H 5850 4876 50  0000 C CNN
F 2 "" H 5850 4650 50  0001 C CNN
F 3 "" H 5850 4650 50  0001 C CNN
	1    5850 4650
	1    0    0    -1  
$EndComp
$Comp
L CG24-cells:O4R U4R150
U 1 1 5EAF1C96
P 5850 5350
F 0 "U4R150" H 5850 5667 50  0000 C CNN
F 1 "O4R" H 5850 5576 50  0000 C CNN
F 2 "" H 5850 5350 50  0001 C CNN
F 3 "" H 5850 5350 50  0001 C CNN
	1    5850 5350
	1    0    0    -1  
$EndComp
$Comp
L CG24-cells:O4R U2R148
U 1 1 5EAF1CAD
P 5850 6050
F 0 "U2R148" H 5850 6367 50  0000 C CNN
F 1 "O4R" H 5850 6276 50  0000 C CNN
F 2 "" H 5850 6050 50  0001 C CNN
F 3 "" H 5850 6050 50  0001 C CNN
	1    5850 6050
	1    0    0    -1  
$EndComp
$Comp
L CG24-cells:O4R U0R1
U 1 1 5EAF1C88
P 7650 1150
F 0 "U0R1" H 7650 1467 50  0000 C CNN
F 1 "O4R" H 7650 1376 50  0000 C CNN
F 2 "" H 7650 1150 50  0001 C CNN
F 3 "" H 7650 1150 50  0001 C CNN
	1    7650 1150
	1    0    0    -1  
$EndComp
$Comp
L CG24-cells:O4R U0R9
U 1 1 5EAF1C82
P 7650 1850
F 0 "U0R9" H 7650 2167 50  0000 C CNN
F 1 "O4R" H 7650 2076 50  0000 C CNN
F 2 "" H 7650 1850 50  0001 C CNN
F 3 "" H 7650 1850 50  0001 C CNN
	1    7650 1850
	1    0    0    -1  
$EndComp
$Comp
L CG24-cells:O4R U0R41
U 1 1 5EAF1CA3
P 7650 2550
F 0 "U0R41" H 7650 2867 50  0000 C CNN
F 1 "O4R" H 7650 2776 50  0000 C CNN
F 2 "" H 7650 2550 50  0001 C CNN
F 3 "" H 7650 2550 50  0001 C CNN
	1    7650 2550
	1    0    0    -1  
$EndComp
$Comp
L CG24-cells:O4R U0R43
U 1 1 5EAF1C84
P 7650 3250
F 0 "U0R43" H 7650 3567 50  0000 C CNN
F 1 "O4R" H 7650 3476 50  0000 C CNN
F 2 "" H 7650 3250 50  0001 C CNN
F 3 "" H 7650 3250 50  0001 C CNN
	1    7650 3250
	1    0    0    -1  
$EndComp
$Comp
L CG24-cells:O4R U0R53
U 1 1 5EAF1C8B
P 7650 3950
F 0 "U0R53" H 7650 4267 50  0000 C CNN
F 1 "O4R" H 7650 4176 50  0000 C CNN
F 2 "" H 7650 3950 50  0001 C CNN
F 3 "" H 7650 3950 50  0001 C CNN
	1    7650 3950
	1    0    0    -1  
$EndComp
$Comp
L CG24-cells:O4R U0R62
U 1 1 5EAF1CAC
P 7650 4650
F 0 "U0R62" H 7650 4967 50  0000 C CNN
F 1 "O4R" H 7650 4876 50  0000 C CNN
F 2 "" H 7650 4650 50  0001 C CNN
F 3 "" H 7650 4650 50  0001 C CNN
	1    7650 4650
	1    0    0    -1  
$EndComp
$Comp
L CG24-cells:O4R U0R64
U 1 1 5EAF1C85
P 7650 5350
F 0 "U0R64" H 7650 5667 50  0000 C CNN
F 1 "O4R" H 7650 5576 50  0000 C CNN
F 2 "" H 7650 5350 50  0001 C CNN
F 3 "" H 7650 5350 50  0001 C CNN
	1    7650 5350
	1    0    0    -1  
$EndComp
$Comp
L CG24-cells:O4R U0R93
U 1 1 5EAF1CA7
P 7650 6050
F 0 "U0R93" H 7650 6367 50  0000 C CNN
F 1 "O4R" H 7650 6276 50  0000 C CNN
F 2 "" H 7650 6050 50  0001 C CNN
F 3 "" H 7650 6050 50  0001 C CNN
	1    7650 6050
	1    0    0    -1  
$EndComp
Wire Wire Line
	2400 6300 3000 6300
Wire Bus Line
	3200 750  3200 4550
Wire Bus Line
	5000 750  5000 5950
Wire Bus Line
	6800 750  6800 5950
Connection ~ 3000 6300
$EndSCHEMATC
