EESchema Schematic File Version 4
EELAYER 30 0
EELAYER END
$Descr A4 11693 8268
encoding utf-8
Sheet 8 20
Title "DL-1727"
Date "2020-04-26"
Rev ""
Comp ""
Comment1 ""
Comment2 "Licence: CC-BY"
Comment3 "Author: Loic *WydD* Petit"
Comment4 "Project: CPS2 Reverse Engineering: DL-1727"
$EndDescr
$Comp
L CG24-cells:V2B U10R41
U 1 1 5EA95677
P 2450 1800
F 0 "U10R41" H 2450 2117 50  0000 C CNN
F 1 "V2B" H 2450 2026 50  0000 C CNN
F 2 "" H 2450 1600 50  0001 C CNN
F 3 "" H 2450 1600 50  0001 C CNN
	1    2450 1800
	1    0    0    -1  
$EndComp
$Comp
L CG24-cells:V2B U8R41
U 1 1 5EAE38C1
P 2450 2400
F 0 "U8R41" H 2450 2717 50  0000 C CNN
F 1 "V2B" H 2450 2626 50  0000 C CNN
F 2 "" H 2450 2200 50  0001 C CNN
F 3 "" H 2450 2200 50  0001 C CNN
	1    2450 2400
	1    0    0    -1  
$EndComp
$Comp
L CG24-cells:V2B U8R31
U 1 1 5EAE48F1
P 2450 3000
F 0 "U8R31" H 2450 3317 50  0000 C CNN
F 1 "V2B" H 2450 3226 50  0000 C CNN
F 2 "" H 2450 2800 50  0001 C CNN
F 3 "" H 2450 2800 50  0001 C CNN
	1    2450 3000
	1    0    0    -1  
$EndComp
$Comp
L CG24-cells:V2B U11R41
U 1 1 5EAF07A6
P 2450 3600
F 0 "U11R41" H 2450 3917 50  0000 C CNN
F 1 "V2B" H 2450 3826 50  0000 C CNN
F 2 "" H 2450 3400 50  0001 C CNN
F 3 "" H 2450 3400 50  0001 C CNN
	1    2450 3600
	1    0    0    -1  
$EndComp
$Comp
L CG24-cells:V2B U9R31
U 1 1 5EAF9271
P 2450 4200
F 0 "U9R31" H 2450 4517 50  0000 C CNN
F 1 "V2B" H 2450 4426 50  0000 C CNN
F 2 "" H 2450 4000 50  0001 C CNN
F 3 "" H 2450 4000 50  0001 C CNN
	1    2450 4200
	1    0    0    -1  
$EndComp
$Comp
L CG24-cells:V2B U6R41
U 1 1 5EAF927D
P 2450 4800
F 0 "U6R41" H 2450 5117 50  0000 C CNN
F 1 "V2B" H 2450 5026 50  0000 C CNN
F 2 "" H 2450 4600 50  0001 C CNN
F 3 "" H 2450 4600 50  0001 C CNN
	1    2450 4800
	1    0    0    -1  
$EndComp
$Comp
L CG24-cells:V2B U7R41
U 1 1 5EB1C79B
P 2450 5400
F 0 "U7R41" H 2450 5717 50  0000 C CNN
F 1 "V2B" H 2450 5626 50  0000 C CNN
F 2 "" H 2450 5200 50  0001 C CNN
F 3 "" H 2450 5200 50  0001 C CNN
	1    2450 5400
	1    0    0    -1  
$EndComp
$Comp
L CG24-cells:V2B U11R51
U 1 1 5EB1D19B
P 2450 6000
F 0 "U11R51" H 2450 6317 50  0000 C CNN
F 1 "V2B" H 2450 6226 50  0000 C CNN
F 2 "" H 2450 5800 50  0001 C CNN
F 3 "" H 2450 5800 50  0001 C CNN
	1    2450 6000
	1    0    0    -1  
$EndComp
$Comp
L CG24-cells:V2B U9R61
U 1 1 5EB1D1A7
P 6950 1800
F 0 "U9R61" H 6950 2117 50  0000 C CNN
F 1 "V2B" H 6950 2026 50  0000 C CNN
F 2 "" H 6950 1600 50  0001 C CNN
F 3 "" H 6950 1600 50  0001 C CNN
	1    6950 1800
	1    0    0    -1  
$EndComp
$Comp
L CG24-cells:V2B U6R61
U 1 1 5EB1FE8F
P 6950 2400
F 0 "U6R61" H 6950 2717 50  0000 C CNN
F 1 "V2B" H 6950 2626 50  0000 C CNN
F 2 "" H 6950 2200 50  0001 C CNN
F 3 "" H 6950 2200 50  0001 C CNN
	1    6950 2400
	1    0    0    -1  
$EndComp
$Comp
L CG24-cells:V2B U7R61
U 1 1 5EB1FE9B
P 6950 3000
F 0 "U7R61" H 6950 3317 50  0000 C CNN
F 1 "V2B" H 6950 3226 50  0000 C CNN
F 2 "" H 6950 2800 50  0001 C CNN
F 3 "" H 6950 2800 50  0001 C CNN
	1    6950 3000
	1    0    0    -1  
$EndComp
$Comp
L CG24-cells:V2B U11R72
U 1 1 5EB1FEA7
P 6950 3600
F 0 "U11R72" H 6950 3917 50  0000 C CNN
F 1 "V2B" H 6950 3826 50  0000 C CNN
F 2 "" H 6950 3400 50  0001 C CNN
F 3 "" H 6950 3400 50  0001 C CNN
	1    6950 3600
	1    0    0    -1  
$EndComp
$Comp
L CG24-cells:V2B U9R72
U 1 1 5EB1FEB3
P 6950 4200
F 0 "U9R72" H 6950 4517 50  0000 C CNN
F 1 "V2B" H 6950 4426 50  0000 C CNN
F 2 "" H 6950 4000 50  0001 C CNN
F 3 "" H 6950 4000 50  0001 C CNN
	1    6950 4200
	1    0    0    -1  
$EndComp
$Comp
L CG24-cells:V2B U5R72
U 1 1 5EB2189F
P 6950 4800
F 0 "U5R72" H 6950 5117 50  0000 C CNN
F 1 "V2B" H 6950 5026 50  0000 C CNN
F 2 "" H 6950 4600 50  0001 C CNN
F 3 "" H 6950 4600 50  0001 C CNN
	1    6950 4800
	1    0    0    -1  
$EndComp
$Comp
L CG24-cells:V2B U4R82
U 1 1 5EB218AB
P 6950 5400
F 0 "U4R82" H 6950 5717 50  0000 C CNN
F 1 "V2B" H 6950 5626 50  0000 C CNN
F 2 "" H 6950 5200 50  0001 C CNN
F 3 "" H 6950 5200 50  0001 C CNN
	1    6950 5400
	1    0    0    -1  
$EndComp
$Comp
L CG24-cells:V2B U5R92
U 1 1 5EB218B7
P 6950 6000
F 0 "U5R92" H 6950 6317 50  0000 C CNN
F 1 "V2B" H 6950 6226 50  0000 C CNN
F 2 "" H 6950 5800 50  0001 C CNN
F 3 "" H 6950 5800 50  0001 C CNN
	1    6950 6000
	1    0    0    -1  
$EndComp
$Comp
L CG24-cells:V2B U16R41
U 1 1 5EA95C9F
P 3250 1800
F 0 "U16R41" H 3250 2117 50  0000 C CNN
F 1 "V2B" H 3250 2026 50  0000 C CNN
F 2 "" H 3250 1600 50  0001 C CNN
F 3 "" H 3250 1600 50  0001 C CNN
	1    3250 1800
	1    0    0    -1  
$EndComp
$Comp
L CG24-cells:V2B U21R41
U 1 1 5EAE3E16
P 3250 2400
F 0 "U21R41" H 3250 2717 50  0000 C CNN
F 1 "V2B" H 3250 2626 50  0000 C CNN
F 2 "" H 3250 2200 50  0001 C CNN
F 3 "" H 3250 2200 50  0001 C CNN
	1    3250 2400
	1    0    0    -1  
$EndComp
$Comp
L CG24-cells:V2B U20R31
U 1 1 5EAE4EFB
P 3250 3000
F 0 "U20R31" H 3250 3317 50  0000 C CNN
F 1 "V2B" H 3250 3226 50  0000 C CNN
F 2 "" H 3250 2800 50  0001 C CNN
F 3 "" H 3250 2800 50  0001 C CNN
	1    3250 3000
	1    0    0    -1  
$EndComp
$Comp
L CG24-cells:V2B U21R31
U 1 1 5EAF15A9
P 3250 3600
F 0 "U21R31" H 3250 3917 50  0000 C CNN
F 1 "V2B" H 3250 3826 50  0000 C CNN
F 2 "" H 3250 3400 50  0001 C CNN
F 3 "" H 3250 3400 50  0001 C CNN
	1    3250 3600
	1    0    0    -1  
$EndComp
$Comp
L CG24-cells:V2B U16R31
U 1 1 5EAF9277
P 3250 4200
F 0 "U16R31" H 3250 4517 50  0000 C CNN
F 1 "V2B" H 3250 4426 50  0000 C CNN
F 2 "" H 3250 4000 50  0001 C CNN
F 3 "" H 3250 4000 50  0001 C CNN
	1    3250 4200
	1    0    0    -1  
$EndComp
$Comp
L CG24-cells:V2B U20R40
U 1 1 5EAF9283
P 3250 4800
F 0 "U20R40" H 3250 5117 50  0000 C CNN
F 1 "V2B" H 3250 5026 50  0000 C CNN
F 2 "" H 3250 4600 50  0001 C CNN
F 3 "" H 3250 4600 50  0001 C CNN
	1    3250 4800
	1    0    0    -1  
$EndComp
$Comp
L CG24-cells:V2B U19R41
U 1 1 5EB23557
P 3250 5400
F 0 "U19R41" H 3250 5717 50  0000 C CNN
F 1 "V2B" H 3250 5626 50  0000 C CNN
F 2 "" H 3250 5200 50  0001 C CNN
F 3 "" H 3250 5200 50  0001 C CNN
	1    3250 5400
	1    0    0    -1  
$EndComp
$Comp
L CG24-cells:V2B U19R51
U 1 1 5EB1D195
P 3250 6000
F 0 "U19R51" H 3250 6317 50  0000 C CNN
F 1 "V2B" H 3250 6226 50  0000 C CNN
F 2 "" H 3250 5800 50  0001 C CNN
F 3 "" H 3250 5800 50  0001 C CNN
	1    3250 6000
	1    0    0    -1  
$EndComp
$Comp
L CG24-cells:V2B U14R41
U 1 1 5EB1D1A1
P 7750 1800
F 0 "U14R41" H 7750 2117 50  0000 C CNN
F 1 "V2B" H 7750 2026 50  0000 C CNN
F 2 "" H 7750 1600 50  0001 C CNN
F 3 "" H 7750 1600 50  0001 C CNN
	1    7750 1800
	1    0    0    -1  
$EndComp
$Comp
L CG24-cells:V2B U15R41
U 1 1 5EB1FE89
P 7750 2400
F 0 "U15R41" H 7750 2717 50  0000 C CNN
F 1 "V2B" H 7750 2626 50  0000 C CNN
F 2 "" H 7750 2200 50  0001 C CNN
F 3 "" H 7750 2200 50  0001 C CNN
	1    7750 2400
	1    0    0    -1  
$EndComp
$Comp
L CG24-cells:V2B U13R41
U 1 1 5EB28917
P 7750 3000
F 0 "U13R41" H 7750 3317 50  0000 C CNN
F 1 "V2B" H 7750 3226 50  0000 C CNN
F 2 "" H 7750 2800 50  0001 C CNN
F 3 "" H 7750 2800 50  0001 C CNN
	1    7750 3000
	1    0    0    -1  
$EndComp
$Comp
L CG24-cells:V2B U20R51
U 1 1 5EB1FEA1
P 7750 3600
F 0 "U20R51" H 7750 3917 50  0000 C CNN
F 1 "V2B" H 7750 3826 50  0000 C CNN
F 2 "" H 7750 3400 50  0001 C CNN
F 3 "" H 7750 3400 50  0001 C CNN
	1    7750 3600
	1    0    0    -1  
$EndComp
$Comp
L CG24-cells:V2B U19R61
U 1 1 5EB1FEAD
P 7750 4200
F 0 "U19R61" H 7750 4517 50  0000 C CNN
F 1 "V2B" H 7750 4426 50  0000 C CNN
F 2 "" H 7750 4000 50  0001 C CNN
F 3 "" H 7750 4000 50  0001 C CNN
	1    7750 4200
	1    0    0    -1  
$EndComp
$Comp
L CG24-cells:V2B U21R51
U 1 1 5EB21899
P 7750 4800
F 0 "U21R51" H 7750 5117 50  0000 C CNN
F 1 "V2B" H 7750 5026 50  0000 C CNN
F 2 "" H 7750 4600 50  0001 C CNN
F 3 "" H 7750 4600 50  0001 C CNN
	1    7750 4800
	1    0    0    -1  
$EndComp
$Comp
L CG24-cells:V2B U16R51
U 1 1 5EB32FD5
P 7750 5400
F 0 "U16R51" H 7750 5717 50  0000 C CNN
F 1 "V2B" H 7750 5626 50  0000 C CNN
F 2 "" H 7750 5200 50  0001 C CNN
F 3 "" H 7750 5200 50  0001 C CNN
	1    7750 5400
	1    0    0    -1  
$EndComp
$Comp
L CG24-cells:V2B U17R51
U 1 1 5EB218B1
P 7750 6000
F 0 "U17R51" H 7750 6317 50  0000 C CNN
F 1 "V2B" H 7750 6226 50  0000 C CNN
F 2 "" H 7750 5800 50  0001 C CNN
F 3 "" H 7750 5800 50  0001 C CNN
	1    7750 6000
	1    0    0    -1  
$EndComp
$Comp
L CG24-cells:V2B U16R113
U 1 1 5EAEEB77
P 4700 1400
F 0 "U16R113" H 4700 1717 50  0000 C CNN
F 1 "V2B" H 4700 1626 50  0000 C CNN
F 2 "" H 4700 1200 50  0001 C CNN
F 3 "" H 4700 1200 50  0001 C CNN
	1    4700 1400
	1    0    0    -1  
$EndComp
$Comp
L CG24-cells:V2B U18R41
U 1 1 5EAEC087
P 4700 2000
F 0 "U18R41" H 4700 2317 50  0000 C CNN
F 1 "V2B" H 4700 2226 50  0000 C CNN
F 2 "" H 4700 1800 50  0001 C CNN
F 3 "" H 4700 1800 50  0001 C CNN
	1    4700 2000
	1    0    0    -1  
$EndComp
$Comp
L CG24-cells:V2B U18R31
U 1 1 5EAE536A
P 4700 2600
F 0 "U18R31" H 4700 2917 50  0000 C CNN
F 1 "V2B" H 4700 2826 50  0000 C CNN
F 2 "" H 4700 2400 50  0001 C CNN
F 3 "" H 4700 2400 50  0001 C CNN
	1    4700 2600
	1    0    0    -1  
$EndComp
$Comp
L CG24-cells:V2B U20R41
U 1 1 5EAF0C78
P 4700 3200
F 0 "U20R41" H 4700 3517 50  0000 C CNN
F 1 "V2B" H 4700 3426 50  0000 C CNN
F 2 "" H 4700 3000 50  0001 C CNN
F 3 "" H 4700 3000 50  0001 C CNN
	1    4700 3200
	1    0    0    -1  
$EndComp
$Comp
L CG24-cells:V2B U17R41
U 1 1 5EB11F4D
P 4700 3800
F 0 "U17R41" H 4700 4117 50  0000 C CNN
F 1 "V2B" H 4700 4026 50  0000 C CNN
F 2 "" H 4700 3600 50  0001 C CNN
F 3 "" H 4700 3600 50  0001 C CNN
	1    4700 3800
	1    0    0    -1  
$EndComp
$Comp
L CG24-cells:V2B U21R61
U 1 1 5EB11F41
P 4700 4400
F 0 "U21R61" H 4700 4717 50  0000 C CNN
F 1 "V2B" H 4700 4626 50  0000 C CNN
F 2 "" H 4700 4200 50  0001 C CNN
F 3 "" H 4700 4200 50  0001 C CNN
	1    4700 4400
	1    0    0    -1  
$EndComp
$Comp
L CG24-cells:V2B U18R51
U 1 1 5EB1C795
P 4700 5000
F 0 "U18R51" H 4700 5317 50  0000 C CNN
F 1 "V2B" H 4700 5226 50  0000 C CNN
F 2 "" H 4700 4800 50  0001 C CNN
F 3 "" H 4700 4800 50  0001 C CNN
	1    4700 5000
	1    0    0    -1  
$EndComp
$Comp
L CG24-cells:V2B U18R61
U 1 1 5EB11F59
P 4700 5600
F 0 "U18R61" H 4700 5917 50  0000 C CNN
F 1 "V2B" H 4700 5826 50  0000 C CNN
F 2 "" H 4700 5400 50  0001 C CNN
F 3 "" H 4700 5400 50  0001 C CNN
	1    4700 5600
	1    0    0    -1  
$EndComp
$Comp
L CG24-cells:V2B U14R61
U 1 1 5EB263F2
P 9200 1400
F 0 "U14R61" H 9200 1717 50  0000 C CNN
F 1 "V2B" H 9200 1626 50  0000 C CNN
F 2 "" H 9200 1200 50  0001 C CNN
F 3 "" H 9200 1200 50  0001 C CNN
	1    9200 1400
	1    0    0    -1  
$EndComp
$Comp
L CG24-cells:V2B U15R61
U 1 1 5EB276D9
P 9200 2000
F 0 "U15R61" H 9200 2317 50  0000 C CNN
F 1 "V2B" H 9200 2226 50  0000 C CNN
F 2 "" H 9200 1800 50  0001 C CNN
F 3 "" H 9200 1800 50  0001 C CNN
	1    9200 2000
	1    0    0    -1  
$EndComp
$Comp
L CG24-cells:V2B U13R61
U 1 1 5EB1FE95
P 9200 2600
F 0 "U13R61" H 9200 2917 50  0000 C CNN
F 1 "V2B" H 9200 2826 50  0000 C CNN
F 2 "" H 9200 2400 50  0001 C CNN
F 3 "" H 9200 2400 50  0001 C CNN
	1    9200 2600
	1    0    0    -1  
$EndComp
$Comp
L CG24-cells:V2B U20R72
U 1 1 5EB29D5A
P 9200 3200
F 0 "U20R72" H 9200 3517 50  0000 C CNN
F 1 "V2B" H 9200 3426 50  0000 C CNN
F 2 "" H 9200 3000 50  0001 C CNN
F 3 "" H 9200 3000 50  0001 C CNN
	1    9200 3200
	1    0    0    -1  
$EndComp
$Comp
L CG24-cells:V2B U18R72
U 1 1 5EB2A929
P 9200 3800
F 0 "U18R72" H 9200 4117 50  0000 C CNN
F 1 "V2B" H 9200 4026 50  0000 C CNN
F 2 "" H 9200 3600 50  0001 C CNN
F 3 "" H 9200 3600 50  0001 C CNN
	1    9200 3800
	1    0    0    -1  
$EndComp
$Comp
L CG24-cells:V2B U21R72
U 1 1 5EB2C41E
P 9200 4400
F 0 "U21R72" H 9200 4717 50  0000 C CNN
F 1 "V2B" H 9200 4626 50  0000 C CNN
F 2 "" H 9200 4200 50  0001 C CNN
F 3 "" H 9200 4200 50  0001 C CNN
	1    9200 4400
	1    0    0    -1  
$EndComp
$Comp
L CG24-cells:V2B U20R82
U 1 1 5EB218A5
P 9200 5000
F 0 "U20R82" H 9200 5317 50  0000 C CNN
F 1 "V2B" H 9200 5226 50  0000 C CNN
F 2 "" H 9200 4800 50  0001 C CNN
F 3 "" H 9200 4800 50  0001 C CNN
	1    9200 5000
	1    0    0    -1  
$EndComp
$Comp
L CG24-cells:V2B U13R123
U 1 1 5EB3424F
P 9200 5600
F 0 "U13R123" H 9200 5917 50  0000 C CNN
F 1 "V2B" H 9200 5826 50  0000 C CNN
F 2 "" H 9200 5400 50  0001 C CNN
F 3 "" H 9200 5400 50  0001 C CNN
	1    9200 5600
	1    0    0    -1  
$EndComp
Wire Wire Line
	2750 1800 2850 1800
Wire Wire Line
	2850 1800 2850 1400
Wire Wire Line
	2850 1400 4400 1400
Connection ~ 2850 1800
Wire Wire Line
	2850 1800 2950 1800
Wire Wire Line
	2750 2400 2850 2400
Wire Wire Line
	2850 2400 2850 2000
Wire Wire Line
	2850 2000 4400 2000
Connection ~ 2850 2400
Wire Wire Line
	2850 2400 2950 2400
Wire Wire Line
	2750 3000 2850 3000
Wire Wire Line
	2850 3000 2850 2600
Wire Wire Line
	2850 2600 4400 2600
Connection ~ 2850 3000
Wire Wire Line
	2850 3000 2950 3000
Wire Wire Line
	2750 3600 2850 3600
Wire Wire Line
	2850 3600 2850 3200
Wire Wire Line
	2850 3200 4400 3200
Connection ~ 2850 3600
Wire Wire Line
	2850 3600 2950 3600
Wire Wire Line
	2750 4200 2850 4200
Wire Wire Line
	2850 4200 2850 3800
Wire Wire Line
	2850 3800 4400 3800
Connection ~ 2850 4200
Wire Wire Line
	2850 4200 2950 4200
Wire Wire Line
	2750 4800 2850 4800
Wire Wire Line
	2850 4800 2850 4400
Wire Wire Line
	2850 4400 4400 4400
Connection ~ 2850 4800
Wire Wire Line
	2850 4800 2950 4800
Wire Wire Line
	2750 5400 2850 5400
Wire Wire Line
	2850 5400 2850 5000
Wire Wire Line
	2850 5000 4400 5000
Connection ~ 2850 5400
Wire Wire Line
	2850 5400 2950 5400
Wire Wire Line
	2750 6000 2850 6000
Wire Wire Line
	2850 6000 2850 5600
Wire Wire Line
	2850 5600 4400 5600
Connection ~ 2850 6000
Wire Wire Line
	2850 6000 2950 6000
Wire Wire Line
	6650 6000 6300 6000
Text Label 6550 6000 2    50   ~ 0
IN0
Text Label 2050 2400 2    50   ~ 0
IN14
Text Label 2050 3000 2    50   ~ 0
IN13
Text Label 2050 3600 2    50   ~ 0
IN12
Text Label 2050 4200 2    50   ~ 0
IN11
Text Label 2050 4800 2    50   ~ 0
IN10
Text Label 2050 5400 2    50   ~ 0
IN9
Text Label 2050 6000 2    50   ~ 0
IN8
Text Label 6550 1800 2    50   ~ 0
IN7
Text Label 6550 2400 2    50   ~ 0
IN6
Text Label 6550 3000 2    50   ~ 0
IN5
Text Label 6550 3600 2    50   ~ 0
IN4
Text Label 6550 4200 2    50   ~ 0
IN3
Text Label 6550 4800 2    50   ~ 0
IN2
Text Label 6550 5400 2    50   ~ 0
IN1
Wire Wire Line
	2150 2400 1800 2400
Wire Wire Line
	2150 3000 1800 3000
Wire Wire Line
	2150 3600 1800 3600
Wire Wire Line
	2150 4200 1800 4200
Wire Wire Line
	2150 4800 1800 4800
Wire Wire Line
	2150 5400 1800 5400
Wire Wire Line
	2150 6000 1800 6000
Wire Wire Line
	6650 1800 6300 1800
Wire Wire Line
	6650 2400 6300 2400
Wire Wire Line
	6650 3000 6300 3000
Wire Wire Line
	6650 3600 6300 3600
Wire Wire Line
	6650 4200 6300 4200
Wire Wire Line
	6650 4800 6300 4800
Wire Wire Line
	6650 5400 6300 5400
Wire Wire Line
	2150 1800 1800 1800
Text Label 2050 1800 2    50   ~ 0
IN15
Text Label 8150 6000 0    50   ~ 0
OUT0
Text Label 8150 5400 0    50   ~ 0
OUT1
Text Label 8150 4800 0    50   ~ 0
OUT2
Text Label 8150 4200 0    50   ~ 0
OUT3
Text Label 8150 3600 0    50   ~ 0
OUT4
Text Label 8150 3000 0    50   ~ 0
OUT5
Text Label 8150 2400 0    50   ~ 0
OUT6
Text Label 8150 1800 0    50   ~ 0
OUT7
Text Label 3650 6000 0    50   ~ 0
OUT8
Text Label 3650 5400 0    50   ~ 0
OUT9
Text Label 3650 4800 0    50   ~ 0
OUT10
Text Label 3650 4200 0    50   ~ 0
OUT11
Text Label 3650 3600 0    50   ~ 0
OUT12
Text Label 3650 3000 0    50   ~ 0
OUT13
Text Label 3650 2400 0    50   ~ 0
OUT14
Text Label 3650 1800 0    50   ~ 0
OUT15
Wire Wire Line
	8050 6000 8500 6000
Wire Wire Line
	8050 5400 8500 5400
Wire Wire Line
	8050 4800 8500 4800
Wire Wire Line
	8050 4200 8500 4200
Wire Wire Line
	8050 3600 8500 3600
Wire Wire Line
	8050 3000 8500 3000
Wire Wire Line
	8050 2400 8500 2400
Wire Wire Line
	8050 1800 8500 1800
Wire Wire Line
	3550 6000 4000 6000
Wire Wire Line
	3550 5400 4000 5400
Wire Wire Line
	3550 4800 4000 4800
Wire Wire Line
	3550 4200 4000 4200
Wire Wire Line
	3550 3600 4000 3600
Wire Wire Line
	3550 3000 4000 3000
Wire Wire Line
	3550 2400 4000 2400
Wire Wire Line
	3550 1800 4000 1800
Entry Wire Line
	1700 1700 1800 1800
Entry Wire Line
	1700 2300 1800 2400
Entry Wire Line
	1700 2900 1800 3000
Entry Wire Line
	1700 3500 1800 3600
Entry Wire Line
	1700 4100 1800 4200
Entry Wire Line
	1700 4700 1800 4800
Entry Wire Line
	1700 5300 1800 5400
Entry Wire Line
	1700 5900 1800 6000
Entry Wire Line
	4100 1700 4000 1800
Entry Wire Line
	4100 2300 4000 2400
Entry Wire Line
	4100 2900 4000 3000
Entry Wire Line
	4100 3500 4000 3600
Entry Wire Line
	4100 4100 4000 4200
Entry Wire Line
	4100 4700 4000 4800
Entry Wire Line
	4100 5300 4000 5400
Entry Wire Line
	4100 5900 4000 6000
Text Label 9600 5600 0    50   ~ 0
DATA0
Text Label 9600 5000 0    50   ~ 0
DATA1
Text Label 9600 4400 0    50   ~ 0
DATA2
Text Label 9600 3800 0    50   ~ 0
DATA3
Text Label 9600 3200 0    50   ~ 0
DATA4
Text Label 9600 2600 0    50   ~ 0
DATA5
Text Label 9600 2000 0    50   ~ 0
DATA6
Text Label 9600 1400 0    50   ~ 0
DATA7
Text Label 5100 5600 0    50   ~ 0
DATA8
Text Label 5100 5000 0    50   ~ 0
DATA9
Text Label 5100 4400 0    50   ~ 0
DATA10
Text Label 5100 3800 0    50   ~ 0
DATA11
Text Label 5100 3200 0    50   ~ 0
DATA12
Text Label 5100 2600 0    50   ~ 0
DATA13
Text Label 5100 2000 0    50   ~ 0
DATA14
Text Label 5100 1400 0    50   ~ 0
DATA15
Wire Wire Line
	9500 5600 10000 5600
Wire Wire Line
	9500 5000 10000 5000
Wire Wire Line
	9500 4400 10000 4400
Wire Wire Line
	9500 3800 10000 3800
Wire Wire Line
	9500 3200 10000 3200
Wire Wire Line
	9500 2600 10000 2600
Wire Wire Line
	9500 2000 10000 2000
Wire Wire Line
	9500 1400 10000 1400
Wire Wire Line
	5000 5600 5500 5600
Wire Wire Line
	5000 5000 5500 5000
Wire Wire Line
	5000 4400 5500 4400
Wire Wire Line
	5000 3800 5500 3800
Wire Wire Line
	5000 3200 5500 3200
Wire Wire Line
	5000 2600 5500 2600
Wire Wire Line
	5000 2000 5500 2000
Wire Wire Line
	5000 1400 5500 1400
Entry Wire Line
	5600 1300 5500 1400
Entry Wire Line
	5600 1900 5500 2000
Entry Wire Line
	5600 2500 5500 2600
Entry Wire Line
	5600 3100 5500 3200
Entry Wire Line
	5600 3700 5500 3800
Entry Wire Line
	5600 4300 5500 4400
Entry Wire Line
	5600 4900 5500 5000
Entry Wire Line
	5600 5500 5500 5600
Wire Wire Line
	7250 1800 7350 1800
Wire Wire Line
	7350 1800 7350 1400
Wire Wire Line
	7350 1400 8900 1400
Connection ~ 7350 1800
Wire Wire Line
	7350 1800 7450 1800
Wire Wire Line
	7250 2400 7350 2400
Wire Wire Line
	7350 2400 7350 2000
Wire Wire Line
	7350 2000 8900 2000
Connection ~ 7350 2400
Wire Wire Line
	7350 2400 7450 2400
Wire Wire Line
	7250 3000 7350 3000
Wire Wire Line
	7350 3000 7350 2600
Wire Wire Line
	7350 2600 8900 2600
Connection ~ 7350 3000
Wire Wire Line
	7350 3000 7450 3000
Wire Wire Line
	7250 3600 7350 3600
Wire Wire Line
	7350 3600 7350 3200
Wire Wire Line
	7350 3200 8900 3200
Connection ~ 7350 3600
Wire Wire Line
	7350 3600 7450 3600
Wire Wire Line
	7250 4200 7350 4200
Wire Wire Line
	7350 4200 7350 3800
Wire Wire Line
	7350 3800 8900 3800
Connection ~ 7350 4200
Wire Wire Line
	7350 4200 7450 4200
Wire Wire Line
	7250 4800 7350 4800
Wire Wire Line
	7350 4800 7350 4400
Wire Wire Line
	7350 4400 8900 4400
Connection ~ 7350 4800
Wire Wire Line
	7350 4800 7450 4800
Wire Wire Line
	7250 5400 7350 5400
Wire Wire Line
	7350 5400 7350 5000
Wire Wire Line
	7350 5000 8900 5000
Connection ~ 7350 5400
Wire Wire Line
	7350 5400 7450 5400
Wire Wire Line
	7250 6000 7350 6000
Wire Wire Line
	7350 6000 7350 5600
Wire Wire Line
	7350 5600 8900 5600
Connection ~ 7350 6000
Wire Wire Line
	7350 6000 7450 6000
Entry Wire Line
	6200 1700 6300 1800
Entry Wire Line
	6200 2300 6300 2400
Entry Wire Line
	6200 2900 6300 3000
Entry Wire Line
	6200 3500 6300 3600
Entry Wire Line
	6200 4100 6300 4200
Entry Wire Line
	6200 4700 6300 4800
Entry Wire Line
	6200 5300 6300 5400
Entry Wire Line
	6200 5900 6300 6000
Entry Wire Line
	8600 1700 8500 1800
Entry Wire Line
	8600 2300 8500 2400
Entry Wire Line
	8600 2900 8500 3000
Entry Wire Line
	8600 3500 8500 3600
Entry Wire Line
	8600 4100 8500 4200
Entry Wire Line
	8600 4700 8500 4800
Entry Wire Line
	8600 5300 8500 5400
Entry Wire Line
	8600 5900 8500 6000
Entry Wire Line
	10100 1300 10000 1400
Entry Wire Line
	10100 1900 10000 2000
Entry Wire Line
	10100 2500 10000 2600
Entry Wire Line
	10100 3100 10000 3200
Entry Wire Line
	10100 3700 10000 3800
Entry Wire Line
	10100 4300 10000 4400
Entry Wire Line
	10100 4900 10000 5000
Entry Wire Line
	10100 5500 10000 5600
Wire Bus Line
	5600 800  10100 800 
Wire Bus Line
	4100 900  8600 900 
Wire Bus Line
	6200 1000 1700 1000
Connection ~ 1700 1000
Wire Bus Line
	1050 1000 1700 1000
Text HLabel 1050 1000 0    50   Input ~ 0
IN[0..15]
Text HLabel 10500 900  2    50   Output ~ 0
OUT[0..15]
Text HLabel 10500 800  2    50   Output ~ 0
DATA[0..15]
Wire Bus Line
	8600 900  10500 900 
Connection ~ 8600 900 
Wire Bus Line
	10500 800  10100 800 
Connection ~ 10100 800 
Text Label 2500 6700 0    50   ~ 0
DATA0
Text Label 2500 6800 0    50   ~ 0
DATA1
Text Label 2500 6900 0    50   ~ 0
DATA2
Text Label 2500 7000 0    50   ~ 0
DATA3
Text Label 2500 7100 0    50   ~ 0
DATA4
Text Label 2500 7200 0    50   ~ 0
DATA5
Text Label 2500 7300 0    50   ~ 0
DATA6
Text Label 2500 7400 0    50   ~ 0
DATA7
Text Label 3650 6700 0    50   ~ 0
DATA8
Text Label 3650 6800 0    50   ~ 0
DATA9
Text Label 3650 6900 0    50   ~ 0
DATA10
Text Label 3650 7000 0    50   ~ 0
DATA11
Text Label 3650 7100 0    50   ~ 0
DATA12
Text Label 3650 7200 0    50   ~ 0
DATA13
Text Label 3650 7300 0    50   ~ 0
DATA14
Text Label 3650 7400 0    50   ~ 0
DATA15
Entry Wire Line
	2850 7400 2950 7300
Entry Wire Line
	2850 7300 2950 7200
Entry Wire Line
	2850 7200 2950 7100
Entry Wire Line
	2850 7100 2950 7000
Entry Wire Line
	2850 7000 2950 6900
Entry Wire Line
	2850 6900 2950 6800
Entry Wire Line
	2850 6800 2950 6700
Entry Wire Line
	2850 6700 2950 6600
Entry Wire Line
	4000 7400 4100 7300
Entry Wire Line
	4000 7300 4100 7200
Entry Wire Line
	4000 7200 4100 7100
Entry Wire Line
	4000 7100 4100 7000
Entry Wire Line
	4000 7000 4100 6900
Entry Wire Line
	4000 6900 4100 6800
Entry Wire Line
	4000 6800 4100 6700
Entry Wire Line
	4000 6700 4100 6600
Wire Bus Line
	5600 6300 4100 6300
Connection ~ 4100 6300
Wire Bus Line
	4100 6300 2950 6300
Wire Wire Line
	2200 6700 2850 6700
Wire Wire Line
	2200 6800 2850 6800
Wire Wire Line
	2200 6900 2850 6900
Wire Wire Line
	2200 7000 2850 7000
Wire Wire Line
	2200 7100 2850 7100
Wire Wire Line
	2200 7200 2850 7200
Wire Wire Line
	2200 7300 2850 7300
Wire Wire Line
	2200 7400 2850 7400
Text Label 2250 6700 0    50   ~ 0
A0
Text Label 2250 6800 0    50   ~ 0
A1
Text Label 2250 6900 0    50   ~ 0
A2
Text Label 2250 7000 0    50   ~ 0
A3
Text Label 2250 7100 0    50   ~ 0
A4
Text Label 2250 7200 0    50   ~ 0
A5
Text Label 2250 7300 0    50   ~ 0
A6
Text Label 2250 7400 0    50   ~ 0
A7
Wire Wire Line
	3350 6700 4000 6700
Wire Wire Line
	3350 6800 4000 6800
Wire Wire Line
	3350 6900 4000 6900
Wire Wire Line
	3350 7000 4000 7000
Wire Wire Line
	3350 7100 4000 7100
Wire Wire Line
	3350 7200 4000 7200
Wire Wire Line
	3350 7300 4000 7300
Wire Wire Line
	3350 7400 4000 7400
Text Label 3400 6700 0    50   ~ 0
B0
Text Label 3400 6800 0    50   ~ 0
B1
Text Label 3400 6900 0    50   ~ 0
B2
Text Label 3400 7000 0    50   ~ 0
B3
Text Label 3400 7100 0    50   ~ 0
B4
Text Label 3400 7200 0    50   ~ 0
B5
Text Label 3400 7300 0    50   ~ 0
B6
Text Label 3400 7400 0    50   ~ 0
B7
Entry Wire Line
	3250 7500 3350 7400
Entry Wire Line
	3250 7400 3350 7300
Entry Wire Line
	3250 7300 3350 7200
Entry Wire Line
	3250 7200 3350 7100
Entry Wire Line
	3250 7100 3350 7000
Entry Wire Line
	3250 7000 3350 6900
Entry Wire Line
	3250 6900 3350 6800
Entry Wire Line
	3250 6800 3350 6700
Entry Wire Line
	2100 7500 2200 7400
Entry Wire Line
	2100 7400 2200 7300
Entry Wire Line
	2100 7300 2200 7200
Entry Wire Line
	2100 7200 2200 7100
Entry Wire Line
	2100 7100 2200 7000
Entry Wire Line
	2100 7000 2200 6900
Entry Wire Line
	2100 6900 2200 6800
Entry Wire Line
	2100 6800 2200 6700
Wire Bus Line
	3250 7650 3050 7650
Wire Bus Line
	2100 7650 1900 7650
Wire Bus Line
	4100 6300 4100 7300
Wire Bus Line
	2950 6300 2950 7300
Wire Bus Line
	10100 800  10100 5500
Wire Bus Line
	8600 900  8600 5900
Wire Bus Line
	6200 1000 6200 5900
Wire Bus Line
	5600 800  5600 6300
Wire Bus Line
	4100 900  4100 5900
Wire Bus Line
	1700 1000 1700 5900
Wire Bus Line
	3250 6800 3250 7650
Wire Bus Line
	2100 6800 2100 7650
Text HLabel 3050 7650 0    50   Output ~ 0
B[0..7]
Text HLabel 1900 7650 0    50   Output ~ 0
A[0..7]
$EndSCHEMATC
