EESchema Schematic File Version 4
EELAYER 30 0
EELAYER END
$Descr A4 11693 8268
encoding utf-8
Sheet 14 83
Title "CPS Reverse Engineering: DL-0311"
Date "2021-09-12"
Rev ""
Comp ""
Comment1 ""
Comment2 ""
Comment3 "Licence: CC-BY"
Comment4 "Author: Loïc *WydD* Petit"
$EndDescr
Connection ~ 5600 3400
Connection ~ 5500 4550
Connection ~ 4050 5100
Connection ~ 5600 4450
Connection ~ 4250 5300
Connection ~ 4150 5200
Connection ~ 3950 5000
Connection ~ 4150 3100
Connection ~ 3950 2900
Connection ~ 4050 3000
Connection ~ 5500 3500
Connection ~ 5500 2450
Connection ~ 4250 3200
Connection ~ 4400 2450
Connection ~ 7600 5500
Connection ~ 9600 4500
Connection ~ 3450 3950
Connection ~ 4500 3400
Entry Wire Line
	3450 2800 3550 2900
Entry Wire Line
	3450 2900 3550 3000
Entry Wire Line
	3450 3300 3550 3200
Entry Wire Line
	3450 4900 3550 5000
Entry Wire Line
	3450 5000 3550 5100
Entry Wire Line
	3450 5100 3550 5200
Entry Wire Line
	3450 5200 3550 5300
Entry Wire Line
	9000 4650 8900 4750
Entry Wire Line
	9000 4750 8900 4850
Entry Wire Line
	9000 4850 8900 4950
Entry Wire Line
	9000 4950 8900 5050
Entry Wire Line
	9050 2650 9150 2550
Entry Wire Line
	9050 2750 9150 2650
Entry Wire Line
	9600 3350 9500 3250
Wire Wire Line
	2550 3150 2850 3150
Wire Wire Line
	3400 3100 4150 3100
Wire Wire Line
	3550 3000 4050 3000
Wire Wire Line
	3550 3200 4250 3200
Wire Wire Line
	3550 5100 4050 5100
Wire Wire Line
	3550 5300 4250 5300
Wire Wire Line
	3950 1850 4600 1850
Wire Wire Line
	3950 2900 3550 2900
Wire Wire Line
	3950 2900 3950 1850
Wire Wire Line
	3950 2900 5700 2900
Wire Wire Line
	3950 3950 4600 3950
Wire Wire Line
	3950 5000 3550 5000
Wire Wire Line
	3950 5000 3950 3950
Wire Wire Line
	3950 5000 5700 5000
Wire Wire Line
	4050 1950 4050 3000
Wire Wire Line
	4050 1950 4600 1950
Wire Wire Line
	4050 3000 5700 3000
Wire Wire Line
	4050 4050 4050 5100
Wire Wire Line
	4050 4050 4600 4050
Wire Wire Line
	4050 5100 5700 5100
Wire Wire Line
	4150 2050 4600 2050
Wire Wire Line
	4150 3100 4150 2050
Wire Wire Line
	4150 3100 5700 3100
Wire Wire Line
	4150 4150 4600 4150
Wire Wire Line
	4150 5200 3550 5200
Wire Wire Line
	4150 5200 4150 4150
Wire Wire Line
	4150 5200 5700 5200
Wire Wire Line
	4250 2150 4250 3200
Wire Wire Line
	4250 2150 4600 2150
Wire Wire Line
	4250 3200 5700 3200
Wire Wire Line
	4250 4250 4250 5300
Wire Wire Line
	4250 4250 4600 4250
Wire Wire Line
	4250 5300 5700 5300
Wire Wire Line
	4400 2450 4600 2450
Wire Wire Line
	4400 4550 4400 2450
Wire Wire Line
	4500 2350 4500 3400
Wire Wire Line
	4500 2350 4600 2350
Wire Wire Line
	4500 3400 4250 3400
Wire Wire Line
	4500 3400 4500 4450
Wire Wire Line
	4500 4450 4600 4450
Wire Wire Line
	4600 4550 4400 4550
Wire Wire Line
	5400 1850 5700 1850
Wire Wire Line
	5400 1950 5700 1950
Wire Wire Line
	5400 2050 5700 2050
Wire Wire Line
	5400 2150 5700 2150
Wire Wire Line
	5400 3950 5700 3950
Wire Wire Line
	5400 4050 5700 4050
Wire Wire Line
	5400 4150 5700 4150
Wire Wire Line
	5400 4250 5700 4250
Wire Wire Line
	5500 2450 5700 2450
Wire Wire Line
	5500 3500 5500 2450
Wire Wire Line
	5500 3500 5700 3500
Wire Wire Line
	5500 4550 5500 3500
Wire Wire Line
	5500 4550 5500 5600
Wire Wire Line
	5500 4550 5700 4550
Wire Wire Line
	5500 5600 5700 5600
Wire Wire Line
	5600 2350 5700 2350
Wire Wire Line
	5600 3400 5350 3400
Wire Wire Line
	5600 3400 5600 2350
Wire Wire Line
	5600 3400 5600 4450
Wire Wire Line
	5600 4450 5600 5500
Wire Wire Line
	5600 4450 5700 4450
Wire Wire Line
	5700 3400 5600 3400
Wire Wire Line
	5700 5500 5600 5500
Wire Wire Line
	6500 1850 7400 1850
Wire Wire Line
	6500 1950 7300 1950
Wire Wire Line
	6500 2050 7200 2050
Wire Wire Line
	6500 2150 7100 2150
Wire Wire Line
	6500 2900 7700 2900
Wire Wire Line
	6500 3000 7700 3000
Wire Wire Line
	6500 3100 7700 3100
Wire Wire Line
	6500 3200 7700 3200
Wire Wire Line
	6500 3950 7400 3950
Wire Wire Line
	6500 4050 7300 4050
Wire Wire Line
	6500 4150 7200 4150
Wire Wire Line
	6500 4250 7100 4250
Wire Wire Line
	6500 5000 7700 5000
Wire Wire Line
	6500 5100 7700 5100
Wire Wire Line
	6500 5200 7700 5200
Wire Wire Line
	6500 5300 7700 5300
Wire Wire Line
	7100 2700 7100 2150
Wire Wire Line
	7100 4800 7100 4250
Wire Wire Line
	7200 2050 7200 2600
Wire Wire Line
	7200 2600 7700 2600
Wire Wire Line
	7200 4150 7200 4700
Wire Wire Line
	7200 4700 7700 4700
Wire Wire Line
	7300 2500 7300 1950
Wire Wire Line
	7300 4600 7300 4050
Wire Wire Line
	7400 1850 7400 2400
Wire Wire Line
	7400 2400 7700 2400
Wire Wire Line
	7400 3950 7400 4500
Wire Wire Line
	7400 4500 7700 4500
Wire Wire Line
	7500 5500 7600 5500
Wire Wire Line
	7500 5600 7700 5600
Wire Wire Line
	7600 3400 7600 5500
Wire Wire Line
	7600 5500 7700 5500
Wire Wire Line
	7700 2500 7300 2500
Wire Wire Line
	7700 2700 7100 2700
Wire Wire Line
	7700 3400 7600 3400
Wire Wire Line
	7700 4600 7300 4600
Wire Wire Line
	7700 4800 7100 4800
Wire Wire Line
	8700 2650 9050 2650
Wire Wire Line
	8700 2750 9050 2750
Wire Wire Line
	8700 2950 8700 3250
Wire Wire Line
	8700 4750 8900 4750
Wire Wire Line
	8700 4850 8900 4850
Wire Wire Line
	8700 4950 8900 4950
Wire Wire Line
	8700 5050 8900 5050
Wire Wire Line
	9300 3250 9500 3250
Wire Bus Line
	3350 3950 3450 3950
Wire Bus Line
	3450 2700 3350 2700
Wire Bus Line
	3450 3300 3450 3950
Wire Bus Line
	9000 4500 9600 4500
Wire Bus Line
	9150 2450 9250 2450
Wire Bus Line
	9600 4500 9600 3350
Wire Bus Line
	9600 4500 9700 4500
Text Label 3550 2900 0    50   ~ 0
_CPC1
Text Label 3550 3000 0    50   ~ 0
_CPC0
Text Label 3550 3200 0    50   ~ 0
_CB4
Text Label 3550 5000 0    50   ~ 0
_CB3
Text Label 3550 5100 0    50   ~ 0
_CB2
Text Label 3550 5200 0    50   ~ 0
_CB1
Text Label 3550 5300 0    50   ~ 0
_CB0
Text Label 8700 4750 0    50   ~ 0
CB3
Text Label 8700 4850 0    50   ~ 0
CB2
Text Label 8700 4950 0    50   ~ 0
CB1
Text Label 8700 5050 0    50   ~ 0
CB0
Text Label 8750 2650 0    50   ~ 0
CPC1
Text Label 8750 2750 0    50   ~ 0
CPC0
Text Label 9300 3250 0    50   ~ 0
CB4
Text HLabel 2000 3100 0    50   Input ~ 0
FLIP
Text HLabel 2000 3200 0    50   Input ~ 0
SCROLL3-T
Text HLabel 2850 3050 0    50   Input ~ 0
_XFLIP
Text HLabel 3350 2700 0    50   Input ~ 0
_CPC[0..1]
Text HLabel 3350 3950 0    50   Input ~ 0
_CB[0..4]
Text HLabel 4250 3400 0    50   Input ~ 0
CLK-~CHNL
Text HLabel 5350 3400 0    50   Input ~ 0
CLK-CHNL
Text HLabel 7500 5500 0    50   Input ~ 0
GFX-CHNL
Text HLabel 7500 5600 0    50   Input ~ 0
~ENABLE-ATTR
Text HLabel 8700 2850 2    50   Output ~ 0
XSEL
Text HLabel 9250 2450 2    50   Output ~ 0
CPC[0..1]
Text HLabel 9700 4500 2    50   3State ~ 0
CB[0..4]
$Comp
L power:VCC #PWR0175
U 1 1 61118E3B
P 4400 2450
F 0 "#PWR0175" H 4400 2300 50  0001 C CNN
F 1 "VCC" H 4415 2623 50  0000 C CNN
F 2 "" H 4400 2450 50  0001 C CNN
F 3 "" H 4400 2450 50  0001 C CNN
	1    4400 2450
	1    0    0    -1  
$EndComp
$Comp
L power:VCC #PWR0176
U 1 1 61118E3C
P 5500 2450
F 0 "#PWR0176" H 5500 2300 50  0001 C CNN
F 1 "VCC" H 5515 2623 50  0000 C CNN
F 2 "" H 5500 2450 50  0001 C CNN
F 3 "" H 5500 2450 50  0001 C CNN
	1    5500 2450
	1    0    0    -1  
$EndComp
$Comp
L power:GND #PWR0174
U 1 1 74B70A71
P 7700 3550
F 0 "#PWR0174" H 7700 3300 50  0001 C CNN
F 1 "GND" H 7705 3377 50  0001 C CNN
F 2 "" H 7700 3550 50  0001 C CNN
F 3 "" H 7700 3550 50  0001 C CNN
	1    7700 3550
	1    0    0    -1  
$EndComp
$Comp
L A5C:NAND02 UEC142
U 1 1 6EA6782C
P 2250 3150
F 0 "UEC142" H 2275 3417 50  0000 C CNN
F 1 "NAND02" H 2275 3326 50  0000 C CNN
F 2 "" H 2250 3150 50  0001 C CNN
F 3 "" H 2250 3150 50  0001 C CNN
	1    2250 3150
	1    0    0    -1  
$EndComp
$Comp
L A5C:XNOR02 UEC145
U 1 1 6EA5F79A
P 3100 3100
F 0 "UEC145" H 3125 3367 50  0000 C CNN
F 1 "XNOR02" H 3125 3276 50  0000 C CNN
F 2 "" H 3125 3100 50  0001 C CNN
F 3 "" H 3125 3100 50  0001 C CNN
	1    3100 3100
	1    0    0    -1  
$EndComp
$Comp
L A5C:BUF12 UEE219
U 1 1 75BCEB23
P 9000 3250
F 0 "UEE219" H 9000 3567 50  0000 C CNN
F 1 "BUF12" H 9000 3476 50  0000 C CNN
F 2 "" H 9000 3250 50  0001 C CNN
F 3 "" H 9000 3250 50  0001 C CNN
	1    9000 3250
	1    0    0    -1  
$EndComp
$Comp
L A5C:M175C UEC167
U 1 1 7047076D
P 5000 2150
F 0 "UEC167" H 5000 2715 50  0000 C CNN
F 1 "M175C" H 5000 2624 50  0000 C CNN
F 2 "" H 5000 1950 50  0001 C CNN
F 3 "" H 5000 1950 50  0001 C CNN
	1    5000 2150
	1    0    0    -1  
$EndComp
$Comp
L A5C:M175C UEA36
U 1 1 739B695F
P 5000 4250
F 0 "UEA36" H 5000 4815 50  0000 C CNN
F 1 "M175C" H 5000 4724 50  0000 C CNN
F 2 "" H 5000 4050 50  0001 C CNN
F 3 "" H 5000 4050 50  0001 C CNN
	1    5000 4250
	1    0    0    -1  
$EndComp
$Comp
L A5C:M175CL UED167
U 1 1 6FA0D8BC
P 6100 2150
F 0 "UED167" H 6100 2715 50  0000 C CNN
F 1 "M175CL" H 6100 2624 50  0000 C CNN
F 2 "" H 6100 1950 50  0001 C CNN
F 3 "" H 6100 1950 50  0001 C CNN
	1    6100 2150
	1    0    0    -1  
$EndComp
$Comp
L A5C:M175CL UEC189
U 1 1 6FA08FDD
P 6100 3200
F 0 "UEC189" H 6100 3765 50  0000 C CNN
F 1 "M175CL" H 6100 3674 50  0000 C CNN
F 2 "" H 6100 3000 50  0001 C CNN
F 3 "" H 6100 3000 50  0001 C CNN
	1    6100 3200
	1    0    0    -1  
$EndComp
$Comp
L A5C:M175C UEA65
U 1 1 6C2DB2E8
P 6100 4250
F 0 "UEA65" H 6100 4815 50  0000 C CNN
F 1 "M175C" H 6100 4724 50  0000 C CNN
F 2 "" H 6100 4050 50  0001 C CNN
F 3 "" H 6100 4050 50  0001 C CNN
	1    6100 4250
	1    0    0    -1  
$EndComp
$Comp
L A5C:M175C UEB64
U 1 1 6C2DB2DC
P 6100 5300
F 0 "UEB64" H 6100 5865 50  0000 C CNN
F 1 "M175C" H 6100 5774 50  0000 C CNN
F 2 "" H 6100 5100 50  0001 C CNN
F 3 "" H 6100 5100 50  0001 C CNN
	1    6100 5300
	1    0    0    -1  
$EndComp
$Comp
L A5C:MUX24GH UEB84
U 1 1 68EA86FC
P 8200 5100
F 0 "UEB84" H 8200 5965 50  0000 C CNN
F 1 "MUX24GH" H 8200 5874 50  0000 C CNN
F 2 "" H 8200 5100 50  0001 C CNN
F 3 "" H 8200 5100 50  0001 C CNN
	1    8200 5100
	1    0    0    -1  
$EndComp
$Comp
L A5C:M258C UEE171
U 1 1 664C3A21
P 8200 3000
F 0 "UEE171" H 8200 3865 50  0000 C CNN
F 1 "M258C" H 8200 3774 50  0000 C CNN
F 2 "" H 8200 3000 50  0001 C CNN
F 3 "" H 8200 3000 50  0001 C CNN
	1    8200 3000
	1    0    0    -1  
$EndComp
Wire Bus Line
	3450 2700 3450 2900
Wire Bus Line
	9150 2450 9150 2650
Wire Bus Line
	3450 3950 3450 5200
Wire Bus Line
	9000 4500 9000 4950
$EndSCHEMATC
