EESchema Schematic File Version 4
EELAYER 30 0
EELAYER END
$Descr A4 11693 8268
encoding utf-8
Sheet 9 20
Title "DL-1727"
Date "2020-04-26"
Rev ""
Comp ""
Comment1 ""
Comment2 "Licence: CC-BY"
Comment3 "Author: Loic *WydD* Petit"
Comment4 "Project: CPS2 Reverse Engineering: DL-1727"
$EndDescr
Entry Wire Line
	2750 1750 2850 1850
Entry Wire Line
	2850 1200 2750 1100
Entry Wire Line
	2850 2500 2750 2400
Entry Wire Line
	2850 3150 2750 3050
Entry Wire Line
	2850 3800 2750 3700
Entry Wire Line
	2850 4450 2750 4350
Entry Wire Line
	2850 5100 2750 5000
Entry Wire Line
	2850 5750 2750 5650
Wire Wire Line
	2500 2100 3500 2100
Wire Wire Line
	2500 2750 3500 2750
Wire Wire Line
	2500 3400 3500 3400
Wire Wire Line
	2500 4700 3500 4700
Wire Wire Line
	2500 5350 3500 5350
Wire Wire Line
	3500 1450 2500 1450
Wire Wire Line
	3500 6000 2500 6000
Wire Wire Line
	4650 1450 5650 1450
Wire Wire Line
	4650 6000 5650 6000
Wire Wire Line
	5650 2100 4650 2100
Wire Wire Line
	5650 2750 4650 2750
Wire Wire Line
	5650 3400 4650 3400
Wire Wire Line
	5650 4050 4650 4050
Wire Wire Line
	5650 4700 4650 4700
Wire Wire Line
	5650 5350 4650 5350
$Comp
L CG24-cells:V2B U4R61
U 1 1 6947FD86
P 1800 6000
F 0 "U4R61" H 1800 6317 50  0000 C CNN
F 1 "V2B" H 1800 6226 50  0000 C CNN
F 2 "" H 1800 5800 50  0001 C CNN
F 3 "" H 1800 5800 50  0001 C CNN
	1    1800 6000
	1    0    0    -1  
$EndComp
$Comp
L CG24-cells:V2B U4R51
U 1 1 5EB41605
P 1800 6350
F 0 "U4R51" H 1800 6667 50  0000 C CNN
F 1 "V2B" H 1800 6576 50  0000 C CNN
F 2 "" H 1800 6150 50  0001 C CNN
F 3 "" H 1800 6150 50  0001 C CNN
	1    1800 6350
	1    0    0    1   
$EndComp
$Comp
L CG24-cells:V2B U4R72
U 1 1 5EB47FB1
P 6700 6350
F 0 "U4R72" H 6700 6667 50  0000 C CNN
F 1 "V2B" H 6700 6576 50  0000 C CNN
F 2 "" H 6700 6150 50  0001 C CNN
F 3 "" H 6700 6150 50  0001 C CNN
	1    6700 6350
	1    0    0    1   
$EndComp
$Comp
L CG24-cells:V2B U2R71
U 1 1 69558041
P 6700 6000
F 0 "U2R71" H 6700 6317 50  0000 C CNN
F 1 "V2B" H 6700 6226 50  0000 C CNN
F 2 "" H 6700 5800 50  0001 C CNN
F 3 "" H 6700 5800 50  0001 C CNN
	1    6700 6000
	1    0    0    -1  
$EndComp
$Comp
L CG24-cells:O4R U4R31
U 1 1 5E9C596F
P 3500 1200
F 0 "U4R31" H 3500 1517 50  0000 C CNN
F 1 "O4R" H 3500 1426 50  0000 C CNN
F 2 "" H 3500 1200 50  0001 C CNN
F 3 "" H 3500 1200 50  0001 C CNN
	1    3500 1200
	1    0    0    -1  
$EndComp
$Comp
L CG24-cells:O4R U4R26
U 1 1 5E9C5977
P 3500 1850
F 0 "U4R26" H 3500 2167 50  0000 C CNN
F 1 "O4R" H 3500 2076 50  0000 C CNN
F 2 "" H 3500 1850 50  0001 C CNN
F 3 "" H 3500 1850 50  0001 C CNN
	1    3500 1850
	1    0    0    -1  
$EndComp
$Comp
L CG24-cells:O4R U4R21
U 1 1 5E9C597D
P 3500 2500
F 0 "U4R21" H 3500 2817 50  0000 C CNN
F 1 "O4R" H 3500 2726 50  0000 C CNN
F 2 "" H 3500 2500 50  0001 C CNN
F 3 "" H 3500 2500 50  0001 C CNN
	1    3500 2500
	1    0    0    -1  
$EndComp
$Comp
L CG24-cells:O4R U2R27
U 1 1 5E9C598D
P 3500 3150
F 0 "U2R27" H 3500 3467 50  0000 C CNN
F 1 "O4R" H 3500 3376 50  0000 C CNN
F 2 "" H 3500 3150 50  0001 C CNN
F 3 "" H 3500 3150 50  0001 C CNN
	1    3500 3150
	1    0    0    -1  
$EndComp
$Comp
L CG24-cells:O4R U2R30
U 1 1 5E9C59B4
P 3500 4450
F 0 "U2R30" H 3500 4767 50  0000 C CNN
F 1 "O4R" H 3500 4676 50  0000 C CNN
F 2 "" H 3500 4450 50  0001 C CNN
F 3 "" H 3500 4450 50  0001 C CNN
	1    3500 4450
	1    0    0    -1  
$EndComp
$Comp
L CG24-cells:O4R U2R32
U 1 1 5E9C598C
P 3500 5100
F 0 "U2R32" H 3500 5417 50  0000 C CNN
F 1 "O4R" H 3500 5326 50  0000 C CNN
F 2 "" H 3500 5100 50  0001 C CNN
F 3 "" H 3500 5100 50  0001 C CNN
	1    3500 5100
	1    0    0    -1  
$EndComp
$Comp
L CG24-cells:O4R U2R42
U 1 1 5E9C5994
P 3500 5750
F 0 "U2R42" H 3500 6067 50  0000 C CNN
F 1 "O4R" H 3500 5976 50  0000 C CNN
F 2 "" H 3500 5750 50  0001 C CNN
F 3 "" H 3500 5750 50  0001 C CNN
	1    3500 5750
	1    0    0    -1  
$EndComp
$Comp
L CG24-cells:B12 U4R34
U 1 1 5E9C58E7
P 4650 1200
F 0 "U4R34" H 4650 1517 50  0000 C CNN
F 1 "B12" H 4650 1426 50  0000 C CNN
F 2 "" H 4650 1200 50  0001 C CNN
F 3 "" H 4650 1200 50  0001 C CNN
	1    4650 1200
	1    0    0    -1  
$EndComp
$Comp
L CG24-cells:B12 U4R29
U 1 1 5E9C58DA
P 4650 1850
F 0 "U4R29" H 4650 2167 50  0000 C CNN
F 1 "B12" H 4650 2076 50  0000 C CNN
F 2 "" H 4650 1850 50  0001 C CNN
F 3 "" H 4650 1850 50  0001 C CNN
	1    4650 1850
	1    0    0    -1  
$EndComp
$Comp
L CG24-cells:B12 U4R24
U 1 1 5E9C58E9
P 4650 2500
F 0 "U4R24" H 4650 2817 50  0000 C CNN
F 1 "B12" H 4650 2726 50  0000 C CNN
F 2 "" H 4650 2500 50  0001 C CNN
F 3 "" H 4650 2500 50  0001 C CNN
	1    4650 2500
	1    0    0    -1  
$EndComp
$Comp
L CG24-cells:B12 U2R39
U 1 1 5E9C58EC
P 4650 3150
F 0 "U2R39" H 4650 3467 50  0000 C CNN
F 1 "B12" H 4650 3376 50  0000 C CNN
F 2 "" H 4650 3150 50  0001 C CNN
F 3 "" H 4650 3150 50  0001 C CNN
	1    4650 3150
	1    0    0    -1  
$EndComp
$Comp
L CG24-cells:B12 U2R25
U 1 1 5E9C58ED
P 4650 3800
F 0 "U2R25" H 4650 4117 50  0000 C CNN
F 1 "B12" H 4650 4026 50  0000 C CNN
F 2 "" H 4650 3800 50  0001 C CNN
F 3 "" H 4650 3800 50  0001 C CNN
	1    4650 3800
	1    0    0    -1  
$EndComp
$Comp
L CG24-cells:B12 U2R37
U 1 1 5E9C58EE
P 4650 4450
F 0 "U2R37" H 4650 4767 50  0000 C CNN
F 1 "B12" H 4650 4676 50  0000 C CNN
F 2 "" H 4650 4450 50  0001 C CNN
F 3 "" H 4650 4450 50  0001 C CNN
	1    4650 4450
	1    0    0    -1  
$EndComp
$Comp
L CG24-cells:B12 U2R35
U 1 1 5E9C58E6
P 4650 5100
F 0 "U2R35" H 4650 5417 50  0000 C CNN
F 1 "B12" H 4650 5326 50  0000 C CNN
F 2 "" H 4650 5100 50  0001 C CNN
F 3 "" H 4650 5100 50  0001 C CNN
	1    4650 5100
	1    0    0    -1  
$EndComp
$Comp
L CG24-cells:B12 U2R45
U 1 1 5E9C58E8
P 4650 5750
F 0 "U2R45" H 4650 6067 50  0000 C CNN
F 1 "B12" H 4650 5976 50  0000 C CNN
F 2 "" H 4650 5750 50  0001 C CNN
F 3 "" H 4650 5750 50  0001 C CNN
	1    4650 5750
	1    0    0    -1  
$EndComp
$Comp
L CG24-cells:B12 U2R58
U 1 1 5E9C58E5
P 9550 1200
F 0 "U2R58" H 9550 1517 50  0000 C CNN
F 1 "B12" H 9550 1426 50  0000 C CNN
F 2 "" H 9550 1200 50  0001 C CNN
F 3 "" H 9550 1200 50  0001 C CNN
	1    9550 1200
	1    0    0    -1  
$EndComp
$Comp
L CG24-cells:B12 U2R56
U 1 1 5E9C58E3
P 9550 1850
F 0 "U2R56" H 9550 2167 50  0000 C CNN
F 1 "B12" H 9550 2076 50  0000 C CNN
F 2 "" H 9550 1850 50  0001 C CNN
F 3 "" H 9550 1850 50  0001 C CNN
	1    9550 1850
	1    0    0    -1  
$EndComp
$Comp
L CG24-cells:B12 U2R60
U 1 1 5E9C58DF
P 9550 2500
F 0 "U2R60" H 9550 2817 50  0000 C CNN
F 1 "B12" H 9550 2726 50  0000 C CNN
F 2 "" H 9550 2500 50  0001 C CNN
F 3 "" H 9550 2500 50  0001 C CNN
	1    9550 2500
	1    0    0    -1  
$EndComp
$Comp
L CG24-cells:B12 U2R67
U 1 1 5E9C58E2
P 9550 3150
F 0 "U2R67" H 9550 3467 50  0000 C CNN
F 1 "B12" H 9550 3376 50  0000 C CNN
F 2 "" H 9550 3150 50  0001 C CNN
F 3 "" H 9550 3150 50  0001 C CNN
	1    9550 3150
	1    0    0    -1  
$EndComp
$Comp
L CG24-cells:B12 U2R79
U 1 1 5E9C58D3
P 9550 3800
F 0 "U2R79" H 9550 4117 50  0000 C CNN
F 1 "B12" H 9550 4026 50  0000 C CNN
F 2 "" H 9550 3800 50  0001 C CNN
F 3 "" H 9550 3800 50  0001 C CNN
	1    9550 3800
	1    0    0    -1  
$EndComp
$Comp
L CG24-cells:B12 U2R77
U 1 1 5E9C58DD
P 9550 4450
F 0 "U2R77" H 9550 4767 50  0000 C CNN
F 1 "B12" H 9550 4676 50  0000 C CNN
F 2 "" H 9550 4450 50  0001 C CNN
F 3 "" H 9550 4450 50  0001 C CNN
	1    9550 4450
	1    0    0    -1  
$EndComp
$Comp
L CG24-cells:B12 U2R81
U 1 1 5E9C58E0
P 9550 5100
F 0 "U2R81" H 9550 5417 50  0000 C CNN
F 1 "B12" H 9550 5326 50  0000 C CNN
F 2 "" H 9550 5100 50  0001 C CNN
F 3 "" H 9550 5100 50  0001 C CNN
	1    9550 5100
	1    0    0    -1  
$EndComp
$Comp
L CG24-cells:B12 U2R88
U 1 1 5E9C58D4
P 9550 5750
F 0 "U2R88" H 9550 6067 50  0000 C CNN
F 1 "B12" H 9550 5976 50  0000 C CNN
F 2 "" H 9550 5750 50  0001 C CNN
F 3 "" H 9550 5750 50  0001 C CNN
	1    9550 5750
	1    0    0    -1  
$EndComp
$Comp
L CG24-cells:O4R U2R51
U 1 1 5E9C59B3
P 8400 1200
F 0 "U2R51" H 8400 1517 50  0000 C CNN
F 1 "O4R" H 8400 1426 50  0000 C CNN
F 2 "" H 8400 1200 50  0001 C CNN
F 3 "" H 8400 1200 50  0001 C CNN
	1    8400 1200
	1    0    0    -1  
$EndComp
$Comp
L CG24-cells:O4R U2R53
U 1 1 5E9C598A
P 8400 1850
F 0 "U2R53" H 8400 2167 50  0000 C CNN
F 1 "O4R" H 8400 2076 50  0000 C CNN
F 2 "" H 8400 1850 50  0001 C CNN
F 3 "" H 8400 1850 50  0001 C CNN
	1    8400 1850
	1    0    0    -1  
$EndComp
$Comp
L CG24-cells:O4R U2R62
U 1 1 5E9C59B9
P 8400 2500
F 0 "U2R62" H 8400 2817 50  0000 C CNN
F 1 "O4R" H 8400 2726 50  0000 C CNN
F 2 "" H 8400 2500 50  0001 C CNN
F 3 "" H 8400 2500 50  0001 C CNN
	1    8400 2500
	1    0    0    -1  
$EndComp
$Comp
L CG24-cells:O4R U2R64
U 1 1 5E9C597F
P 8400 3150
F 0 "U2R64" H 8400 3467 50  0000 C CNN
F 1 "O4R" H 8400 3376 50  0000 C CNN
F 2 "" H 8400 3150 50  0001 C CNN
F 3 "" H 8400 3150 50  0001 C CNN
	1    8400 3150
	1    0    0    -1  
$EndComp
$Comp
L CG24-cells:O4R U2R72
U 1 1 5E9C59B6
P 8400 3800
F 0 "U2R72" H 8400 4117 50  0000 C CNN
F 1 "O4R" H 8400 4026 50  0000 C CNN
F 2 "" H 8400 3800 50  0001 C CNN
F 3 "" H 8400 3800 50  0001 C CNN
	1    8400 3800
	1    0    0    -1  
$EndComp
$Comp
L CG24-cells:O4R U2R74
U 1 1 5E9C597E
P 8400 4450
F 0 "U2R74" H 8400 4767 50  0000 C CNN
F 1 "O4R" H 8400 4676 50  0000 C CNN
F 2 "" H 8400 4450 50  0001 C CNN
F 3 "" H 8400 4450 50  0001 C CNN
	1    8400 4450
	1    0    0    -1  
$EndComp
$Comp
L CG24-cells:O4R U2R83
U 1 1 5E9C599E
P 8400 5100
F 0 "U2R83" H 8400 5417 50  0000 C CNN
F 1 "O4R" H 8400 5326 50  0000 C CNN
F 2 "" H 8400 5100 50  0001 C CNN
F 3 "" H 8400 5100 50  0001 C CNN
	1    8400 5100
	1    0    0    -1  
$EndComp
$Comp
L CG24-cells:O4R U2R85
U 1 1 5E9C5989
P 8400 5750
F 0 "U2R85" H 8400 6067 50  0000 C CNN
F 1 "O4R" H 8400 5976 50  0000 C CNN
F 2 "" H 8400 5750 50  0001 C CNN
F 3 "" H 8400 5750 50  0001 C CNN
	1    8400 5750
	1    0    0    -1  
$EndComp
$Comp
L CG24-cells:O4R U2R22
U 1 1 5E9C5987
P 3500 3800
F 0 "U2R22" H 3500 4117 50  0000 C CNN
F 1 "O4R" H 3500 4026 50  0000 C CNN
F 2 "" H 3500 3800 50  0001 C CNN
F 3 "" H 3500 3800 50  0001 C CNN
	1    3500 3800
	1    0    0    -1  
$EndComp
Wire Wire Line
	2500 4050 3500 4050
Text Label 10150 5750 2    50   ~ 0
IN0
Text Label 10150 5100 2    50   ~ 0
IN1
Text Label 10150 4450 2    50   ~ 0
IN2
Text Label 10150 3800 2    50   ~ 0
IN3
Text Label 10150 3150 2    50   ~ 0
IN4
Text Label 10150 2500 2    50   ~ 0
IN5
Text Label 10150 1850 2    50   ~ 0
IN6
Text Label 10150 1200 2    50   ~ 0
IN7
Text Label 5250 5750 2    50   ~ 0
IN8
Text Label 5250 5100 2    50   ~ 0
IN9
Text Label 5250 4450 2    50   ~ 0
IN10
Text Label 5250 3800 2    50   ~ 0
IN11
Text Label 5250 3150 2    50   ~ 0
IN12
Text Label 5250 2500 2    50   ~ 0
IN13
Text Label 5250 1850 2    50   ~ 0
IN14
Text Label 5250 1200 2    50   ~ 0
IN15
Wire Wire Line
	4950 5750 5300 5750
Wire Wire Line
	4950 5100 5300 5100
Wire Wire Line
	4950 4450 5300 4450
Wire Wire Line
	4950 3800 5300 3800
Wire Wire Line
	4950 3150 5300 3150
Wire Wire Line
	4950 2500 5300 2500
Wire Wire Line
	4950 1850 5300 1850
Wire Wire Line
	4950 1200 5300 1200
Wire Wire Line
	2100 6000 2500 6000
Entry Wire Line
	5400 1750 5300 1850
Entry Wire Line
	5300 1200 5400 1100
Entry Wire Line
	5300 2500 5400 2400
Entry Wire Line
	5300 3150 5400 3050
Entry Wire Line
	5300 3800 5400 3700
Entry Wire Line
	5300 4450 5400 4350
Entry Wire Line
	5300 5100 5400 5000
Entry Wire Line
	5300 5750 5400 5650
Wire Wire Line
	3200 5750 2850 5750
Wire Wire Line
	3200 5100 2850 5100
Wire Wire Line
	3200 4450 2850 4450
Wire Wire Line
	3200 3800 2850 3800
Wire Wire Line
	3200 3150 2850 3150
Wire Wire Line
	3200 2500 2850 2500
Wire Wire Line
	3200 1850 2850 1850
Wire Wire Line
	3200 1200 2850 1200
Text HLabel 9050 5650 0    50   BiDi ~ 0
DATA0
Text HLabel 9050 5000 0    50   BiDi ~ 0
DATA1
Text HLabel 9050 4350 0    50   BiDi ~ 0
DATA2
Text HLabel 9050 3700 0    50   BiDi ~ 0
DATA3
Text HLabel 9050 3050 0    50   BiDi ~ 0
DATA4
Text HLabel 9050 2400 0    50   BiDi ~ 0
DATA5
Text HLabel 9050 1750 0    50   BiDi ~ 0
DATA6
Text HLabel 9050 1100 0    50   BiDi ~ 0
DATA7
Text HLabel 4150 5650 0    50   BiDi ~ 0
DATA8
Text HLabel 4150 5000 0    50   BiDi ~ 0
DATA9
Text HLabel 4150 4350 0    50   BiDi ~ 0
DATA10
Text HLabel 4150 3700 0    50   BiDi ~ 0
DATA11
Text HLabel 4150 3050 0    50   BiDi ~ 0
DATA12
Text HLabel 4150 2400 0    50   BiDi ~ 0
DATA13
Text HLabel 4150 1750 0    50   BiDi ~ 0
DATA14
Text HLabel 4150 1100 0    50   BiDi ~ 0
DATA15
Wire Wire Line
	4350 1200 4250 1200
Wire Wire Line
	4150 1100 4250 1100
Wire Wire Line
	4250 1100 4250 1200
Connection ~ 4250 1200
Wire Wire Line
	4250 1200 3800 1200
Wire Wire Line
	4350 1850 4250 1850
Wire Wire Line
	4150 1750 4250 1750
Wire Wire Line
	4250 1750 4250 1850
Connection ~ 4250 1850
Wire Wire Line
	4250 1850 3800 1850
Wire Wire Line
	4350 2500 4250 2500
Wire Wire Line
	4150 2400 4250 2400
Wire Wire Line
	4250 2400 4250 2500
Connection ~ 4250 2500
Wire Wire Line
	4250 2500 3800 2500
Wire Wire Line
	4350 3150 4250 3150
Wire Wire Line
	4150 3050 4250 3050
Wire Wire Line
	4250 3050 4250 3150
Connection ~ 4250 3150
Wire Wire Line
	4250 3150 3800 3150
Wire Wire Line
	4350 3800 4250 3800
Wire Wire Line
	4150 3700 4250 3700
Wire Wire Line
	4250 3700 4250 3800
Connection ~ 4250 3800
Wire Wire Line
	4250 3800 3800 3800
Wire Wire Line
	4350 4450 4250 4450
Wire Wire Line
	4150 4350 4250 4350
Wire Wire Line
	4250 4350 4250 4450
Connection ~ 4250 4450
Wire Wire Line
	4250 4450 3800 4450
Wire Wire Line
	4350 5100 4250 5100
Wire Wire Line
	4150 5000 4250 5000
Wire Wire Line
	4250 5000 4250 5100
Connection ~ 4250 5100
Wire Wire Line
	4250 5100 3800 5100
Wire Wire Line
	4350 5750 4250 5750
Wire Wire Line
	4150 5650 4250 5650
Wire Wire Line
	4250 5650 4250 5750
Connection ~ 4250 5750
Wire Wire Line
	4250 5750 3800 5750
Text Label 7800 5750 0    50   ~ 0
OUT0
Text Label 7800 5100 0    50   ~ 0
OUT1
Text Label 7800 4450 0    50   ~ 0
OUT2
Text Label 7800 3800 0    50   ~ 0
OUT3
Text Label 7800 3150 0    50   ~ 0
OUT4
Text Label 7800 2500 0    50   ~ 0
OUT5
Text Label 7800 1850 0    50   ~ 0
OUT6
Text Label 7800 1200 0    50   ~ 0
OUT7
Text Label 2900 5750 0    50   ~ 0
OUT8
Text Label 2900 5100 0    50   ~ 0
OUT9
Text Label 2900 4450 0    50   ~ 0
OUT10
Text Label 2900 3800 0    50   ~ 0
OUT11
Text Label 2900 3150 0    50   ~ 0
OUT12
Text Label 2900 2500 0    50   ~ 0
OUT13
Text Label 2900 1850 0    50   ~ 0
OUT14
Text Label 2900 1200 0    50   ~ 0
OUT15
Connection ~ 2500 6000
Wire Wire Line
	5650 6350 5650 6000
Wire Wire Line
	2100 6350 5650 6350
Connection ~ 5650 6000
Entry Wire Line
	7650 1750 7750 1850
Entry Wire Line
	7750 1200 7650 1100
Entry Wire Line
	7750 2500 7650 2400
Entry Wire Line
	7750 3150 7650 3050
Entry Wire Line
	7750 3800 7650 3700
Entry Wire Line
	7750 4450 7650 4350
Entry Wire Line
	7750 5100 7650 5000
Entry Wire Line
	7750 5750 7650 5650
Wire Wire Line
	7400 2100 8400 2100
Wire Wire Line
	7400 2750 8400 2750
Wire Wire Line
	7400 3400 8400 3400
Wire Wire Line
	7400 4700 8400 4700
Wire Wire Line
	7400 5350 8400 5350
Wire Wire Line
	8400 1450 7400 1450
Wire Wire Line
	8400 6000 7400 6000
Wire Wire Line
	9550 1450 10550 1450
Wire Wire Line
	9550 6000 10550 6000
Wire Wire Line
	10550 2100 9550 2100
Wire Wire Line
	10550 2750 9550 2750
Wire Wire Line
	10550 3400 9550 3400
Wire Wire Line
	10550 4050 9550 4050
Wire Wire Line
	10550 4700 9550 4700
Wire Wire Line
	10550 5350 9550 5350
Wire Wire Line
	7400 4050 8400 4050
Wire Wire Line
	9850 5750 10200 5750
Wire Wire Line
	9850 5100 10200 5100
Wire Wire Line
	9850 4450 10200 4450
Wire Wire Line
	9850 3800 10200 3800
Wire Wire Line
	9850 3150 10200 3150
Wire Wire Line
	9850 2500 10200 2500
Wire Wire Line
	9850 1850 10200 1850
Wire Wire Line
	9850 1200 10200 1200
Wire Wire Line
	7000 6000 7400 6000
Entry Wire Line
	10300 1750 10200 1850
Entry Wire Line
	10200 1200 10300 1100
Entry Wire Line
	10200 2500 10300 2400
Entry Wire Line
	10200 3150 10300 3050
Entry Wire Line
	10200 3800 10300 3700
Entry Wire Line
	10200 4450 10300 4350
Entry Wire Line
	10200 5100 10300 5000
Entry Wire Line
	10200 5750 10300 5650
Wire Wire Line
	8100 5750 7750 5750
Wire Wire Line
	8100 5100 7750 5100
Wire Wire Line
	8100 4450 7750 4450
Wire Wire Line
	8100 3800 7750 3800
Wire Wire Line
	8100 3150 7750 3150
Wire Wire Line
	8100 2500 7750 2500
Wire Wire Line
	8100 1850 7750 1850
Wire Wire Line
	8100 1200 7750 1200
Wire Wire Line
	9250 1200 9150 1200
Wire Wire Line
	9050 1100 9150 1100
Wire Wire Line
	9150 1100 9150 1200
Connection ~ 9150 1200
Wire Wire Line
	9150 1200 8700 1200
Wire Wire Line
	9250 1850 9150 1850
Wire Wire Line
	9050 1750 9150 1750
Wire Wire Line
	9150 1750 9150 1850
Connection ~ 9150 1850
Wire Wire Line
	9150 1850 8700 1850
Wire Wire Line
	9250 2500 9150 2500
Wire Wire Line
	9050 2400 9150 2400
Wire Wire Line
	9150 2400 9150 2500
Connection ~ 9150 2500
Wire Wire Line
	9150 2500 8700 2500
Wire Wire Line
	9250 3150 9150 3150
Wire Wire Line
	9050 3050 9150 3050
Wire Wire Line
	9150 3050 9150 3150
Connection ~ 9150 3150
Wire Wire Line
	9150 3150 8700 3150
Wire Wire Line
	9250 3800 9150 3800
Wire Wire Line
	9050 3700 9150 3700
Wire Wire Line
	9150 3700 9150 3800
Connection ~ 9150 3800
Wire Wire Line
	9150 3800 8700 3800
Wire Wire Line
	9250 4450 9150 4450
Wire Wire Line
	9050 4350 9150 4350
Wire Wire Line
	9150 4350 9150 4450
Connection ~ 9150 4450
Wire Wire Line
	9150 4450 8700 4450
Wire Wire Line
	9250 5100 9150 5100
Wire Wire Line
	9050 5000 9150 5000
Wire Wire Line
	9150 5000 9150 5100
Connection ~ 9150 5100
Wire Wire Line
	9150 5100 8700 5100
Wire Wire Line
	9250 5750 9150 5750
Wire Wire Line
	9050 5650 9150 5650
Wire Wire Line
	9150 5650 9150 5750
Connection ~ 9150 5750
Wire Wire Line
	9150 5750 8700 5750
Connection ~ 7400 6000
Wire Wire Line
	10550 6350 10550 6000
Wire Wire Line
	7000 6350 10550 6350
Connection ~ 10550 6000
Wire Wire Line
	1500 6000 1400 6000
Wire Wire Line
	1400 6800 5800 6800
Wire Wire Line
	5800 6800 5800 6000
Wire Wire Line
	5800 6000 6400 6000
Wire Wire Line
	6400 6350 5900 6350
Wire Wire Line
	5900 6350 5900 6900
Wire Wire Line
	5900 6900 1300 6900
Wire Wire Line
	1300 6900 1300 6350
Wire Wire Line
	1300 6350 1500 6350
Wire Wire Line
	1400 6000 1400 6800
Wire Bus Line
	2750 750  7650 750 
Wire Bus Line
	10300 650  5400 650 
Connection ~ 5400 650 
Wire Bus Line
	5400 650  1650 650 
Wire Bus Line
	2750 750  1650 750 
Connection ~ 2750 750 
Text HLabel 1200 6900 0    50   Input ~ 0
IN-ENABLE
Text HLabel 1200 6800 0    50   Input ~ 0
OUT-ENABLE
Wire Wire Line
	1400 6800 1200 6800
Connection ~ 1400 6800
Wire Wire Line
	1300 6900 1200 6900
Connection ~ 1300 6900
Text HLabel 1650 650  0    50   Output ~ 0
IN[0..15]
Text HLabel 1650 750  0    50   Input ~ 0
OUT[0..15]
Wire Wire Line
	2500 1450 2500 2100
Connection ~ 2500 2100
Wire Wire Line
	2500 2100 2500 2750
Connection ~ 2500 2750
Wire Wire Line
	2500 2750 2500 3400
Connection ~ 2500 3400
Wire Wire Line
	2500 3400 2500 4050
Connection ~ 2500 4050
Wire Wire Line
	2500 4050 2500 4700
Connection ~ 2500 4700
Wire Wire Line
	2500 4700 2500 5350
Connection ~ 2500 5350
Wire Wire Line
	2500 5350 2500 6000
Wire Wire Line
	5650 1450 5650 2100
Connection ~ 5650 2100
Wire Wire Line
	5650 2100 5650 2750
Connection ~ 5650 2750
Wire Wire Line
	5650 2750 5650 3400
Connection ~ 5650 3400
Wire Wire Line
	5650 3400 5650 4050
Connection ~ 5650 4050
Wire Wire Line
	5650 4050 5650 4700
Connection ~ 5650 4700
Wire Wire Line
	5650 4700 5650 5350
Connection ~ 5650 5350
Wire Wire Line
	5650 5350 5650 6000
Wire Wire Line
	7400 1450 7400 2100
Connection ~ 7400 2100
Wire Wire Line
	7400 2100 7400 2750
Connection ~ 7400 2750
Wire Wire Line
	7400 2750 7400 3400
Connection ~ 7400 3400
Wire Wire Line
	7400 3400 7400 4050
Connection ~ 7400 4050
Wire Wire Line
	7400 4050 7400 4700
Connection ~ 7400 4700
Wire Wire Line
	7400 4700 7400 5350
Connection ~ 7400 5350
Wire Wire Line
	7400 5350 7400 6000
Wire Wire Line
	10550 1450 10550 2100
Connection ~ 10550 2100
Wire Wire Line
	10550 2100 10550 2750
Connection ~ 10550 2750
Wire Wire Line
	10550 2750 10550 3400
Connection ~ 10550 3400
Wire Wire Line
	10550 3400 10550 4050
Connection ~ 10550 4050
Wire Wire Line
	10550 4050 10550 4700
Connection ~ 10550 4700
Wire Wire Line
	10550 4700 10550 5350
Connection ~ 10550 5350
Wire Wire Line
	10550 5350 10550 6000
Wire Bus Line
	2750 750  2750 5650
Wire Bus Line
	7650 750  7650 5650
Wire Bus Line
	10300 650  10300 5650
Wire Bus Line
	5400 650  5400 5650
$EndSCHEMATC
