EESchema Schematic File Version 5
EELAYER 33 0
EELAYER END
$Descr A4 11693 8268
encoding utf-8
Sheet 3 20
Title ""
Date "2020-04-12"
Rev ""
Comp ""
Comment1 ""
Comment2 "Licence: CC-BY"
Comment3 "Author: Loic *WydD* Petit"
Comment4 "Project: CPS2 Reverse Engineering: DL-1827"
Comment5 ""
Comment6 ""
Comment7 ""
Comment8 ""
Comment9 ""
$EndDescr
Connection ~ 4650 4950
Connection ~ 4650 2850
Connection ~ 4650 4250
Connection ~ 4650 3550
Connection ~ 4650 2150
Wire Wire Line
	4200 4950 4650 4950
Wire Wire Line
	4650 1400 4650 2150
Wire Wire Line
	4650 1400 5900 1400
Wire Wire Line
	4650 2150 4650 2850
Wire Wire Line
	4650 2150 5900 2150
Wire Wire Line
	4650 2850 4650 3550
Wire Wire Line
	4650 2850 5900 2850
Wire Wire Line
	4650 3550 4650 4250
Wire Wire Line
	4650 3550 5900 3550
Wire Wire Line
	4650 4250 4650 4950
Wire Wire Line
	4650 4250 5900 4250
Wire Wire Line
	4650 4950 5900 4950
Wire Wire Line
	6200 1150 6950 1150
Wire Wire Line
	6200 1900 6950 1900
Wire Wire Line
	6200 2600 6950 2600
Wire Wire Line
	6200 3300 6950 3300
Wire Wire Line
	6200 4000 6950 4000
Wire Wire Line
	6200 4700 6950 4700
Text HLabel 3600 4950 0    50   Input ~ 0
ENABLE
Text HLabel 5600 1150 0    50   Input ~ 0
_OBJRAM-BANK-CLK
Text HLabel 5600 1900 0    50   Input ~ 0
_DEBUG-RANGE
Text HLabel 5600 2600 0    50   Input ~ 0
_CPU-R~W
Text HLabel 5600 3300 0    50   Input ~ 0
_CPU-FC0
Text HLabel 5600 4000 0    50   Input ~ 0
_CPU-FC1
Text HLabel 5600 4700 0    50   Input ~ 0
_CPU-FC2
Text HLabel 6950 1150 2    50   Output ~ 0
OBJRAM-BANK-CLK
Text HLabel 6950 1900 2    50   Output ~ 0
DEBUG-RANGE
Text HLabel 6950 2600 2    50   Output ~ 0
CPU-R~W
Text HLabel 6950 3300 2    50   Output ~ 0
CPU-FC0
Text HLabel 6950 4000 2    50   Output ~ 0
CPU-FC1
Text HLabel 6950 4700 2    50   Output ~ 0
CPU-FC2
$Comp
L CG24-cells:V1L U28R163
U 1 1 5E7BA402
P 3900 4950
AR Path="/5E919108/5E7BA402" Ref="U28R163"  Part="1" 
AR Path="/5E90DB79/5E7BA402" Ref="U28R163"  Part="1" 
F 0 "U28R163" H 3900 5267 50  0000 C CNN
F 1 "V1L" H 3900 5176 50  0000 C CNN
F 2 "" H 3900 4750 50  0001 C CNN
F 3 "" H 3900 4750 50  0001 C CNN
	1    3900 4950
	1    0    0    -1  
$EndComp
$Comp
L CG24-cells:B12 U42R86
U 1 1 5E82E40E
P 5900 1150
AR Path="/5E919108/5E82E40E" Ref="U42R86"  Part="1" 
AR Path="/5E90DB79/5E82E40E" Ref="U42R86"  Part="1" 
F 0 "U42R86" H 5900 1515 50  0000 C CNN
F 1 "B12" H 5900 1424 50  0000 C CNN
F 2 "" H 5900 1150 50  0001 C CNN
F 3 "" H 5900 1150 50  0001 C CNN
	1    5900 1150
	1    0    0    -1  
$EndComp
$Comp
L CG24-cells:B12 U42R96
U 1 1 5EBC3694
P 5900 1900
AR Path="/5E919108/5EBC3694" Ref="U42R96"  Part="1" 
AR Path="/5E90DB79/5EBC3694" Ref="U42R96"  Part="1" 
F 0 "U42R96" H 5900 2265 50  0000 C CNN
F 1 "B12" H 5900 2174 50  0000 C CNN
F 2 "" H 5900 1900 50  0001 C CNN
F 3 "" H 5900 1900 50  0001 C CNN
	1    5900 1900
	1    0    0    -1  
$EndComp
$Comp
L CG24-cells:B12 U42R179
U 1 1 5E9A9EBF
P 5900 2600
AR Path="/5E919108/5E9A9EBF" Ref="U42R179"  Part="1" 
AR Path="/5E90DB79/5E9A9EBF" Ref="U42R179"  Part="1" 
F 0 "U42R179" H 5900 2965 50  0000 C CNN
F 1 "B12" H 5900 2874 50  0000 C CNN
F 2 "" H 5900 2600 50  0001 C CNN
F 3 "" H 5900 2600 50  0001 C CNN
	1    5900 2600
	1    0    0    -1  
$EndComp
$Comp
L CG24-cells:B12 U36R183
U 1 1 5E7D7C4B
P 5900 3300
AR Path="/5E919108/5E7D7C4B" Ref="U36R183"  Part="1" 
AR Path="/5E90DB79/5E7D7C4B" Ref="U36R183"  Part="1" 
F 0 "U36R183" H 5900 3665 50  0000 C CNN
F 1 "B12" H 5900 3574 50  0000 C CNN
F 2 "" H 5900 3300 50  0001 C CNN
F 3 "" H 5900 3300 50  0001 C CNN
	1    5900 3300
	1    0    0    -1  
$EndComp
$Comp
L CG24-cells:B12 U32R181
U 1 1 5F469A50
P 5900 4000
AR Path="/5E919108/5F469A50" Ref="U32R181"  Part="1" 
AR Path="/5E90DB79/5F469A50" Ref="U32R181"  Part="1" 
F 0 "U32R181" H 5900 4365 50  0000 C CNN
F 1 "B12" H 5900 4274 50  0000 C CNN
F 2 "" H 5900 4000 50  0001 C CNN
F 3 "" H 5900 4000 50  0001 C CNN
	1    5900 4000
	1    0    0    -1  
$EndComp
$Comp
L CG24-cells:B12 U38R183
U 1 1 5E7C91C0
P 5900 4700
AR Path="/5E919108/5E7C91C0" Ref="U38R183"  Part="1" 
AR Path="/5E90DB79/5E7C91C0" Ref="U38R183"  Part="1" 
F 0 "U38R183" H 5900 5065 50  0000 C CNN
F 1 "B12" H 5900 4974 50  0000 C CNN
F 2 "" H 5900 4700 50  0001 C CNN
F 3 "" H 5900 4700 50  0001 C CNN
	1    5900 4700
	1    0    0    -1  
$EndComp
$EndSCHEMATC
