EESchema Schematic File Version 4
EELAYER 30 0
EELAYER END
$Descr A4 11693 8268
encoding utf-8
Sheet 51 83
Title "CPS Reverse Engineering: DL-0311"
Date "2021-09-12"
Rev ""
Comp ""
Comment1 ""
Comment2 ""
Comment3 "Licence: CC-BY"
Comment4 "Author: Loïc *WydD* Petit"
$EndDescr
Connection ~ 3200 5900
Connection ~ 3300 4250
Connection ~ 3200 4350
Connection ~ 7900 3450
Connection ~ 5000 6500
Connection ~ 7900 2400
Connection ~ 5050 1350
Connection ~ 4050 5400
Connection ~ 4050 1700
Connection ~ 3650 6650
Connection ~ 9550 700 
Connection ~ 2400 600 
Connection ~ 3300 2700
Connection ~ 2400 1350
Connection ~ 2500 5950
NoConn ~ 5050 5050
Entry Wire Line
	2400 850  2500 950 
Entry Wire Line
	3400 1800 3500 1900
Entry Wire Line
	3400 1900 3500 2000
Entry Wire Line
	3400 2100 3500 2200
Entry Wire Line
	3400 2200 3500 2300
Entry Wire Line
	3400 2300 3500 2400
Entry Wire Line
	3400 2400 3500 2500
Entry Wire Line
	3400 3150 3500 3250
Entry Wire Line
	3400 3250 3500 3350
Entry Wire Line
	3400 3350 3500 3450
Entry Wire Line
	3400 3450 3500 3550
Entry Wire Line
	3400 3650 3500 3750
Entry Wire Line
	3400 3750 3500 3850
Entry Wire Line
	3400 3850 3500 3950
Entry Wire Line
	3400 4800 3500 4900
Entry Wire Line
	3400 4900 3500 5000
Entry Wire Line
	3400 5500 3500 5600
Entry Wire Line
	3750 6400 3650 6500
Entry Wire Line
	3750 6900 3650 6800
Entry Wire Line
	5500 1000 5600 900 
Entry Wire Line
	5500 1950 5600 1850
Entry Wire Line
	5500 2050 5600 1950
Entry Wire Line
	5500 2150 5600 2050
Entry Wire Line
	5500 2250 5600 2150
Entry Wire Line
	5500 3500 5600 3400
Entry Wire Line
	5500 3600 5600 3500
Entry Wire Line
	5500 3700 5600 3600
Entry Wire Line
	5500 3800 5600 3700
Entry Wire Line
	5500 5150 5600 5050
Entry Wire Line
	5500 5250 5600 5150
Entry Wire Line
	5500 5350 5600 5250
Entry Wire Line
	5500 6400 5600 6300
Entry Wire Line
	5500 6900 5600 6800
Entry Wire Line
	6950 1850 7050 1950
Entry Wire Line
	6950 1950 7050 2050
Entry Wire Line
	6950 2050 7050 2150
Entry Wire Line
	6950 2150 7050 2250
Entry Wire Line
	6950 2900 7050 3000
Entry Wire Line
	6950 3000 7050 3100
Entry Wire Line
	6950 3100 7050 3200
Entry Wire Line
	6950 3200 7050 3300
Entry Wire Line
	6950 4050 7050 4150
Entry Wire Line
	9450 1950 9550 1850
Entry Wire Line
	9450 2050 9550 1950
Entry Wire Line
	9450 2150 9550 2050
Entry Wire Line
	9450 2250 9550 2150
Entry Wire Line
	9450 3000 9550 2900
Entry Wire Line
	9450 3100 9550 3000
Entry Wire Line
	9450 3200 9550 3100
Entry Wire Line
	9450 3300 9550 3200
Entry Wire Line
	9450 4150 9550 4050
Wire Wire Line
	2050 1350 2400 1350
Wire Wire Line
	2400 1350 2400 5850
Wire Wire Line
	2400 5950 2500 5950
Wire Wire Line
	2500 950  4050 950 
Wire Wire Line
	2500 1050 2500 5950
Wire Wire Line
	2500 1050 4050 1050
Wire Wire Line
	2500 5950 2650 5950
Wire Wire Line
	2650 5850 2400 5850
Wire Wire Line
	3200 2700 3300 2700
Wire Wire Line
	3200 2800 3200 4350
Wire Wire Line
	3200 2800 4050 2800
Wire Wire Line
	3200 4350 3200 5900
Wire Wire Line
	3200 4350 4050 4350
Wire Wire Line
	3200 5900 4050 5900
Wire Wire Line
	3200 6050 3200 5900
Wire Wire Line
	3300 2700 3300 4250
Wire Wire Line
	3300 2700 4050 2700
Wire Wire Line
	3300 4250 3300 5800
Wire Wire Line
	3300 4250 4050 4250
Wire Wire Line
	3300 5800 4050 5800
Wire Wire Line
	3750 6900 4500 6900
Wire Wire Line
	3950 1700 4050 1700
Wire Wire Line
	3950 4800 4050 4800
Wire Wire Line
	3950 5300 4050 5300
Wire Wire Line
	3950 5400 4050 5400
Wire Wire Line
	4050 1700 4050 1800
Wire Wire Line
	4050 1900 3500 1900
Wire Wire Line
	4050 2000 3500 2000
Wire Wire Line
	4050 2200 3500 2200
Wire Wire Line
	4050 2300 3500 2300
Wire Wire Line
	4050 2400 3500 2400
Wire Wire Line
	4050 2500 3500 2500
Wire Wire Line
	4050 3250 3500 3250
Wire Wire Line
	4050 3350 3500 3350
Wire Wire Line
	4050 3450 3500 3450
Wire Wire Line
	4050 3550 3500 3550
Wire Wire Line
	4050 3750 3500 3750
Wire Wire Line
	4050 3850 3500 3850
Wire Wire Line
	4050 3950 3500 3950
Wire Wire Line
	4050 4900 3500 4900
Wire Wire Line
	4050 5000 3500 5000
Wire Wire Line
	4050 5400 4050 5500
Wire Wire Line
	4050 5600 3500 5600
Wire Wire Line
	4500 6400 3750 6400
Wire Wire Line
	4800 6500 5000 6500
Wire Wire Line
	4900 1100 5050 1100
Wire Wire Line
	4900 6400 5500 6400
Wire Wire Line
	4900 6900 5500 6900
Wire Wire Line
	5000 6050 3200 6050
Wire Wire Line
	5000 6500 5000 6050
Wire Wire Line
	5000 6500 5000 7000
Wire Wire Line
	5000 7000 4800 7000
Wire Wire Line
	5050 1100 5050 1350
Wire Wire Line
	5050 1350 2400 1350
Wire Wire Line
	5050 3500 5500 3500
Wire Wire Line
	5050 3600 5500 3600
Wire Wire Line
	5050 3700 5500 3700
Wire Wire Line
	5050 3800 5500 3800
Wire Wire Line
	5050 5150 5500 5150
Wire Wire Line
	5050 5250 5500 5250
Wire Wire Line
	5050 5350 5500 5350
Wire Wire Line
	5500 1000 5000 1000
Wire Wire Line
	5500 1950 5050 1950
Wire Wire Line
	5500 2050 5050 2050
Wire Wire Line
	5500 2150 5050 2150
Wire Wire Line
	5500 2250 5050 2250
Wire Wire Line
	7050 1950 8000 1950
Wire Wire Line
	7050 2050 8000 2050
Wire Wire Line
	7050 2150 8000 2150
Wire Wire Line
	7050 2250 8000 2250
Wire Wire Line
	7050 3000 8000 3000
Wire Wire Line
	7050 3100 8000 3100
Wire Wire Line
	7050 3200 8000 3200
Wire Wire Line
	7050 3300 8000 3300
Wire Wire Line
	7050 4150 8000 4150
Wire Wire Line
	7900 1350 5050 1350
Wire Wire Line
	7900 1350 7900 2400
Wire Wire Line
	7900 2400 7900 3450
Wire Wire Line
	7900 2400 8000 2400
Wire Wire Line
	7900 3450 7900 3650
Wire Wire Line
	7900 3650 9000 3650
Wire Wire Line
	8000 3450 7900 3450
Wire Wire Line
	8300 4250 9000 4250
Wire Wire Line
	8400 4150 9450 4150
Wire Wire Line
	9000 3650 9000 4250
Wire Wire Line
	9450 1950 9000 1950
Wire Wire Line
	9450 2050 9000 2050
Wire Wire Line
	9450 2150 9000 2150
Wire Wire Line
	9450 2250 9000 2250
Wire Wire Line
	9450 3000 9000 3000
Wire Wire Line
	9450 3100 9000 3100
Wire Wire Line
	9450 3200 9000 3200
Wire Wire Line
	9450 3300 9000 3300
Wire Bus Line
	2400 600  2300 600 
Wire Bus Line
	2400 600  2400 850 
Wire Bus Line
	3400 1650 3250 1650
Wire Bus Line
	3650 6500 3650 6650
Wire Bus Line
	3650 6650 3550 6650
Wire Bus Line
	3650 6650 3650 6800
Wire Bus Line
	5600 700  9550 700 
Wire Bus Line
	6950 600  2400 600 
Wire Bus Line
	9550 700  9650 700 
Text Label 2550 950  0    50   ~ 0
~OBJRAM-BASE6
Text Label 3800 6400 0    50   ~ 0
STATE1
Text Label 3800 6900 0    50   ~ 0
STATE0
Text Label 4000 1900 2    50   ~ 0
ENTRY-IDX7
Text Label 4000 2000 2    50   ~ 0
ENTRY-IDX6
Text Label 4000 2200 2    50   ~ 0
ENTRY-IDX6
Text Label 4000 2300 2    50   ~ 0
ENTRY-IDX5
Text Label 4000 2400 2    50   ~ 0
ENTRY-IDX4
Text Label 4000 2500 2    50   ~ 0
ENTRY-IDX3
Text Label 4000 3250 2    50   ~ 0
ENTRY-IDX5
Text Label 4000 3350 2    50   ~ 0
ENTRY-IDX4
Text Label 4000 3450 2    50   ~ 0
ENTRY-IDX3
Text Label 4000 3550 2    50   ~ 0
ENTRY-IDX2
Text Label 4000 3750 2    50   ~ 0
ENTRY-IDX2
Text Label 4000 3850 2    50   ~ 0
ENTRY-IDX1
Text Label 4000 3950 2    50   ~ 0
ENTRY-IDX0
Text Label 4000 4900 2    50   ~ 0
ENTRY-IDX1
Text Label 4000 5000 2    50   ~ 0
ENTRY-IDX0
Text Label 4000 5600 2    50   ~ 0
ENTRY-IDX7
Text Label 5150 3500 0    50   ~ 0
ADDR8
Text Label 5150 3600 0    50   ~ 0
ADDR7
Text Label 5150 3700 0    50   ~ 0
ADDR6
Text Label 5150 3800 0    50   ~ 0
ADDR5
Text Label 5150 5150 0    50   ~ 0
ADDR4
Text Label 5150 5250 0    50   ~ 0
ADDR3
Text Label 5150 5350 0    50   ~ 0
ADDR13
Text Label 5400 1000 2    50   ~ 0
ADDR14
Text Label 5400 1950 2    50   ~ 0
ADDR12
Text Label 5400 2050 2    50   ~ 0
ADDR11
Text Label 5400 2150 2    50   ~ 0
ADDR10
Text Label 5400 2250 2    50   ~ 0
ADDR9
Text Label 5400 6400 2    50   ~ 0
ADDR2
Text Label 5400 6900 2    50   ~ 0
ADDR1
Text Label 7100 1950 0    50   ~ 0
~OBJRAM-BASE15
Text Label 7100 2050 0    50   ~ 0
~OBJRAM-BASE14
Text Label 7100 2150 0    50   ~ 0
~OBJRAM-BASE13
Text Label 7100 2250 0    50   ~ 0
~OBJRAM-BASE12
Text Label 7100 3000 0    50   ~ 0
~OBJRAM-BASE11
Text Label 7100 3100 0    50   ~ 0
~OBJRAM-BASE10
Text Label 7100 3200 0    50   ~ 0
~OBJRAM-BASE9
Text Label 7100 3300 0    50   ~ 0
~OBJRAM-BASE8
Text Label 7100 4150 0    50   ~ 0
~OBJRAM-BASE7
Text Label 9350 1950 2    50   ~ 0
ADDR23
Text Label 9350 2050 2    50   ~ 0
ADDR22
Text Label 9350 2150 2    50   ~ 0
ADDR21
Text Label 9350 2250 2    50   ~ 0
ADDR20
Text Label 9350 3000 2    50   ~ 0
ADDR19
Text Label 9350 3100 2    50   ~ 0
ADDR18
Text Label 9350 3200 2    50   ~ 0
ADDR17
Text Label 9350 3300 2    50   ~ 0
ADDR16
Text Label 9350 4150 2    50   ~ 0
ADDR15
Text HLabel 1800 5950 0    50   Input ~ 0
~BUS-SPRITE-LOOKUP
Text HLabel 2050 1350 0    50   Input ~ 0
~BUS-WSTOBJ
Text HLabel 2300 600  0    50   Input ~ 0
~OBJRAM-BASE[6..15]
Text HLabel 3200 2700 0    50   Input ~ 0
X8-MODE
Text HLabel 3250 1650 0    50   Input ~ 0
ENTRY-IDX[0..7]
Text HLabel 3550 6650 0    50   Input ~ 0
STATE[0..1]
Text HLabel 9650 700  2    50   3State ~ 0
ADDR[1..23]
$Comp
L power:VCC #PWR0260
U 1 1 61D52AF9
P 3950 4800
F 0 "#PWR0260" H 3950 4650 50  0001 C CNN
F 1 "VCC" H 3965 4973 50  0001 C CNN
F 2 "" H 3950 4800 50  0001 C CNN
F 3 "" H 3950 4800 50  0001 C CNN
	1    3950 4800
	1    0    0    -1  
$EndComp
$Comp
L power:VCC #PWR0261
U 1 1 61D35C57
P 3950 5300
F 0 "#PWR0261" H 3950 5150 50  0001 C CNN
F 1 "VCC" H 3965 5473 50  0001 C CNN
F 2 "" H 3950 5300 50  0001 C CNN
F 3 "" H 3950 5300 50  0001 C CNN
	1    3950 5300
	1    0    0    -1  
$EndComp
$Comp
L power:GND #PWR0262
U 1 1 61D5A682
P 3950 1700
F 0 "#PWR0262" H 3950 1450 50  0001 C CNN
F 1 "GND" H 3955 1527 50  0001 C CNN
F 2 "" H 3950 1700 50  0001 C CNN
F 3 "" H 3950 1700 50  0001 C CNN
	1    3950 1700
	1    0    0    -1  
$EndComp
$Comp
L power:GND #PWR0263
U 1 1 61D3D7F8
P 3950 5400
F 0 "#PWR0263" H 3950 5150 50  0001 C CNN
F 1 "GND" H 3955 5227 50  0001 C CNN
F 2 "" H 3950 5400 50  0001 C CNN
F 3 "" H 3950 5400 50  0001 C CNN
	1    3950 5400
	1    0    0    -1  
$EndComp
$Comp
L power:GND #PWR0264
U 1 1 61D562E3
P 4050 4050
F 0 "#PWR0264" H 4050 3800 50  0001 C CNN
F 1 "GND" H 4055 3877 50  0001 C CNN
F 2 "" H 4050 4050 50  0001 C CNN
F 3 "" H 4050 4050 50  0001 C CNN
	1    4050 4050
	1    0    0    -1  
$EndComp
$Comp
L power:GND #PWR0265
U 1 1 618C25A5
P 4050 5100
F 0 "#PWR0265" H 4050 4850 50  0001 C CNN
F 1 "GND" H 4055 4927 50  0001 C CNN
F 2 "" H 4050 5100 50  0001 C CNN
F 3 "" H 4050 5100 50  0001 C CNN
	1    4050 5100
	1    0    0    -1  
$EndComp
$Comp
L A5C:M125C UBB?
U 1 1 613CD737
P 4700 6400
AR Path="/611BD068/613CD737" Ref="UBB?"  Part="1" 
AR Path="/6121D233/613CD737" Ref="UBB21"  Part="1" 
AR Path="/612CA5FA/612CAD0C/613CD737" Ref="UBB21"  Part="1" 
F 0 "UBB21" H 4700 6665 50  0000 C CNN
F 1 "M125C" H 4700 6574 50  0000 C CNN
F 2 "" H 4200 6350 50  0001 C CNN
F 3 "" H 4200 6350 50  0001 C CNN
	1    4700 6400
	1    0    0    -1  
$EndComp
$Comp
L A5C:M125C UBG?
U 1 1 613CD73D
P 4700 6900
AR Path="/611BD068/613CD73D" Ref="UBG?"  Part="1" 
AR Path="/6121D233/613CD73D" Ref="UBG13"  Part="1" 
AR Path="/612CA5FA/612CAD0C/613CD73D" Ref="UBG13"  Part="1" 
F 0 "UBG13" H 4700 7165 50  0000 C CNN
F 1 "M125C" H 4700 7074 50  0000 C CNN
F 2 "" H 4200 6850 50  0001 C CNN
F 3 "" H 4200 6850 50  0001 C CNN
	1    4700 6900
	1    0    0    -1  
$EndComp
$Comp
L A5C:TINVBF UAC296
U 1 1 61118D6C
P 4800 1000
F 0 "UAC296" H 4800 1265 50  0000 C CNN
F 1 "TINVBF" H 4800 1174 50  0000 C CNN
F 2 "" H 4300 950 50  0001 C CNN
F 3 "" H 4300 950 50  0001 C CNN
	1    4800 1000
	1    0    0    -1  
$EndComp
$Comp
L A5C:TINVBF UAD279
U 1 1 79E7E3DF
P 8200 4150
F 0 "UAD279" H 8200 4415 50  0000 C CNN
F 1 "TINVBF" H 8200 4324 50  0000 C CNN
F 2 "" H 7700 4100 50  0001 C CNN
F 3 "" H 7700 4100 50  0001 C CNN
	1    8200 4150
	1    0    0    -1  
$EndComp
$Comp
L A5C:OR02 UAD323
U 1 1 61118DBF
P 2900 5900
F 0 "UAD323" H 2925 6167 50  0000 C CNN
F 1 "OR02" H 2925 6076 50  0000 C CNN
F 2 "" H 2950 5900 50  0001 C CNN
F 3 "" H 2950 5900 50  0001 C CNN
	1    2900 5900
	1    0    0    -1  
$EndComp
$Comp
L A5C:XNOR02 UAC290
U 1 1 61118D6D
P 4300 1000
F 0 "UAC290" H 4325 1267 50  0000 C CNN
F 1 "XNOR02" H 4325 1176 50  0000 C CNN
F 2 "" H 4325 1000 50  0001 C CNN
F 3 "" H 4325 1000 50  0001 C CNN
	1    4300 1000
	1    0    0    -1  
$EndComp
$Comp
L A5C:INV01 UAD270
U 1 1 786BE69D
P 2100 5950
F 0 "UAD270" H 2100 6267 50  0000 C CNN
F 1 "INV01" H 2100 6176 50  0000 C CNN
F 2 "" H 2100 5750 50  0001 C CNN
F 3 "" H 2100 5750 50  0001 C CNN
	1    2100 5950
	1    0    0    -1  
$EndComp
$Comp
L A5C:M368C UCC?
U 1 1 681AE421
P 8500 2200
AR Path="/604B5523/681AE421" Ref="UCC?"  Part="1" 
AR Path="/681AE421" Ref="UBG152"  Part="1" 
AR Path="/6121D233/681AE421" Ref="UBG152"  Part="1" 
AR Path="/612CA5FA/612CAD0C/681AE421" Ref="UBG152"  Part="1" 
F 0 "UBG152" H 8500 2710 50  0000 C CNN
F 1 "M368C" H 8500 2620 50  0000 C CNN
F 2 "" H 8800 2000 50  0001 C CNN
F 3 "" H 8800 2000 50  0001 C CNN
	1    8500 2200
	1    0    0    -1  
$EndComp
$Comp
L A5C:M368C UED?
U 1 1 7529433F
P 8500 3250
AR Path="/604B5523/7529433F" Ref="UED?"  Part="1" 
AR Path="/7529433F" Ref="UEI328"  Part="1" 
AR Path="/6121D233/7529433F" Ref="UEI328"  Part="1" 
AR Path="/612CA5FA/612CAD0C/7529433F" Ref="UEI328"  Part="1" 
F 0 "UEI328" H 8500 3760 50  0000 C CNN
F 1 "M368C" H 8500 3670 50  0000 C CNN
F 2 "" H 8800 3050 50  0001 C CNN
F 3 "" H 8800 3050 50  0001 C CNN
	1    8500 3250
	1    0    0    -1  
$EndComp
$Comp
L A5C:MUX24GH UBJ57
U 1 1 77FACDE8
P 4550 2300
F 0 "UBJ57" H 4550 3165 50  0000 C CNN
F 1 "MUX24GH" H 4550 3074 50  0000 C CNN
F 2 "" H 4550 2300 50  0001 C CNN
F 3 "" H 4550 2300 50  0001 C CNN
	1    4550 2300
	1    0    0    -1  
$EndComp
$Comp
L A5C:MUX24GH UBI138
U 1 1 778A06FC
P 4550 3850
F 0 "UBI138" H 4550 4715 50  0000 C CNN
F 1 "MUX24GH" H 4550 4624 50  0000 C CNN
F 2 "" H 4550 3850 50  0001 C CNN
F 3 "" H 4550 3850 50  0001 C CNN
	1    4550 3850
	1    0    0    -1  
$EndComp
$Comp
L A5C:MUX24GH UBI166
U 1 1 778A0F8D
P 4550 5400
F 0 "UBI166" H 4550 6265 50  0000 C CNN
F 1 "MUX24GH" H 4550 6174 50  0000 C CNN
F 2 "" H 4550 5400 50  0001 C CNN
F 3 "" H 4550 5400 50  0001 C CNN
	1    4550 5400
	1    0    0    -1  
$EndComp
Wire Bus Line
	6950 600  6950 4050
Wire Bus Line
	9550 700  9550 4050
Wire Bus Line
	5600 700  5600 6800
Wire Bus Line
	3400 1650 3400 5500
$EndSCHEMATC
