EESchema Schematic File Version 4
LIBS:93646E-cache
EELAYER 26 0
EELAYER END
$Descr A3 16535 11693
encoding utf-8
Sheet 1 1
Title "93646E Extension Board"
Date "2019-10-20"
Rev "v01"
Comp ""
Comment1 ""
Comment2 "Licence: CC-BY"
Comment3 "Author: Loic *WydD* Petit"
Comment4 "Project: CPS2 Reverse Engineering: 93646E"
$EndDescr
$Comp
L CPS2-Custom:96PIN_Sep CN1
U 1 1 5DAB729F
P 2200 4100
F 0 "CN1" V -1173 4075 50  0000 C CNN
F 1 "96PIN_Sep" V -1174 4075 50  0001 C CNN
F 2 "" H 1000 4400 50  0001 C CNN
F 3 "" H 1000 4400 50  0001 C CNN
	1    2200 4100
	0    1    1    0   
$EndComp
Text Label 2750 6400 0    50   ~ 0
QSOUND-ADDR0
Text Label 2750 6300 0    50   ~ 0
QSOUND-ADDR1
Text Label 2750 6200 0    50   ~ 0
QSOUND-ADDR2
Text Label 2750 6100 0    50   ~ 0
QSOUND-ADDR3
Text Label 2750 6000 0    50   ~ 0
QSOUND-ADDR4
Text Label 2750 5900 0    50   ~ 0
QSOUND-ADDR5
Text Label 2750 5800 0    50   ~ 0
QSOUND-ADDR6
Text Label 2750 5700 0    50   ~ 0
QSOUND-ADDR7
Text Label 2750 3100 0    50   ~ 0
QSOUND-ADDR8
Text Label 2750 3000 0    50   ~ 0
QSOUND-ADDR9
Text Label 2750 2900 0    50   ~ 0
QSOUND-ADDR10
Text Label 2750 2800 0    50   ~ 0
QSOUND-ADDR11
Text Label 2750 2700 0    50   ~ 0
QSOUND-ADDR12
Text Label 2750 2600 0    50   ~ 0
QSOUND-ADDR13
Text Label 2750 2500 0    50   ~ 0
QSOUND-ADDR14
Text Label 2750 2400 0    50   ~ 0
QSOUND-ADDR15
Text Label 950  3950 0    50   ~ 0
QSOUND-ADDR16
Text Label 2750 5600 0    50   ~ 0
QSOUND-ADDR17
Text Label 2750 2300 0    50   ~ 0
QSOUND-ADDR18
Text Label 950  3850 0    50   ~ 0
QSOUND-ADDR19
Text Label 2750 5500 0    50   ~ 0
QSOUND-ADDR20
Text Label 2750 2200 0    50   ~ 0
QSOUND-ADDR21
Wire Wire Line
	2700 6400 3450 6400
Wire Wire Line
	2700 6300 3450 6300
Wire Wire Line
	2700 6200 3450 6200
Wire Wire Line
	2700 6100 3450 6100
Wire Wire Line
	2700 6000 3450 6000
Wire Wire Line
	2700 5900 3450 5900
Wire Wire Line
	2700 5800 3450 5800
Wire Wire Line
	2700 5700 3450 5700
Wire Wire Line
	2700 3100 3450 3100
Wire Wire Line
	2700 3000 3450 3000
Wire Wire Line
	2700 2900 3450 2900
Wire Wire Line
	2700 2800 3450 2800
Wire Wire Line
	2700 2700 3450 2700
Wire Wire Line
	2700 2600 3450 2600
Wire Wire Line
	900  3950 1650 3950
Wire Wire Line
	2700 5600 3450 5600
Wire Wire Line
	2700 2300 3450 2300
Wire Wire Line
	900  3850 1650 3850
Wire Wire Line
	2700 5500 3450 5500
Wire Wire Line
	2700 2200 3450 2200
Wire Wire Line
	2700 2400 3450 2400
Wire Wire Line
	2700 2500 3450 2500
Text Label 950  3750 0    50   ~ 0
QSOUND-ADDR22
Wire Wire Line
	900  3750 1650 3750
Text Label 1000 4750 0    50   ~ 0
QSOUND-DATA0
Text Label 1000 4650 0    50   ~ 0
QSOUND-DATA1
Text Label 1000 4550 0    50   ~ 0
QSOUND-DATA2
Text Label 1000 4450 0    50   ~ 0
QSOUND-DATA3
Text Label 1000 4350 0    50   ~ 0
QSOUND-DATA4
Text Label 1000 4250 0    50   ~ 0
QSOUND-DATA5
Text Label 1000 4150 0    50   ~ 0
QSOUND-DATA6
Text Label 1000 4050 0    50   ~ 0
QSOUND-DATA7
Wire Wire Line
	950  4050 1650 4050
Wire Wire Line
	950  4150 1650 4150
Wire Wire Line
	950  4250 1650 4250
Wire Wire Line
	950  4350 1650 4350
Wire Wire Line
	950  4450 1650 4450
Wire Wire Line
	950  4550 1650 4550
Wire Wire Line
	950  4650 1650 4650
Wire Wire Line
	950  4750 1650 4750
$Comp
L power:VCC #PWR06
U 1 1 5DAC113C
P 2850 900
F 0 "#PWR06" H 2850 750 50  0001 C CNN
F 1 "VCC" H 2867 1073 50  0000 C CNN
F 2 "" H 2850 900 50  0001 C CNN
F 3 "" H 2850 900 50  0001 C CNN
	1    2850 900 
	1    0    0    -1  
$EndComp
$Comp
L power:VCC #PWR03
U 1 1 5DAC1156
P 1500 2500
F 0 "#PWR03" H 1500 2350 50  0001 C CNN
F 1 "VCC" H 1517 2673 50  0000 C CNN
F 2 "" H 1500 2500 50  0001 C CNN
F 3 "" H 1500 2500 50  0001 C CNN
	1    1500 2500
	1    0    0    -1  
$EndComp
$Comp
L power:VCC #PWR08
U 1 1 5DAC1BE0
P 2850 4200
F 0 "#PWR08" H 2850 4050 50  0001 C CNN
F 1 "VCC" H 2867 4373 50  0000 C CNN
F 2 "" H 2850 4200 50  0001 C CNN
F 3 "" H 2850 4200 50  0001 C CNN
	1    2850 4200
	1    0    0    -1  
$EndComp
Wire Wire Line
	1500 2550 1650 2550
Wire Wire Line
	2700 900  2850 900 
Wire Wire Line
	2700 4200 2850 4200
$Comp
L power:VCC #PWR07
U 1 1 5DAC5EEA
P 2850 3300
F 0 "#PWR07" H 2850 3150 50  0001 C CNN
F 1 "VCC" H 3000 3350 50  0000 C CNN
F 2 "" H 2850 3300 50  0001 C CNN
F 3 "" H 2850 3300 50  0001 C CNN
	1    2850 3300
	1    0    0    -1  
$EndComp
Wire Wire Line
	2700 3300 2850 3300
Wire Wire Line
	2700 3200 2700 3300
Connection ~ 2700 3300
$Comp
L power:VCC #PWR09
U 1 1 5DAC78F7
P 2850 6600
F 0 "#PWR09" H 2850 6450 50  0001 C CNN
F 1 "VCC" H 3000 6650 50  0000 C CNN
F 2 "" H 2850 6600 50  0001 C CNN
F 3 "" H 2850 6600 50  0001 C CNN
	1    2850 6600
	1    0    0    -1  
$EndComp
Wire Wire Line
	2700 6600 2850 6600
Wire Wire Line
	2700 6500 2700 6600
Connection ~ 2700 6600
$Comp
L power:VCC #PWR02
U 1 1 5DAC93FD
P 1300 4850
F 0 "#PWR02" H 1300 4700 50  0001 C CNN
F 1 "VCC" H 1450 4900 50  0000 C CNN
F 2 "" H 1300 4850 50  0001 C CNN
F 3 "" H 1300 4850 50  0001 C CNN
	1    1300 4850
	1    0    0    -1  
$EndComp
Wire Wire Line
	1300 4850 1650 4850
$Comp
L power:GND #PWR011
U 1 1 5DACA264
P 3400 1900
F 0 "#PWR011" H 3400 1650 50  0001 C CNN
F 1 "GND" H 3405 1727 50  0001 C CNN
F 2 "" H 3400 1900 50  0001 C CNN
F 3 "" H 3400 1900 50  0001 C CNN
	1    3400 1900
	1    0    0    -1  
$EndComp
$Comp
L power:GND #PWR010
U 1 1 5DACA27F
P 2850 6700
F 0 "#PWR010" H 2850 6450 50  0001 C CNN
F 1 "GND" H 2855 6527 50  0001 C CNN
F 2 "" H 2850 6700 50  0001 C CNN
F 3 "" H 2850 6700 50  0001 C CNN
	1    2850 6700
	1    0    0    -1  
$EndComp
Wire Wire Line
	2850 6700 2700 6700
$Comp
L power:GND #PWR01
U 1 1 5DACE009
P 900 3600
F 0 "#PWR01" H 900 3350 50  0001 C CNN
F 1 "GND" H 905 3427 50  0001 C CNN
F 2 "" H 900 3600 50  0001 C CNN
F 3 "" H 900 3600 50  0001 C CNN
	1    900  3600
	-1   0    0    -1  
$EndComp
Wire Wire Line
	900  3550 1650 3550
$Comp
L 74xx:74LS138 UA2
U 1 1 5DAD6714
P 13150 8200
F 0 "UA2" H 12900 8700 50  0000 C CNN
F 1 "74LS138" H 13350 7650 50  0000 C CNN
F 2 "" H 13150 8200 50  0001 C CNN
F 3 "http://www.ti.com/lit/gpn/sn74LS138" H 13150 8200 50  0001 C CNN
	1    13150 8200
	1    0    0    -1  
$EndComp
$Comp
L Device:Ferrite_Bead_Small FB1
U 1 1 5DAB873E
P 13900 7900
F 0 "FB1" V 13850 8050 50  0000 C CNN
F 1 "Ferrite_Bead_Small" V 13754 7900 50  0001 C CNN
F 2 "" V 13830 7900 50  0001 C CNN
F 3 "~" H 13900 7900 50  0001 C CNN
	1    13900 7900
	0    1    1    0   
$EndComp
$Comp
L Device:Ferrite_Bead_Small FB2
U 1 1 5DAB88E0
P 14000 8000
F 0 "FB2" V 13950 8150 50  0000 C CNN
F 1 "Ferrite_Bead_Small" V 13854 8000 50  0001 C CNN
F 2 "" V 13930 8000 50  0001 C CNN
F 3 "~" H 14000 8000 50  0001 C CNN
	1    14000 8000
	0    1    1    0   
$EndComp
$Comp
L Device:Ferrite_Bead_Small FB3
U 1 1 5DAB9A10
P 14100 8100
F 0 "FB3" V 14050 8250 50  0000 C CNN
F 1 "Ferrite_Bead_Small" V 13954 8100 50  0001 C CNN
F 2 "" V 14030 8100 50  0001 C CNN
F 3 "~" H 14100 8100 50  0001 C CNN
	1    14100 8100
	0    1    1    0   
$EndComp
$Comp
L Device:Ferrite_Bead_Small FB4
U 1 1 5DABAB4B
P 14200 8200
F 0 "FB4" V 14150 8350 50  0000 C CNN
F 1 "Ferrite_Bead_Small" V 14054 8200 50  0001 C CNN
F 2 "" V 14130 8200 50  0001 C CNN
F 3 "~" H 14200 8200 50  0001 C CNN
	1    14200 8200
	0    1    1    0   
$EndComp
$Comp
L Device:Ferrite_Bead_Small FB5
U 1 1 5DABBC95
P 13900 8300
F 0 "FB5" V 13850 8450 50  0000 C CNN
F 1 "Ferrite_Bead_Small" V 13754 8300 50  0001 C CNN
F 2 "" V 13830 8300 50  0001 C CNN
F 3 "~" H 13900 8300 50  0001 C CNN
	1    13900 8300
	0    1    1    0   
$EndComp
$Comp
L Device:Ferrite_Bead_Small FB6
U 1 1 5DABCDD2
P 14000 8400
F 0 "FB6" V 13950 8550 50  0000 C CNN
F 1 "Ferrite_Bead_Small" V 13854 8400 50  0001 C CNN
F 2 "" V 13930 8400 50  0001 C CNN
F 3 "~" H 14000 8400 50  0001 C CNN
	1    14000 8400
	0    1    1    0   
$EndComp
$Comp
L Device:Ferrite_Bead_Small FB7
U 1 1 5DABDF04
P 14100 8500
F 0 "FB7" V 14050 8650 50  0000 C CNN
F 1 "Ferrite_Bead_Small" V 13954 8500 50  0001 C CNN
F 2 "" V 14030 8500 50  0001 C CNN
F 3 "~" H 14100 8500 50  0001 C CNN
	1    14100 8500
	0    1    1    0   
$EndComp
$Comp
L Device:Ferrite_Bead_Small FB8
U 1 1 5DABF039
P 14200 8600
F 0 "FB8" V 14150 8750 50  0000 C CNN
F 1 "Ferrite_Bead_Small" V 14054 8600 50  0001 C CNN
F 2 "" V 14130 8600 50  0001 C CNN
F 3 "~" H 14200 8600 50  0001 C CNN
	1    14200 8600
	0    1    1    0   
$EndComp
Wire Wire Line
	13650 7900 13800 7900
Wire Wire Line
	13900 8000 13650 8000
Wire Wire Line
	13650 8100 14000 8100
Wire Wire Line
	14100 8200 13650 8200
Wire Wire Line
	13650 8300 13800 8300
Wire Wire Line
	13900 8400 13650 8400
Wire Wire Line
	13650 8500 14000 8500
Wire Wire Line
	14100 8600 13650 8600
$Comp
L power:VCC #PWR036
U 1 1 5DAD7E7D
P 13150 7600
F 0 "#PWR036" H 13150 7450 50  0001 C CNN
F 1 "VCC" H 13150 7800 50  0000 C CNN
F 2 "" H 13150 7600 50  0001 C CNN
F 3 "" H 13150 7600 50  0001 C CNN
	1    13150 7600
	1    0    0    -1  
$EndComp
$Comp
L Device:C_Small CX8
U 1 1 5DAD7FD6
P 13500 7600
F 0 "CX8" V 13271 7600 50  0000 C CNN
F 1 "0.1u" V 13362 7600 50  0000 C CNN
F 2 "" H 13500 7600 50  0001 C CNN
F 3 "~" H 13500 7600 50  0001 C CNN
	1    13500 7600
	0    1    1    0   
$EndComp
Wire Wire Line
	13150 7600 13400 7600
Connection ~ 13150 7600
$Comp
L power:GND #PWR042
U 1 1 5DADD46B
P 13600 7600
F 0 "#PWR042" H 13600 7350 50  0001 C CNN
F 1 "GND" H 13605 7427 50  0001 C CNN
F 2 "" H 13600 7600 50  0001 C CNN
F 3 "" H 13600 7600 50  0001 C CNN
	1    13600 7600
	1    0    0    -1  
$EndComp
$Comp
L power:GND #PWR037
U 1 1 5DADD506
P 13150 8900
F 0 "#PWR037" H 13150 8650 50  0001 C CNN
F 1 "GND" H 13155 8727 50  0001 C CNN
F 2 "" H 13150 8900 50  0001 C CNN
F 3 "" H 13150 8900 50  0001 C CNN
	1    13150 8900
	1    0    0    -1  
$EndComp
Text Label 11950 8700 0    50   ~ 0
QSOUND-ADDR22
Wire Wire Line
	11900 8700 12650 8700
Text Label 11950 8100 0    50   ~ 0
QSOUND-ADDR21
Wire Wire Line
	11900 8100 12650 8100
Text Label 11950 8000 0    50   ~ 0
QSOUND-ADDR20
Wire Wire Line
	11900 8000 12650 8000
Text Label 11950 7900 0    50   ~ 0
QSOUND-ADDR19
Wire Wire Line
	11900 7900 12650 7900
$Comp
L power:GND #PWR034
U 1 1 5DAEE20B
P 12350 8500
F 0 "#PWR034" H 12350 8250 50  0001 C CNN
F 1 "GND" H 12355 8327 50  0001 C CNN
F 2 "" H 12350 8500 50  0001 C CNN
F 3 "" H 12350 8500 50  0001 C CNN
	1    12350 8500
	1    0    0    -1  
$EndComp
$Comp
L power:VCC #PWR035
U 1 1 5DAEE22E
P 12650 8350
F 0 "#PWR035" H 12650 8200 50  0001 C CNN
F 1 "VCC" H 12650 8550 50  0000 C CNN
F 2 "" H 12650 8350 50  0001 C CNN
F 3 "" H 12650 8350 50  0001 C CNN
	1    12650 8350
	1    0    0    -1  
$EndComp
Wire Wire Line
	12650 8350 12650 8400
Wire Wire Line
	12350 8500 12650 8500
Wire Wire Line
	12650 8700 12650 8600
$Comp
L CPS2-Custom:27C4001 UB1
U 1 1 5DB0B1AB
P 5850 2300
F 0 "UB1" H 5600 3550 50  0000 C CNN
F 1 "27C4001" H 6050 1100 50  0000 C CNN
F 2 "Package_DIP:DIP-32_W15.24mm_Socket" H 5850 2300 50  0001 C CNN
F 3 "http://ww1.microchip.com/downloads/en/DeviceDoc/doc0015.pdf" H 5850 2450 50  0001 C CNN
	1    5850 2300
	1    0    0    -1  
$EndComp
Text Label 5300 3250 0    50   ~ 0
~E1
Wire Wire Line
	14000 7900 14700 7900
Wire Wire Line
	14100 8000 14700 8000
Wire Wire Line
	14300 8600 14700 8600
Wire Wire Line
	14200 8100 14700 8100
Wire Wire Line
	14200 8500 14700 8500
Wire Wire Line
	14300 8200 14700 8200
Wire Wire Line
	14100 8400 14700 8400
Wire Wire Line
	14000 8300 14700 8300
Text Label 14550 7900 0    50   ~ 0
~E1
Text Label 14550 8000 0    50   ~ 0
~E2
Text Label 14550 8100 0    50   ~ 0
~E3
Text Label 14550 8200 0    50   ~ 0
~E4
Text Label 14550 8300 0    50   ~ 0
~E5
Text Label 14550 8400 0    50   ~ 0
~E6
Text Label 14550 8500 0    50   ~ 0
~E7
Text Label 14550 8600 0    50   ~ 0
~E8
Wire Wire Line
	5300 3250 5450 3250
Text Label 6300 1250 0    50   ~ 0
QSOUND-DATA0
Text Label 6300 1350 0    50   ~ 0
QSOUND-DATA1
Text Label 6300 1450 0    50   ~ 0
QSOUND-DATA2
Text Label 6300 1550 0    50   ~ 0
QSOUND-DATA3
Text Label 6300 1650 0    50   ~ 0
QSOUND-DATA4
Text Label 6300 1750 0    50   ~ 0
QSOUND-DATA5
Text Label 6300 1850 0    50   ~ 0
QSOUND-DATA6
Text Label 6300 1950 0    50   ~ 0
QSOUND-DATA7
Wire Wire Line
	6250 1950 6950 1950
Wire Wire Line
	6250 1850 6950 1850
Wire Wire Line
	6250 1750 6950 1750
Wire Wire Line
	6250 1650 6950 1650
Wire Wire Line
	6250 1550 6950 1550
Wire Wire Line
	6250 1450 6950 1450
Wire Wire Line
	6250 1350 6950 1350
Wire Wire Line
	6250 1250 6950 1250
$Comp
L power:GND #PWR014
U 1 1 5DB72DFF
P 5850 3500
F 0 "#PWR014" H 5850 3250 50  0001 C CNN
F 1 "GND" H 5855 3327 50  0001 C CNN
F 2 "" H 5850 3500 50  0001 C CNN
F 3 "" H 5850 3500 50  0001 C CNN
	1    5850 3500
	1    0    0    -1  
$EndComp
$Comp
L power:VCC #PWR025
U 1 1 5DB72F89
P 9600 7900
F 0 "#PWR025" H 9600 7750 50  0001 C CNN
F 1 "VCC" H 9600 8100 50  0000 C CNN
F 2 "" H 9600 7900 50  0001 C CNN
F 3 "" H 9600 7900 50  0001 C CNN
	1    9600 7900
	1    0    0    -1  
$EndComp
$Comp
L Device:C_Small CX5
U 1 1 5DB72FAC
P 9900 7900
F 0 "CX5" V 9671 7900 50  0000 C CNN
F 1 "0.1u" V 9762 7900 50  0000 C CNN
F 2 "" H 9900 7900 50  0001 C CNN
F 3 "~" H 9900 7900 50  0001 C CNN
	1    9900 7900
	0    1    1    0   
$EndComp
$Comp
L power:GND #PWR027
U 1 1 5DB73012
P 10000 7900
F 0 "#PWR027" H 10000 7650 50  0001 C CNN
F 1 "GND" H 10005 7727 50  0001 C CNN
F 2 "" H 10000 7900 50  0001 C CNN
F 3 "" H 10000 7900 50  0001 C CNN
	1    10000 7900
	1    0    0    -1  
$EndComp
$Comp
L power:VCC #PWR013
U 1 1 5DB895BB
P 5850 1050
F 0 "#PWR013" H 5850 900 50  0001 C CNN
F 1 "VCC" H 5850 1250 50  0000 C CNN
F 2 "" H 5850 1050 50  0001 C CNN
F 3 "" H 5850 1050 50  0001 C CNN
	1    5850 1050
	1    0    0    -1  
$EndComp
$Comp
L Device:C_Small CX1
U 1 1 5DB895C1
P 6200 1050
F 0 "CX1" V 5971 1050 50  0000 C CNN
F 1 "0.1u" V 6062 1050 50  0000 C CNN
F 2 "" H 6200 1050 50  0001 C CNN
F 3 "~" H 6200 1050 50  0001 C CNN
	1    6200 1050
	0    1    1    0   
$EndComp
$Comp
L power:GND #PWR017
U 1 1 5DB895C8
P 6300 1050
F 0 "#PWR017" H 6300 800 50  0001 C CNN
F 1 "GND" H 6305 877 50  0001 C CNN
F 2 "" H 6300 1050 50  0001 C CNN
F 3 "" H 6300 1050 50  0001 C CNN
	1    6300 1050
	1    0    0    -1  
$EndComp
Wire Wire Line
	6100 1050 5850 1050
$Comp
L CPS2-Custom:27C4001 UB2
U 1 1 5DB9118B
P 8350 2300
F 0 "UB2" H 8100 3550 50  0000 C CNN
F 1 "27C4001" H 8550 1100 50  0000 C CNN
F 2 "Package_DIP:DIP-32_W15.24mm_Socket" H 8350 2300 50  0001 C CNN
F 3 "http://ww1.microchip.com/downloads/en/DeviceDoc/doc0015.pdf" H 8350 2450 50  0001 C CNN
	1    8350 2300
	1    0    0    -1  
$EndComp
Text Label 7800 3250 0    50   ~ 0
~E2
Wire Wire Line
	7800 3250 7950 3250
Text Label 8800 1250 0    50   ~ 0
QSOUND-DATA0
Text Label 8800 1350 0    50   ~ 0
QSOUND-DATA1
Text Label 8800 1450 0    50   ~ 0
QSOUND-DATA2
Text Label 8800 1550 0    50   ~ 0
QSOUND-DATA3
Text Label 8800 1650 0    50   ~ 0
QSOUND-DATA4
Text Label 8800 1750 0    50   ~ 0
QSOUND-DATA5
Text Label 8800 1850 0    50   ~ 0
QSOUND-DATA6
Text Label 8800 1950 0    50   ~ 0
QSOUND-DATA7
Wire Wire Line
	8750 1950 9450 1950
Wire Wire Line
	8750 1850 9450 1850
Wire Wire Line
	8750 1750 9450 1750
Wire Wire Line
	8750 1650 9450 1650
Wire Wire Line
	8750 1550 9450 1550
Wire Wire Line
	8750 1450 9450 1450
Wire Wire Line
	8750 1350 9450 1350
Wire Wire Line
	8750 1250 9450 1250
$Comp
L power:GND #PWR020
U 1 1 5DB911CC
P 8350 3500
F 0 "#PWR020" H 8350 3250 50  0001 C CNN
F 1 "GND" H 8355 3327 50  0001 C CNN
F 2 "" H 8350 3500 50  0001 C CNN
F 3 "" H 8350 3500 50  0001 C CNN
	1    8350 3500
	1    0    0    -1  
$EndComp
$Comp
L power:VCC #PWR019
U 1 1 5DB911D2
P 8350 1050
F 0 "#PWR019" H 8350 900 50  0001 C CNN
F 1 "VCC" H 8350 1250 50  0000 C CNN
F 2 "" H 8350 1050 50  0001 C CNN
F 3 "" H 8350 1050 50  0001 C CNN
	1    8350 1050
	1    0    0    -1  
$EndComp
$Comp
L Device:C_Small CX3
U 1 1 5DB911D8
P 8700 1050
F 0 "CX3" V 8471 1050 50  0000 C CNN
F 1 "0.1u" V 8562 1050 50  0000 C CNN
F 2 "" H 8700 1050 50  0001 C CNN
F 3 "~" H 8700 1050 50  0001 C CNN
	1    8700 1050
	0    1    1    0   
$EndComp
$Comp
L power:GND #PWR023
U 1 1 5DB911DF
P 8800 1050
F 0 "#PWR023" H 8800 800 50  0001 C CNN
F 1 "GND" H 8805 877 50  0001 C CNN
F 2 "" H 8800 1050 50  0001 C CNN
F 3 "" H 8800 1050 50  0001 C CNN
	1    8800 1050
	1    0    0    -1  
$EndComp
Wire Wire Line
	8600 1050 8350 1050
Connection ~ 5850 1050
Connection ~ 8350 1050
$Comp
L CPS2-Custom:27C4001 UB3
U 1 1 5DBDB85F
P 10850 2300
F 0 "UB3" H 10600 3550 50  0000 C CNN
F 1 "27C4001" H 11050 1100 50  0000 C CNN
F 2 "Package_DIP:DIP-32_W15.24mm_Socket" H 10850 2300 50  0001 C CNN
F 3 "http://ww1.microchip.com/downloads/en/DeviceDoc/doc0015.pdf" H 10850 2450 50  0001 C CNN
	1    10850 2300
	1    0    0    -1  
$EndComp
Text Label 10300 3250 0    50   ~ 0
~E3
Wire Wire Line
	10300 3250 10450 3250
Text Label 11300 1250 0    50   ~ 0
QSOUND-DATA0
Text Label 11300 1350 0    50   ~ 0
QSOUND-DATA1
Text Label 11300 1450 0    50   ~ 0
QSOUND-DATA2
Text Label 11300 1550 0    50   ~ 0
QSOUND-DATA3
Text Label 11300 1650 0    50   ~ 0
QSOUND-DATA4
Text Label 11300 1750 0    50   ~ 0
QSOUND-DATA5
Text Label 11300 1850 0    50   ~ 0
QSOUND-DATA6
Text Label 11300 1950 0    50   ~ 0
QSOUND-DATA7
Wire Wire Line
	11250 1950 11950 1950
Wire Wire Line
	11250 1850 11950 1850
Wire Wire Line
	11250 1750 11950 1750
Wire Wire Line
	11250 1650 11950 1650
Wire Wire Line
	11250 1550 11950 1550
Wire Wire Line
	11250 1450 11950 1450
Wire Wire Line
	11250 1350 11950 1350
Wire Wire Line
	11250 1250 11950 1250
$Comp
L power:GND #PWR029
U 1 1 5DBDB8A0
P 10850 3500
F 0 "#PWR029" H 10850 3250 50  0001 C CNN
F 1 "GND" H 10855 3327 50  0001 C CNN
F 2 "" H 10850 3500 50  0001 C CNN
F 3 "" H 10850 3500 50  0001 C CNN
	1    10850 3500
	1    0    0    -1  
$EndComp
$Comp
L power:VCC #PWR028
U 1 1 5DBDB8A6
P 10850 1050
F 0 "#PWR028" H 10850 900 50  0001 C CNN
F 1 "VCC" H 10850 1250 50  0000 C CNN
F 2 "" H 10850 1050 50  0001 C CNN
F 3 "" H 10850 1050 50  0001 C CNN
	1    10850 1050
	1    0    0    -1  
$EndComp
$Comp
L Device:C_Small CX6
U 1 1 5DBDB8AC
P 11200 1050
F 0 "CX6" V 10971 1050 50  0000 C CNN
F 1 "0.1u" V 11062 1050 50  0000 C CNN
F 2 "" H 11200 1050 50  0001 C CNN
F 3 "~" H 11200 1050 50  0001 C CNN
	1    11200 1050
	0    1    1    0   
$EndComp
$Comp
L power:GND #PWR032
U 1 1 5DBDB8B3
P 11300 1050
F 0 "#PWR032" H 11300 800 50  0001 C CNN
F 1 "GND" H 11305 877 50  0001 C CNN
F 2 "" H 11300 1050 50  0001 C CNN
F 3 "" H 11300 1050 50  0001 C CNN
	1    11300 1050
	1    0    0    -1  
$EndComp
Wire Wire Line
	11100 1050 10850 1050
$Comp
L CPS2-Custom:27C4001 UB4
U 1 1 5DBDB8BA
P 13350 2300
F 0 "UB4" H 13100 3550 50  0000 C CNN
F 1 "27C4001" H 13550 1100 50  0000 C CNN
F 2 "Package_DIP:DIP-32_W15.24mm_Socket" H 13350 2300 50  0001 C CNN
F 3 "http://ww1.microchip.com/downloads/en/DeviceDoc/doc0015.pdf" H 13350 2450 50  0001 C CNN
	1    13350 2300
	1    0    0    -1  
$EndComp
Text Label 12800 3250 0    50   ~ 0
~E4
Wire Wire Line
	12800 3250 12950 3250
Text Label 13800 1250 0    50   ~ 0
QSOUND-DATA0
Text Label 13800 1350 0    50   ~ 0
QSOUND-DATA1
Text Label 13800 1450 0    50   ~ 0
QSOUND-DATA2
Text Label 13800 1550 0    50   ~ 0
QSOUND-DATA3
Text Label 13800 1650 0    50   ~ 0
QSOUND-DATA4
Text Label 13800 1750 0    50   ~ 0
QSOUND-DATA5
Text Label 13800 1850 0    50   ~ 0
QSOUND-DATA6
Text Label 13800 1950 0    50   ~ 0
QSOUND-DATA7
Wire Wire Line
	13750 1950 14450 1950
Wire Wire Line
	13750 1850 14450 1850
Wire Wire Line
	13750 1750 14450 1750
Wire Wire Line
	13750 1650 14450 1650
Wire Wire Line
	13750 1550 14450 1550
Wire Wire Line
	13750 1450 14450 1450
Wire Wire Line
	13750 1350 14450 1350
Wire Wire Line
	13750 1250 14450 1250
$Comp
L power:GND #PWR039
U 1 1 5DBDB8FB
P 13350 3500
F 0 "#PWR039" H 13350 3250 50  0001 C CNN
F 1 "GND" H 13355 3327 50  0001 C CNN
F 2 "" H 13350 3500 50  0001 C CNN
F 3 "" H 13350 3500 50  0001 C CNN
	1    13350 3500
	1    0    0    -1  
$EndComp
$Comp
L power:VCC #PWR038
U 1 1 5DBDB901
P 13350 1050
F 0 "#PWR038" H 13350 900 50  0001 C CNN
F 1 "VCC" H 13350 1250 50  0000 C CNN
F 2 "" H 13350 1050 50  0001 C CNN
F 3 "" H 13350 1050 50  0001 C CNN
	1    13350 1050
	1    0    0    -1  
$EndComp
$Comp
L Device:C_Small CX9
U 1 1 5DBDB907
P 13700 1050
F 0 "CX9" V 13471 1050 50  0000 C CNN
F 1 "0.1u" V 13562 1050 50  0000 C CNN
F 2 "" H 13700 1050 50  0001 C CNN
F 3 "~" H 13700 1050 50  0001 C CNN
	1    13700 1050
	0    1    1    0   
$EndComp
$Comp
L power:GND #PWR043
U 1 1 5DBDB90E
P 13800 1050
F 0 "#PWR043" H 13800 800 50  0001 C CNN
F 1 "GND" H 13805 877 50  0001 C CNN
F 2 "" H 13800 1050 50  0001 C CNN
F 3 "" H 13800 1050 50  0001 C CNN
	1    13800 1050
	1    0    0    -1  
$EndComp
Wire Wire Line
	13600 1050 13350 1050
Connection ~ 10850 1050
Connection ~ 13350 1050
$Comp
L CPS2-Custom:27C4001 UC1
U 1 1 5DC42328
P 5850 5400
F 0 "UC1" H 5600 6650 50  0000 C CNN
F 1 "27C4001" H 6050 4200 50  0000 C CNN
F 2 "Package_DIP:DIP-32_W15.24mm_Socket" H 5850 5400 50  0001 C CNN
F 3 "http://ww1.microchip.com/downloads/en/DeviceDoc/doc0015.pdf" H 5850 5550 50  0001 C CNN
	1    5850 5400
	1    0    0    -1  
$EndComp
Text Label 5300 6350 0    50   ~ 0
~E5
Wire Wire Line
	5300 6350 5450 6350
Text Label 6300 4350 0    50   ~ 0
QSOUND-DATA0
Text Label 6300 4450 0    50   ~ 0
QSOUND-DATA1
Text Label 6300 4550 0    50   ~ 0
QSOUND-DATA2
Text Label 6300 4650 0    50   ~ 0
QSOUND-DATA3
Text Label 6300 4750 0    50   ~ 0
QSOUND-DATA4
Text Label 6300 4850 0    50   ~ 0
QSOUND-DATA5
Text Label 6300 4950 0    50   ~ 0
QSOUND-DATA6
Text Label 6300 5050 0    50   ~ 0
QSOUND-DATA7
Wire Wire Line
	6250 5050 6950 5050
Wire Wire Line
	6250 4950 6950 4950
Wire Wire Line
	6250 4850 6950 4850
Wire Wire Line
	6250 4750 6950 4750
Wire Wire Line
	6250 4650 6950 4650
Wire Wire Line
	6250 4550 6950 4550
Wire Wire Line
	6250 4450 6950 4450
Wire Wire Line
	6250 4350 6950 4350
$Comp
L power:GND #PWR016
U 1 1 5DC42369
P 5850 6600
F 0 "#PWR016" H 5850 6350 50  0001 C CNN
F 1 "GND" H 5855 6427 50  0001 C CNN
F 2 "" H 5850 6600 50  0001 C CNN
F 3 "" H 5850 6600 50  0001 C CNN
	1    5850 6600
	1    0    0    -1  
$EndComp
$Comp
L power:VCC #PWR015
U 1 1 5DC4236F
P 5850 4150
F 0 "#PWR015" H 5850 4000 50  0001 C CNN
F 1 "VCC" H 5850 4350 50  0000 C CNN
F 2 "" H 5850 4150 50  0001 C CNN
F 3 "" H 5850 4150 50  0001 C CNN
	1    5850 4150
	1    0    0    -1  
$EndComp
$Comp
L Device:C_Small CX2
U 1 1 5DC42375
P 6200 4150
F 0 "CX2" V 5971 4150 50  0000 C CNN
F 1 "0.1u" V 6062 4150 50  0000 C CNN
F 2 "" H 6200 4150 50  0001 C CNN
F 3 "~" H 6200 4150 50  0001 C CNN
	1    6200 4150
	0    1    1    0   
$EndComp
$Comp
L power:GND #PWR018
U 1 1 5DC4237C
P 6300 4150
F 0 "#PWR018" H 6300 3900 50  0001 C CNN
F 1 "GND" H 6305 3977 50  0001 C CNN
F 2 "" H 6300 4150 50  0001 C CNN
F 3 "" H 6300 4150 50  0001 C CNN
	1    6300 4150
	1    0    0    -1  
$EndComp
Wire Wire Line
	6100 4150 5850 4150
$Comp
L CPS2-Custom:27C4001 UC2
U 1 1 5DC42383
P 8350 5400
F 0 "UC2" H 8100 6650 50  0000 C CNN
F 1 "27C4001" H 8550 4200 50  0000 C CNN
F 2 "Package_DIP:DIP-32_W15.24mm_Socket" H 8350 5400 50  0001 C CNN
F 3 "http://ww1.microchip.com/downloads/en/DeviceDoc/doc0015.pdf" H 8350 5550 50  0001 C CNN
	1    8350 5400
	1    0    0    -1  
$EndComp
Text Label 7800 6350 0    50   ~ 0
~E6
Wire Wire Line
	7800 6350 7950 6350
Text Label 8800 4350 0    50   ~ 0
QSOUND-DATA0
Text Label 8800 4450 0    50   ~ 0
QSOUND-DATA1
Text Label 8800 4550 0    50   ~ 0
QSOUND-DATA2
Text Label 8800 4650 0    50   ~ 0
QSOUND-DATA3
Text Label 8800 4750 0    50   ~ 0
QSOUND-DATA4
Text Label 8800 4850 0    50   ~ 0
QSOUND-DATA5
Text Label 8800 4950 0    50   ~ 0
QSOUND-DATA6
Text Label 8800 5050 0    50   ~ 0
QSOUND-DATA7
Wire Wire Line
	8750 5050 9450 5050
Wire Wire Line
	8750 4950 9450 4950
Wire Wire Line
	8750 4850 9450 4850
Wire Wire Line
	8750 4750 9450 4750
Wire Wire Line
	8750 4650 9450 4650
Wire Wire Line
	8750 4550 9450 4550
Wire Wire Line
	8750 4450 9450 4450
Wire Wire Line
	8750 4350 9450 4350
$Comp
L power:GND #PWR022
U 1 1 5DC423C4
P 8350 6600
F 0 "#PWR022" H 8350 6350 50  0001 C CNN
F 1 "GND" H 8355 6427 50  0001 C CNN
F 2 "" H 8350 6600 50  0001 C CNN
F 3 "" H 8350 6600 50  0001 C CNN
	1    8350 6600
	1    0    0    -1  
$EndComp
$Comp
L power:VCC #PWR021
U 1 1 5DC423CA
P 8350 4150
F 0 "#PWR021" H 8350 4000 50  0001 C CNN
F 1 "VCC" H 8350 4350 50  0000 C CNN
F 2 "" H 8350 4150 50  0001 C CNN
F 3 "" H 8350 4150 50  0001 C CNN
	1    8350 4150
	1    0    0    -1  
$EndComp
$Comp
L Device:C_Small CX4
U 1 1 5DC423D0
P 8700 4150
F 0 "CX4" V 8471 4150 50  0000 C CNN
F 1 "0.1u" V 8562 4150 50  0000 C CNN
F 2 "" H 8700 4150 50  0001 C CNN
F 3 "~" H 8700 4150 50  0001 C CNN
	1    8700 4150
	0    1    1    0   
$EndComp
$Comp
L power:GND #PWR024
U 1 1 5DC423D7
P 8800 4150
F 0 "#PWR024" H 8800 3900 50  0001 C CNN
F 1 "GND" H 8805 3977 50  0001 C CNN
F 2 "" H 8800 4150 50  0001 C CNN
F 3 "" H 8800 4150 50  0001 C CNN
	1    8800 4150
	1    0    0    -1  
$EndComp
Wire Wire Line
	8600 4150 8350 4150
Connection ~ 5850 4150
Connection ~ 8350 4150
$Comp
L CPS2-Custom:27C4001 UC3
U 1 1 5DC423E0
P 10850 5400
F 0 "UC3" H 10600 6650 50  0000 C CNN
F 1 "27C4001" H 11050 4200 50  0000 C CNN
F 2 "Package_DIP:DIP-32_W15.24mm_Socket" H 10850 5400 50  0001 C CNN
F 3 "http://ww1.microchip.com/downloads/en/DeviceDoc/doc0015.pdf" H 10850 5550 50  0001 C CNN
	1    10850 5400
	1    0    0    -1  
$EndComp
Text Label 10300 6350 0    50   ~ 0
~E7
Wire Wire Line
	10300 6350 10450 6350
Text Label 11300 4350 0    50   ~ 0
QSOUND-DATA0
Text Label 11300 4450 0    50   ~ 0
QSOUND-DATA1
Text Label 11300 4550 0    50   ~ 0
QSOUND-DATA2
Text Label 11300 4650 0    50   ~ 0
QSOUND-DATA3
Text Label 11300 4750 0    50   ~ 0
QSOUND-DATA4
Text Label 11300 4850 0    50   ~ 0
QSOUND-DATA5
Text Label 11300 4950 0    50   ~ 0
QSOUND-DATA6
Text Label 11300 5050 0    50   ~ 0
QSOUND-DATA7
Wire Wire Line
	11250 5050 11950 5050
Wire Wire Line
	11250 4950 11950 4950
Wire Wire Line
	11250 4850 11950 4850
Wire Wire Line
	11250 4750 11950 4750
Wire Wire Line
	11250 4650 11950 4650
Wire Wire Line
	11250 4550 11950 4550
Wire Wire Line
	11250 4450 11950 4450
Wire Wire Line
	11250 4350 11950 4350
$Comp
L power:GND #PWR031
U 1 1 5DC42421
P 10850 6600
F 0 "#PWR031" H 10850 6350 50  0001 C CNN
F 1 "GND" H 10855 6427 50  0001 C CNN
F 2 "" H 10850 6600 50  0001 C CNN
F 3 "" H 10850 6600 50  0001 C CNN
	1    10850 6600
	1    0    0    -1  
$EndComp
$Comp
L power:VCC #PWR030
U 1 1 5DC42427
P 10850 4150
F 0 "#PWR030" H 10850 4000 50  0001 C CNN
F 1 "VCC" H 10850 4350 50  0000 C CNN
F 2 "" H 10850 4150 50  0001 C CNN
F 3 "" H 10850 4150 50  0001 C CNN
	1    10850 4150
	1    0    0    -1  
$EndComp
$Comp
L Device:C_Small CX7
U 1 1 5DC4242D
P 11200 4150
F 0 "CX7" V 10971 4150 50  0000 C CNN
F 1 "0.1u" V 11062 4150 50  0000 C CNN
F 2 "" H 11200 4150 50  0001 C CNN
F 3 "~" H 11200 4150 50  0001 C CNN
	1    11200 4150
	0    1    1    0   
$EndComp
$Comp
L power:GND #PWR033
U 1 1 5DC42434
P 11300 4150
F 0 "#PWR033" H 11300 3900 50  0001 C CNN
F 1 "GND" H 11305 3977 50  0001 C CNN
F 2 "" H 11300 4150 50  0001 C CNN
F 3 "" H 11300 4150 50  0001 C CNN
	1    11300 4150
	1    0    0    -1  
$EndComp
Wire Wire Line
	11100 4150 10850 4150
$Comp
L CPS2-Custom:27C4001 UC4
U 1 1 5DC4243B
P 13350 5400
F 0 "UC4" H 13100 6650 50  0000 C CNN
F 1 "27C4001" H 13550 4200 50  0000 C CNN
F 2 "Package_DIP:DIP-32_W15.24mm_Socket" H 13350 5400 50  0001 C CNN
F 3 "http://ww1.microchip.com/downloads/en/DeviceDoc/doc0015.pdf" H 13350 5550 50  0001 C CNN
	1    13350 5400
	1    0    0    -1  
$EndComp
Text Label 12800 6350 0    50   ~ 0
~E8
Wire Wire Line
	12800 6350 12950 6350
Text Label 13800 4350 0    50   ~ 0
QSOUND-DATA0
Text Label 13800 4450 0    50   ~ 0
QSOUND-DATA1
Text Label 13800 4550 0    50   ~ 0
QSOUND-DATA2
Text Label 13800 4650 0    50   ~ 0
QSOUND-DATA3
Text Label 13800 4750 0    50   ~ 0
QSOUND-DATA4
Text Label 13800 4850 0    50   ~ 0
QSOUND-DATA5
Text Label 13800 4950 0    50   ~ 0
QSOUND-DATA6
Text Label 13800 5050 0    50   ~ 0
QSOUND-DATA7
Wire Wire Line
	13750 5050 14450 5050
Wire Wire Line
	13750 4950 14450 4950
Wire Wire Line
	13750 4850 14450 4850
Wire Wire Line
	13750 4750 14450 4750
Wire Wire Line
	13750 4650 14450 4650
Wire Wire Line
	13750 4550 14450 4550
Wire Wire Line
	13750 4450 14450 4450
Wire Wire Line
	13750 4350 14450 4350
$Comp
L power:GND #PWR041
U 1 1 5DC4247C
P 13350 6600
F 0 "#PWR041" H 13350 6350 50  0001 C CNN
F 1 "GND" H 13355 6427 50  0001 C CNN
F 2 "" H 13350 6600 50  0001 C CNN
F 3 "" H 13350 6600 50  0001 C CNN
	1    13350 6600
	1    0    0    -1  
$EndComp
$Comp
L power:VCC #PWR040
U 1 1 5DC42482
P 13350 4150
F 0 "#PWR040" H 13350 4000 50  0001 C CNN
F 1 "VCC" H 13350 4350 50  0000 C CNN
F 2 "" H 13350 4150 50  0001 C CNN
F 3 "" H 13350 4150 50  0001 C CNN
	1    13350 4150
	1    0    0    -1  
$EndComp
$Comp
L Device:C_Small CX10
U 1 1 5DC42488
P 13700 4150
F 0 "CX10" V 13471 4150 50  0000 C CNN
F 1 "0.1u" V 13562 4150 50  0000 C CNN
F 2 "" H 13700 4150 50  0001 C CNN
F 3 "~" H 13700 4150 50  0001 C CNN
	1    13700 4150
	0    1    1    0   
$EndComp
$Comp
L power:GND #PWR044
U 1 1 5DC4248F
P 13800 4150
F 0 "#PWR044" H 13800 3900 50  0001 C CNN
F 1 "GND" H 13805 3977 50  0001 C CNN
F 2 "" H 13800 4150 50  0001 C CNN
F 3 "" H 13800 4150 50  0001 C CNN
	1    13800 4150
	1    0    0    -1  
$EndComp
Wire Wire Line
	13600 4150 13350 4150
Connection ~ 10850 4150
Connection ~ 13350 4150
$Comp
L CPS2-Custom:MSM16811 UA4
U 1 1 5DD6BDF3
P 9600 8200
F 0 "UA4" H 9350 8500 50  0000 C CNN
F 1 "MSM16811" H 9850 7900 50  0000 C CNN
F 2 "" H 10100 8150 50  0001 C CNN
F 3 "" H 10100 8150 50  0001 C CNN
	1    9600 8200
	1    0    0    -1  
$EndComp
Wire Wire Line
	9600 7900 9800 7900
Connection ~ 9600 7900
NoConn ~ 9200 8250
$Comp
L power:GND #PWR026
U 1 1 5DEBA86F
P 9600 8550
F 0 "#PWR026" H 9600 8300 50  0001 C CNN
F 1 "GND" H 9605 8377 50  0001 C CNN
F 2 "" H 9600 8550 50  0001 C CNN
F 3 "" H 9600 8550 50  0001 C CNN
	1    9600 8550
	1    0    0    -1  
$EndComp
Text Label 8700 8100 0    50   ~ 0
IDENT-DI
Wire Wire Line
	8650 8350 9200 8350
Text Label 8700 8350 0    50   ~ 0
IDENT-CS2
Wire Wire Line
	10000 8100 10550 8100
Text Label 10050 8100 0    50   ~ 0
IDENT-DO
Wire Wire Line
	8650 8100 9200 8100
Text Label 10050 8350 0    50   ~ 0
IDENT-CLK
Wire Wire Line
	10000 8350 10550 8350
Text Label 1150 3650 0    50   ~ 0
IDENT-DI
Wire Wire Line
	1100 3650 1650 3650
Wire Wire Line
	2700 2100 3250 2100
Text Label 2750 2100 0    50   ~ 0
IDENT-DO
Wire Wire Line
	2700 2000 3250 2000
Text Label 2750 2000 0    50   ~ 0
IDENT-CS2
Text Label 2750 5300 0    50   ~ 0
IDENT-CLK
Wire Wire Line
	2700 5300 3250 5300
$Comp
L power:VCC #PWR04
U 1 1 5E1AB806
P 2200 8100
F 0 "#PWR04" H 2200 7950 50  0001 C CNN
F 1 "VCC" H 2217 8273 50  0000 C CNN
F 2 "" H 2200 8100 50  0001 C CNN
F 3 "" H 2200 8100 50  0001 C CNN
	1    2200 8100
	1    0    0    -1  
$EndComp
$Comp
L power:GND #PWR05
U 1 1 5E1D978B
P 2200 8400
F 0 "#PWR05" H 2200 8150 50  0001 C CNN
F 1 "GND" H 2205 8227 50  0001 C CNN
F 2 "" H 2200 8400 50  0001 C CNN
F 3 "" H 2200 8400 50  0001 C CNN
	1    2200 8400
	1    0    0    -1  
$EndComp
$Comp
L Device:CP CCX1
U 1 1 5E207E64
P 1500 8250
F 0 "CCX1" H 1618 8296 50  0000 L CNN
F 1 "10u" H 1618 8205 50  0000 L CNN
F 2 "" H 1538 8100 50  0001 C CNN
F 3 "~" H 1500 8250 50  0001 C CNN
	1    1500 8250
	1    0    0    -1  
$EndComp
$Comp
L Device:CP CCX2
U 1 1 5E37B6EC
P 1950 8250
F 0 "CCX2" H 2068 8296 50  0000 L CNN
F 1 "10u" H 2068 8205 50  0000 L CNN
F 2 "" H 1988 8100 50  0001 C CNN
F 3 "~" H 1950 8250 50  0001 C CNN
	1    1950 8250
	1    0    0    -1  
$EndComp
$Comp
L Device:CP CCX3
U 1 1 5E3A9DE8
P 2400 8250
F 0 "CCX3" H 2518 8296 50  0000 L CNN
F 1 "10u" H 2518 8205 50  0000 L CNN
F 2 "" H 2438 8100 50  0001 C CNN
F 3 "~" H 2400 8250 50  0001 C CNN
	1    2400 8250
	1    0    0    -1  
$EndComp
$Comp
L Device:CP CCX4
U 1 1 5E3A9DEF
P 2850 8250
F 0 "CCX4" H 2968 8296 50  0000 L CNN
F 1 "10u" H 2968 8205 50  0000 L CNN
F 2 "" H 2888 8100 50  0001 C CNN
F 3 "~" H 2850 8250 50  0001 C CNN
	1    2850 8250
	1    0    0    -1  
$EndComp
Wire Wire Line
	1500 8400 1950 8400
Connection ~ 1950 8400
Wire Wire Line
	1950 8400 2200 8400
Connection ~ 2200 8400
Wire Wire Line
	2200 8400 2400 8400
Connection ~ 2400 8400
Wire Wire Line
	2400 8400 2850 8400
Wire Wire Line
	1500 8100 1950 8100
Connection ~ 1950 8100
Wire Wire Line
	1950 8100 2200 8100
Connection ~ 2200 8100
Wire Wire Line
	2200 8100 2400 8100
Connection ~ 2400 8100
Wire Wire Line
	2400 8100 2850 8100
$Comp
L Jumper:SolderJumper_2_Bridged JP1
U 1 1 5E550E3D
P 6350 8150
F 0 "JP1" H 6350 8263 50  0000 C CNN
F 1 "SolderJumper_2_Bridged" H 6350 8264 50  0001 C CNN
F 2 "" H 6350 8150 50  0001 C CNN
F 3 "~" H 6350 8150 50  0001 C CNN
	1    6350 8150
	1    0    0    -1  
$EndComp
$Comp
L Jumper:SolderJumper_2_Open JP2
U 1 1 5E550F39
P 6350 8350
F 0 "JP2" H 6350 8463 50  0000 C CNN
F 1 "SolderJumper_2_Open" H 6350 8464 50  0001 C CNN
F 2 "" H 6350 8350 50  0001 C CNN
F 3 "~" H 6350 8350 50  0001 C CNN
	1    6350 8350
	1    0    0    -1  
$EndComp
$Comp
L Jumper:SolderJumper_2_Open JP3
U 1 1 5E5B35AF
P 5850 8150
F 0 "JP3" H 5850 8263 50  0000 C CNN
F 1 "SolderJumper_2_Open" H 5850 8264 50  0001 C CNN
F 2 "" H 5850 8150 50  0001 C CNN
F 3 "~" H 5850 8150 50  0001 C CNN
	1    5850 8150
	-1   0    0    -1  
$EndComp
$Comp
L Jumper:SolderJumper_2_Bridged JP4
U 1 1 5E615957
P 5850 8350
F 0 "JP4" H 5850 8463 50  0000 C CNN
F 1 "SolderJumper_2_Bridged" H 5850 8464 50  0001 C CNN
F 2 "" H 5850 8350 50  0001 C CNN
F 3 "~" H 5850 8350 50  0001 C CNN
	1    5850 8350
	-1   0    0    -1  
$EndComp
Wire Wire Line
	6500 8150 6500 8250
Wire Wire Line
	6200 8150 6100 8150
Wire Wire Line
	6000 8350 6100 8350
Text Label 6550 8250 0    50   ~ 0
QSOUND-ADDR1
Wire Wire Line
	6500 8250 7250 8250
Connection ~ 6500 8250
Wire Wire Line
	6500 8250 6500 8350
Text Label 4900 6450 0    50   ~ 0
ROM-24
Wire Wire Line
	7200 6450 7950 6450
Text Label 7400 6450 0    50   ~ 0
ROM-24
Wire Wire Line
	9700 6450 10450 6450
Text Label 9900 6450 0    50   ~ 0
ROM-24
Wire Wire Line
	12200 6450 12950 6450
Text Label 12400 6450 0    50   ~ 0
ROM-24
Wire Wire Line
	12200 3350 12950 3350
Text Label 12400 3350 0    50   ~ 0
ROM-24
Wire Wire Line
	9700 3350 10450 3350
Text Label 9900 3350 0    50   ~ 0
ROM-24
Wire Wire Line
	7200 3350 7950 3350
Text Label 7400 3350 0    50   ~ 0
ROM-24
Text Label 4750 1450 0    50   ~ 0
QSOUND-ADDR2
Text Label 4750 1550 0    50   ~ 0
QSOUND-ADDR3
Text Label 4750 1650 0    50   ~ 0
QSOUND-ADDR4
Text Label 4750 1750 0    50   ~ 0
QSOUND-ADDR5
Text Label 4750 1850 0    50   ~ 0
QSOUND-ADDR6
Text Label 4750 1950 0    50   ~ 0
QSOUND-ADDR7
Text Label 4750 2050 0    50   ~ 0
QSOUND-ADDR8
Text Label 4750 2150 0    50   ~ 0
QSOUND-ADDR9
Text Label 4750 2250 0    50   ~ 0
QSOUND-ADDR10
Text Label 4750 2350 0    50   ~ 0
QSOUND-ADDR11
Text Label 4750 2450 0    50   ~ 0
QSOUND-ADDR12
Text Label 4750 2550 0    50   ~ 0
QSOUND-ADDR13
Text Label 4750 2650 0    50   ~ 0
QSOUND-ADDR14
Text Label 4750 2750 0    50   ~ 0
QSOUND-ADDR15
Text Label 4750 2850 0    50   ~ 0
QSOUND-ADDR16
Text Label 4750 2950 0    50   ~ 0
QSOUND-ADDR17
Wire Wire Line
	4700 1350 5450 1350
Wire Wire Line
	4700 1450 5450 1450
Wire Wire Line
	4700 1550 5450 1550
Wire Wire Line
	4700 1650 5450 1650
Wire Wire Line
	4700 1750 5450 1750
Wire Wire Line
	4700 1850 5450 1850
Wire Wire Line
	4700 1950 5450 1950
Wire Wire Line
	4700 2050 5450 2050
Wire Wire Line
	4700 2150 5450 2150
Wire Wire Line
	4700 2250 5450 2250
Wire Wire Line
	4700 2350 5450 2350
Wire Wire Line
	4700 2450 5450 2450
Wire Wire Line
	4700 2550 5450 2550
Wire Wire Line
	4700 2650 5450 2650
Wire Wire Line
	4700 2750 5450 2750
Wire Wire Line
	4700 2850 5450 2850
Wire Wire Line
	4700 2950 5450 2950
Text Label 4900 1350 0    50   ~ 0
ROM-11
Wire Wire Line
	4700 3350 5450 3350
Text Label 4900 3350 0    50   ~ 0
ROM-24
Wire Wire Line
	6100 7900 6850 7900
Text Label 6300 7900 0    50   ~ 0
ROM-11
Wire Wire Line
	6100 8600 6850 8600
Text Label 6300 8600 0    50   ~ 0
ROM-24
Wire Wire Line
	6100 8150 6100 7900
Connection ~ 6100 8150
Wire Wire Line
	6100 8150 6000 8150
Wire Wire Line
	6100 8600 6100 8350
Connection ~ 6100 8350
Wire Wire Line
	6100 8350 6200 8350
NoConn ~ 2700 1000
NoConn ~ 2700 1100
NoConn ~ 2700 1200
NoConn ~ 2700 1300
NoConn ~ 2700 1400
NoConn ~ 2700 1500
NoConn ~ 2700 1600
NoConn ~ 2700 1700
NoConn ~ 2700 1800
NoConn ~ 1650 2650
NoConn ~ 1650 2750
NoConn ~ 1650 2850
NoConn ~ 1650 2950
NoConn ~ 1650 3050
NoConn ~ 1650 3150
NoConn ~ 1650 3250
NoConn ~ 1650 3350
NoConn ~ 1650 3450
NoConn ~ 2700 3400
NoConn ~ 2700 3500
NoConn ~ 2700 3600
NoConn ~ 2700 3700
NoConn ~ 2700 3800
NoConn ~ 2700 3900
NoConn ~ 2700 4000
NoConn ~ 2700 4300
NoConn ~ 2700 4400
NoConn ~ 2700 4500
NoConn ~ 2700 4600
NoConn ~ 2700 4700
NoConn ~ 2700 4800
NoConn ~ 2700 4900
NoConn ~ 2700 5000
NoConn ~ 2700 5100
NoConn ~ 1650 4950
NoConn ~ 1650 5050
NoConn ~ 1650 5150
NoConn ~ 1650 5250
NoConn ~ 1650 5350
NoConn ~ 1650 5450
NoConn ~ 1650 5550
NoConn ~ 1650 5650
NoConn ~ 2700 6800
NoConn ~ 2700 6900
NoConn ~ 2700 7000
NoConn ~ 2700 7100
NoConn ~ 2700 7200
NoConn ~ 2700 7300
Wire Wire Line
	1500 2500 1500 2550
Wire Wire Line
	900  3600 900  3550
$Comp
L power:PWR_FLAG #FLG0101
U 1 1 5F32174B
P 3150 900
F 0 "#FLG0101" H 3150 975 50  0001 C CNN
F 1 "PWR_FLAG" H 3150 1074 50  0000 C CNN
F 2 "" H 3150 900 50  0001 C CNN
F 3 "~" H 3150 900 50  0001 C CNN
	1    3150 900 
	1    0    0    -1  
$EndComp
$Comp
L power:PWR_FLAG #FLG0102
U 1 1 5F35B2BA
P 3400 1900
F 0 "#FLG0102" H 3400 1975 50  0001 C CNN
F 1 "PWR_FLAG" H 3400 2074 50  0000 C CNN
F 2 "" H 3400 1900 50  0001 C CNN
F 3 "~" H 3400 1900 50  0001 C CNN
	1    3400 1900
	1    0    0    -1  
$EndComp
Wire Wire Line
	2700 1900 3400 1900
Connection ~ 3400 1900
Wire Wire Line
	3150 900  2850 900 
Connection ~ 2850 900 
Wire Wire Line
	4700 6450 5450 6450
Wire Wire Line
	5700 8150 5700 8250
$Comp
L power:GND #PWR046
U 1 1 5DC21546
P 5300 8250
F 0 "#PWR046" H 5300 8000 50  0001 C CNN
F 1 "GND" H 5305 8077 50  0001 C CNN
F 2 "" H 5300 8250 50  0001 C CNN
F 3 "" H 5300 8250 50  0001 C CNN
	1    5300 8250
	1    0    0    -1  
$EndComp
Wire Wire Line
	5300 8250 5700 8250
Connection ~ 5700 8250
Wire Wire Line
	5700 8250 5700 8350
$Comp
L power:GND #PWR012
U 1 1 5DACB14F
P 3450 5200
F 0 "#PWR012" H 3450 4950 50  0001 C CNN
F 1 "GND" H 3455 5027 50  0001 C CNN
F 2 "" H 3450 5200 50  0001 C CNN
F 3 "" H 3450 5200 50  0001 C CNN
	1    3450 5200
	1    0    0    -1  
$EndComp
Wire Wire Line
	2700 5200 3450 5200
$Comp
L power:GND #PWR045
U 1 1 5DD0A7CA
P 3650 5400
F 0 "#PWR045" H 3650 5150 50  0001 C CNN
F 1 "GND" H 3655 5227 50  0001 C CNN
F 2 "" H 3650 5400 50  0001 C CNN
F 3 "" H 3650 5400 50  0001 C CNN
	1    3650 5400
	1    0    0    -1  
$EndComp
Wire Wire Line
	2700 5400 3650 5400
Text Label 2750 5400 0    50   ~ 0
~QSOUND-ENABLE
Text Label 4750 1250 0    50   ~ 0
QSOUND-ADDR0
Wire Wire Line
	4700 1250 5450 1250
Text Label 4750 3050 0    50   ~ 0
QSOUND-ADDR18
Wire Wire Line
	4700 3050 5450 3050
Text Label 7250 1450 0    50   ~ 0
QSOUND-ADDR2
Text Label 7250 1550 0    50   ~ 0
QSOUND-ADDR3
Text Label 7250 1650 0    50   ~ 0
QSOUND-ADDR4
Text Label 7250 1750 0    50   ~ 0
QSOUND-ADDR5
Text Label 7250 1850 0    50   ~ 0
QSOUND-ADDR6
Text Label 7250 1950 0    50   ~ 0
QSOUND-ADDR7
Text Label 7250 2050 0    50   ~ 0
QSOUND-ADDR8
Text Label 7250 2150 0    50   ~ 0
QSOUND-ADDR9
Text Label 7250 2250 0    50   ~ 0
QSOUND-ADDR10
Text Label 7250 2350 0    50   ~ 0
QSOUND-ADDR11
Text Label 7250 2450 0    50   ~ 0
QSOUND-ADDR12
Text Label 7250 2550 0    50   ~ 0
QSOUND-ADDR13
Text Label 7250 2650 0    50   ~ 0
QSOUND-ADDR14
Text Label 7250 2750 0    50   ~ 0
QSOUND-ADDR15
Text Label 7250 2850 0    50   ~ 0
QSOUND-ADDR16
Text Label 7250 2950 0    50   ~ 0
QSOUND-ADDR17
Wire Wire Line
	7200 1350 7950 1350
Wire Wire Line
	7200 1450 7950 1450
Wire Wire Line
	7200 1550 7950 1550
Wire Wire Line
	7200 1650 7950 1650
Wire Wire Line
	7200 1750 7950 1750
Wire Wire Line
	7200 1850 7950 1850
Wire Wire Line
	7200 1950 7950 1950
Wire Wire Line
	7200 2050 7950 2050
Wire Wire Line
	7200 2150 7950 2150
Wire Wire Line
	7200 2250 7950 2250
Wire Wire Line
	7200 2350 7950 2350
Wire Wire Line
	7200 2450 7950 2450
Wire Wire Line
	7200 2550 7950 2550
Wire Wire Line
	7200 2650 7950 2650
Wire Wire Line
	7200 2750 7950 2750
Wire Wire Line
	7200 2850 7950 2850
Wire Wire Line
	7200 2950 7950 2950
Text Label 7400 1350 0    50   ~ 0
ROM-11
Text Label 7250 1250 0    50   ~ 0
QSOUND-ADDR0
Wire Wire Line
	7200 1250 7950 1250
Text Label 7250 3050 0    50   ~ 0
QSOUND-ADDR18
Wire Wire Line
	7200 3050 7950 3050
Text Label 9750 1450 0    50   ~ 0
QSOUND-ADDR2
Text Label 9750 1550 0    50   ~ 0
QSOUND-ADDR3
Text Label 9750 1650 0    50   ~ 0
QSOUND-ADDR4
Text Label 9750 1750 0    50   ~ 0
QSOUND-ADDR5
Text Label 9750 1850 0    50   ~ 0
QSOUND-ADDR6
Text Label 9750 1950 0    50   ~ 0
QSOUND-ADDR7
Text Label 9750 2050 0    50   ~ 0
QSOUND-ADDR8
Text Label 9750 2150 0    50   ~ 0
QSOUND-ADDR9
Text Label 9750 2250 0    50   ~ 0
QSOUND-ADDR10
Text Label 9750 2350 0    50   ~ 0
QSOUND-ADDR11
Text Label 9750 2450 0    50   ~ 0
QSOUND-ADDR12
Text Label 9750 2550 0    50   ~ 0
QSOUND-ADDR13
Text Label 9750 2650 0    50   ~ 0
QSOUND-ADDR14
Text Label 9750 2750 0    50   ~ 0
QSOUND-ADDR15
Text Label 9750 2850 0    50   ~ 0
QSOUND-ADDR16
Text Label 9750 2950 0    50   ~ 0
QSOUND-ADDR17
Wire Wire Line
	9700 1350 10450 1350
Wire Wire Line
	9700 1450 10450 1450
Wire Wire Line
	9700 1550 10450 1550
Wire Wire Line
	9700 1650 10450 1650
Wire Wire Line
	9700 1750 10450 1750
Wire Wire Line
	9700 1850 10450 1850
Wire Wire Line
	9700 1950 10450 1950
Wire Wire Line
	9700 2050 10450 2050
Wire Wire Line
	9700 2150 10450 2150
Wire Wire Line
	9700 2250 10450 2250
Wire Wire Line
	9700 2350 10450 2350
Wire Wire Line
	9700 2450 10450 2450
Wire Wire Line
	9700 2550 10450 2550
Wire Wire Line
	9700 2650 10450 2650
Wire Wire Line
	9700 2750 10450 2750
Wire Wire Line
	9700 2850 10450 2850
Wire Wire Line
	9700 2950 10450 2950
Text Label 9900 1350 0    50   ~ 0
ROM-11
Text Label 9750 1250 0    50   ~ 0
QSOUND-ADDR0
Wire Wire Line
	9700 1250 10450 1250
Text Label 9750 3050 0    50   ~ 0
QSOUND-ADDR18
Wire Wire Line
	9700 3050 10450 3050
Text Label 12250 1450 0    50   ~ 0
QSOUND-ADDR2
Text Label 12250 1550 0    50   ~ 0
QSOUND-ADDR3
Text Label 12250 1650 0    50   ~ 0
QSOUND-ADDR4
Text Label 12250 1750 0    50   ~ 0
QSOUND-ADDR5
Text Label 12250 1850 0    50   ~ 0
QSOUND-ADDR6
Text Label 12250 1950 0    50   ~ 0
QSOUND-ADDR7
Text Label 12250 2050 0    50   ~ 0
QSOUND-ADDR8
Text Label 12250 2150 0    50   ~ 0
QSOUND-ADDR9
Text Label 12250 2250 0    50   ~ 0
QSOUND-ADDR10
Text Label 12250 2350 0    50   ~ 0
QSOUND-ADDR11
Text Label 12250 2450 0    50   ~ 0
QSOUND-ADDR12
Text Label 12250 2550 0    50   ~ 0
QSOUND-ADDR13
Text Label 12250 2650 0    50   ~ 0
QSOUND-ADDR14
Text Label 12250 2750 0    50   ~ 0
QSOUND-ADDR15
Text Label 12250 2850 0    50   ~ 0
QSOUND-ADDR16
Text Label 12250 2950 0    50   ~ 0
QSOUND-ADDR17
Wire Wire Line
	12200 1350 12950 1350
Wire Wire Line
	12200 1450 12950 1450
Wire Wire Line
	12200 1550 12950 1550
Wire Wire Line
	12200 1650 12950 1650
Wire Wire Line
	12200 1750 12950 1750
Wire Wire Line
	12200 1850 12950 1850
Wire Wire Line
	12200 1950 12950 1950
Wire Wire Line
	12200 2050 12950 2050
Wire Wire Line
	12200 2150 12950 2150
Wire Wire Line
	12200 2250 12950 2250
Wire Wire Line
	12200 2350 12950 2350
Wire Wire Line
	12200 2450 12950 2450
Wire Wire Line
	12200 2550 12950 2550
Wire Wire Line
	12200 2650 12950 2650
Wire Wire Line
	12200 2750 12950 2750
Wire Wire Line
	12200 2850 12950 2850
Wire Wire Line
	12200 2950 12950 2950
Text Label 12400 1350 0    50   ~ 0
ROM-11
Text Label 12250 1250 0    50   ~ 0
QSOUND-ADDR0
Wire Wire Line
	12200 1250 12950 1250
Text Label 12250 3050 0    50   ~ 0
QSOUND-ADDR18
Wire Wire Line
	12200 3050 12950 3050
Text Label 4750 4550 0    50   ~ 0
QSOUND-ADDR2
Text Label 4750 4650 0    50   ~ 0
QSOUND-ADDR3
Text Label 4750 4750 0    50   ~ 0
QSOUND-ADDR4
Text Label 4750 4850 0    50   ~ 0
QSOUND-ADDR5
Text Label 4750 4950 0    50   ~ 0
QSOUND-ADDR6
Text Label 4750 5050 0    50   ~ 0
QSOUND-ADDR7
Text Label 4750 5150 0    50   ~ 0
QSOUND-ADDR8
Text Label 4750 5250 0    50   ~ 0
QSOUND-ADDR9
Text Label 4750 5350 0    50   ~ 0
QSOUND-ADDR10
Text Label 4750 5450 0    50   ~ 0
QSOUND-ADDR11
Text Label 4750 5550 0    50   ~ 0
QSOUND-ADDR12
Text Label 4750 5650 0    50   ~ 0
QSOUND-ADDR13
Text Label 4750 5750 0    50   ~ 0
QSOUND-ADDR14
Text Label 4750 5850 0    50   ~ 0
QSOUND-ADDR15
Text Label 4750 5950 0    50   ~ 0
QSOUND-ADDR16
Text Label 4750 6050 0    50   ~ 0
QSOUND-ADDR17
Wire Wire Line
	4700 4450 5450 4450
Wire Wire Line
	4700 4550 5450 4550
Wire Wire Line
	4700 4650 5450 4650
Wire Wire Line
	4700 4750 5450 4750
Wire Wire Line
	4700 4850 5450 4850
Wire Wire Line
	4700 4950 5450 4950
Wire Wire Line
	4700 5050 5450 5050
Wire Wire Line
	4700 5150 5450 5150
Wire Wire Line
	4700 5250 5450 5250
Wire Wire Line
	4700 5350 5450 5350
Wire Wire Line
	4700 5450 5450 5450
Wire Wire Line
	4700 5550 5450 5550
Wire Wire Line
	4700 5650 5450 5650
Wire Wire Line
	4700 5750 5450 5750
Wire Wire Line
	4700 5850 5450 5850
Wire Wire Line
	4700 5950 5450 5950
Wire Wire Line
	4700 6050 5450 6050
Text Label 4900 4450 0    50   ~ 0
ROM-11
Text Label 4750 4350 0    50   ~ 0
QSOUND-ADDR0
Wire Wire Line
	4700 4350 5450 4350
Text Label 4750 6150 0    50   ~ 0
QSOUND-ADDR18
Wire Wire Line
	4700 6150 5450 6150
Text Label 7250 4550 0    50   ~ 0
QSOUND-ADDR2
Text Label 7250 4650 0    50   ~ 0
QSOUND-ADDR3
Text Label 7250 4750 0    50   ~ 0
QSOUND-ADDR4
Text Label 7250 4850 0    50   ~ 0
QSOUND-ADDR5
Text Label 7250 4950 0    50   ~ 0
QSOUND-ADDR6
Text Label 7250 5050 0    50   ~ 0
QSOUND-ADDR7
Text Label 7250 5150 0    50   ~ 0
QSOUND-ADDR8
Text Label 7250 5250 0    50   ~ 0
QSOUND-ADDR9
Text Label 7250 5350 0    50   ~ 0
QSOUND-ADDR10
Text Label 7250 5450 0    50   ~ 0
QSOUND-ADDR11
Text Label 7250 5550 0    50   ~ 0
QSOUND-ADDR12
Text Label 7250 5650 0    50   ~ 0
QSOUND-ADDR13
Text Label 7250 5750 0    50   ~ 0
QSOUND-ADDR14
Text Label 7250 5850 0    50   ~ 0
QSOUND-ADDR15
Text Label 7250 5950 0    50   ~ 0
QSOUND-ADDR16
Text Label 7250 6050 0    50   ~ 0
QSOUND-ADDR17
Wire Wire Line
	7200 4450 7950 4450
Wire Wire Line
	7200 4550 7950 4550
Wire Wire Line
	7200 4650 7950 4650
Wire Wire Line
	7200 4750 7950 4750
Wire Wire Line
	7200 4850 7950 4850
Wire Wire Line
	7200 4950 7950 4950
Wire Wire Line
	7200 5050 7950 5050
Wire Wire Line
	7200 5150 7950 5150
Wire Wire Line
	7200 5250 7950 5250
Wire Wire Line
	7200 5350 7950 5350
Wire Wire Line
	7200 5450 7950 5450
Wire Wire Line
	7200 5550 7950 5550
Wire Wire Line
	7200 5650 7950 5650
Wire Wire Line
	7200 5750 7950 5750
Wire Wire Line
	7200 5850 7950 5850
Wire Wire Line
	7200 5950 7950 5950
Wire Wire Line
	7200 6050 7950 6050
Text Label 7400 4450 0    50   ~ 0
ROM-11
Text Label 7250 4350 0    50   ~ 0
QSOUND-ADDR0
Wire Wire Line
	7200 4350 7950 4350
Text Label 7250 6150 0    50   ~ 0
QSOUND-ADDR18
Wire Wire Line
	7200 6150 7950 6150
Text Label 9750 4550 0    50   ~ 0
QSOUND-ADDR2
Text Label 9750 4650 0    50   ~ 0
QSOUND-ADDR3
Text Label 9750 4750 0    50   ~ 0
QSOUND-ADDR4
Text Label 9750 4850 0    50   ~ 0
QSOUND-ADDR5
Text Label 9750 4950 0    50   ~ 0
QSOUND-ADDR6
Text Label 9750 5050 0    50   ~ 0
QSOUND-ADDR7
Text Label 9750 5150 0    50   ~ 0
QSOUND-ADDR8
Text Label 9750 5250 0    50   ~ 0
QSOUND-ADDR9
Text Label 9750 5350 0    50   ~ 0
QSOUND-ADDR10
Text Label 9750 5450 0    50   ~ 0
QSOUND-ADDR11
Text Label 9750 5550 0    50   ~ 0
QSOUND-ADDR12
Text Label 9750 5650 0    50   ~ 0
QSOUND-ADDR13
Text Label 9750 5750 0    50   ~ 0
QSOUND-ADDR14
Text Label 9750 5850 0    50   ~ 0
QSOUND-ADDR15
Text Label 9750 5950 0    50   ~ 0
QSOUND-ADDR16
Text Label 9750 6050 0    50   ~ 0
QSOUND-ADDR17
Wire Wire Line
	9700 4450 10450 4450
Wire Wire Line
	9700 4550 10450 4550
Wire Wire Line
	9700 4650 10450 4650
Wire Wire Line
	9700 4750 10450 4750
Wire Wire Line
	9700 4850 10450 4850
Wire Wire Line
	9700 4950 10450 4950
Wire Wire Line
	9700 5050 10450 5050
Wire Wire Line
	9700 5150 10450 5150
Wire Wire Line
	9700 5250 10450 5250
Wire Wire Line
	9700 5350 10450 5350
Wire Wire Line
	9700 5450 10450 5450
Wire Wire Line
	9700 5550 10450 5550
Wire Wire Line
	9700 5650 10450 5650
Wire Wire Line
	9700 5750 10450 5750
Wire Wire Line
	9700 5850 10450 5850
Wire Wire Line
	9700 5950 10450 5950
Wire Wire Line
	9700 6050 10450 6050
Text Label 9900 4450 0    50   ~ 0
ROM-11
Text Label 9750 4350 0    50   ~ 0
QSOUND-ADDR0
Wire Wire Line
	9700 4350 10450 4350
Text Label 9750 6150 0    50   ~ 0
QSOUND-ADDR18
Wire Wire Line
	9700 6150 10450 6150
Text Label 12250 4550 0    50   ~ 0
QSOUND-ADDR2
Text Label 12250 4650 0    50   ~ 0
QSOUND-ADDR3
Text Label 12250 4750 0    50   ~ 0
QSOUND-ADDR4
Text Label 12250 4850 0    50   ~ 0
QSOUND-ADDR5
Text Label 12250 4950 0    50   ~ 0
QSOUND-ADDR6
Text Label 12250 5050 0    50   ~ 0
QSOUND-ADDR7
Text Label 12250 5150 0    50   ~ 0
QSOUND-ADDR8
Text Label 12250 5250 0    50   ~ 0
QSOUND-ADDR9
Text Label 12250 5350 0    50   ~ 0
QSOUND-ADDR10
Text Label 12250 5450 0    50   ~ 0
QSOUND-ADDR11
Text Label 12250 5550 0    50   ~ 0
QSOUND-ADDR12
Text Label 12250 5650 0    50   ~ 0
QSOUND-ADDR13
Text Label 12250 5750 0    50   ~ 0
QSOUND-ADDR14
Text Label 12250 5850 0    50   ~ 0
QSOUND-ADDR15
Text Label 12250 5950 0    50   ~ 0
QSOUND-ADDR16
Text Label 12250 6050 0    50   ~ 0
QSOUND-ADDR17
Wire Wire Line
	12200 4450 12950 4450
Wire Wire Line
	12200 4550 12950 4550
Wire Wire Line
	12200 4650 12950 4650
Wire Wire Line
	12200 4750 12950 4750
Wire Wire Line
	12200 4850 12950 4850
Wire Wire Line
	12200 4950 12950 4950
Wire Wire Line
	12200 5050 12950 5050
Wire Wire Line
	12200 5150 12950 5150
Wire Wire Line
	12200 5250 12950 5250
Wire Wire Line
	12200 5350 12950 5350
Wire Wire Line
	12200 5450 12950 5450
Wire Wire Line
	12200 5550 12950 5550
Wire Wire Line
	12200 5650 12950 5650
Wire Wire Line
	12200 5750 12950 5750
Wire Wire Line
	12200 5850 12950 5850
Wire Wire Line
	12200 5950 12950 5950
Wire Wire Line
	12200 6050 12950 6050
Text Label 12400 4450 0    50   ~ 0
ROM-11
Text Label 12250 4350 0    50   ~ 0
QSOUND-ADDR0
Wire Wire Line
	12200 4350 12950 4350
Text Label 12250 6150 0    50   ~ 0
QSOUND-ADDR18
Wire Wire Line
	12200 6150 12950 6150
$EndSCHEMATC
