EESchema Schematic File Version 4
EELAYER 30 0
EELAYER END
$Descr A4 11693 8268
encoding utf-8
Sheet 2 8
Title ""
Date "2020-05-05"
Rev ""
Comp ""
Comment1 ""
Comment2 "Licence: CC-BY"
Comment3 "Author: Loic *WydD* Petit"
Comment4 "Project: CPS2 Reverse Engineering: DL-1927"
$EndDescr
Connection ~ 3450 750 
Connection ~ 5250 750 
Connection ~ 3250 2100
Connection ~ 3250 4200
Connection ~ 3250 3500
Connection ~ 3250 2800
Connection ~ 3250 4900
Connection ~ 3250 5600
Connection ~ 6100 1400
Connection ~ 6100 2100
Connection ~ 6100 2800
Connection ~ 6100 3500
Connection ~ 6100 4200
Connection ~ 6100 4900
Connection ~ 6100 5600
Connection ~ 6100 6300
Connection ~ 4300 1400
Connection ~ 4300 2100
Connection ~ 4300 2800
Connection ~ 4300 3500
Connection ~ 4300 4200
Connection ~ 4300 4900
Entry Wire Line
	3550 1150 3450 1050
Entry Wire Line
	3550 1850 3450 1750
Entry Wire Line
	3550 2550 3450 2450
Entry Wire Line
	3550 3250 3450 3150
Entry Wire Line
	3550 3950 3450 3850
Entry Wire Line
	3550 4650 3450 4550
Entry Wire Line
	5350 1150 5250 1050
Entry Wire Line
	5350 1850 5250 1750
Entry Wire Line
	5350 2550 5250 2450
Entry Wire Line
	5350 3250 5250 3150
Entry Wire Line
	5350 3950 5250 3850
Entry Wire Line
	5350 4650 5250 4550
Entry Wire Line
	5350 5350 5250 5250
Entry Wire Line
	5350 6050 5250 5950
Entry Wire Line
	7150 1150 7050 1050
Entry Wire Line
	7150 1850 7050 1750
Entry Wire Line
	7150 2550 7050 2450
Entry Wire Line
	7150 3250 7050 3150
Entry Wire Line
	7150 3950 7050 3850
Entry Wire Line
	7150 4650 7050 4550
Entry Wire Line
	7150 5350 7050 5250
Entry Wire Line
	7150 6050 7050 5950
Wire Wire Line
	3250 1400 3250 2100
Wire Wire Line
	3250 1400 4300 1400
Wire Wire Line
	3250 2100 3250 2800
Wire Wire Line
	3250 2100 4300 2100
Wire Wire Line
	3250 2800 3250 3500
Wire Wire Line
	3250 2800 4300 2800
Wire Wire Line
	3250 3500 3250 4200
Wire Wire Line
	3250 3500 4300 3500
Wire Wire Line
	3250 4200 3250 4900
Wire Wire Line
	3250 4200 4300 4200
Wire Wire Line
	3250 4900 3250 5600
Wire Wire Line
	3250 4900 4300 4900
Wire Wire Line
	3250 5600 3250 6300
Wire Wire Line
	3250 5600 6100 5600
Wire Wire Line
	3250 6300 6100 6300
Wire Wire Line
	4000 1150 3550 1150
Wire Wire Line
	4000 1850 3550 1850
Wire Wire Line
	4000 2550 3550 2550
Wire Wire Line
	4000 3250 3550 3250
Wire Wire Line
	4000 3950 3550 3950
Wire Wire Line
	4000 4650 3550 4650
Wire Wire Line
	4300 1400 6100 1400
Wire Wire Line
	4300 2100 6100 2100
Wire Wire Line
	4300 2800 6100 2800
Wire Wire Line
	4300 3500 6100 3500
Wire Wire Line
	4300 4200 6100 4200
Wire Wire Line
	4300 4900 6100 4900
Wire Wire Line
	5800 1150 5350 1150
Wire Wire Line
	5800 1850 5350 1850
Wire Wire Line
	5800 2550 5350 2550
Wire Wire Line
	5800 3250 5350 3250
Wire Wire Line
	5800 3950 5350 3950
Wire Wire Line
	5800 4650 5350 4650
Wire Wire Line
	5800 5350 5350 5350
Wire Wire Line
	5800 6050 5350 6050
Wire Wire Line
	6100 1400 7900 1400
Wire Wire Line
	6100 2100 7900 2100
Wire Wire Line
	6100 2800 7900 2800
Wire Wire Line
	6100 3500 7900 3500
Wire Wire Line
	6100 4200 7900 4200
Wire Wire Line
	6100 4900 7900 4900
Wire Wire Line
	6100 5600 7900 5600
Wire Wire Line
	6100 6300 7900 6300
Wire Wire Line
	7600 1150 7150 1150
Wire Wire Line
	7600 1850 7150 1850
Wire Wire Line
	7600 2550 7150 2550
Wire Wire Line
	7600 3250 7150 3250
Wire Wire Line
	7600 3950 7150 3950
Wire Wire Line
	7600 4650 7150 4650
Wire Wire Line
	7600 5350 7150 5350
Wire Wire Line
	7600 6050 7150 6050
Wire Bus Line
	3450 750  3100 750 
Wire Bus Line
	5250 750  3450 750 
Wire Bus Line
	5250 750  7050 750 
Text Label 3900 1150 2    50   ~ 0
DATA7
Text Label 3900 1850 2    50   ~ 0
DATA6
Text Label 3900 2550 2    50   ~ 0
DATA5
Text Label 3900 3250 2    50   ~ 0
DATA4
Text Label 3900 3950 2    50   ~ 0
DATA3
Text Label 3900 4650 2    50   ~ 0
DATA2
Text Label 5700 1150 2    50   ~ 0
DATA15
Text Label 5700 1850 2    50   ~ 0
DATA14
Text Label 5700 2550 2    50   ~ 0
DATA13
Text Label 5700 3250 2    50   ~ 0
DATA12
Text Label 5700 3950 2    50   ~ 0
DATA11
Text Label 5700 4650 2    50   ~ 0
DATA10
Text Label 5700 5350 2    50   ~ 0
DATA9
Text Label 5700 6050 2    50   ~ 0
DATA8
Text Label 7500 1150 2    50   ~ 0
DATA23
Text Label 7500 1850 2    50   ~ 0
DATA22
Text Label 7500 2550 2    50   ~ 0
DATA21
Text Label 7500 3250 2    50   ~ 0
DATA20
Text Label 7500 3950 2    50   ~ 0
DATA19
Text Label 7500 4650 2    50   ~ 0
DATA18
Text Label 7500 5350 2    50   ~ 0
DATA17
Text Label 7500 6050 2    50   ~ 0
DATA16
Text HLabel 2650 6300 0    50   Input ~ 0
~ENABLE
Text HLabel 3100 750  0    50   Input ~ 0
DATA[2..23]
Text HLabel 4600 1150 2    50   Output ~ 0
OUT7
Text HLabel 4600 1850 2    50   Output ~ 0
OUT6
Text HLabel 4600 2550 2    50   Output ~ 0
OUT5
Text HLabel 4600 3250 2    50   Output ~ 0
OUT4
Text HLabel 4600 3950 2    50   Output ~ 0
OUT3
Text HLabel 4600 4650 2    50   Output ~ 0
OUT2
Text HLabel 6400 1150 2    50   Output ~ 0
OUT15
Text HLabel 6400 1850 2    50   Output ~ 0
OUT14
Text HLabel 6400 2550 2    50   Output ~ 0
OUT13
Text HLabel 6400 3250 2    50   Output ~ 0
OUT12
Text HLabel 6400 3950 2    50   Output ~ 0
OUT11
Text HLabel 6400 4650 2    50   Output ~ 0
OUT10
Text HLabel 6400 5350 2    50   Output ~ 0
OUT9
Text HLabel 6400 6050 2    50   Output ~ 0
OUT8
Text HLabel 8200 1150 2    50   Output ~ 0
OUT23
Text HLabel 8200 1850 2    50   Output ~ 0
OUT22
Text HLabel 8200 2550 2    50   Output ~ 0
OUT21
Text HLabel 8200 3250 2    50   Output ~ 0
OUT20
Text HLabel 8200 3950 2    50   Output ~ 0
OUT19
Text HLabel 8200 4650 2    50   Output ~ 0
OUT18
Text HLabel 8200 5350 2    50   Output ~ 0
OUT17
Text HLabel 8200 6050 2    50   Output ~ 0
OUT16
$Comp
L CG24-cells:O4R U32R1
U 1 1 5EAF1C9D
P 4300 1150
F 0 "U32R1" H 4300 1467 50  0000 C CNN
F 1 "O4R" H 4300 1376 50  0000 C CNN
F 2 "" H 4300 1150 50  0001 C CNN
F 3 "" H 4300 1150 50  0001 C CNN
	1    4300 1150
	1    0    0    -1  
$EndComp
$Comp
L CG24-cells:O4R U32R4
U 1 1 5EAF1C8E
P 4300 1850
F 0 "U32R4" H 4300 2167 50  0000 C CNN
F 1 "O4R" H 4300 2076 50  0000 C CNN
F 2 "" H 4300 1850 50  0001 C CNN
F 3 "" H 4300 1850 50  0001 C CNN
	1    4300 1850
	1    0    0    -1  
$EndComp
$Comp
L CG24-cells:O4R U30R6
U 1 1 5EAF1CA0
P 4300 2550
F 0 "U30R6" H 4300 2867 50  0000 C CNN
F 1 "O4R" H 4300 2776 50  0000 C CNN
F 2 "" H 4300 2550 50  0001 C CNN
F 3 "" H 4300 2550 50  0001 C CNN
	1    4300 2550
	1    0    0    -1  
$EndComp
$Comp
L CG24-cells:O4R U30R4
U 1 1 5EAF1CA4
P 4300 3250
F 0 "U30R4" H 4300 3567 50  0000 C CNN
F 1 "O4R" H 4300 3476 50  0000 C CNN
F 2 "" H 4300 3250 50  0001 C CNN
F 3 "" H 4300 3250 50  0001 C CNN
	1    4300 3250
	1    0    0    -1  
$EndComp
$Comp
L CG24-cells:O4R U22R2
U 1 1 5EAF1C90
P 4300 3950
F 0 "U22R2" H 4300 4267 50  0000 C CNN
F 1 "O4R" H 4300 4176 50  0000 C CNN
F 2 "" H 4300 3950 50  0001 C CNN
F 3 "" H 4300 3950 50  0001 C CNN
	1    4300 3950
	1    0    0    -1  
$EndComp
$Comp
L CG24-cells:O4R U24R0
U 1 1 5EAF1CA5
P 4300 4650
F 0 "U24R0" H 4300 4967 50  0000 C CNN
F 1 "O4R" H 4300 4876 50  0000 C CNN
F 2 "" H 4300 4650 50  0001 C CNN
F 3 "" H 4300 4650 50  0001 C CNN
	1    4300 4650
	1    0    0    -1  
$EndComp
$Comp
L CG24-cells:O4R U32R104
U 1 1 5EAF1CA9
P 6100 1150
F 0 "U32R104" H 6100 1467 50  0000 C CNN
F 1 "O4R" H 6100 1376 50  0000 C CNN
F 2 "" H 6100 1150 50  0001 C CNN
F 3 "" H 6100 1150 50  0001 C CNN
	1    6100 1150
	1    0    0    -1  
$EndComp
$Comp
L CG24-cells:O4R U32R95
U 1 1 5EAF1C93
P 6100 1850
F 0 "U32R95" H 6100 2167 50  0000 C CNN
F 1 "O4R" H 6100 2076 50  0000 C CNN
F 2 "" H 6100 1850 50  0001 C CNN
F 3 "" H 6100 1850 50  0001 C CNN
	1    6100 1850
	1    0    0    -1  
$EndComp
$Comp
L CG24-cells:O4R U32R85
U 1 1 5EAF1C99
P 6100 2550
F 0 "U32R85" H 6100 2867 50  0000 C CNN
F 1 "O4R" H 6100 2776 50  0000 C CNN
F 2 "" H 6100 2550 50  0001 C CNN
F 3 "" H 6100 2550 50  0001 C CNN
	1    6100 2550
	1    0    0    -1  
$EndComp
$Comp
L CG24-cells:O4R U32R83
U 1 1 5EAF1CA6
P 6100 3250
F 0 "U32R83" H 6100 3567 50  0000 C CNN
F 1 "O4R" H 6100 3476 50  0000 C CNN
F 2 "" H 6100 3250 50  0001 C CNN
F 3 "" H 6100 3250 50  0001 C CNN
	1    6100 3250
	1    0    0    -1  
$EndComp
$Comp
L CG24-cells:O4R U32R53
U 1 1 5EAF1C91
P 6100 3950
F 0 "U32R53" H 6100 4267 50  0000 C CNN
F 1 "O4R" H 6100 4176 50  0000 C CNN
F 2 "" H 6100 3950 50  0001 C CNN
F 3 "" H 6100 3950 50  0001 C CNN
	1    6100 3950
	1    0    0    -1  
$EndComp
$Comp
L CG24-cells:O4R U32R51
U 1 1 5EAF1CAE
P 6100 4650
F 0 "U32R51" H 6100 4967 50  0000 C CNN
F 1 "O4R" H 6100 4876 50  0000 C CNN
F 2 "" H 6100 4650 50  0001 C CNN
F 3 "" H 6100 4650 50  0001 C CNN
	1    6100 4650
	1    0    0    -1  
$EndComp
$Comp
L CG24-cells:O4R U32R42
U 1 1 5EAF1C8F
P 6100 5350
F 0 "U32R42" H 6100 5667 50  0000 C CNN
F 1 "O4R" H 6100 5576 50  0000 C CNN
F 2 "" H 6100 5350 50  0001 C CNN
F 3 "" H 6100 5350 50  0001 C CNN
	1    6100 5350
	1    0    0    -1  
$EndComp
$Comp
L CG24-cells:O4R U32R32
U 1 1 5EAF1C9C
P 6100 6050
F 0 "U32R32" H 6100 6367 50  0000 C CNN
F 1 "O4R" H 6100 6276 50  0000 C CNN
F 2 "" H 6100 6050 50  0001 C CNN
F 3 "" H 6100 6050 50  0001 C CNN
	1    6100 6050
	1    0    0    -1  
$EndComp
$Comp
L CG24-cells:O4R U24R150
U 1 1 5EAF1C9E
P 7900 1150
F 0 "U24R150" H 7900 1467 50  0000 C CNN
F 1 "O4R" H 7900 1376 50  0000 C CNN
F 2 "" H 7900 1150 50  0001 C CNN
F 3 "" H 7900 1150 50  0001 C CNN
	1    7900 1150
	1    0    0    -1  
$EndComp
$Comp
L CG24-cells:O4R U26R150
U 1 1 5EAF1CA2
P 7900 1850
F 0 "U26R150" H 7900 2167 50  0000 C CNN
F 1 "O4R" H 7900 2076 50  0000 C CNN
F 2 "" H 7900 1850 50  0001 C CNN
F 3 "" H 7900 1850 50  0001 C CNN
	1    7900 1850
	1    0    0    -1  
$EndComp
$Comp
L CG24-cells:O4R U28R150
U 1 1 5EAF1C95
P 7900 2550
F 0 "U28R150" H 7900 2867 50  0000 C CNN
F 1 "O4R" H 7900 2776 50  0000 C CNN
F 2 "" H 7900 2550 50  0001 C CNN
F 3 "" H 7900 2550 50  0001 C CNN
	1    7900 2550
	1    0    0    -1  
$EndComp
$Comp
L CG24-cells:O4R U30R148
U 1 1 5EAF1C8D
P 7900 3250
F 0 "U30R148" H 7900 3567 50  0000 C CNN
F 1 "O4R" H 7900 3476 50  0000 C CNN
F 2 "" H 7900 3250 50  0001 C CNN
F 3 "" H 7900 3250 50  0001 C CNN
	1    7900 3250
	1    0    0    -1  
$EndComp
$Comp
L CG24-cells:O4R U32R148
U 1 1 5EAF1C97
P 7900 3950
F 0 "U32R148" H 7900 4267 50  0000 C CNN
F 1 "O4R" H 7900 4176 50  0000 C CNN
F 2 "" H 7900 3950 50  0001 C CNN
F 3 "" H 7900 3950 50  0001 C CNN
	1    7900 3950
	1    0    0    -1  
$EndComp
$Comp
L CG24-cells:O4R U32R146
U 1 1 5EAF1CAA
P 7900 4650
F 0 "U32R146" H 7900 4967 50  0000 C CNN
F 1 "O4R" H 7900 4876 50  0000 C CNN
F 2 "" H 7900 4650 50  0001 C CNN
F 3 "" H 7900 4650 50  0001 C CNN
	1    7900 4650
	1    0    0    -1  
$EndComp
$Comp
L CG24-cells:O4R U32R137
U 1 1 5EAF1C9F
P 7900 5350
F 0 "U32R137" H 7900 5667 50  0000 C CNN
F 1 "O4R" H 7900 5576 50  0000 C CNN
F 2 "" H 7900 5350 50  0001 C CNN
F 3 "" H 7900 5350 50  0001 C CNN
	1    7900 5350
	1    0    0    -1  
$EndComp
$Comp
L CG24-cells:O4R U32R106
U 1 1 5EAF1C83
P 7900 6050
F 0 "U32R106" H 7900 6367 50  0000 C CNN
F 1 "O4R" H 7900 6276 50  0000 C CNN
F 2 "" H 7900 6050 50  0001 C CNN
F 3 "" H 7900 6050 50  0001 C CNN
	1    7900 6050
	1    0    0    -1  
$EndComp
Wire Wire Line
	3250 6300 2650 6300
Wire Bus Line
	3450 750  3450 4550
Wire Bus Line
	5250 750  5250 5950
Wire Bus Line
	7050 750  7050 5950
Connection ~ 3250 6300
$EndSCHEMATC
