EESchema Schematic File Version 4
EELAYER 30 0
EELAYER END
$Descr A4 11693 8268
encoding utf-8
Sheet 35 83
Title "CPS Reverse Engineering: DL-0311"
Date "2021-09-12"
Rev ""
Comp ""
Comment1 ""
Comment2 ""
Comment3 "Licence: CC-BY"
Comment4 "Author: Loïc *WydD* Petit"
$EndDescr
Connection ~ 3400 2950
Connection ~ 3500 3050
Connection ~ 4700 2950
Connection ~ 4600 3050
Connection ~ 3500 4100
Connection ~ 3400 4000
Connection ~ 5200 2100
Connection ~ 4000 2100
Connection ~ 6900 1350
Connection ~ 5800 3050
Connection ~ 4600 2100
Connection ~ 4700 4000
Connection ~ 5900 4000
Connection ~ 5800 2100
Connection ~ 9250 3500
Connection ~ 9250 3950
Connection ~ 9250 3050
Connection ~ 9250 2600
Connection ~ 9250 5300
Connection ~ 9250 4400
Connection ~ 9250 4850
Connection ~ 9250 2150
Connection ~ 5200 5600
Connection ~ 5200 6050
Connection ~ 5200 6500
Connection ~ 4750 4650
Connection ~ 7000 4500
Connection ~ 5900 2950
NoConn ~ 4250 1800
NoConn ~ 6800 1450
NoConn ~ 6800 1250
NoConn ~ 6800 950 
NoConn ~ 5450 1800
Entry Wire Line
	2850 1600 2950 1700
Entry Wire Line
	2850 2350 2950 2450
Entry Wire Line
	2850 2450 2950 2550
Entry Wire Line
	2850 2550 2950 2650
Entry Wire Line
	2850 2650 2950 2750
Entry Wire Line
	2850 3400 2950 3500
Entry Wire Line
	2850 3500 2950 3600
Entry Wire Line
	2850 3600 2950 3700
Entry Wire Line
	2850 3700 2950 3800
Entry Wire Line
	4850 5050 4750 4950
Entry Wire Line
	4850 5500 4750 5400
Entry Wire Line
	4850 5950 4750 5850
Entry Wire Line
	4850 6400 4750 6300
Entry Wire Line
	7500 2000 7400 2100
Entry Wire Line
	7500 2100 7400 2200
Entry Wire Line
	7500 2850 7400 2950
Entry Wire Line
	7500 2950 7400 3050
Entry Wire Line
	10200 1650 10300 1550
Entry Wire Line
	10200 2100 10300 2000
Entry Wire Line
	10200 2550 10300 2450
Entry Wire Line
	10200 3000 10300 2900
Entry Wire Line
	10200 3450 10300 3350
Entry Wire Line
	10200 3900 10300 3800
Entry Wire Line
	10200 4350 10300 4250
Entry Wire Line
	10200 4800 10300 4700
Entry Wire Line
	10200 5250 10300 5150
Wire Wire Line
	1900 4400 2750 4400
Wire Wire Line
	2750 4700 3500 4700
Wire Wire Line
	2950 1700 3750 1700
Wire Wire Line
	2950 2450 3600 2450
Wire Wire Line
	2950 2550 3600 2550
Wire Wire Line
	2950 2650 3600 2650
Wire Wire Line
	2950 2750 3600 2750
Wire Wire Line
	2950 3500 3600 3500
Wire Wire Line
	2950 3600 3600 3600
Wire Wire Line
	2950 3700 3600 3700
Wire Wire Line
	2950 3800 3600 3800
Wire Wire Line
	3300 4400 3400 4400
Wire Wire Line
	3400 1900 3400 2950
Wire Wire Line
	3400 1900 3750 1900
Wire Wire Line
	3400 2950 3400 4000
Wire Wire Line
	3400 2950 3600 2950
Wire Wire Line
	3400 4000 3600 4000
Wire Wire Line
	3400 4400 3400 4000
Wire Wire Line
	3500 2100 4000 2100
Wire Wire Line
	3500 3050 3500 2100
Wire Wire Line
	3500 3050 3500 4100
Wire Wire Line
	3500 3050 3600 3050
Wire Wire Line
	3500 4100 3500 4700
Wire Wire Line
	3600 4100 3500 4100
Wire Wire Line
	4000 2100 4600 2100
Wire Wire Line
	4600 2100 4600 3050
Wire Wire Line
	4600 2100 5200 2100
Wire Wire Line
	4600 3050 4600 4100
Wire Wire Line
	4600 3050 4800 3050
Wire Wire Line
	4600 4100 4800 4100
Wire Wire Line
	4600 6500 5200 6500
Wire Wire Line
	4700 1900 4950 1900
Wire Wire Line
	4700 2950 4700 1900
Wire Wire Line
	4700 2950 4700 4000
Wire Wire Line
	4700 4000 4700 4500
Wire Wire Line
	4700 4000 4800 4000
Wire Wire Line
	4700 4500 4250 4500
Wire Wire Line
	4800 2450 4400 2450
Wire Wire Line
	4800 2550 4400 2550
Wire Wire Line
	4800 2650 4400 2650
Wire Wire Line
	4800 2750 4400 2750
Wire Wire Line
	4800 2950 4700 2950
Wire Wire Line
	4800 3500 4400 3500
Wire Wire Line
	4800 3600 4400 3600
Wire Wire Line
	4800 3700 4400 3700
Wire Wire Line
	4800 3800 4400 3800
Wire Wire Line
	4850 5050 5450 5050
Wire Wire Line
	4850 5500 5450 5500
Wire Wire Line
	4850 5950 5450 5950
Wire Wire Line
	4850 6400 5450 6400
Wire Wire Line
	4900 1250 6000 1250
Wire Wire Line
	4950 1700 4250 1700
Wire Wire Line
	5200 2100 5800 2100
Wire Wire Line
	5200 5150 5450 5150
Wire Wire Line
	5200 5600 5200 5150
Wire Wire Line
	5200 6050 5200 5600
Wire Wire Line
	5200 6500 5200 6050
Wire Wire Line
	5450 1050 5450 1150
Wire Wire Line
	5450 1150 6000 1150
Wire Wire Line
	5450 1700 5550 1700
Wire Wire Line
	5450 5600 5200 5600
Wire Wire Line
	5450 6050 5200 6050
Wire Wire Line
	5450 6500 5200 6500
Wire Wire Line
	5550 950  5550 1700
Wire Wire Line
	5550 950  6000 950 
Wire Wire Line
	5600 2650 6000 2650
Wire Wire Line
	5800 1650 5800 2100
Wire Wire Line
	5800 3050 5800 2100
Wire Wire Line
	5800 3050 6000 3050
Wire Wire Line
	5800 4100 5800 3050
Wire Wire Line
	5800 4100 6000 4100
Wire Wire Line
	5900 600  5900 1050
Wire Wire Line
	5900 600  6900 600 
Wire Wire Line
	5900 1050 6000 1050
Wire Wire Line
	5900 1550 5900 2950
Wire Wire Line
	5900 1550 6000 1550
Wire Wire Line
	5900 2950 6000 2950
Wire Wire Line
	5900 4000 5900 2950
Wire Wire Line
	5900 4000 5900 4500
Wire Wire Line
	5900 4000 6000 4000
Wire Wire Line
	5900 4500 5500 4500
Wire Wire Line
	6000 1650 5800 1650
Wire Wire Line
	6000 2450 5600 2450
Wire Wire Line
	6000 2550 5600 2550
Wire Wire Line
	6000 2750 5600 2750
Wire Wire Line
	6000 3500 5600 3500
Wire Wire Line
	6000 3600 5600 3600
Wire Wire Line
	6000 3700 5600 3700
Wire Wire Line
	6000 3800 5600 3800
Wire Wire Line
	6000 5100 7500 5100
Wire Wire Line
	6000 6450 7800 6450
Wire Wire Line
	6800 1050 8500 1050
Wire Wire Line
	6800 1150 8750 1150
Wire Wire Line
	6800 1350 6900 1350
Wire Wire Line
	6800 1550 7000 1550
Wire Wire Line
	6800 1650 7000 1650
Wire Wire Line
	6800 2450 6900 2450
Wire Wire Line
	6800 2750 6900 2750
Wire Wire Line
	6800 3500 7300 3500
Wire Wire Line
	6800 3700 7100 3700
Wire Wire Line
	6900 1350 6900 600 
Wire Wire Line
	6900 1350 7000 1350
Wire Wire Line
	6900 2300 7800 2300
Wire Wire Line
	6900 2450 6900 2300
Wire Wire Line
	6900 2750 6900 3250
Wire Wire Line
	6900 3250 7800 3250
Wire Wire Line
	7000 2400 7000 2550
Wire Wire Line
	7000 2400 7800 2400
Wire Wire Line
	7000 2550 6800 2550
Wire Wire Line
	7000 2650 6800 2650
Wire Wire Line
	7000 3150 7000 2650
Wire Wire Line
	7000 3150 7800 3150
Wire Wire Line
	7000 3800 6800 3800
Wire Wire Line
	7000 4500 6900 4500
Wire Wire Line
	7000 4500 7000 3800
Wire Wire Line
	7000 5400 7000 4500
Wire Wire Line
	7000 5400 7900 5400
Wire Wire Line
	7100 3700 7100 4750
Wire Wire Line
	7100 4750 7900 4750
Wire Wire Line
	7200 3600 6800 3600
Wire Wire Line
	7200 4100 7200 3600
Wire Wire Line
	7200 4100 7800 4100
Wire Wire Line
	7300 3500 7300 4000
Wire Wire Line
	7300 4000 7800 4000
Wire Wire Line
	7500 3700 7800 3700
Wire Wire Line
	7500 5100 7500 3700
Wire Wire Line
	7600 3800 7600 5550
Wire Wire Line
	7600 5550 6000 5550
Wire Wire Line
	7700 4550 7700 6000
Wire Wire Line
	7700 6000 6000 6000
Wire Wire Line
	7800 2000 7500 2000
Wire Wire Line
	7800 2100 7500 2100
Wire Wire Line
	7800 2850 7500 2850
Wire Wire Line
	7800 2950 7500 2950
Wire Wire Line
	7800 3800 7600 3800
Wire Wire Line
	7800 5200 7800 6450
Wire Wire Line
	7800 5200 7900 5200
Wire Wire Line
	7900 4550 7700 4550
Wire Wire Line
	8500 1650 8500 1050
Wire Wire Line
	8500 1650 8800 1650
Wire Wire Line
	8500 4550 8600 4550
Wire Wire Line
	8500 5200 8500 4750
Wire Wire Line
	8500 5300 8600 5300
Wire Wire Line
	8600 1550 8600 2000
Wire Wire Line
	8600 2150 8700 2150
Wire Wire Line
	8600 2400 8600 2850
Wire Wire Line
	8600 3250 8600 3700
Wire Wire Line
	8600 3850 9350 3850
Wire Wire Line
	8600 4550 8600 4100
Wire Wire Line
	8600 4650 8500 4650
Wire Wire Line
	8600 4750 8600 4650
Wire Wire Line
	8600 4750 9350 4750
Wire Wire Line
	8600 5200 9350 5200
Wire Wire Line
	8600 5300 8600 5200
Wire Wire Line
	8700 2050 9350 2050
Wire Wire Line
	8700 2150 8700 2050
Wire Wire Line
	8700 2250 8600 2250
Wire Wire Line
	8700 2500 8700 2250
Wire Wire Line
	8700 2500 9350 2500
Wire Wire Line
	8700 2950 8700 3000
Wire Wire Line
	8700 2950 9350 2950
Wire Wire Line
	8700 3000 8600 3000
Wire Wire Line
	8700 3100 8600 3100
Wire Wire Line
	8700 3400 8700 3100
Wire Wire Line
	8700 3400 9350 3400
Wire Wire Line
	8700 3950 8600 3950
Wire Wire Line
	8700 4300 8700 3950
Wire Wire Line
	8700 4300 9350 4300
Wire Wire Line
	8800 1550 8600 1550
Wire Wire Line
	9250 1700 9250 2150
Wire Wire Line
	9250 2150 9250 2600
Wire Wire Line
	9250 2600 9250 3050
Wire Wire Line
	9250 3050 9250 3500
Wire Wire Line
	9250 3500 9250 3950
Wire Wire Line
	9250 3950 9250 4400
Wire Wire Line
	9250 4400 9250 4850
Wire Wire Line
	9250 4850 9250 5300
Wire Wire Line
	9250 5300 9250 5600
Wire Wire Line
	9250 5600 8850 5600
Wire Wire Line
	9350 1700 9250 1700
Wire Wire Line
	9350 2150 9250 2150
Wire Wire Line
	9350 2600 9250 2600
Wire Wire Line
	9350 3050 9250 3050
Wire Wire Line
	9350 3500 9250 3500
Wire Wire Line
	9350 3950 9250 3950
Wire Wire Line
	9350 4400 9250 4400
Wire Wire Line
	9350 4850 9250 4850
Wire Wire Line
	9350 5300 9250 5300
Wire Wire Line
	9900 1650 10200 1650
Wire Wire Line
	9900 2100 10200 2100
Wire Wire Line
	9900 2550 10200 2550
Wire Wire Line
	9900 3000 10200 3000
Wire Wire Line
	9900 3450 10200 3450
Wire Wire Line
	9900 3900 10200 3900
Wire Wire Line
	9900 4350 10200 4350
Wire Wire Line
	9900 4800 10200 4800
Wire Wire Line
	9900 5250 10200 5250
Wire Bus Line
	2850 1400 2700 1400
Wire Bus Line
	4750 4650 4600 4650
Wire Bus Line
	7400 4650 4750 4650
Wire Bus Line
	10300 1450 10400 1450
Text Label 2950 1700 0    50   ~ 0
BUS-DATA8
Text Label 2950 2450 0    50   ~ 0
BUS-DATA7
Text Label 2950 2550 0    50   ~ 0
BUS-DATA6
Text Label 2950 2650 0    50   ~ 0
BUS-DATA5
Text Label 2950 2750 0    50   ~ 0
BUS-DATA4
Text Label 2950 3500 0    50   ~ 0
BUS-DATA3
Text Label 2950 3600 0    50   ~ 0
BUS-DATA2
Text Label 2950 3700 0    50   ~ 0
BUS-DATA1
Text Label 2950 3800 0    50   ~ 0
BUS-DATA0
Text Label 5150 5050 2    50   ~ 0
WX-C3
Text Label 5150 5500 2    50   ~ 0
WX-C2
Text Label 5150 5950 2    50   ~ 0
WX-C1
Text Label 5150 6400 2    50   ~ 0
WX-C0
Text Label 7800 2000 2    50   ~ 0
WX-C7
Text Label 7800 2100 2    50   ~ 0
WX-C6
Text Label 7800 2850 2    50   ~ 0
WX-C5
Text Label 7800 2950 2    50   ~ 0
WX-C4
Text Label 9900 1650 0    50   ~ 0
WX-A8
Text Label 9900 2100 0    50   ~ 0
WX-A7
Text Label 9900 2550 0    50   ~ 0
WX-A6
Text Label 9900 3000 0    50   ~ 0
WX-A5
Text Label 9900 3450 0    50   ~ 0
WX-A4
Text Label 9900 3900 0    50   ~ 0
WX-A3
Text Label 9900 4350 0    50   ~ 0
WX-A2
Text Label 9900 4800 0    50   ~ 0
WX-A1
Text Label 9900 5250 0    50   ~ 0
WX-A0
Text HLabel 1300 4400 0    50   Input ~ 0
~BUS-SPRITE-X
Text HLabel 2700 1400 0    50   Input ~ 0
BUS-DATA[0..8]
Text HLabel 2750 4300 0    50   Input ~ 0
SPRITE-BLOCK-READY
Text HLabel 2750 4500 0    50   Input ~ 0
CLK4M
Text HLabel 2750 4700 0    50   Input ~ 0
~RESET
Text HLabel 4250 4500 0    50   Input ~ 0
~CLK4MLI
Text HLabel 4600 4650 0    50   Input ~ 0
WX-C[0..7]
Text HLabel 4600 6500 0    50   Input ~ 0
~FLIP
Text HLabel 4900 1000 0    50   Input ~ 0
SPRITE-BLOCK-READY
Text HLabel 4900 1100 0    50   Input ~ 0
LI
Text HLabel 4900 1250 0    50   Input ~ 0
~SPRITE-X-READY-LI
Text HLabel 5500 4500 0    50   Input ~ 0
~CLK8M4M
Text HLabel 6900 4500 0    50   Output ~ 0
SPRITE-X0
Text HLabel 7000 1350 2    50   Output ~ 0
Y-HI-~ZERO
Text HLabel 7000 1650 2    50   Output ~ 0
Y-HI-INC
Text HLabel 7000 1550 2    50   Output ~ 0
X-HI-~ZERO
Text HLabel 8850 5600 0    50   Input ~ 0
~FLIP
Text HLabel 9350 1150 2    50   Output ~ 0
OBJUP
Text HLabel 10400 1450 2    50   Output ~ 0
WX-A[0..8]
$Comp
L A5C:NAND02 UDB106
U 1 1 6251A1D2
P 5150 1050
F 0 "UDB106" H 5175 1317 50  0000 C CNN
F 1 "NAND02" H 5175 1226 50  0000 C CNN
F 2 "" H 5150 1050 50  0001 C CNN
F 3 "" H 5150 1050 50  0001 C CNN
	1    5150 1050
	1    0    0    -1  
$EndComp
$Comp
L A5C:XNOR02 UDB?
U 1 1 62BCF534
P 5700 5100
AR Path="/613100A2/612BF9D1/62BCF534" Ref="UDB?"  Part="1" 
AR Path="/613100A2/61290CE0/62BCF534" Ref="UDB51"  Part="1" 
F 0 "UDB51" H 5725 5367 50  0000 C CNN
F 1 "XNOR02" H 5725 5276 50  0000 C CNN
F 2 "" H 5725 5100 50  0001 C CNN
F 3 "" H 5725 5100 50  0001 C CNN
	1    5700 5100
	1    0    0    -1  
$EndComp
$Comp
L A5C:XNOR02 UDA?
U 1 1 62BCF52E
P 5700 5550
AR Path="/613100A2/612BF9D1/62BCF52E" Ref="UDA?"  Part="1" 
AR Path="/613100A2/61290CE0/62BCF52E" Ref="UDA36"  Part="1" 
F 0 "UDA36" H 5725 5817 50  0000 C CNN
F 1 "XNOR02" H 5725 5726 50  0000 C CNN
F 2 "" H 5725 5550 50  0001 C CNN
F 3 "" H 5725 5550 50  0001 C CNN
	1    5700 5550
	1    0    0    -1  
$EndComp
$Comp
L A5C:XNOR02 UDC?
U 1 1 62BCF528
P 5700 6000
AR Path="/613100A2/612BF9D1/62BCF528" Ref="UDC?"  Part="1" 
AR Path="/613100A2/61290CE0/62BCF528" Ref="UDC42"  Part="1" 
F 0 "UDC42" H 5725 6267 50  0000 C CNN
F 1 "XNOR02" H 5725 6176 50  0000 C CNN
F 2 "" H 5725 6000 50  0001 C CNN
F 3 "" H 5725 6000 50  0001 C CNN
	1    5700 6000
	1    0    0    -1  
$EndComp
$Comp
L A5C:XNOR02 UDF?
U 1 1 62BCF522
P 5700 6450
AR Path="/613100A2/612BF9D1/62BCF522" Ref="UDF?"  Part="1" 
AR Path="/613100A2/61290CE0/62BCF522" Ref="UDF41"  Part="1" 
F 0 "UDF41" H 5725 6717 50  0000 C CNN
F 1 "XNOR02" H 5725 6626 50  0000 C CNN
F 2 "" H 5725 6450 50  0001 C CNN
F 3 "" H 5725 6450 50  0001 C CNN
	1    5700 6450
	1    0    0    -1  
$EndComp
$Comp
L A5C:XNOR02 UDD81
U 1 1 695D03DA
P 9050 1600
F 0 "UDD81" H 9075 1867 50  0000 C CNN
F 1 "XNOR02" H 9075 1776 50  0000 C CNN
F 2 "" H 9075 1600 50  0001 C CNN
F 3 "" H 9075 1600 50  0001 C CNN
	1    9050 1600
	1    0    0    -1  
$EndComp
$Comp
L A5C:XNOR02 UDD62
U 1 1 7E37E540
P 9600 1650
F 0 "UDD62" H 9625 1917 50  0000 C CNN
F 1 "XNOR02" H 9625 1826 50  0000 C CNN
F 2 "" H 9625 1650 50  0001 C CNN
F 3 "" H 9625 1650 50  0001 C CNN
	1    9600 1650
	1    0    0    -1  
$EndComp
$Comp
L A5C:XNOR02 UDG90
U 1 1 695D03D3
P 9600 2100
F 0 "UDG90" H 9625 2367 50  0000 C CNN
F 1 "XNOR02" H 9625 2276 50  0000 C CNN
F 2 "" H 9625 2100 50  0001 C CNN
F 3 "" H 9625 2100 50  0001 C CNN
	1    9600 2100
	1    0    0    -1  
$EndComp
$Comp
L A5C:XNOR02 UDE68
U 1 1 695D03CD
P 9600 2550
F 0 "UDE68" H 9625 2817 50  0000 C CNN
F 1 "XNOR02" H 9625 2726 50  0000 C CNN
F 2 "" H 9625 2550 50  0001 C CNN
F 3 "" H 9625 2550 50  0001 C CNN
	1    9600 2550
	1    0    0    -1  
$EndComp
$Comp
L A5C:XNOR02 UDF88
U 1 1 695D03BF
P 9600 3000
F 0 "UDF88" H 9625 3267 50  0000 C CNN
F 1 "XNOR02" H 9625 3176 50  0000 C CNN
F 2 "" H 9625 3000 50  0001 C CNN
F 3 "" H 9625 3000 50  0001 C CNN
	1    9600 3000
	1    0    0    -1  
$EndComp
$Comp
L A5C:XNOR02 UDF84
U 1 1 695D03C5
P 9600 3450
F 0 "UDF84" H 9625 3717 50  0000 C CNN
F 1 "XNOR02" H 9625 3626 50  0000 C CNN
F 2 "" H 9625 3450 50  0001 C CNN
F 3 "" H 9625 3450 50  0001 C CNN
	1    9600 3450
	1    0    0    -1  
$EndComp
$Comp
L A5C:XNOR02 UDD69
U 1 1 695D03B3
P 9600 3900
F 0 "UDD69" H 9625 4167 50  0000 C CNN
F 1 "XNOR02" H 9625 4076 50  0000 C CNN
F 2 "" H 9625 3900 50  0001 C CNN
F 3 "" H 9625 3900 50  0001 C CNN
	1    9600 3900
	1    0    0    -1  
$EndComp
$Comp
L A5C:XNOR02 UDA75
U 1 1 695D03B9
P 9600 4350
F 0 "UDA75" H 9625 4617 50  0000 C CNN
F 1 "XNOR02" H 9625 4526 50  0000 C CNN
F 2 "" H 9625 4350 50  0001 C CNN
F 3 "" H 9625 4350 50  0001 C CNN
	1    9600 4350
	1    0    0    -1  
$EndComp
$Comp
L A5C:XNOR02 UDC69
U 1 1 695D03A7
P 9600 4800
F 0 "UDC69" H 9625 5067 50  0000 C CNN
F 1 "XNOR02" H 9625 4976 50  0000 C CNN
F 2 "" H 9625 4800 50  0001 C CNN
F 3 "" H 9625 4800 50  0001 C CNN
	1    9600 4800
	1    0    0    -1  
$EndComp
$Comp
L A5C:XNOR02 UDH41
U 1 1 695D03AD
P 9600 5250
F 0 "UDH41" H 9625 5517 50  0000 C CNN
F 1 "XNOR02" H 9625 5426 50  0000 C CNN
F 2 "" H 9625 5250 50  0001 C CNN
F 3 "" H 9625 5250 50  0001 C CNN
	1    9600 5250
	1    0    0    -1  
$EndComp
$Comp
L A5C:NAND03 UDA112
U 1 1 684ECC8E
P 3000 4400
F 0 "UDA112" H 3025 4692 50  0000 C CNN
F 1 "NAND03" H 3025 4601 50  0000 C CNN
F 2 "" H 3000 4400 50  0001 C CNN
F 3 "" H 3000 4400 50  0001 C CNN
	1    3000 4400
	1    0    0    -1  
$EndComp
$Comp
L A5C:INV01 UDA86
U 1 1 684ECC97
P 1600 4400
F 0 "UDA86" H 1600 4717 50  0000 C CNN
F 1 "INV01" H 1600 4626 50  0000 C CNN
F 2 "" H 1600 4200 50  0001 C CNN
F 3 "" H 1600 4200 50  0001 C CNN
	1    1600 4400
	1    0    0    -1  
$EndComp
$Comp
L A5C:INV01 UBD?
U 1 1 627D0A9B
P 9050 1150
AR Path="/60F602ED/627D0A9B" Ref="UBD?"  Part="1" 
AR Path="/613100A2/627D0A9B" Ref="UBD?"  Part="1" 
AR Path="/613100A2/61290CE0/627D0A9B" Ref="UDF73"  Part="1" 
F 0 "UDF73" H 9050 1467 50  0000 C CNN
F 1 "INV01" H 9050 1376 50  0000 C CNN
F 2 "" H 9050 950 50  0001 C CNN
F 3 "" H 9050 950 50  0001 C CNN
	1    9050 1150
	1    0    0    -1  
$EndComp
$Comp
L A5C:FA1 UDC44
U 1 1 695D0369
P 8200 4700
F 0 "UDC44" H 8200 5115 50  0000 C CNN
F 1 "FA1" H 8200 5024 50  0000 C CNN
F 2 "" H 8150 4750 50  0001 C CNN
F 3 "" H 8150 4750 50  0001 C CNN
	1    8200 4700
	1    0    0    -1  
$EndComp
$Comp
L A5C:HA1 UDF44
U 1 1 695D0363
P 8200 5300
F 0 "UDF44" H 8200 5665 50  0000 C CNN
F 1 "HA1" H 8200 5574 50  0000 C CNN
F 2 "" H 8150 5300 50  0001 C CNN
F 3 "" H 8150 5300 50  0001 C CNN
	1    8200 5300
	1    0    0    -1  
$EndComp
$Comp
L A5C:DFFCOR UDH124
U 1 1 684ECC64
P 4000 1800
F 0 "UDH124" H 4000 2165 50  0000 C CNN
F 1 "DFFCOR" H 4000 2074 50  0000 C CNN
F 2 "" H 4000 1800 50  0001 C CNN
F 3 "" H 4000 1800 50  0001 C CNN
	1    4000 1800
	1    0    0    -1  
$EndComp
$Comp
L A5C:DFFCOR UDG104
U 1 1 61FB8BE2
P 5200 1800
F 0 "UDG104" H 5200 2165 50  0000 C CNN
F 1 "DFFCOR" H 5200 2074 50  0000 C CNN
F 2 "" H 5200 1800 50  0001 C CNN
F 3 "" H 5200 1800 50  0001 C CNN
	1    5200 1800
	1    0    0    -1  
$EndComp
$Comp
L A5C:FA2 UDC118
U 1 1 695D037F
P 8200 2300
F 0 "UDC118" H 8200 2865 50  0000 C CNN
F 1 "FA2" H 8200 2774 50  0000 C CNN
F 2 "" H 8050 2500 50  0001 C CNN
F 3 "" H 8050 2500 50  0001 C CNN
	1    8200 2300
	1    0    0    -1  
$EndComp
$Comp
L A5C:FA2 UDE111
U 1 1 695D0378
P 8200 3150
F 0 "UDE111" H 8200 3715 50  0000 C CNN
F 1 "FA2" H 8200 3624 50  0000 C CNN
F 2 "" H 8050 3350 50  0001 C CNN
F 3 "" H 8050 3350 50  0001 C CNN
	1    8200 3150
	1    0    0    -1  
$EndComp
$Comp
L A5C:FA2 UDA39
U 1 1 695D0370
P 8200 4000
F 0 "UDA39" H 8200 4565 50  0000 C CNN
F 1 "FA2" H 8200 4474 50  0000 C CNN
F 2 "" H 8050 4200 50  0001 C CNN
F 3 "" H 8050 4200 50  0001 C CNN
	1    8200 4000
	1    0    0    -1  
$EndComp
$Comp
L A5C:M175C UDK104
U 1 1 684ECC6B
P 4000 2750
F 0 "UDK104" H 4000 3315 50  0000 C CNN
F 1 "M175C" H 4000 3224 50  0000 C CNN
F 2 "" H 4000 2550 50  0001 C CNN
F 3 "" H 4000 2550 50  0001 C CNN
	1    4000 2750
	1    0    0    -1  
$EndComp
$Comp
L A5C:M175C UDB83
U 1 1 684ECC79
P 4000 3800
F 0 "UDB83" H 4000 4365 50  0000 C CNN
F 1 "M175C" H 4000 4274 50  0000 C CNN
F 2 "" H 4000 3600 50  0001 C CNN
F 3 "" H 4000 3600 50  0001 C CNN
	1    4000 3800
	1    0    0    -1  
$EndComp
$Comp
L A5C:M175C UDK124
U 1 1 684ECCA1
P 5200 2750
F 0 "UDK124" H 5200 3315 50  0000 C CNN
F 1 "M175C" H 5200 3224 50  0000 C CNN
F 2 "" H 5200 2550 50  0001 C CNN
F 3 "" H 5200 2550 50  0001 C CNN
	1    5200 2750
	1    0    0    -1  
$EndComp
$Comp
L A5C:M175C UDB62
U 1 1 66C605D5
P 5200 3800
F 0 "UDB62" H 5200 4365 50  0000 C CNN
F 1 "M175C" H 5200 4274 50  0000 C CNN
F 2 "" H 5200 3600 50  0001 C CNN
F 3 "" H 5200 3600 50  0001 C CNN
	1    5200 3800
	1    0    0    -1  
$EndComp
$Comp
L A5C:M175C UDJ123
U 1 1 684ECCD9
P 6400 2750
F 0 "UDJ123" H 6400 3315 50  0000 C CNN
F 1 "M175C" H 6400 3224 50  0000 C CNN
F 2 "" H 6400 2550 50  0001 C CNN
F 3 "" H 6400 2550 50  0001 C CNN
	1    6400 2750
	1    0    0    -1  
$EndComp
$Comp
L A5C:M175C UDA55
U 1 1 679944B8
P 6400 3800
F 0 "UDA55" H 6400 4365 50  0000 C CNN
F 1 "M175C" H 6400 4274 50  0000 C CNN
F 2 "" H 6400 3600 50  0001 C CNN
F 3 "" H 6400 3600 50  0001 C CNN
	1    6400 3800
	1    0    0    -1  
$EndComp
$Comp
L A5C:M175CLH UDF91
U 1 1 61EE0378
P 6400 1250
F 0 "UDF91" H 6400 1815 50  0000 C CNN
F 1 "M175CLH" H 6400 1724 50  0000 C CNN
F 2 "" H 6400 1050 50  0001 C CNN
F 3 "" H 6400 1050 50  0001 C CNN
	1    6400 1250
	1    0    0    -1  
$EndComp
Wire Bus Line
	4750 4650 4750 6300
Wire Bus Line
	7400 2100 7400 4650
Wire Bus Line
	2850 1400 2850 3700
Wire Bus Line
	10300 1450 10300 5150
$EndSCHEMATC
