EESchema Schematic File Version 4
EELAYER 30 0
EELAYER END
$Descr A3 16535 11693
encoding utf-8
Sheet 27 83
Title "CPS Reverse Engineering: DL-0311"
Date "2021-09-12"
Rev ""
Comp ""
Comment1 ""
Comment2 ""
Comment3 "Licence: CC-BY"
Comment4 "Author: Loïc *WydD* Petit"
$EndDescr
Connection ~ 4450 5600
Connection ~ 4450 7200
Connection ~ 4450 6400
Connection ~ 3450 3200
Connection ~ 3450 7250
Connection ~ 3350 8400
Connection ~ 3350 4350
Connection ~ 3450 4250
Connection ~ 7850 4850
Connection ~ 10050 6600
Connection ~ 9950 6400
Connection ~ 10050 7400
Connection ~ 11100 7450
Connection ~ 11100 6650
Connection ~ 12600 6550
Connection ~ 12750 6650
Connection ~ 12400 6450
Connection ~ 12500 6450
Connection ~ 12600 7350
Connection ~ 12500 7250
Connection ~ 10700 3250
Connection ~ 10050 5800
Connection ~ 9950 5600
Connection ~ 9950 4800
Connection ~ 10700 3650
Connection ~ 12600 4850
Connection ~ 12500 5750
Connection ~ 12500 5450
Connection ~ 12500 5650
Connection ~ 12750 5350
Connection ~ 12600 5250
Connection ~ 12750 4750
Connection ~ 12750 5950
Connection ~ 12600 5850
Connection ~ 12400 7150
Connection ~ 12300 7250
Connection ~ 12300 7050
Connection ~ 12400 6050
Connection ~ 12400 6350
Connection ~ 11100 5850
Connection ~ 12300 6750
Connection ~ 5900 7500
NoConn ~ 4050 4850
NoConn ~ 13600 7250
NoConn ~ 4050 6100
Entry Wire Line
	2650 2600 2750 2700
Entry Wire Line
	2650 2700 2750 2800
Entry Wire Line
	2650 2800 2750 2900
Entry Wire Line
	2650 2900 2750 3000
Entry Wire Line
	2650 3650 2750 3750
Entry Wire Line
	2650 3750 2750 3850
Entry Wire Line
	2650 3850 2750 3950
Entry Wire Line
	2650 3950 2750 4050
Entry Wire Line
	2650 4750 2750 4850
Entry Wire Line
	2650 6000 2750 6100
Entry Wire Line
	2650 6650 2750 6750
Entry Wire Line
	2650 6750 2750 6850
Entry Wire Line
	2650 6850 2750 6950
Entry Wire Line
	2650 6950 2750 7050
Entry Wire Line
	2650 7700 2750 7800
Entry Wire Line
	2650 7800 2750 7900
Entry Wire Line
	2650 7900 2750 8000
Entry Wire Line
	2650 8000 2750 8100
Entry Wire Line
	5800 6200 5900 6300
Entry Wire Line
	5800 6750 5900 6850
Entry Wire Line
	5800 6850 5900 6950
Entry Wire Line
	5800 6950 5900 7050
Entry Wire Line
	5800 7050 5900 7150
Entry Wire Line
	5800 7800 5900 7700
Entry Wire Line
	5800 7900 5900 7800
Entry Wire Line
	5800 8000 5900 7900
Entry Wire Line
	5800 8100 5900 8000
Entry Wire Line
	5950 3750 6050 3850
Entry Wire Line
	5950 3850 6050 3950
Entry Wire Line
	5950 3950 6050 4050
Entry Wire Line
	5950 4050 6050 4150
Entry Wire Line
	5950 4950 6050 5050
Entry Wire Line
	12650 2700 12750 2600
Entry Wire Line
	12650 2800 12750 2700
Entry Wire Line
	12650 2900 12750 2800
Entry Wire Line
	12650 3000 12750 2900
Wire Wire Line
	2450 3200 3450 3200
Wire Wire Line
	2450 7250 3450 7250
Wire Wire Line
	2750 2700 3550 2700
Wire Wire Line
	2750 2800 3550 2800
Wire Wire Line
	2750 2900 3550 2900
Wire Wire Line
	2750 3000 3550 3000
Wire Wire Line
	2750 3750 3550 3750
Wire Wire Line
	2750 3850 3550 3850
Wire Wire Line
	2750 3950 3550 3950
Wire Wire Line
	2750 4050 3550 4050
Wire Wire Line
	2750 4850 3550 4850
Wire Wire Line
	2750 6100 3550 6100
Wire Wire Line
	2750 6750 3550 6750
Wire Wire Line
	2750 6850 3550 6850
Wire Wire Line
	2750 6950 3550 6950
Wire Wire Line
	2750 7050 3550 7050
Wire Wire Line
	2750 7800 3550 7800
Wire Wire Line
	2750 7900 3550 7900
Wire Wire Line
	2750 8000 3550 8000
Wire Wire Line
	2750 8100 3550 8100
Wire Wire Line
	3100 5600 4450 5600
Wire Wire Line
	3250 4350 3350 4350
Wire Wire Line
	3250 8400 3350 8400
Wire Wire Line
	3350 3300 3350 4350
Wire Wire Line
	3350 4350 3550 4350
Wire Wire Line
	3350 7350 3350 8400
Wire Wire Line
	3350 8400 3550 8400
Wire Wire Line
	3450 4250 3450 3200
Wire Wire Line
	3450 5050 3450 4250
Wire Wire Line
	3450 7250 3450 6300
Wire Wire Line
	3450 8300 3450 7250
Wire Wire Line
	3550 3200 3450 3200
Wire Wire Line
	3550 3300 3350 3300
Wire Wire Line
	3550 4250 3450 4250
Wire Wire Line
	3550 5050 3450 5050
Wire Wire Line
	3550 6300 3450 6300
Wire Wire Line
	3550 7250 3450 7250
Wire Wire Line
	3550 7350 3350 7350
Wire Wire Line
	3550 8300 3450 8300
Wire Wire Line
	4350 2700 4800 2700
Wire Wire Line
	4350 2800 4800 2800
Wire Wire Line
	4350 2900 4800 2900
Wire Wire Line
	4350 3000 4800 3000
Wire Wire Line
	4350 3750 4550 3750
Wire Wire Line
	4350 3850 4550 3850
Wire Wire Line
	4350 3950 4550 3950
Wire Wire Line
	4350 4050 4550 4050
Wire Wire Line
	4350 6750 4550 6750
Wire Wire Line
	4350 6850 4550 6850
Wire Wire Line
	4350 6950 4550 6950
Wire Wire Line
	4350 7050 4550 7050
Wire Wire Line
	4350 7800 4550 7800
Wire Wire Line
	4350 7900 4550 7900
Wire Wire Line
	4350 8000 4550 8000
Wire Wire Line
	4350 8100 4550 8100
Wire Wire Line
	4450 4200 4550 4200
Wire Wire Line
	4450 5600 4450 4200
Wire Wire Line
	4450 5600 4450 6400
Wire Wire Line
	4450 6400 5050 6400
Wire Wire Line
	4450 7200 4450 6400
Wire Wire Line
	4450 7200 4550 7200
Wire Wire Line
	4450 8250 4450 7200
Wire Wire Line
	4550 8250 4450 8250
Wire Wire Line
	4650 4950 4050 4950
Wire Wire Line
	4650 6200 4050 6200
Wire Wire Line
	4950 5050 5150 5050
Wire Wire Line
	4950 6300 5050 6300
Wire Wire Line
	5050 4950 5950 4950
Wire Wire Line
	5050 6200 5800 6200
Wire Wire Line
	5050 6400 5050 6300
Wire Wire Line
	5150 5600 4450 5600
Wire Wire Line
	5150 5600 5150 5050
Wire Wire Line
	5550 3750 5950 3750
Wire Wire Line
	5550 3850 5950 3850
Wire Wire Line
	5550 3950 5950 3950
Wire Wire Line
	5550 4050 5950 4050
Wire Wire Line
	5550 6750 5800 6750
Wire Wire Line
	5550 6850 5800 6850
Wire Wire Line
	5550 6950 5800 6950
Wire Wire Line
	5550 7050 5800 7050
Wire Wire Line
	5550 7800 5800 7800
Wire Wire Line
	5550 7900 5800 7900
Wire Wire Line
	5550 8000 5800 8000
Wire Wire Line
	5550 8100 5800 8100
Wire Wire Line
	7850 4850 7650 4850
Wire Wire Line
	7850 7450 7850 4850
Wire Wire Line
	8450 7450 7850 7450
Wire Wire Line
	9000 4800 9950 4800
Wire Wire Line
	9000 7400 10050 7400
Wire Wire Line
	9150 4050 9150 7300
Wire Wire Line
	9150 7300 10150 7300
Wire Wire Line
	9250 4150 9250 6500
Wire Wire Line
	9250 6500 10150 6500
Wire Wire Line
	9350 4250 9350 5700
Wire Wire Line
	9350 5700 10150 5700
Wire Wire Line
	9450 4350 14250 4350
Wire Wire Line
	9450 4900 9450 4350
Wire Wire Line
	9500 6300 10150 6300
Wire Wire Line
	9500 5500 10150 5500
Wire Wire Line
	9550 4700 10200 4700
Wire Wire Line
	9500 7100 10150 7100
Wire Wire Line
	9950 4800 10200 4800
Wire Wire Line
	9950 5600 9950 4800
Wire Wire Line
	9950 6400 9950 5600
Wire Wire Line
	9950 6400 9950 7200
Wire Wire Line
	10050 5000 10200 5000
Wire Wire Line
	10050 5800 10050 5000
Wire Wire Line
	10050 6600 10050 5800
Wire Wire Line
	10050 7400 10050 6600
Wire Wire Line
	10150 5600 9950 5600
Wire Wire Line
	10150 5800 10050 5800
Wire Wire Line
	10150 6400 9950 6400
Wire Wire Line
	10150 6600 10050 6600
Wire Wire Line
	10150 7200 9950 7200
Wire Wire Line
	10150 7400 10050 7400
Wire Wire Line
	10200 4900 9450 4900
Wire Wire Line
	10700 3250 10800 3250
Wire Wire Line
	10700 3650 10700 3250
Wire Wire Line
	10700 3750 10700 3650
Wire Wire Line
	10700 3750 10800 3750
Wire Wire Line
	10800 3650 10700 3650
Wire Wire Line
	11000 5650 11200 5650
Wire Wire Line
	11000 6450 11200 6450
Wire Wire Line
	11000 7250 11200 7250
Wire Wire Line
	11050 4850 11250 4850
Wire Wire Line
	11100 5050 11250 5050
Wire Wire Line
	11100 5850 11100 5050
Wire Wire Line
	11100 6650 11100 5850
Wire Wire Line
	11100 6650 11200 6650
Wire Wire Line
	11100 7450 11100 6650
Wire Wire Line
	11100 7450 11100 7700
Wire Wire Line
	11100 7700 11000 7700
Wire Wire Line
	11200 5850 11100 5850
Wire Wire Line
	11200 7450 11100 7450
Wire Wire Line
	11350 3700 12750 3700
Wire Wire Line
	11400 3250 12800 3250
Wire Wire Line
	11700 6450 12400 6450
Wire Wire Line
	11700 6550 12000 6550
Wire Wire Line
	11700 7250 12300 7250
Wire Wire Line
	11700 7350 12100 7350
Wire Wire Line
	11750 4850 12600 4850
Wire Wire Line
	11750 4950 11800 4950
Wire Wire Line
	11800 2700 11800 4950
Wire Wire Line
	11900 2800 11900 5750
Wire Wire Line
	11900 5750 11700 5750
Wire Wire Line
	12000 6550 12000 2900
Wire Wire Line
	12100 3000 12100 7350
Wire Wire Line
	12300 4600 12300 6750
Wire Wire Line
	12300 6750 12300 7050
Wire Wire Line
	12300 6750 13600 6750
Wire Wire Line
	12300 7050 12300 7250
Wire Wire Line
	12300 7250 12300 7800
Wire Wire Line
	12400 4600 12400 6050
Wire Wire Line
	12400 6050 12400 6350
Wire Wire Line
	12400 6050 13600 6050
Wire Wire Line
	12400 6350 12400 6450
Wire Wire Line
	12400 6450 12400 7150
Wire Wire Line
	12400 7150 12400 7800
Wire Wire Line
	12500 4600 12500 5450
Wire Wire Line
	12500 5450 12500 5650
Wire Wire Line
	12500 5450 13600 5450
Wire Wire Line
	12500 5650 11700 5650
Wire Wire Line
	12500 5650 12500 5750
Wire Wire Line
	12500 5750 12500 6450
Wire Wire Line
	12500 6450 12500 7250
Wire Wire Line
	12500 7250 12500 7800
Wire Wire Line
	12600 4600 12600 4850
Wire Wire Line
	12600 4850 12600 5250
Wire Wire Line
	12600 5250 12600 5850
Wire Wire Line
	12600 5850 12600 6550
Wire Wire Line
	12600 6550 12600 7350
Wire Wire Line
	12600 7350 12600 7800
Wire Wire Line
	12750 3700 12750 4750
Wire Wire Line
	12750 4750 12750 5350
Wire Wire Line
	12750 4750 13600 4750
Wire Wire Line
	12750 5350 12750 5950
Wire Wire Line
	12750 5350 12850 5350
Wire Wire Line
	12750 5950 12750 6650
Wire Wire Line
	12750 5950 12850 5950
Wire Wire Line
	12750 6650 12750 7800
Wire Wire Line
	12750 6650 12850 6650
Wire Wire Line
	12800 3250 12800 7450
Wire Wire Line
	12800 7450 12850 7450
Wire Wire Line
	12850 5250 12600 5250
Wire Wire Line
	12850 5750 12500 5750
Wire Wire Line
	12850 5850 12600 5850
Wire Wire Line
	12850 6350 12400 6350
Wire Wire Line
	12850 6450 12500 6450
Wire Wire Line
	12850 6550 12600 6550
Wire Wire Line
	12850 7050 12300 7050
Wire Wire Line
	12850 7150 12400 7150
Wire Wire Line
	12850 7250 12500 7250
Wire Wire Line
	12850 7350 12600 7350
Wire Wire Line
	13400 5300 13400 5350
Wire Wire Line
	13400 5350 13600 5350
Wire Wire Line
	13450 5950 13450 5850
Wire Wire Line
	13450 6650 13450 6500
Wire Wire Line
	13600 4850 12600 4850
Wire Wire Line
	13600 5950 13450 5950
Wire Wire Line
	13600 6650 13450 6650
Wire Wire Line
	14150 5400 14350 5400
Wire Wire Line
	14150 6000 14450 6000
Wire Wire Line
	14150 6700 14550 6700
Wire Wire Line
	14250 4350 14250 4800
Wire Wire Line
	14250 4800 14150 4800
Wire Wire Line
	14350 4250 9350 4250
Wire Wire Line
	14350 5400 14350 4250
Wire Wire Line
	14450 4150 9250 4150
Wire Wire Line
	14450 6000 14450 4150
Wire Wire Line
	14550 4050 9150 4050
Wire Wire Line
	14550 4050 14550 6700
Wire Bus Line
	2650 2450 2550 2450
Wire Bus Line
	5900 7500 6050 7500
Wire Bus Line
	6050 5150 6150 5150
Wire Bus Line
	12750 2500 12850 2500
Text Notes 1850 5600 0    50   ~ 0
0 if 16-17 MOD32
Text Notes 3350 5500 0    197  ~ 0
STAR1
Text Notes 8200 7850 0    197  ~ 0
STAR1[5..8] X
Text Notes 10050 3950 0    50   ~ 0
0 if column is 16-17 MOD32
Text Label 3250 2700 2    50   ~ 0
BUS-DATA8
Text Label 3250 2800 2    50   ~ 0
BUS-DATA7
Text Label 3250 2900 2    50   ~ 0
BUS-DATA6
Text Label 3250 3000 2    50   ~ 0
BUS-DATA5
Text Label 3250 3750 2    50   ~ 0
BUS-DATA4
Text Label 3250 3850 2    50   ~ 0
BUS-DATA3
Text Label 3250 3950 2    50   ~ 0
BUS-DATA2
Text Label 3250 4050 2    50   ~ 0
BUS-DATA1
Text Label 3250 4850 2    50   ~ 0
BUS-DATA0
Text Label 3250 6100 2    50   ~ 0
BUS-DATA8
Text Label 3250 6750 2    50   ~ 0
BUS-DATA7
Text Label 3250 6850 2    50   ~ 0
BUS-DATA6
Text Label 3250 6950 2    50   ~ 0
BUS-DATA5
Text Label 3250 7050 2    50   ~ 0
BUS-DATA4
Text Label 3250 7800 2    50   ~ 0
BUS-DATA3
Text Label 3250 7900 2    50   ~ 0
BUS-DATA2
Text Label 3250 8000 2    50   ~ 0
BUS-DATA1
Text Label 3250 8100 2    50   ~ 0
BUS-DATA0
Text Label 4400 2700 0    50   ~ 0
STAR-X8
Text Label 4400 2800 0    50   ~ 0
STAR-X7
Text Label 4400 2900 0    50   ~ 0
STAR-X6
Text Label 4400 3000 0    50   ~ 0
STAR-X5
Text Label 5600 3750 0    50   ~ 0
XSHIFT4
Text Label 5600 3850 0    50   ~ 0
XSHIFT3
Text Label 5600 3950 0    50   ~ 0
XSHIFT2
Text Label 5600 4050 0    50   ~ 0
XSHIFT1
Text Label 5600 4950 0    50   ~ 0
XSHIFT0
Text Label 5600 6200 0    50   ~ 0
Y8
Text Label 5600 6750 0    50   ~ 0
Y7
Text Label 5600 6850 0    50   ~ 0
Y6
Text Label 5600 6950 0    50   ~ 0
Y5
Text Label 5600 7050 0    50   ~ 0
Y4
Text Label 5600 7800 0    50   ~ 0
Y3
Text Label 5600 7900 0    50   ~ 0
Y2
Text Label 5600 8000 0    50   ~ 0
Y1
Text Label 5600 8100 0    50   ~ 0
Y0
Text Label 9500 6300 0    50   ~ 0
STAR-X7
Text Label 9500 5500 0    50   ~ 0
STAR-X6
Text Label 9550 4700 0    50   ~ 0
STAR-X5
Text Label 9500 7100 0    50   ~ 0
STAR-X8
Text Label 12550 3000 2    50   ~ 0
STAR1-X3
Text Label 12550 2900 2    50   ~ 0
STAR1-X2
Text Label 12550 2800 2    50   ~ 0
STAR1-X1
Text Label 12550 2700 2    50   ~ 0
STAR1-X0
Text HLabel 1900 3150 0    50   Input ~ 0
~STAR1-X
Text HLabel 1900 3250 0    50   Input ~ 0
~CLK4M
Text HLabel 1900 7200 0    50   Input ~ 0
~STAR1-Y
Text HLabel 1900 7300 0    50   Input ~ 0
~CLK4M
Text HLabel 2550 2450 0    50   Input ~ 0
BUS-DATA[0..8]
Text HLabel 3100 5600 0    50   Input ~ 0
~STAR1-T
Text HLabel 6050 7500 2    50   3State ~ 0
Y[0..8]
Text HLabel 6150 5150 2    50   3State ~ 0
XSHIFT[0..4]
Text HLabel 7650 4850 0    50   Input ~ 0
~LI
Text HLabel 10100 3250 0    50   Input ~ 0
~STAR1-T
Text HLabel 11000 7700 0    50   Input ~ 0
~CLK4M
Text HLabel 12850 2500 2    50   Output ~ 0
STAR1-X[0..3]
$Comp
L power:VCC #PWR0200
U 1 1 6EE189AB
P 3250 4350
F 0 "#PWR0200" H 3250 4200 50  0001 C CNN
F 1 "VCC" H 3265 4523 50  0000 C CNN
F 2 "" H 3250 4350 50  0001 C CNN
F 3 "" H 3250 4350 50  0001 C CNN
	1    3250 4350
	1    0    0    -1  
$EndComp
$Comp
L power:VCC #PWR0201
U 1 1 71BE5FED
P 3250 8400
F 0 "#PWR0201" H 3250 8250 50  0001 C CNN
F 1 "VCC" H 3265 8573 50  0000 C CNN
F 2 "" H 3250 8400 50  0001 C CNN
F 3 "" H 3250 8400 50  0001 C CNN
	1    3250 8400
	1    0    0    -1  
$EndComp
$Comp
L power:VCC #PWR0206
U 1 1 67B6C1E5
P 8450 4750
F 0 "#PWR0206" H 8450 4600 50  0001 C CNN
F 1 "VCC" H 8465 4923 50  0000 C CNN
F 2 "" H 8450 4750 50  0001 C CNN
F 3 "" H 8450 4750 50  0001 C CNN
	1    8450 4750
	1    0    0    -1  
$EndComp
$Comp
L power:VCC #PWR0207
U 1 1 67B6C1EB
P 8450 7350
F 0 "#PWR0207" H 8450 7200 50  0001 C CNN
F 1 "VCC" H 8465 7523 50  0000 C CNN
F 2 "" H 8450 7350 50  0001 C CNN
F 3 "" H 8450 7350 50  0001 C CNN
	1    8450 7350
	1    0    0    -1  
$EndComp
$Comp
L A5C:TINVBF UEJ96
U 1 1 6EE1899C
P 4850 4950
AR Path="/611CB236/6EE1899C" Ref="UEJ96"  Part="1" 
AR Path="/612D3239/612D3C64/6EE1899C" Ref="UEJ96"  Part="1" 
F 0 "UEJ96" H 4850 5215 50  0000 C CNN
F 1 "TINVBF" H 4850 5124 50  0000 C CNN
F 2 "" H 4350 4900 50  0001 C CNN
F 3 "" H 4350 4900 50  0001 C CNN
	1    4850 4950
	1    0    0    -1  
$EndComp
$Comp
L A5C:TINVBF UEJ86
U 1 1 71BE5FC2
P 4850 6200
AR Path="/611CB236/71BE5FC2" Ref="UEJ86"  Part="1" 
AR Path="/612D3239/612D3C64/71BE5FC2" Ref="UEJ86"  Part="1" 
F 0 "UEJ86" H 4850 6465 50  0000 C CNN
F 1 "TINVBF" H 4850 6374 50  0000 C CNN
F 2 "" H 4350 6150 50  0001 C CNN
F 3 "" H 4350 6150 50  0001 C CNN
	1    4850 6200
	1    0    0    -1  
$EndComp
$Comp
L A5C:OR02 UEK191
U 1 1 6EE1895E
P 2150 3200
AR Path="/611CB236/6EE1895E" Ref="UEK191"  Part="1" 
AR Path="/612D3239/612D3C64/6EE1895E" Ref="UEK191"  Part="1" 
F 0 "UEK191" H 2175 3467 50  0000 C CNN
F 1 "OR02" H 2175 3376 50  0000 C CNN
F 2 "" H 2200 3200 50  0001 C CNN
F 3 "" H 2200 3200 50  0001 C CNN
	1    2150 3200
	1    0    0    -1  
$EndComp
$Comp
L A5C:OR02 UEA149
U 1 1 71BE5F90
P 2150 7250
AR Path="/611CB236/71BE5F90" Ref="UEA149"  Part="1" 
AR Path="/612D3239/612D3C64/71BE5F90" Ref="UEA149"  Part="1" 
F 0 "UEA149" H 2175 7517 50  0000 C CNN
F 1 "OR02" H 2175 7426 50  0000 C CNN
F 2 "" H 2200 7250 50  0001 C CNN
F 3 "" H 2200 7250 50  0001 C CNN
	1    2150 7250
	1    0    0    -1  
$EndComp
$Comp
L A5C:AND02 UED70
U 1 1 67B6C1D9
P 8700 4800
AR Path="/611CB236/67B6C1D9" Ref="UED70"  Part="1" 
AR Path="/612D3239/612D3C64/67B6C1D9" Ref="UED70"  Part="1" 
F 0 "UED70" H 8725 5067 50  0000 C CNN
F 1 "AND02" H 8725 4976 50  0000 C CNN
F 2 "" H 8700 4800 50  0001 C CNN
F 3 "" H 8700 4800 50  0001 C CNN
	1    8700 4800
	1    0    0    -1  
$EndComp
$Comp
L A5C:AND02 UEC107
U 1 1 67B6C1DF
P 8700 7400
AR Path="/611CB236/67B6C1DF" Ref="UEC107"  Part="1" 
AR Path="/612D3239/612D3C64/67B6C1DF" Ref="UEC107"  Part="1" 
F 0 "UEC107" H 8725 7667 50  0000 C CNN
F 1 "AND02" H 8725 7576 50  0000 C CNN
F 2 "" H 8700 7400 50  0001 C CNN
F 3 "" H 8700 7400 50  0001 C CNN
	1    8700 7400
	1    0    0    -1  
$EndComp
$Comp
L A5C:NAND02 UED142
U 1 1 67B6C15C
P 11050 3700
AR Path="/611CB236/67B6C15C" Ref="UED142"  Part="1" 
AR Path="/612D3239/612D3C64/67B6C15C" Ref="UED142"  Part="1" 
F 0 "UED142" H 11075 3967 50  0000 C CNN
F 1 "NAND02" H 11075 3876 50  0000 C CNN
F 2 "" H 11050 3700 50  0001 C CNN
F 3 "" H 11050 3700 50  0001 C CNN
	1    11050 3700
	1    0    0    -1  
$EndComp
$Comp
L A5C:NOR02 UEC117
U 1 1 67B6C162
P 13100 5300
AR Path="/611CB236/67B6C162" Ref="UEC117"  Part="1" 
AR Path="/612D3239/612D3C64/67B6C162" Ref="UEC117"  Part="1" 
F 0 "UEC117" H 13125 5567 50  0000 C CNN
F 1 "NOR02" H 13125 5476 50  0000 C CNN
F 2 "" H 13100 5300 50  0001 C CNN
F 3 "" H 13100 5300 50  0001 C CNN
	1    13100 5300
	1    0    0    -1  
$EndComp
$Comp
L A5C:XOR02 UEC110
U 1 1 67B6C168
P 13850 4800
AR Path="/611CB236/67B6C168" Ref="UEC110"  Part="1" 
AR Path="/612D3239/612D3C64/67B6C168" Ref="UEC110"  Part="1" 
F 0 "UEC110" H 13875 5067 50  0000 C CNN
F 1 "XOR02" H 13875 4976 50  0000 C CNN
F 2 "" H 13850 4800 50  0001 C CNN
F 3 "" H 13850 4800 50  0001 C CNN
	1    13850 4800
	1    0    0    -1  
$EndComp
$Comp
L A5C:XNOR02 UEC113
U 1 1 67B6C16E
P 13850 5400
AR Path="/611CB236/67B6C16E" Ref="UEC113"  Part="1" 
AR Path="/612D3239/612D3C64/67B6C16E" Ref="UEC113"  Part="1" 
F 0 "UEC113" H 13875 5667 50  0000 C CNN
F 1 "XNOR02" H 13875 5576 50  0000 C CNN
F 2 "" H 13875 5400 50  0001 C CNN
F 3 "" H 13875 5400 50  0001 C CNN
	1    13850 5400
	1    0    0    -1  
$EndComp
$Comp
L A5C:XNOR02 UEC121
U 1 1 67B6C174
P 13850 6000
AR Path="/611CB236/67B6C174" Ref="UEC121"  Part="1" 
AR Path="/612D3239/612D3C64/67B6C174" Ref="UEC121"  Part="1" 
F 0 "UEC121" H 13875 6267 50  0000 C CNN
F 1 "XNOR02" H 13875 6176 50  0000 C CNN
F 2 "" H 13875 6000 50  0001 C CNN
F 3 "" H 13875 6000 50  0001 C CNN
	1    13850 6000
	1    0    0    -1  
$EndComp
$Comp
L A5C:XNOR02 UED124
U 1 1 67B6C1CF
P 13850 6700
AR Path="/611CB236/67B6C1CF" Ref="UED124"  Part="1" 
AR Path="/612D3239/612D3C64/67B6C1CF" Ref="UED124"  Part="1" 
F 0 "UED124" H 13875 6967 50  0000 C CNN
F 1 "XNOR02" H 13875 6876 50  0000 C CNN
F 2 "" H 13875 6700 50  0001 C CNN
F 3 "" H 13875 6700 50  0001 C CNN
	1    13850 6700
	1    0    0    -1  
$EndComp
$Comp
L A5C:INV01 UEI69
U 1 1 67B6C1F1
P 8150 4850
AR Path="/611CB236/67B6C1F1" Ref="UEI69"  Part="1" 
AR Path="/612D3239/612D3C64/67B6C1F1" Ref="UEI69"  Part="1" 
F 0 "UEI69" H 8150 5167 50  0000 C CNN
F 1 "INV01" H 8150 5076 50  0000 C CNN
F 2 "" H 8150 4650 50  0001 C CNN
F 3 "" H 8150 4650 50  0001 C CNN
	1    8150 4850
	1    0    0    -1  
$EndComp
$Comp
L A5C:INV01 UEI153
U 1 1 67B6C1C9
P 10400 3250
AR Path="/611CB236/67B6C1C9" Ref="UEI153"  Part="1" 
AR Path="/612D3239/612D3C64/67B6C1C9" Ref="UEI153"  Part="1" 
F 0 "UEI153" H 10400 3567 50  0000 C CNN
F 1 "INV01" H 10400 3476 50  0000 C CNN
F 2 "" H 10400 3050 50  0001 C CNN
F 3 "" H 10400 3050 50  0001 C CNN
	1    10400 3250
	1    0    0    -1  
$EndComp
$Comp
L A5C:INV01 UEG144
U 1 1 67B6C17A
P 11100 3250
AR Path="/611CB236/67B6C17A" Ref="UEG144"  Part="1" 
AR Path="/612D3239/612D3C64/67B6C17A" Ref="UEG144"  Part="1" 
F 0 "UEG144" H 11100 3567 50  0000 C CNN
F 1 "INV01" H 11100 3476 50  0000 C CNN
F 2 "" H 11100 3050 50  0001 C CNN
F 3 "" H 11100 3050 50  0001 C CNN
	1    11100 3250
	1    0    0    -1  
$EndComp
$Comp
L A5C:NOR03 UEC138
U 1 1 67B6C180
P 13150 5850
AR Path="/611CB236/67B6C180" Ref="UEC138"  Part="1" 
AR Path="/612D3239/612D3C64/67B6C180" Ref="UEC138"  Part="1" 
F 0 "UEC138" H 13150 6167 50  0000 C CNN
F 1 "NOR03" H 13150 6076 50  0000 C CNN
F 2 "" H 13150 5850 50  0001 C CNN
F 3 "" H 13150 5850 50  0001 C CNN
	1    13150 5850
	1    0    0    -1  
$EndComp
$Comp
L A5C:DFFCOO UEK102
U 1 1 6EE18975
P 3800 4950
AR Path="/611CB236/6EE18975" Ref="UEK102"  Part="1" 
AR Path="/612D3239/612D3C64/6EE18975" Ref="UEK102"  Part="1" 
F 0 "UEK102" H 3800 5315 50  0000 C CNN
F 1 "DFFCOO" H 3800 5224 50  0000 C CNN
F 2 "" H 3800 4950 50  0001 C CNN
F 3 "" H 3800 4950 50  0001 C CNN
	1    3800 4950
	1    0    0    -1  
$EndComp
$Comp
L A5C:DFFCOO UEK111
U 1 1 71BE5F9D
P 3800 6200
AR Path="/611CB236/71BE5F9D" Ref="UEK111"  Part="1" 
AR Path="/612D3239/612D3C64/71BE5F9D" Ref="UEK111"  Part="1" 
F 0 "UEK111" H 3800 6565 50  0000 C CNN
F 1 "DFFCOO" H 3800 6474 50  0000 C CNN
F 2 "" H 3800 6200 50  0001 C CNN
F 3 "" H 3800 6200 50  0001 C CNN
	1    3800 6200
	1    0    0    -1  
$EndComp
$Comp
L A5C:DFFCOO UEG112
U 1 1 67B6C186
P 11450 5750
AR Path="/611CB236/67B6C186" Ref="UEG112"  Part="1" 
AR Path="/612D3239/612D3C64/67B6C186" Ref="UEG112"  Part="1" 
F 0 "UEG112" H 11450 6115 50  0000 C CNN
F 1 "DFFCOO" H 11450 6024 50  0000 C CNN
F 2 "" H 11450 5750 50  0001 C CNN
F 3 "" H 11450 5750 50  0001 C CNN
	1    11450 5750
	1    0    0    -1  
$EndComp
$Comp
L A5C:DFFCOO UEE122
U 1 1 67B6C18C
P 11450 6550
AR Path="/611CB236/67B6C18C" Ref="UEE122"  Part="1" 
AR Path="/612D3239/612D3C64/67B6C18C" Ref="UEE122"  Part="1" 
F 0 "UEE122" H 11450 6915 50  0000 C CNN
F 1 "DFFCOO" H 11450 6824 50  0000 C CNN
F 2 "" H 11450 6550 50  0001 C CNN
F 3 "" H 11450 6550 50  0001 C CNN
	1    11450 6550
	1    0    0    -1  
$EndComp
$Comp
L A5C:DFFCOO UEG116
U 1 1 67B6C198
P 11450 7350
AR Path="/611CB236/67B6C198" Ref="UEG116"  Part="1" 
AR Path="/612D3239/612D3C64/67B6C198" Ref="UEG116"  Part="1" 
F 0 "UEG116" H 11450 7715 50  0000 C CNN
F 1 "DFFCOO" H 11450 7624 50  0000 C CNN
F 2 "" H 11450 7350 50  0001 C CNN
F 3 "" H 11450 7350 50  0001 C CNN
	1    11450 7350
	1    0    0    -1  
$EndComp
$Comp
L A5C:DFFCOO UEE117
U 1 1 67B6C192
P 11500 4950
AR Path="/611CB236/67B6C192" Ref="UEE117"  Part="1" 
AR Path="/612D3239/612D3C64/67B6C192" Ref="UEE117"  Part="1" 
F 0 "UEE117" H 11500 5315 50  0000 C CNN
F 1 "DFFCOO" H 11500 5224 50  0000 C CNN
F 2 "" H 11500 4950 50  0001 C CNN
F 3 "" H 11500 4950 50  0001 C CNN
	1    11500 4950
	1    0    0    -1  
$EndComp
$Comp
L A5C:NOR04 UED126
U 1 1 67B6C19E
P 13150 6500
AR Path="/611CB236/67B6C19E" Ref="UED126"  Part="1" 
AR Path="/612D3239/612D3C64/67B6C19E" Ref="UED126"  Part="1" 
F 0 "UED126" H 13150 6842 50  0000 C CNN
F 1 "NOR04" H 13150 6751 50  0000 C CNN
F 2 "" H 13150 6500 50  0001 C CNN
F 3 "" H 13150 6500 50  0001 C CNN
	1    13150 6500
	1    0    0    -1  
$EndComp
$Comp
L A5C:AOI22 UEC105
U 1 1 67B6C1A4
P 10550 5600
AR Path="/611CB236/67B6C1A4" Ref="UEC105"  Part="1" 
AR Path="/612D3239/612D3C64/67B6C1A4" Ref="UEC105"  Part="1" 
F 0 "UEC105" H 10575 5917 50  0000 C CNN
F 1 "AOI22" H 10575 5826 50  0000 C CNN
F 2 "" H 10700 5600 50  0001 C CNN
F 3 "" H 10700 5600 50  0001 C CNN
	1    10550 5600
	1    0    0    -1  
$EndComp
$Comp
L A5C:AOI22 UEC102
U 1 1 67B6C1AA
P 10550 6400
AR Path="/611CB236/67B6C1AA" Ref="UEC102"  Part="1" 
AR Path="/612D3239/612D3C64/67B6C1AA" Ref="UEC102"  Part="1" 
F 0 "UEC102" H 10575 6717 50  0000 C CNN
F 1 "AOI22" H 10575 6626 50  0000 C CNN
F 2 "" H 10700 6400 50  0001 C CNN
F 3 "" H 10700 6400 50  0001 C CNN
	1    10550 6400
	1    0    0    -1  
$EndComp
$Comp
L A5C:AOI22 UED106
U 1 1 67B6C1B6
P 10550 7200
AR Path="/611CB236/67B6C1B6" Ref="UED106"  Part="1" 
AR Path="/612D3239/612D3C64/67B6C1B6" Ref="UED106"  Part="1" 
F 0 "UED106" H 10575 7517 50  0000 C CNN
F 1 "AOI22" H 10575 7426 50  0000 C CNN
F 2 "" H 10700 7200 50  0001 C CNN
F 3 "" H 10700 7200 50  0001 C CNN
	1    10550 7200
	1    0    0    -1  
$EndComp
$Comp
L A5C:AOI22 UED111
U 1 1 67B6C1B0
P 10600 4800
AR Path="/611CB236/67B6C1B0" Ref="UED111"  Part="1" 
AR Path="/612D3239/612D3C64/67B6C1B0" Ref="UED111"  Part="1" 
F 0 "UED111" H 10625 5117 50  0000 C CNN
F 1 "AOI22" H 10625 5026 50  0000 C CNN
F 2 "" H 10750 4800 50  0001 C CNN
F 3 "" H 10750 4800 50  0001 C CNN
	1    10600 4800
	1    0    0    -1  
$EndComp
$Comp
L A5C:NOR05 UEG135
U 1 1 67B6C1BC
P 13150 7250
AR Path="/611CB236/67B6C1BC" Ref="UEG135"  Part="1" 
AR Path="/612D3239/612D3C64/67B6C1BC" Ref="UEG135"  Part="1" 
F 0 "UEG135" H 13225 7665 50  0000 C CNN
F 1 "NOR05" H 13225 7574 50  0000 C CNN
F 2 "" H 13150 7300 50  0001 C CNN
F 3 "" H 13150 7300 50  0001 C CNN
	1    13150 7250
	1    0    0    -1  
$EndComp
$Comp
L A5C:M175C UEE92
U 1 1 6EE18966
P 3950 3000
AR Path="/611CB236/6EE18966" Ref="UEE92"  Part="1" 
AR Path="/612D3239/612D3C64/6EE18966" Ref="UEE92"  Part="1" 
F 0 "UEE92" H 3950 3565 50  0000 C CNN
F 1 "M175C" H 3950 3474 50  0000 C CNN
F 2 "" H 3950 2800 50  0001 C CNN
F 3 "" H 3950 2800 50  0001 C CNN
	1    3950 3000
	1    0    0    -1  
$EndComp
$Comp
L A5C:M175CL UEJ110
U 1 1 6EE18981
P 3950 4050
AR Path="/611CB236/6EE18981" Ref="UEJ110"  Part="1" 
AR Path="/612D3239/612D3C64/6EE18981" Ref="UEJ110"  Part="1" 
F 0 "UEJ110" H 3950 4615 50  0000 C CNN
F 1 "M175CL" H 3950 4524 50  0000 C CNN
F 2 "" H 3950 3850 50  0001 C CNN
F 3 "" H 3950 3850 50  0001 C CNN
	1    3950 4050
	1    0    0    -1  
$EndComp
$Comp
L A5C:M175CL UEI129
U 1 1 71BE5FD3
P 3950 7050
AR Path="/611CB236/71BE5FD3" Ref="UEI129"  Part="1" 
AR Path="/612D3239/612D3C64/71BE5FD3" Ref="UEI129"  Part="1" 
F 0 "UEI129" H 3950 7615 50  0000 C CNN
F 1 "M175CL" H 3950 7524 50  0000 C CNN
F 2 "" H 3950 6850 50  0001 C CNN
F 3 "" H 3950 6850 50  0001 C CNN
	1    3950 7050
	1    0    0    -1  
$EndComp
$Comp
L A5C:M175CL UEK122
U 1 1 71BE5FA8
P 3950 8100
AR Path="/611CB236/71BE5FA8" Ref="UEK122"  Part="1" 
AR Path="/612D3239/612D3C64/71BE5FA8" Ref="UEK122"  Part="1" 
F 0 "UEK122" H 3950 8665 50  0000 C CNN
F 1 "M175CL" H 3950 8574 50  0000 C CNN
F 2 "" H 3950 7900 50  0001 C CNN
F 3 "" H 3950 7900 50  0001 C CNN
	1    3950 8100
	1    0    0    -1  
$EndComp
$Comp
L A5C:M368C UCC?
U 1 1 6EE18992
P 5050 4000
AR Path="/604B5523/6EE18992" Ref="UCC?"  Part="1" 
AR Path="/6EE18992" Ref="UEJ98"  Part="1" 
AR Path="/60DE1519/6EE18992" Ref="UEJ98"  Part="1" 
AR Path="/611CB236/6EE18992" Ref="UEJ98"  Part="1" 
AR Path="/612D3239/612D3C64/6EE18992" Ref="UEJ98"  Part="1" 
F 0 "UEJ98" H 5050 4510 50  0000 C CNN
F 1 "M368C" H 5050 4420 50  0000 C CNN
F 2 "" H 5350 3800 50  0001 C CNN
F 3 "" H 5350 3800 50  0001 C CNN
	1    5050 4000
	1    0    0    -1  
$EndComp
$Comp
L A5C:M368C UEJ?
U 1 1 71BE5FD9
P 5050 7000
AR Path="/604B5523/71BE5FD9" Ref="UEJ?"  Part="1" 
AR Path="/71BE5FD9" Ref="UEI122"  Part="1" 
AR Path="/60DE1519/71BE5FD9" Ref="UEI122"  Part="1" 
AR Path="/611CB236/71BE5FD9" Ref="UEI122"  Part="1" 
AR Path="/612D3239/612D3C64/71BE5FD9" Ref="UEI122"  Part="1" 
F 0 "UEI122" H 5050 7510 50  0000 C CNN
F 1 "M368C" H 5050 7420 50  0000 C CNN
F 2 "" H 5350 6800 50  0001 C CNN
F 3 "" H 5350 6800 50  0001 C CNN
	1    5050 7000
	1    0    0    -1  
$EndComp
$Comp
L A5C:M368C UEJ?
U 1 1 71BE5FB8
P 5050 8050
AR Path="/604B5523/71BE5FB8" Ref="UEJ?"  Part="1" 
AR Path="/71BE5FB8" Ref="UEJ133"  Part="1" 
AR Path="/60DE1519/71BE5FB8" Ref="UEJ133"  Part="1" 
AR Path="/611CB236/71BE5FB8" Ref="UEJ133"  Part="1" 
AR Path="/612D3239/612D3C64/71BE5FB8" Ref="UEJ133"  Part="1" 
F 0 "UEJ133" H 5050 8560 50  0000 C CNN
F 1 "M368C" H 5050 8470 50  0000 C CNN
F 2 "" H 5350 7850 50  0001 C CNN
F 3 "" H 5350 7850 50  0001 C CNN
	1    5050 8050
	1    0    0    -1  
$EndComp
Wire Wire Line
	11800 2700 12650 2700
Wire Wire Line
	11900 2800 12650 2800
Wire Wire Line
	12000 2900 12650 2900
Wire Wire Line
	12100 3000 12650 3000
Wire Bus Line
	12750 2500 12750 2900
Wire Bus Line
	5900 6300 5900 7500
Wire Bus Line
	5900 7500 5900 8000
Wire Bus Line
	6050 3850 6050 5150
Wire Bus Line
	2650 2450 2650 8000
$EndSCHEMATC
