EESchema Schematic File Version 4
EELAYER 30 0
EELAYER END
$Descr A4 11693 8268
encoding utf-8
Sheet 45 83
Title "CPS Reverse Engineering: DL-0311"
Date "2021-09-12"
Rev ""
Comp ""
Comment1 ""
Comment2 ""
Comment3 "Licence: CC-BY"
Comment4 "Author: Loïc *WydD* Petit"
$EndDescr
Connection ~ 3200 5050
Connection ~ 3200 4150
Connection ~ 3200 2350
Connection ~ 3200 3250
Connection ~ 3200 5950
Connection ~ 7600 5950
Connection ~ 7600 5050
Connection ~ 7600 4150
Connection ~ 7600 3250
Connection ~ 7600 2350
NoConn ~ 4300 2200
NoConn ~ 8700 2200
Entry Wire Line
	2450 900  2550 1000
Entry Wire Line
	2450 1000 2550 1100
Entry Wire Line
	2450 1100 2550 1200
Entry Wire Line
	2450 1200 2550 1300
Entry Wire Line
	2450 1800 2550 1900
Entry Wire Line
	2450 1900 2550 2000
Entry Wire Line
	2450 2000 2550 2100
Entry Wire Line
	2550 2800 2450 2900
Entry Wire Line
	2550 2900 2450 3000
Entry Wire Line
	2550 3000 2450 3100
Entry Wire Line
	2550 3100 2450 3200
Entry Wire Line
	2550 3700 2450 3800
Entry Wire Line
	2550 3800 2450 3900
Entry Wire Line
	2550 3900 2450 4000
Entry Wire Line
	2550 4000 2450 4100
Entry Wire Line
	2550 4600 2450 4700
Entry Wire Line
	2550 4700 2450 4800
Entry Wire Line
	2550 4800 2450 4900
Entry Wire Line
	2550 4900 2450 5000
Entry Wire Line
	2550 5500 2450 5600
Entry Wire Line
	2550 5600 2450 5700
Entry Wire Line
	2550 5700 2450 5800
Entry Wire Line
	2550 5800 2450 5900
Entry Wire Line
	4850 1000 4950 1100
Entry Wire Line
	4850 1100 4950 1200
Entry Wire Line
	4850 1200 4950 1300
Entry Wire Line
	4850 1300 4950 1400
Entry Wire Line
	4850 1900 4950 2000
Entry Wire Line
	4850 2000 4950 2100
Entry Wire Line
	4850 2100 4950 2200
Entry Wire Line
	4850 2800 4950 2900
Entry Wire Line
	4850 2900 4950 3000
Entry Wire Line
	4850 3000 4950 3100
Entry Wire Line
	4850 3100 4950 3200
Entry Wire Line
	4850 3700 4950 3800
Entry Wire Line
	4850 3800 4950 3900
Entry Wire Line
	4850 3900 4950 4000
Entry Wire Line
	4850 4000 4950 4100
Entry Wire Line
	4850 4600 4950 4700
Entry Wire Line
	4850 4700 4950 4800
Entry Wire Line
	4850 4800 4950 4900
Entry Wire Line
	4850 4900 4950 5000
Entry Wire Line
	4850 5500 4950 5600
Entry Wire Line
	4850 5600 4950 5700
Entry Wire Line
	4850 5700 4950 5800
Entry Wire Line
	4850 5800 4950 5900
Entry Wire Line
	6850 900  6950 1000
Entry Wire Line
	6850 1000 6950 1100
Entry Wire Line
	6850 1100 6950 1200
Entry Wire Line
	6850 1200 6950 1300
Entry Wire Line
	6850 1800 6950 1900
Entry Wire Line
	6850 1900 6950 2000
Entry Wire Line
	6850 2000 6950 2100
Entry Wire Line
	6950 2800 6850 2900
Entry Wire Line
	6950 2900 6850 3000
Entry Wire Line
	6950 3000 6850 3100
Entry Wire Line
	6950 3100 6850 3200
Entry Wire Line
	6950 3700 6850 3800
Entry Wire Line
	6950 3800 6850 3900
Entry Wire Line
	6950 3900 6850 4000
Entry Wire Line
	6950 4000 6850 4100
Entry Wire Line
	6950 4600 6850 4700
Entry Wire Line
	6950 4700 6850 4800
Entry Wire Line
	6950 4800 6850 4900
Entry Wire Line
	6950 4900 6850 5000
Entry Wire Line
	6950 5500 6850 5600
Entry Wire Line
	6950 5600 6850 5700
Entry Wire Line
	6950 5700 6850 5800
Entry Wire Line
	6950 5800 6850 5900
Entry Wire Line
	9150 1000 9250 1100
Entry Wire Line
	9150 1100 9250 1200
Entry Wire Line
	9150 1200 9250 1300
Entry Wire Line
	9150 1300 9250 1400
Entry Wire Line
	9150 1900 9250 2000
Entry Wire Line
	9150 2000 9250 2100
Entry Wire Line
	9150 2100 9250 2200
Entry Wire Line
	9150 2800 9250 2900
Entry Wire Line
	9150 2900 9250 3000
Entry Wire Line
	9150 3000 9250 3100
Entry Wire Line
	9150 3100 9250 3200
Entry Wire Line
	9150 3700 9250 3800
Entry Wire Line
	9150 3800 9250 3900
Entry Wire Line
	9150 3900 9250 4000
Entry Wire Line
	9150 4000 9250 4100
Entry Wire Line
	9150 4600 9250 4700
Entry Wire Line
	9150 4700 9250 4800
Entry Wire Line
	9150 4800 9250 4900
Entry Wire Line
	9150 4900 9250 5000
Entry Wire Line
	9150 5500 9250 5600
Entry Wire Line
	9150 5600 9250 5700
Entry Wire Line
	9150 5700 9250 5800
Entry Wire Line
	9150 5800 9250 5900
Wire Wire Line
	2550 1000 3300 1000
Wire Wire Line
	2550 1100 3300 1100
Wire Wire Line
	2550 1200 3300 1200
Wire Wire Line
	2550 1300 3300 1300
Wire Wire Line
	2550 1900 3300 1900
Wire Wire Line
	2550 2000 3300 2000
Wire Wire Line
	2550 2100 3300 2100
Wire Wire Line
	2550 2800 3300 2800
Wire Wire Line
	2550 2900 3300 2900
Wire Wire Line
	2550 3000 3300 3000
Wire Wire Line
	2550 3100 3300 3100
Wire Wire Line
	2550 3700 3300 3700
Wire Wire Line
	2550 3800 3300 3800
Wire Wire Line
	2550 3900 3300 3900
Wire Wire Line
	2550 4000 3300 4000
Wire Wire Line
	2550 4600 3300 4600
Wire Wire Line
	2550 4700 3300 4700
Wire Wire Line
	2550 4800 3300 4800
Wire Wire Line
	2550 4900 3300 4900
Wire Wire Line
	2550 5500 3300 5500
Wire Wire Line
	2550 5600 3300 5600
Wire Wire Line
	2550 5700 3300 5700
Wire Wire Line
	2550 5800 3300 5800
Wire Wire Line
	3050 2200 3300 2200
Wire Wire Line
	3200 2350 3200 1450
Wire Wire Line
	3200 2350 3200 3250
Wire Wire Line
	3200 3250 3200 4150
Wire Wire Line
	3200 4150 3200 5050
Wire Wire Line
	3200 5050 3200 5950
Wire Wire Line
	3200 5950 3050 5950
Wire Wire Line
	3300 1450 3200 1450
Wire Wire Line
	3300 2350 3200 2350
Wire Wire Line
	3300 3250 3200 3250
Wire Wire Line
	3300 4150 3200 4150
Wire Wire Line
	3300 5050 3200 5050
Wire Wire Line
	3300 5950 3200 5950
Wire Wire Line
	4300 1000 4850 1000
Wire Wire Line
	4300 1100 4850 1100
Wire Wire Line
	4300 1200 4850 1200
Wire Wire Line
	4300 1300 4850 1300
Wire Wire Line
	4300 1900 4850 1900
Wire Wire Line
	4300 2000 4850 2000
Wire Wire Line
	4300 2100 4850 2100
Wire Wire Line
	4850 2800 4300 2800
Wire Wire Line
	4850 2900 4300 2900
Wire Wire Line
	4850 3000 4300 3000
Wire Wire Line
	4850 3100 4300 3100
Wire Wire Line
	4850 3700 4300 3700
Wire Wire Line
	4850 3800 4300 3800
Wire Wire Line
	4850 3900 4300 3900
Wire Wire Line
	4850 4000 4300 4000
Wire Wire Line
	4850 4600 4300 4600
Wire Wire Line
	4850 4700 4300 4700
Wire Wire Line
	4850 4800 4300 4800
Wire Wire Line
	4850 4900 4300 4900
Wire Wire Line
	4850 5500 4300 5500
Wire Wire Line
	4850 5600 4300 5600
Wire Wire Line
	4850 5700 4300 5700
Wire Wire Line
	4850 5800 4300 5800
Wire Wire Line
	6950 1000 7700 1000
Wire Wire Line
	6950 1100 7700 1100
Wire Wire Line
	6950 1200 7700 1200
Wire Wire Line
	6950 1300 7700 1300
Wire Wire Line
	6950 1900 7700 1900
Wire Wire Line
	6950 2000 7700 2000
Wire Wire Line
	6950 2100 7700 2100
Wire Wire Line
	6950 2800 7700 2800
Wire Wire Line
	6950 2900 7700 2900
Wire Wire Line
	6950 3000 7700 3000
Wire Wire Line
	6950 3100 7700 3100
Wire Wire Line
	6950 3700 7700 3700
Wire Wire Line
	6950 3800 7700 3800
Wire Wire Line
	6950 3900 7700 3900
Wire Wire Line
	6950 4000 7700 4000
Wire Wire Line
	6950 4600 7700 4600
Wire Wire Line
	6950 4700 7700 4700
Wire Wire Line
	6950 4800 7700 4800
Wire Wire Line
	6950 4900 7700 4900
Wire Wire Line
	6950 5500 7700 5500
Wire Wire Line
	6950 5600 7700 5600
Wire Wire Line
	6950 5700 7700 5700
Wire Wire Line
	6950 5800 7700 5800
Wire Wire Line
	7450 2200 7700 2200
Wire Wire Line
	7600 1450 7600 2350
Wire Wire Line
	7600 1450 7700 1450
Wire Wire Line
	7600 2350 7600 3250
Wire Wire Line
	7600 3250 7600 4150
Wire Wire Line
	7600 4150 7600 5050
Wire Wire Line
	7600 5050 7600 5950
Wire Wire Line
	7600 6150 3200 6150
Wire Wire Line
	7700 2350 7600 2350
Wire Wire Line
	7700 3250 7600 3250
Wire Wire Line
	7700 4150 7600 4150
Wire Wire Line
	7700 5050 7600 5050
Wire Wire Line
	7700 5950 7600 5950
Wire Wire Line
	9150 1000 8700 1000
Wire Wire Line
	9150 1100 8700 1100
Wire Wire Line
	9150 1200 8700 1200
Wire Wire Line
	9150 1300 8700 1300
Wire Wire Line
	9150 1900 8700 1900
Wire Wire Line
	9150 2000 8700 2000
Wire Wire Line
	9150 2100 8700 2100
Wire Wire Line
	9150 2800 8700 2800
Wire Wire Line
	9150 2900 8700 2900
Wire Wire Line
	9150 3000 8700 3000
Wire Wire Line
	9150 3100 8700 3100
Wire Wire Line
	9150 3700 8700 3700
Wire Wire Line
	9150 3800 8700 3800
Wire Wire Line
	9150 3900 8700 3900
Wire Wire Line
	9150 4000 8700 4000
Wire Wire Line
	9150 4600 8700 4600
Wire Wire Line
	9150 4700 8700 4700
Wire Wire Line
	9150 4800 8700 4800
Wire Wire Line
	9150 4900 8700 4900
Wire Wire Line
	9150 5500 8700 5500
Wire Wire Line
	9150 5600 8700 5600
Wire Wire Line
	9150 5700 8700 5700
Wire Wire Line
	9150 5800 8700 5800
Wire Bus Line
	2450 800  2350 800 
Wire Bus Line
	4950 6250 5050 6250
Wire Bus Line
	6850 800  6750 800 
Wire Bus Line
	9250 6200 9400 6200
Text Label 2550 1000 0    50   ~ 0
~ROMA-BASE6
Text Label 2550 1100 0    50   ~ 0
~ROMA-BASE5
Text Label 2550 1200 0    50   ~ 0
~ROMA-BASE4
Text Label 2550 1300 0    50   ~ 0
~ROMA-BASE3
Text Label 2550 1900 0    50   ~ 0
~ROMA-BASE2
Text Label 2550 2000 0    50   ~ 0
~ROMA-BASE1
Text Label 2550 2100 0    50   ~ 0
~ROMA-BASE0
Text Label 2550 2800 0    50   ~ 0
~WSTROM-CNT15
Text Label 2550 2900 0    50   ~ 0
~WSTROM-CNT14
Text Label 2550 3000 0    50   ~ 0
~WSTROM-CNT13
Text Label 2550 3100 0    50   ~ 0
~WSTROM-CNT12
Text Label 2550 3700 0    50   ~ 0
~WSTROM-CNT11
Text Label 2550 3800 0    50   ~ 0
~WSTROM-CNT10
Text Label 2550 3900 0    50   ~ 0
~WSTROM-CNT9
Text Label 2550 4000 0    50   ~ 0
~WSTROM-CNT8
Text Label 2550 4600 0    50   ~ 0
~WSTROM-CNT7
Text Label 2550 4700 0    50   ~ 0
~WSTROM-CNT6
Text Label 2550 4800 0    50   ~ 0
~WSTROM-CNT5
Text Label 2550 4900 0    50   ~ 0
~WSTROM-CNT4
Text Label 2550 5500 0    50   ~ 0
~WSTROM-CNT3
Text Label 2550 5600 0    50   ~ 0
~WSTROM-CNT2
Text Label 2550 5700 0    50   ~ 0
~WSTROM-CNT1
Text Label 2550 5800 0    50   ~ 0
~WSTROM-CNT0
Text Label 4850 1000 2    50   ~ 0
GFX-ADDR22
Text Label 4850 1100 2    50   ~ 0
GFX-ADDR21
Text Label 4850 1200 2    50   ~ 0
GFX-ADDR20
Text Label 4850 1300 2    50   ~ 0
GFX-ADDR19
Text Label 4850 1900 2    50   ~ 0
GFX-ADDR18
Text Label 4850 2000 2    50   ~ 0
GFX-ADDR17
Text Label 4850 2100 2    50   ~ 0
GFX-ADDR16
Text Label 4850 2800 2    50   ~ 0
GFX-ADDR15
Text Label 4850 2900 2    50   ~ 0
GFX-ADDR14
Text Label 4850 3000 2    50   ~ 0
GFX-ADDR13
Text Label 4850 3100 2    50   ~ 0
GFX-ADDR12
Text Label 4850 3700 2    50   ~ 0
GFX-ADDR11
Text Label 4850 3800 2    50   ~ 0
GFX-ADDR10
Text Label 4850 3900 2    50   ~ 0
GFX-ADDR9
Text Label 4850 4000 2    50   ~ 0
GFX-ADDR8
Text Label 4850 4600 2    50   ~ 0
GFX-ADDR7
Text Label 4850 4700 2    50   ~ 0
GFX-ADDR6
Text Label 4850 4800 2    50   ~ 0
GFX-ADDR5
Text Label 4850 4900 2    50   ~ 0
GFX-ADDR4
Text Label 4850 5500 2    50   ~ 0
GFX-ADDR3
Text Label 4850 5600 2    50   ~ 0
GFX-ADDR2
Text Label 4850 5700 2    50   ~ 0
GFX-ADDR1
Text Label 4850 5800 2    50   ~ 0
GFX-ADDR0
Text Label 6950 1000 0    50   ~ 0
~RAM-BASE6
Text Label 6950 1100 0    50   ~ 0
~RAM-BASE5
Text Label 6950 1200 0    50   ~ 0
~RAM-BASE4
Text Label 6950 1300 0    50   ~ 0
~RAM-BASE3
Text Label 6950 1900 0    50   ~ 0
~RAM-BASE2
Text Label 6950 2000 0    50   ~ 0
~RAM-BASE1
Text Label 6950 2100 0    50   ~ 0
~RAM-BASE0
Text Label 6950 2800 0    50   ~ 0
~WSTROM-CNT12
Text Label 6950 2900 0    50   ~ 0
~WSTROM-CNT13
Text Label 6950 3000 0    50   ~ 0
~WSTROM-CNT14
Text Label 6950 3100 0    50   ~ 0
~WSTROM-CNT15
Text Label 6950 3700 0    50   ~ 0
~WSTROM-CNT8
Text Label 6950 3800 0    50   ~ 0
~WSTROM-CNT9
Text Label 6950 3900 0    50   ~ 0
~WSTROM-CNT10
Text Label 6950 4000 0    50   ~ 0
~WSTROM-CNT11
Text Label 6950 4600 0    50   ~ 0
~WSTROM-CNT4
Text Label 6950 4700 0    50   ~ 0
~WSTROM-CNT5
Text Label 6950 4800 0    50   ~ 0
~WSTROM-CNT6
Text Label 6950 4900 0    50   ~ 0
~WSTROM-CNT7
Text Label 6950 5500 0    50   ~ 0
~WSTROM-CNT0
Text Label 6950 5600 0    50   ~ 0
~WSTROM-CNT1
Text Label 6950 5700 0    50   ~ 0
~WSTROM-CNT2
Text Label 6950 5800 0    50   ~ 0
~WSTROM-CNT3
Text Label 9050 1000 2    50   ~ 0
ADDR23
Text Label 9050 1100 2    50   ~ 0
ADDR22
Text Label 9050 1200 2    50   ~ 0
ADDR21
Text Label 9050 1300 2    50   ~ 0
ADDR20
Text Label 9050 1900 2    50   ~ 0
ADDR19
Text Label 9050 2000 2    50   ~ 0
ADDR18
Text Label 9050 2100 2    50   ~ 0
ADDR17
Text Label 9050 2800 2    50   ~ 0
ADDR13
Text Label 9050 2900 2    50   ~ 0
ADDR14
Text Label 9050 3000 2    50   ~ 0
ADDR15
Text Label 9050 3100 2    50   ~ 0
ADDR16
Text Label 9050 3700 2    50   ~ 0
ADDR9
Text Label 9050 3800 2    50   ~ 0
ADDR10
Text Label 9050 3900 2    50   ~ 0
ADDR11
Text Label 9050 4000 2    50   ~ 0
ADDR12
Text Label 9050 4600 2    50   ~ 0
ADDR5
Text Label 9050 4700 2    50   ~ 0
ADDR6
Text Label 9050 4800 2    50   ~ 0
ADDR7
Text Label 9050 4900 2    50   ~ 0
ADDR8
Text Label 9050 5500 2    50   ~ 0
ADDR1
Text Label 9050 5600 2    50   ~ 0
ADDR2
Text Label 9050 5700 2    50   ~ 0
ADDR3
Text Label 9050 5800 2    50   ~ 0
ADDR4
Text HLabel 2300 6400 0    50   Input ~ 0
~WSTROM-CNT[0..15]
Text HLabel 2350 800  0    50   Input ~ 0
~ROMA-BASE[0..6]
Text HLabel 3050 5950 0    50   Input ~ 0
~WSTROM
Text HLabel 5050 6250 2    50   3State ~ 0
GFX-ADDR[0..22]
Text HLabel 6750 800  0    50   Input ~ 0
~RAM-BASE[0..6]
Text HLabel 9400 6200 2    50   3State ~ 0
ADDR[1..23]
$Comp
L power:GND #PWR0258
U 1 1 616A8471
P 3050 2200
F 0 "#PWR0258" H 3050 1950 50  0001 C CNN
F 1 "GND" H 3055 2027 50  0001 C CNN
F 2 "" H 3050 2200 50  0001 C CNN
F 3 "" H 3050 2200 50  0001 C CNN
	1    3050 2200
	1    0    0    -1  
$EndComp
$Comp
L power:GND #PWR0259
U 1 1 616B8388
P 7450 2200
F 0 "#PWR0259" H 7450 1950 50  0001 C CNN
F 1 "GND" H 7455 2027 50  0001 C CNN
F 2 "" H 7450 2200 50  0001 C CNN
F 3 "" H 7450 2200 50  0001 C CNN
	1    7450 2200
	1    0    0    -1  
$EndComp
$Comp
L A5C:M368C UEC?
U 1 1 61118D9E
P 3800 1250
AR Path="/604B5523/61118D9E" Ref="UEC?"  Part="1" 
AR Path="/61118D9E" Ref="UCC225"  Part="1" 
AR Path="/6119A10E/61118D9E" Ref="UCC225"  Part="1" 
AR Path="/612E58BE/612EE46C/61118D9E" Ref="UCC225"  Part="1" 
F 0 "UCC225" H 3800 1760 50  0000 C CNN
F 1 "M368C" H 3800 1670 50  0000 C CNN
F 2 "" H 4100 1050 50  0001 C CNN
F 3 "" H 4100 1050 50  0001 C CNN
	1    3800 1250
	1    0    0    -1  
$EndComp
$Comp
L A5C:M368C UCC?
U 1 1 61118DA4
P 3800 2150
AR Path="/604B5523/61118DA4" Ref="UCC?"  Part="1" 
AR Path="/61118DA4" Ref="UCC218"  Part="1" 
AR Path="/6119A10E/61118DA4" Ref="UCC218"  Part="1" 
AR Path="/612E58BE/612EE46C/61118DA4" Ref="UCC218"  Part="1" 
F 0 "UCC218" H 3800 2660 50  0000 C CNN
F 1 "M368C" H 3800 2570 50  0000 C CNN
F 2 "" H 4100 1950 50  0001 C CNN
F 3 "" H 4100 1950 50  0001 C CNN
	1    3800 2150
	1    0    0    -1  
$EndComp
$Comp
L A5C:M368C UCB?
U 1 1 75EEDE24
P 3800 3050
AR Path="/604B5523/75EEDE24" Ref="UCB?"  Part="1" 
AR Path="/75EEDE24" Ref="UCC425"  Part="1" 
AR Path="/6119A10E/75EEDE24" Ref="UCC425"  Part="1" 
AR Path="/612E58BE/612EE46C/75EEDE24" Ref="UCC425"  Part="1" 
F 0 "UCC425" H 3800 3560 50  0000 C CNN
F 1 "M368C" H 3800 3470 50  0000 C CNN
F 2 "" H 4100 2850 50  0001 C CNN
F 3 "" H 4100 2850 50  0001 C CNN
	1    3800 3050
	1    0    0    -1  
$EndComp
$Comp
L A5C:M368C UCB?
U 1 1 61118DBA
P 3800 3950
AR Path="/604B5523/61118DBA" Ref="UCB?"  Part="1" 
AR Path="/61118DBA" Ref="UBI11"  Part="1" 
AR Path="/6119A10E/61118DBA" Ref="UBI11"  Part="1" 
AR Path="/612E58BE/612EE46C/61118DBA" Ref="UBI11"  Part="1" 
F 0 "UBI11" H 3800 4460 50  0000 C CNN
F 1 "M368C" H 3800 4370 50  0000 C CNN
F 2 "" H 4100 3750 50  0001 C CNN
F 3 "" H 4100 3750 50  0001 C CNN
	1    3800 3950
	1    0    0    -1  
$EndComp
$Comp
L A5C:M368C UCC?
U 1 1 7E61EF4C
P 3800 4850
AR Path="/604B5523/7E61EF4C" Ref="UCC?"  Part="1" 
AR Path="/7E61EF4C" Ref="UEJ265"  Part="1" 
AR Path="/6119A10E/7E61EF4C" Ref="UEJ265"  Part="1" 
AR Path="/612E58BE/612EE46C/7E61EF4C" Ref="UEJ265"  Part="1" 
F 0 "UEJ265" H 3800 5360 50  0000 C CNN
F 1 "M368C" H 3800 5270 50  0000 C CNN
F 2 "" H 4100 4650 50  0001 C CNN
F 3 "" H 4100 4650 50  0001 C CNN
	1    3800 4850
	1    0    0    -1  
$EndComp
$Comp
L A5C:M368C UCC?
U 1 1 67B51256
P 3800 5750
AR Path="/604B5523/67B51256" Ref="UCC?"  Part="1" 
AR Path="/67B51256" Ref="UEG254"  Part="1" 
AR Path="/6119A10E/67B51256" Ref="UEG254"  Part="1" 
AR Path="/612E58BE/612EE46C/67B51256" Ref="UEG254"  Part="1" 
F 0 "UEG254" H 3800 6260 50  0000 C CNN
F 1 "M368C" H 3800 6170 50  0000 C CNN
F 2 "" H 4100 5550 50  0001 C CNN
F 3 "" H 4100 5550 50  0001 C CNN
	1    3800 5750
	1    0    0    -1  
$EndComp
$Comp
L A5C:M368C UCC?
U 1 1 61118DB6
P 8200 1250
AR Path="/604B5523/61118DB6" Ref="UCC?"  Part="1" 
AR Path="/61118DB6" Ref="UBG122"  Part="1" 
AR Path="/6119A10E/61118DB6" Ref="UBG122"  Part="1" 
AR Path="/612E58BE/612EE46C/61118DB6" Ref="UBG122"  Part="1" 
F 0 "UBG122" H 8200 1760 50  0000 C CNN
F 1 "M368C" H 8200 1670 50  0000 C CNN
F 2 "" H 8500 1050 50  0001 C CNN
F 3 "" H 8500 1050 50  0001 C CNN
	1    8200 1250
	1    0    0    -1  
$EndComp
$Comp
L A5C:M368C UBG?
U 1 1 61118D9B
P 8200 2150
AR Path="/604B5523/61118D9B" Ref="UBG?"  Part="1" 
AR Path="/61118D9B" Ref="UEC302"  Part="1" 
AR Path="/6119A10E/61118D9B" Ref="UEC302"  Part="1" 
AR Path="/612E58BE/612EE46C/61118D9B" Ref="UEC302"  Part="1" 
F 0 "UEC302" H 8200 2660 50  0000 C CNN
F 1 "M368C" H 8200 2570 50  0000 C CNN
F 2 "" H 8500 1950 50  0001 C CNN
F 3 "" H 8500 1950 50  0001 C CNN
	1    8200 2150
	1    0    0    -1  
$EndComp
$Comp
L A5C:M368C UEF?
U 1 1 61118DB1
P 8200 3050
AR Path="/604B5523/61118DB1" Ref="UEF?"  Part="1" 
AR Path="/61118DB1" Ref="UEG328"  Part="1" 
AR Path="/6119A10E/61118DB1" Ref="UEG328"  Part="1" 
AR Path="/612E58BE/612EE46C/61118DB1" Ref="UEG328"  Part="1" 
F 0 "UEG328" H 8200 3560 50  0000 C CNN
F 1 "M368C" H 8200 3470 50  0000 C CNN
F 2 "" H 8500 2850 50  0001 C CNN
F 3 "" H 8500 2850 50  0001 C CNN
	1    8200 3050
	1    0    0    -1  
$EndComp
$Comp
L A5C:M368C UCC?
U 1 1 61118DB2
P 8200 3950
AR Path="/604B5523/61118DB2" Ref="UCC?"  Part="1" 
AR Path="/61118DB2" Ref="UEF317"  Part="1" 
AR Path="/6119A10E/61118DB2" Ref="UEF317"  Part="1" 
AR Path="/612E58BE/612EE46C/61118DB2" Ref="UEF317"  Part="1" 
F 0 "UEF317" H 8200 4460 50  0000 C CNN
F 1 "M368C" H 8200 4370 50  0000 C CNN
F 2 "" H 8500 3750 50  0001 C CNN
F 3 "" H 8500 3750 50  0001 C CNN
	1    8200 3950
	1    0    0    -1  
$EndComp
$Comp
L A5C:M368C UEJ?
U 1 1 61118DB3
P 8200 4850
AR Path="/604B5523/61118DB3" Ref="UEJ?"  Part="1" 
AR Path="/61118DB3" Ref="UCC510"  Part="1" 
AR Path="/6119A10E/61118DB3" Ref="UCC510"  Part="1" 
AR Path="/612E58BE/612EE46C/61118DB3" Ref="UCC510"  Part="1" 
F 0 "UCC510" H 8200 5360 50  0000 C CNN
F 1 "M368C" H 8200 5270 50  0000 C CNN
F 2 "" H 8500 4650 50  0001 C CNN
F 3 "" H 8500 4650 50  0001 C CNN
	1    8200 4850
	1    0    0    -1  
$EndComp
$Comp
L A5C:M368C UBG?
U 1 1 61118DBD
P 8200 5750
AR Path="/604B5523/61118DBD" Ref="UBG?"  Part="1" 
AR Path="/61118DBD" Ref="UBF144"  Part="1" 
AR Path="/6119A10E/61118DBD" Ref="UBF144"  Part="1" 
AR Path="/612E58BE/612EE46C/61118DBD" Ref="UBF144"  Part="1" 
F 0 "UBF144" H 8200 6260 50  0000 C CNN
F 1 "M368C" H 8200 6170 50  0000 C CNN
F 2 "" H 8500 5550 50  0001 C CNN
F 3 "" H 8500 5550 50  0001 C CNN
	1    8200 5750
	1    0    0    -1  
$EndComp
Wire Bus Line
	2300 6400 2450 6400
Connection ~ 2450 6400
Wire Bus Line
	2450 6400 6850 6400
Wire Wire Line
	3200 5950 3200 6150
Wire Wire Line
	7600 5950 7600 6150
Wire Bus Line
	2450 800  2450 2000
Wire Bus Line
	6850 800  6850 2000
Wire Bus Line
	2450 2900 2450 6400
Wire Bus Line
	6850 2900 6850 6400
Wire Bus Line
	9250 1100 9250 6200
Wire Bus Line
	4950 1100 4950 6250
$EndSCHEMATC
