EESchema Schematic File Version 4
EELAYER 30 0
EELAYER END
$Descr A4 11693 8268
encoding utf-8
Sheet 14 83
Title "CPS Reverse Engineering: DL-0311"
Date "2021-09-12"
Rev ""
Comp ""
Comment1 ""
Comment2 ""
Comment3 "Licence: CC-BY"
Comment4 "Author: Loïc *WydD* Petit"
$EndDescr
Connection ~ 5650 5000
Connection ~ 5650 6050
Connection ~ 5650 6700
Connection ~ 5650 4350
Connection ~ 5650 3300
Connection ~ 5650 2650
Connection ~ 5650 1600
Entry Wire Line
	1650 1250 1750 1350
Entry Wire Line
	1650 1350 1750 1450
Entry Wire Line
	1650 1450 1750 1550
Entry Wire Line
	1650 1550 1750 1650
Entry Wire Line
	1650 1650 1750 1750
Entry Wire Line
	1650 1750 1750 1850
Entry Wire Line
	1650 1850 1750 1950
Entry Wire Line
	1650 1950 1750 2050
Entry Wire Line
	1650 2050 1750 2150
Entry Wire Line
	6850 850  6750 950 
Entry Wire Line
	6850 1550 6750 1650
Entry Wire Line
	6850 2600 6750 2700
Entry Wire Line
	6850 3250 6750 3350
Entry Wire Line
	6850 4300 6750 4400
Entry Wire Line
	6850 4950 6750 5050
Entry Wire Line
	6850 6000 6750 6100
Entry Wire Line
	6850 6650 6750 6750
Wire Wire Line
	1750 1350 2050 1350
Wire Wire Line
	1750 1450 2050 1450
Wire Wire Line
	1750 1550 2050 1550
Wire Wire Line
	1750 1650 2050 1650
Wire Wire Line
	1750 1750 2050 1750
Wire Wire Line
	1750 1850 2050 1850
Wire Wire Line
	1750 1950 2050 1950
Wire Wire Line
	1750 2050 2050 2050
Wire Wire Line
	1750 2150 2050 2150
Wire Wire Line
	5300 1250 4750 1250
Wire Wire Line
	5300 1000 5750 1000
Wire Wire Line
	5650 6700 5650 6050
Wire Wire Line
	5650 6050 5650 5000
Wire Wire Line
	5650 5000 5650 4350
Wire Wire Line
	5650 4350 5650 3300
Wire Wire Line
	5650 2650 5650 3300
Wire Wire Line
	5650 2650 5650 1600
Wire Wire Line
	5650 1600 5650 900 
Wire Wire Line
	5750 6800 5250 6800
Wire Wire Line
	5750 6700 5650 6700
Wire Wire Line
	5750 6150 5250 6150
Wire Wire Line
	5750 6050 5650 6050
Wire Wire Line
	5750 5100 5250 5100
Wire Wire Line
	5750 5000 5650 5000
Wire Wire Line
	5750 4450 5250 4450
Wire Wire Line
	5750 4350 5650 4350
Wire Wire Line
	5750 3400 5250 3400
Wire Wire Line
	5750 3300 5650 3300
Wire Wire Line
	5750 2750 5250 2750
Wire Wire Line
	5750 2650 5650 2650
Wire Wire Line
	5750 1700 5300 1700
Wire Wire Line
	5750 1600 5650 1600
Wire Wire Line
	5750 900  5650 900 
Wire Wire Line
	6300 6750 6750 6750
Wire Wire Line
	6300 6100 6750 6100
Wire Wire Line
	6300 5050 6750 5050
Wire Wire Line
	6300 4400 6750 4400
Wire Wire Line
	6300 3350 6750 3350
Wire Wire Line
	6300 2700 6750 2700
Wire Wire Line
	6300 1650 6750 1650
Wire Wire Line
	6300 950  6750 950 
Wire Bus Line
	1650 1150 1550 1150
Wire Bus Line
	6850 700  7000 700 
Text Label 1800 1350 0    50   ~ 0
LINE0
Text Label 1800 1450 0    50   ~ 0
LINE1
Text Label 1800 1550 0    50   ~ 0
LINE2
Text Label 1800 1650 0    50   ~ 0
LINE3
Text Label 1800 1750 0    50   ~ 0
LINE4
Text Label 1800 1850 0    50   ~ 0
LINE5
Text Label 1800 1950 0    50   ~ 0
LINE6
Text Label 1800 2050 0    50   ~ 0
LINE7
Text Label 1800 2150 0    50   ~ 0
LINE8
Text Label 4700 1800 2    50   ~ 0
LINE6
Text Label 4750 950  2    50   ~ 0
LINE7
Text Label 6300 6750 0    50   ~ 0
ROW0
Text Label 6300 6100 0    50   ~ 0
ROW1
Text Label 6300 5050 0    50   ~ 0
ROW2
Text Label 6300 4400 0    50   ~ 0
ROW3
Text Label 6300 3350 0    50   ~ 0
ROW4
Text Label 6300 2700 0    50   ~ 0
ROW5
Text Label 6300 1650 0    50   ~ 0
ROW6
Text Label 6300 950  0    50   ~ 0
ROW7
Text HLabel 1550 1150 0    50   Input ~ 0
LINE[0..8]
Text HLabel 7000 700  2    50   Output ~ 0
ROW[0..7]
$Comp
L A5C:XOR02 UBF130
U 1 1 649BE7D1
P 5000 1000
F 0 "UBF130" H 5025 1267 50  0000 C CNN
F 1 "XOR02" H 5025 1176 50  0000 C CNN
F 2 "" H 5000 1000 50  0001 C CNN
F 3 "" H 5000 1000 50  0001 C CNN
	1    5000 1000
	1    0    0    -1  
$EndComp
$Comp
L A5C:XNOR02 UBE135
U 1 1 6210F132
P 6000 6750
F 0 "UBE135" H 6025 7017 50  0000 C CNN
F 1 "XNOR02" H 6025 6926 50  0000 C CNN
F 2 "" H 6025 6750 50  0001 C CNN
F 3 "" H 6025 6750 50  0001 C CNN
	1    6000 6750
	1    0    0    -1  
$EndComp
$Comp
L A5C:XNOR02 UBE143
U 1 1 623EB95A
P 6000 6100
F 0 "UBE143" H 6025 6367 50  0000 C CNN
F 1 "XNOR02" H 6025 6276 50  0000 C CNN
F 2 "" H 6025 6100 50  0001 C CNN
F 3 "" H 6025 6100 50  0001 C CNN
	1    6000 6100
	1    0    0    -1  
$EndComp
$Comp
L A5C:XNOR02 UBE179
U 1 1 62559E93
P 6000 5050
F 0 "UBE179" H 6025 5317 50  0000 C CNN
F 1 "XNOR02" H 6025 5226 50  0000 C CNN
F 2 "" H 6025 5050 50  0001 C CNN
F 3 "" H 6025 5050 50  0001 C CNN
	1    6000 5050
	1    0    0    -1  
$EndComp
$Comp
L A5C:XNOR02 UBD160
U 1 1 62B19999
P 6000 4400
F 0 "UBD160" H 6025 4667 50  0000 C CNN
F 1 "XNOR02" H 6025 4576 50  0000 C CNN
F 2 "" H 6025 4400 50  0001 C CNN
F 3 "" H 6025 4400 50  0001 C CNN
	1    6000 4400
	1    0    0    -1  
$EndComp
$Comp
L A5C:XNOR02 UBD151
U 1 1 62C88044
P 6000 3350
F 0 "UBD151" H 6025 3617 50  0000 C CNN
F 1 "XNOR02" H 6025 3526 50  0000 C CNN
F 2 "" H 6025 3350 50  0001 C CNN
F 3 "" H 6025 3350 50  0001 C CNN
	1    6000 3350
	1    0    0    -1  
$EndComp
$Comp
L A5C:XNOR02 UBC181
U 1 1 62DF71D0
P 6000 2700
F 0 "UBC181" H 6025 2967 50  0000 C CNN
F 1 "XNOR02" H 6025 2876 50  0000 C CNN
F 2 "" H 6025 2700 50  0001 C CNN
F 3 "" H 6025 2700 50  0001 C CNN
	1    6000 2700
	1    0    0    -1  
$EndComp
$Comp
L A5C:XNOR02 UBE160
U 1 1 626C7E1B
P 6000 1650
F 0 "UBE160" H 6025 1917 50  0000 C CNN
F 1 "XNOR02" H 6025 1826 50  0000 C CNN
F 2 "" H 6025 1650 50  0001 C CNN
F 3 "" H 6025 1650 50  0001 C CNN
	1    6000 1650
	1    0    0    -1  
$EndComp
$Comp
L A5C:XNOR02 UBE152
U 1 1 67D78380
P 6000 950
F 0 "UBE152" H 6025 1217 50  0000 C CNN
F 1 "XNOR02" H 6025 1126 50  0000 C CNN
F 2 "" H 6025 950 50  0001 C CNN
F 3 "" H 6025 950 50  0001 C CNN
	1    6000 950 
	1    0    0    -1  
$EndComp
$Comp
L A5C:HA1 UBE148
U 1 1 608C56A2
P 4950 6150
F 0 "UBE148" H 4950 6515 50  0000 C CNN
F 1 "HA1" H 4950 6424 50  0000 C CNN
F 2 "" H 4900 6150 50  0001 C CNN
F 3 "" H 4900 6150 50  0001 C CNN
	1    4950 6150
	1    0    0    -1  
$EndComp
$Comp
L A5C:HA1 UBD169
U 1 1 60FED63F
P 4950 3400
F 0 "UBD169" H 4950 3765 50  0000 C CNN
F 1 "HA1" H 4950 3674 50  0000 C CNN
F 2 "" H 4900 3400 50  0001 C CNN
F 3 "" H 4900 3400 50  0001 C CNN
	1    4950 3400
	1    0    0    -1  
$EndComp
$Comp
L A5C:HA1 UBD174
U 1 1 60FED639
P 4950 2750
F 0 "UBD174" H 4950 3115 50  0000 C CNN
F 1 "HA1" H 4950 3024 50  0000 C CNN
F 2 "" H 4900 2750 50  0001 C CNN
F 3 "" H 4900 2750 50  0001 C CNN
	1    4950 2750
	1    0    0    -1  
$EndComp
$Comp
L A5C:HA1 UBE164
U 1 1 61708407
P 5000 1700
F 0 "UBE164" H 5000 2065 50  0000 C CNN
F 1 "HA1" H 5000 1974 50  0000 C CNN
F 2 "" H 4950 1700 50  0001 C CNN
F 3 "" H 4950 1700 50  0001 C CNN
	1    5000 1700
	1    0    0    -1  
$EndComp
Text Notes 7500 4250 0    50   ~ 0
MUX\n7\n6\n5\n4\n3\n2\n1\n0
Text Notes 8400 4250 0    50   ~ 0
SCROLL1\nxx\nxx\nFLIP(LINE8)\nLINE7\nLINE6\nLINE5\nLINE4\nLINE3
Text Notes 8950 4250 0    50   ~ 0
SCROLL2\nxx\nxx\nFLIP(LINE8)\nFLIP(LINE8)\nLINE7\nLINE6\nLINE5\nLINE4
Text Notes 9500 4250 0    50   ~ 0
SCROLL3\nxx\nxx\nFLIP(LINE8)\nFLIP(LINE8)\nFLIP(LINE8)\nLINE7\nLINE6\nLINE5
Text Notes 7850 4250 0    50   ~ 0
ROWSCROLL\nLINE7\nLINE6\nLINE5\nLINE4\nLINE3\nLINE2\nLINE1\nLINE0
$Comp
L A5C:HA1 UBE137
U 1 1 60B7EAED
P 4950 6800
F 0 "UBE137" H 4950 7165 50  0000 C CNN
F 1 "HA1" H 4950 7074 50  0000 C CNN
F 2 "" H 4900 6800 50  0001 C CNN
F 3 "" H 4900 6800 50  0001 C CNN
	1    4950 6800
	1    0    0    -1  
$EndComp
Wire Wire Line
	5250 6400 5250 6700
Wire Wire Line
	5250 6050 5250 5500
Wire Wire Line
	4750 1250 4750 1050
Wire Wire Line
	5250 3000 5250 3300
Wire Wire Line
	5250 6400 4550 6400
Wire Wire Line
	4550 6400 4550 6050
Wire Wire Line
	4550 6050 4650 6050
Wire Wire Line
	4650 6250 4450 6250
Wire Wire Line
	4550 5000 4550 5500
Wire Wire Line
	4550 5500 5250 5500
Wire Wire Line
	5250 3800 5250 4350
$Comp
L A5C:HA1 UBD164
U 1 1 61423639
P 4950 4450
F 0 "UBD164" H 4950 4815 50  0000 C CNN
F 1 "HA1" H 4950 4724 50  0000 C CNN
F 2 "" H 4900 4450 50  0001 C CNN
F 3 "" H 4900 4450 50  0001 C CNN
	1    4950 4450
	1    0    0    -1  
$EndComp
Wire Wire Line
	4650 5200 4450 5200
Wire Wire Line
	4650 5000 4550 5000
$Comp
L A5C:HA1 UBE169
U 1 1 6142363F
P 4950 5100
F 0 "UBE169" H 4950 5465 50  0000 C CNN
F 1 "HA1" H 4950 5374 50  0000 C CNN
F 2 "" H 4900 5100 50  0001 C CNN
F 3 "" H 4900 5100 50  0001 C CNN
	1    4950 5100
	1    0    0    -1  
$EndComp
Wire Wire Line
	5250 4700 4550 4700
Wire Wire Line
	4550 4700 4550 4350
Wire Wire Line
	4550 4350 4650 4350
Wire Wire Line
	4650 4550 4450 4550
Wire Wire Line
	5250 3800 4550 3800
Wire Wire Line
	4550 3800 4550 3300
Wire Wire Line
	4550 3300 4650 3300
Wire Wire Line
	4650 3500 4450 3500
Wire Wire Line
	5250 3000 4550 3000
Wire Wire Line
	4550 3000 4550 2650
Wire Wire Line
	4550 2650 4650 2650
Wire Wire Line
	4650 2850 4450 2850
Wire Wire Line
	4450 6900 4650 6900
Wire Wire Line
	4650 6700 4550 6700
Wire Wire Line
	4450 6900 4450 6700
Wire Wire Line
	4450 5200 4450 5000
Wire Wire Line
	4450 3500 4450 3300
Connection ~ 3850 4150
Connection ~ 3850 2800
Connection ~ 3850 2450
Connection ~ 3850 5850
Wire Wire Line
	3200 4400 3850 4400
Wire Wire Line
	3200 2800 3850 2800
Wire Wire Line
	3600 5850 3850 5850
Wire Wire Line
	3600 4150 3850 4150
Wire Wire Line
	3600 2450 3850 2450
Wire Wire Line
	3850 7100 3200 7100
Wire Wire Line
	3850 7000 3200 7000
Wire Wire Line
	3850 5950 3850 5850
Wire Wire Line
	3850 4150 3850 4250
Wire Wire Line
	3850 3150 3200 3150
Wire Wire Line
	3850 3250 3850 3150
Wire Wire Line
	3850 2900 3850 2800
Wire Wire Line
	3850 2800 3850 2700
Wire Wire Line
	3850 2550 3850 2450
Text Label 3850 7100 2    50   ~ 0
SCROLL-TYPE0
Text Label 3850 7000 2    50   ~ 0
SCROLL-TYPE1
Text Label 3850 6850 2    50   ~ 0
LINE0
Text Label 3850 6750 2    50   ~ 0
LINE3
Text Label 3850 6650 2    50   ~ 0
LINE4
Text Label 3850 6550 2    50   ~ 0
LINE5
Text Label 3850 6400 2    50   ~ 0
LINE1
Text Label 3850 6300 2    50   ~ 0
LINE4
Text Label 3850 6200 2    50   ~ 0
LINE5
Text Label 3850 6100 2    50   ~ 0
LINE6
Text Label 3850 5400 2    50   ~ 0
SCROLL-TYPE0
Text Label 3850 5300 2    50   ~ 0
SCROLL-TYPE1
Text Label 3850 5150 2    50   ~ 0
LINE2
Text Label 3850 5050 2    50   ~ 0
LINE5
Text Label 3850 4950 2    50   ~ 0
LINE6
Text Label 3850 4850 2    50   ~ 0
LINE7
Text Label 3850 4700 2    50   ~ 0
LINE3
Text Label 3850 4600 2    50   ~ 0
LINE6
Text Label 3850 4500 2    50   ~ 0
LINE7
Text Label 3850 3700 2    50   ~ 0
SCROLL-TYPE0
Text Label 3850 3600 2    50   ~ 0
SCROLL-TYPE1
Text Label 3850 3450 2    50   ~ 0
LINE4
Text Label 3850 3350 2    50   ~ 0
LINE7
Text Label 3850 3000 2    50   ~ 0
LINE5
$Comp
L power:GND #PWR0150
U 1 1 60A6ED0A
P 3600 5850
F 0 "#PWR0150" H 3600 5600 50  0001 C CNN
F 1 "GND" H 3605 5677 50  0001 C CNN
F 2 "" H 3600 5850 50  0001 C CNN
F 3 "" H 3600 5850 50  0001 C CNN
	1    3600 5850
	1    0    0    -1  
$EndComp
$Comp
L power:GND #PWR0151
U 1 1 61155F4B
P 3600 4150
F 0 "#PWR0151" H 3600 3900 50  0001 C CNN
F 1 "GND" H 3605 3977 50  0001 C CNN
F 2 "" H 3600 4150 50  0001 C CNN
F 3 "" H 3600 4150 50  0001 C CNN
	1    3600 4150
	1    0    0    -1  
$EndComp
$Comp
L power:GND #PWR0152
U 1 1 60D2A738
P 3600 2450
F 0 "#PWR0152" H 3600 2200 50  0001 C CNN
F 1 "GND" H 3605 2277 50  0001 C CNN
F 2 "" H 3600 2450 50  0001 C CNN
F 3 "" H 3600 2450 50  0001 C CNN
	1    3600 2450
	1    0    0    -1  
$EndComp
$Comp
L A5C:MUX42H UCB352
U 1 1 63405871
P 4150 6550
F 0 "UCB352" H 4150 7365 50  0000 C CNN
F 1 "MUX42H" H 4150 7274 50  0000 C CNN
F 2 "" H 4200 6600 50  0001 C CNN
F 3 "" H 4200 6600 50  0001 C CNN
	1    4150 6550
	1    0    0    1   
$EndComp
$Comp
L A5C:MUX42H UBG48
U 1 1 63A82119
P 4150 4850
F 0 "UBG48" H 4150 5665 50  0000 C CNN
F 1 "MUX42H" H 4150 5574 50  0000 C CNN
F 2 "" H 4200 4900 50  0001 C CNN
F 3 "" H 4200 4900 50  0001 C CNN
	1    4150 4850
	1    0    0    1   
$EndComp
$Comp
L A5C:MUX42H UBF29
U 1 1 63A80F8C
P 4150 3150
F 0 "UBF29" H 4150 3965 50  0000 C CNN
F 1 "MUX42H" H 4150 3874 50  0000 C CNN
F 2 "" H 4200 3200 50  0001 C CNN
F 3 "" H 4200 3200 50  0001 C CNN
	1    4150 3150
	1    0    0    1   
$EndComp
Connection ~ 3200 4400
$Comp
L A5C:NBUF02 UAC216
U 1 1 613AB177
P 2250 4450
F 0 "UAC216" H 2250 4767 50  0000 C CNN
F 1 "NBUF02" H 2250 4676 50  0000 C CNN
F 2 "" H 2250 4250 50  0001 C CNN
F 3 "" H 2250 4250 50  0001 C CNN
	1    2250 4450
	1    0    0    -1  
$EndComp
$Comp
L A5C:INV01 UAC160
U 1 1 73945881
P 1500 3850
F 0 "UAC160" H 1500 4167 50  0000 C CNN
F 1 "INV01" H 1500 4076 50  0000 C CNN
F 2 "" H 1500 3650 50  0001 C CNN
F 3 "" H 1500 3650 50  0001 C CNN
	1    1500 3850
	1    0    0    -1  
$EndComp
$Comp
L A5C:INV01 UAC195
U 1 1 6150F732
P 1100 4700
F 0 "UAC195" H 1100 5017 50  0000 C CNN
F 1 "INV01" H 1100 4926 50  0000 C CNN
F 2 "" H 1100 4500 50  0001 C CNN
F 3 "" H 1100 4500 50  0001 C CNN
	1    1100 4700
	1    0    0    1   
$EndComp
$Comp
L A5C:XNOR02 UAD266
U 1 1 71AB9068
P 2800 4400
F 0 "UAD266" H 2825 4667 50  0000 C CNN
F 1 "XNOR02" H 2825 4576 50  0000 C CNN
F 2 "" H 2825 4400 50  0001 C CNN
F 3 "" H 2825 4400 50  0001 C CNN
	1    2800 4400
	1    0    0    -1  
$EndComp
$Comp
L A5C:AND02 UAC242
U 1 1 736B818A
P 2250 3800
F 0 "UAC242" H 2275 4067 50  0000 C CNN
F 1 "AND02" H 2275 3976 50  0000 C CNN
F 2 "" H 2250 3800 50  0001 C CNN
F 3 "" H 2250 3800 50  0001 C CNN
	1    2250 3800
	1    0    0    -1  
$EndComp
$Comp
L A5C:AND02 UAC179
U 1 1 6150E84B
P 1650 4450
F 0 "UAC179" H 1675 4717 50  0000 C CNN
F 1 "AND02" H 1675 4626 50  0000 C CNN
F 2 "" H 1650 4450 50  0001 C CNN
F 3 "" H 1650 4450 50  0001 C CNN
	1    1650 4450
	1    0    0    -1  
$EndComp
Text HLabel 2400 6750 0    50   Input ~ 0
SCROLL-TYPE[0..1]
Text HLabel 1400 4400 0    50   Input ~ 0
FLIP
Text HLabel 1200 3850 0    50   Input ~ 0
FLIP
Text Label 2000 3750 2    50   ~ 0
LINE8
Text Label 800  4700 2    50   ~ 0
LINE8
Wire Wire Line
	3100 4400 3200 4400
Wire Wire Line
	1800 3850 2000 3850
Wire Wire Line
	1400 4500 1400 4700
Entry Wire Line
	3100 7000 3200 7100
Entry Wire Line
	3100 6900 3200 7000
Wire Wire Line
	5250 4700 5250 5000
Connection ~ 3200 3150
Wire Wire Line
	3200 3150 3200 2800
Connection ~ 3850 3150
Wire Wire Line
	3200 3150 3200 4400
Wire Wire Line
	4700 1600 4350 1600
Wire Wire Line
	4350 1600 4350 2100
Wire Wire Line
	4350 2100 5250 2100
Wire Wire Line
	5250 2100 5250 2650
Wire Wire Line
	5300 1600 5300 1250
Connection ~ 2550 4450
Wire Wire Line
	2550 3800 2550 4350
Wire Wire Line
	2550 4450 2550 7500
Wire Wire Line
	2550 7500 4550 7500
Wire Wire Line
	5650 6700 5650 7500
Wire Wire Line
	4550 6700 4550 7500
Connection ~ 4550 7500
Wire Wire Line
	4550 7500 5650 7500
Wire Bus Line
	3100 6750 2400 6750
Text Notes 3250 4400 0    50   ~ 0
FLIP(LINE8)
Text Notes 4650 7450 0    50   ~ 0
FLIP ? LINE8 : 1
Text Notes 7500 4600 0    50   ~ 0
POS = FLIP ? LINE8 : 1\nROW = POS ? MUX + 1 : -MUX
Wire Bus Line
	3100 6750 3100 7000
Wire Bus Line
	6850 700  6850 6650
Wire Bus Line
	1650 1150 1650 2050
$EndSCHEMATC
