EESchema Schematic File Version 4
EELAYER 30 0
EELAYER END
$Descr A4 11693 8268
encoding utf-8
Sheet 39 69
Title ""
Date "2020-11-26"
Rev ""
Comp ""
Comment1 "Licence: CC-BY"
Comment2 "Author: Loïc *WydD* Petit"
Comment3 ""
Comment4 ""
$EndDescr
Connection ~ 5850 1950
Connection ~ 5550 4200
Connection ~ 5550 4450
Connection ~ 5750 3350
Connection ~ 6050 3150
Connection ~ 5850 3250
Connection ~ 5850 2600
Connection ~ 5750 2700
Connection ~ 6050 1850
Connection ~ 4900 5000
Connection ~ 1650 4900
Connection ~ 3350 4150
Connection ~ 3250 4350
Connection ~ 4850 2900
Connection ~ 4850 3650
Connection ~ 3350 2650
Connection ~ 3250 2850
Connection ~ 4850 4400
Connection ~ 6050 3800
Connection ~ 5850 3900
Connection ~ 5650 3450
Connection ~ 5750 4000
Connection ~ 5650 4100
Connection ~ 5650 4550
Connection ~ 5750 4650
Connection ~ 6050 2500
Connection ~ 3350 3400
Connection ~ 3250 3600
Connection ~ 2150 5450
Entry Wire Line
	2500 1700 2600 1800
Entry Wire Line
	2500 2450 2600 2550
Entry Wire Line
	2500 3200 2600 3300
Entry Wire Line
	2500 3950 2600 4050
Wire Wire Line
	1550 5450 2150 5450
Wire Wire Line
	1650 4900 1550 4900
Wire Wire Line
	1650 4900 1650 5350
Wire Wire Line
	1650 5350 2250 5350
Wire Wire Line
	2150 5000 2150 5450
Wire Wire Line
	2150 5450 2250 5450
Wire Wire Line
	2250 5000 2150 5000
Wire Wire Line
	2600 1800 3900 1800
Wire Wire Line
	2600 2550 3900 2550
Wire Wire Line
	2600 3300 3900 3300
Wire Wire Line
	2600 4050 3900 4050
Wire Wire Line
	3250 2100 3900 2100
Wire Wire Line
	3250 2850 3250 2100
Wire Wire Line
	3250 2850 3900 2850
Wire Wire Line
	3250 3600 3250 2850
Wire Wire Line
	3250 4350 3250 3600
Wire Wire Line
	3250 4350 3250 5400
Wire Wire Line
	3250 5400 2800 5400
Wire Wire Line
	3350 1900 3350 2650
Wire Wire Line
	3350 2650 3350 3400
Wire Wire Line
	3350 3400 3900 3400
Wire Wire Line
	3350 4150 3350 3400
Wire Wire Line
	3350 4150 3350 4950
Wire Wire Line
	3350 4950 2800 4950
Wire Wire Line
	3500 2000 3500 5500
Wire Wire Line
	3500 2000 3900 2000
Wire Wire Line
	3500 5500 7900 5500
Wire Wire Line
	3600 2750 3900 2750
Wire Wire Line
	3600 5400 3600 2750
Wire Wire Line
	3700 3500 3700 5300
Wire Wire Line
	3700 5300 7700 5300
Wire Wire Line
	3800 4250 3900 4250
Wire Wire Line
	3800 5200 3800 4250
Wire Wire Line
	3900 1900 3350 1900
Wire Wire Line
	3900 2650 3350 2650
Wire Wire Line
	3900 3500 3700 3500
Wire Wire Line
	3900 3600 3250 3600
Wire Wire Line
	3900 4150 3350 4150
Wire Wire Line
	3900 4350 3250 4350
Wire Wire Line
	4750 2700 4950 2700
Wire Wire Line
	4750 3450 4950 3450
Wire Wire Line
	4750 4200 4950 4200
Wire Wire Line
	4850 2150 4850 2900
Wire Wire Line
	4850 2900 4850 3650
Wire Wire Line
	4850 3650 4850 4400
Wire Wire Line
	4850 4400 4850 4650
Wire Wire Line
	4850 4400 4950 4400
Wire Wire Line
	4850 4650 4650 4650
Wire Wire Line
	4900 4950 4900 5000
Wire Wire Line
	4900 5000 4800 5000
Wire Wire Line
	4900 5000 4900 5050
Wire Wire Line
	4950 1950 4750 1950
Wire Wire Line
	4950 2150 4850 2150
Wire Wire Line
	4950 2900 4850 2900
Wire Wire Line
	4950 3650 4850 3650
Wire Wire Line
	5450 1950 5850 1950
Wire Wire Line
	5450 2700 5750 2700
Wire Wire Line
	5450 3450 5650 3450
Wire Wire Line
	5450 4200 5550 4200
Wire Wire Line
	5450 5000 6050 5000
Wire Wire Line
	5550 4200 5550 1800
Wire Wire Line
	5550 4200 5550 4450
Wire Wire Line
	5550 4200 7050 4200
Wire Wire Line
	5550 4450 5550 4750
Wire Wire Line
	5650 3450 5650 1800
Wire Wire Line
	5650 3450 5650 4100
Wire Wire Line
	5650 4100 5650 4550
Wire Wire Line
	5650 4550 5650 4750
Wire Wire Line
	5750 1800 5750 2700
Wire Wire Line
	5750 2700 5750 3350
Wire Wire Line
	5750 3350 5750 4000
Wire Wire Line
	5750 4000 5750 4650
Wire Wire Line
	5750 4650 5750 4750
Wire Wire Line
	5850 1950 5850 1800
Wire Wire Line
	5850 1950 5850 2600
Wire Wire Line
	5850 2600 5850 3250
Wire Wire Line
	5850 2600 6450 2600
Wire Wire Line
	5850 3250 5850 3900
Wire Wire Line
	5850 3900 5850 4750
Wire Wire Line
	6050 1850 6050 1800
Wire Wire Line
	6050 1850 6450 1850
Wire Wire Line
	6050 2500 6050 1850
Wire Wire Line
	6050 2500 6450 2500
Wire Wire Line
	6050 3150 6050 2500
Wire Wire Line
	6050 3800 6050 3150
Wire Wire Line
	6050 5000 6050 3800
Wire Wire Line
	6450 1950 5850 1950
Wire Wire Line
	6450 3150 6050 3150
Wire Wire Line
	6450 3250 5850 3250
Wire Wire Line
	6450 3350 5750 3350
Wire Wire Line
	6450 3800 6050 3800
Wire Wire Line
	6450 3900 5850 3900
Wire Wire Line
	6450 4000 5750 4000
Wire Wire Line
	6450 4100 5650 4100
Wire Wire Line
	6450 4450 5550 4450
Wire Wire Line
	6450 4550 5650 4550
Wire Wire Line
	6450 4650 5750 4650
Wire Wire Line
	6450 4750 5850 4750
Wire Wire Line
	7000 1900 7900 1900
Wire Wire Line
	7000 2600 7000 2550
Wire Wire Line
	7000 2700 5750 2700
Wire Wire Line
	7050 3350 7050 3250
Wire Wire Line
	7050 3450 5650 3450
Wire Wire Line
	7050 4100 7050 3950
Wire Wire Line
	7050 4600 8750 4600
Wire Wire Line
	7550 2650 7800 2650
Wire Wire Line
	7600 3400 7700 3400
Wire Wire Line
	7600 4150 7600 5200
Wire Wire Line
	7600 5200 3800 5200
Wire Wire Line
	7700 3400 7700 5300
Wire Wire Line
	7800 2650 7800 5400
Wire Wire Line
	7800 5400 3600 5400
Wire Wire Line
	7900 1900 7900 5500
Wire Wire Line
	8750 5000 8750 4700
Wire Wire Line
	9300 4650 9500 4650
Wire Bus Line
	2500 1600 2350 1600
Text Notes 6000 1750 0    50   ~ 0
LO
Text Notes 8800 5000 0    50   ~ 0
LO
Text Label 2650 1800 0    50   ~ 0
XS0
Text Label 2650 2550 0    50   ~ 0
XS1
Text Label 2650 3300 0    50   ~ 0
XS2
Text Label 2650 4050 0    50   ~ 0
XS3
Text HLabel 1550 4900 0    50   Input ~ 0
~LOAD
Text HLabel 1550 5450 0    50   Input ~ 0
~RESET
Text HLabel 2350 1600 0    50   Input ~ 0
XS[0..3]
Text HLabel 4650 4650 0    50   Input ~ 0
~CLK8M
Text HLabel 9500 4650 2    50   Output ~ 0
SERIAL-END
$Comp
L power:VCC #PWR?
U 1 1 5FB8849F
P 4800 5000
AR Path="/60BA673A/5FB8849F" Ref="#PWR?"  Part="1" 
AR Path="/5FB6D140/5FB8849F" Ref="#PWR?"  Part="1" 
AR Path="/5FB596E4/5FB8849F" Ref="#PWR?"  Part="1" 
AR Path="/5FBBD4DB/5FBBDC14/5FB8849F" Ref="#PWR0139"  Part="1" 
F 0 "#PWR0139" H 4800 4850 50  0001 C CNN
F 1 "VCC" H 4815 5173 50  0000 C CNN
F 2 "" H 4800 5000 50  0001 C CNN
F 3 "" H 4800 5000 50  0001 C CNN
	1    4800 5000
	1    0    0    -1  
$EndComp
$Comp
L power:VCC #PWR?
U 1 1 5FB884A5
P 8150 5000
AR Path="/60BA673A/5FB884A5" Ref="#PWR?"  Part="1" 
AR Path="/5FB6D140/5FB884A5" Ref="#PWR?"  Part="1" 
AR Path="/5FB596E4/5FB884A5" Ref="#PWR?"  Part="1" 
AR Path="/5FBBD4DB/5FBBDC14/5FB884A5" Ref="#PWR0140"  Part="1" 
F 0 "#PWR0140" H 8150 4850 50  0001 C CNN
F 1 "VCC" H 8165 5173 50  0000 C CNN
F 2 "" H 8150 5000 50  0001 C CNN
F 3 "" H 8150 5000 50  0001 C CNN
	1    8150 5000
	1    0    0    -1  
$EndComp
$Comp
L A5C:AND02 UAY?
U 1 1 5FB884C3
P 2500 4950
AR Path="/60BA673A/5FB884C3" Ref="UAY?"  Part="1" 
AR Path="/5FB6D140/5FB884C3" Ref="UAL122"  Part="1" 
AR Path="/5FB596E4/5FB884C3" Ref="UAL122"  Part="1" 
AR Path="/5FBBD4DB/5FBBDC14/5FB884C3" Ref="UAL122"  Part="1" 
F 0 "UAL122" H 2525 5217 50  0000 C CNN
F 1 "AND02" H 2525 5126 50  0000 C CNN
F 2 "" H 2500 4950 50  0001 C CNN
F 3 "" H 2500 4950 50  0001 C CNN
	1    2500 4950
	1    0    0    -1  
$EndComp
$Comp
L A5C:AND02 UAY?
U 1 1 5FB884C9
P 2500 5400
AR Path="/60BA673A/5FB884C9" Ref="UAY?"  Part="1" 
AR Path="/5FB6D140/5FB884C9" Ref="UAL119"  Part="1" 
AR Path="/5FB596E4/5FB884C9" Ref="UAL119"  Part="1" 
AR Path="/5FBBD4DB/5FBBDC14/5FB884C9" Ref="UAL119"  Part="1" 
F 0 "UAL119" H 2525 5667 50  0000 C CNN
F 1 "AND02" H 2525 5576 50  0000 C CNN
F 2 "" H 2500 5400 50  0001 C CNN
F 3 "" H 2500 5400 50  0001 C CNN
	1    2500 5400
	1    0    0    -1  
$EndComp
$Comp
L A5C:NAND02 UAY?
U 1 1 5FB884CF
P 5150 5000
AR Path="/60BA673A/5FB884CF" Ref="UAY?"  Part="1" 
AR Path="/5FB6D140/5FB884CF" Ref="UAL94"  Part="1" 
AR Path="/5FB596E4/5FB884CF" Ref="UAL94"  Part="1" 
AR Path="/5FBBD4DB/5FBBDC14/5FB884CF" Ref="UAL94"  Part="1" 
F 0 "UAL94" H 5175 5267 50  0000 C CNN
F 1 "NAND02" H 5175 5176 50  0000 C CNN
F 2 "" H 5150 5000 50  0001 C CNN
F 3 "" H 5150 5000 50  0001 C CNN
	1    5150 5000
	1    0    0    -1  
$EndComp
$Comp
L A5C:XOR02 UAY?
U 1 1 5FB884D5
P 6700 1900
AR Path="/60BA673A/5FB884D5" Ref="UAY?"  Part="1" 
AR Path="/5FB6D140/5FB884D5" Ref="UAL96"  Part="1" 
AR Path="/5FB596E4/5FB884D5" Ref="UAL96"  Part="1" 
AR Path="/5FBBD4DB/5FBBDC14/5FB884D5" Ref="UAL96"  Part="1" 
F 0 "UAL96" H 6725 2167 50  0000 C CNN
F 1 "XOR02" H 6725 2076 50  0000 C CNN
F 2 "" H 6700 1900 50  0001 C CNN
F 3 "" H 6700 1900 50  0001 C CNN
	1    6700 1900
	1    0    0    -1  
$EndComp
$Comp
L A5C:NOR02 UAY?
U 1 1 5FB884DB
P 6700 2550
AR Path="/60BA673A/5FB884DB" Ref="UAY?"  Part="1" 
AR Path="/5FB6D140/5FB884DB" Ref="UAL106"  Part="1" 
AR Path="/5FB596E4/5FB884DB" Ref="UAL106"  Part="1" 
AR Path="/5FBBD4DB/5FBBDC14/5FB884DB" Ref="UAL106"  Part="1" 
F 0 "UAL106" H 6725 2817 50  0000 C CNN
F 1 "NOR02" H 6725 2726 50  0000 C CNN
F 2 "" H 6700 2550 50  0001 C CNN
F 3 "" H 6700 2550 50  0001 C CNN
	1    6700 2550
	1    0    0    -1  
$EndComp
$Comp
L A5C:XNOR02 UAY?
U 1 1 5FB884E1
P 7250 2650
AR Path="/60BA673A/5FB884E1" Ref="UAY?"  Part="1" 
AR Path="/5FB6D140/5FB884E1" Ref="UAL109"  Part="1" 
AR Path="/5FB596E4/5FB884E1" Ref="UAL109"  Part="1" 
AR Path="/5FBBD4DB/5FBBDC14/5FB884E1" Ref="UAL109"  Part="1" 
F 0 "UAL109" H 7275 2917 50  0000 C CNN
F 1 "XNOR02" H 7275 2826 50  0000 C CNN
F 2 "" H 7275 2650 50  0001 C CNN
F 3 "" H 7275 2650 50  0001 C CNN
	1    7250 2650
	1    0    0    -1  
$EndComp
$Comp
L A5C:XNOR02 UAZ?
U 1 1 5FB884E7
P 7300 3400
AR Path="/60BA673A/5FB884E7" Ref="UAZ?"  Part="1" 
AR Path="/5FB6D140/5FB884E7" Ref="UAN118"  Part="1" 
AR Path="/5FB596E4/5FB884E7" Ref="UAN118"  Part="1" 
AR Path="/5FBBD4DB/5FBBDC14/5FB884E7" Ref="UAN118"  Part="1" 
F 0 "UAN118" H 7325 3667 50  0000 C CNN
F 1 "XNOR02" H 7325 3576 50  0000 C CNN
F 2 "" H 7325 3400 50  0001 C CNN
F 3 "" H 7325 3400 50  0001 C CNN
	1    7300 3400
	1    0    0    -1  
$EndComp
$Comp
L A5C:XNOR02 UAZ?
U 1 1 5FB884ED
P 7300 4150
AR Path="/60BA673A/5FB884ED" Ref="UAZ?"  Part="1" 
AR Path="/5FB6D140/5FB884ED" Ref="UAN105"  Part="1" 
AR Path="/5FB596E4/5FB884ED" Ref="UAN105"  Part="1" 
AR Path="/5FBBD4DB/5FBBDC14/5FB884ED" Ref="UAN105"  Part="1" 
F 0 "UAN105" H 7325 4417 50  0000 C CNN
F 1 "XNOR02" H 7325 4326 50  0000 C CNN
F 2 "" H 7325 4150 50  0001 C CNN
F 3 "" H 7325 4150 50  0001 C CNN
	1    7300 4150
	1    0    0    -1  
$EndComp
$Comp
L A5C:NOR02 UAZ?
U 1 1 5FB884F3
P 9000 4650
AR Path="/60BA673A/5FB884F3" Ref="UAZ?"  Part="1" 
AR Path="/5FB6D140/5FB884F3" Ref="UAN93"  Part="1" 
AR Path="/5FB596E4/5FB884F3" Ref="UAN93"  Part="1" 
AR Path="/5FBBD4DB/5FBBDC14/5FB884F3" Ref="UAN93"  Part="1" 
F 0 "UAN93" H 9025 4917 50  0000 C CNN
F 1 "NOR02" H 9025 4826 50  0000 C CNN
F 2 "" H 9000 4650 50  0001 C CNN
F 3 "" H 9000 4650 50  0001 C CNN
	1    9000 4650
	1    0    0    -1  
$EndComp
$Comp
L A5C:INV01 UAY?
U 1 1 5FB88505
P 1950 4900
AR Path="/60BA673A/5FB88505" Ref="UAY?"  Part="1" 
AR Path="/5FB6D140/5FB88505" Ref="UAL121"  Part="1" 
AR Path="/5FB596E4/5FB88505" Ref="UAL121"  Part="1" 
AR Path="/5FBBD4DB/5FBBDC14/5FB88505" Ref="UAL121"  Part="1" 
F 0 "UAL121" H 1950 5217 50  0000 C CNN
F 1 "INV01" H 1950 5126 50  0000 C CNN
F 2 "" H 1950 4700 50  0001 C CNN
F 3 "" H 1950 4700 50  0001 C CNN
	1    1950 4900
	1    0    0    -1  
$EndComp
$Comp
L A5C:NOR03 UAZ?
U 1 1 5FB8851D
P 6750 3250
AR Path="/60BA673A/5FB8851D" Ref="UAZ?"  Part="1" 
AR Path="/5FB6D140/5FB8851D" Ref="UAN122"  Part="1" 
AR Path="/5FB596E4/5FB8851D" Ref="UAN122"  Part="1" 
AR Path="/5FBBD4DB/5FBBDC14/5FB8851D" Ref="UAN122"  Part="1" 
F 0 "UAN122" H 6750 3567 50  0000 C CNN
F 1 "NOR03" H 6750 3476 50  0000 C CNN
F 2 "" H 6750 3250 50  0001 C CNN
F 3 "" H 6750 3250 50  0001 C CNN
	1    6750 3250
	1    0    0    -1  
$EndComp
$Comp
L A5C:INV01 UAY?
U 1 1 5FB88523
P 8450 5000
AR Path="/60BA673A/5FB88523" Ref="UAY?"  Part="1" 
AR Path="/5FB6D140/5FB88523" Ref="UAL93"  Part="1" 
AR Path="/5FB596E4/5FB88523" Ref="UAL93"  Part="1" 
AR Path="/5FBBD4DB/5FBBDC14/5FB88523" Ref="UAL93"  Part="1" 
F 0 "UAL93" H 8450 5317 50  0000 C CNN
F 1 "INV01" H 8450 5226 50  0000 C CNN
F 2 "" H 8450 4800 50  0001 C CNN
F 3 "" H 8450 4800 50  0001 C CNN
	1    8450 5000
	1    0    0    -1  
$EndComp
$Comp
L A5C:DFFCOO UAY?
U 1 1 5FB88529
P 5200 2050
AR Path="/60BA673A/5FB88529" Ref="UAY?"  Part="1" 
AR Path="/5FB6D140/5FB88529" Ref="UAL102"  Part="1" 
AR Path="/5FB596E4/5FB88529" Ref="UAL102"  Part="1" 
AR Path="/5FBBD4DB/5FBBDC14/5FB88529" Ref="UAL102"  Part="1" 
F 0 "UAL102" H 5200 2415 50  0000 C CNN
F 1 "DFFCOO" H 5200 2324 50  0000 C CNN
F 2 "" H 5200 2050 50  0001 C CNN
F 3 "" H 5200 2050 50  0001 C CNN
	1    5200 2050
	1    0    0    -1  
$EndComp
$Comp
L A5C:DFFCOO UAY?
U 1 1 5FB8852F
P 5200 2800
AR Path="/60BA673A/5FB8852F" Ref="UAY?"  Part="1" 
AR Path="/5FB6D140/5FB8852F" Ref="UAL114"  Part="1" 
AR Path="/5FB596E4/5FB8852F" Ref="UAL114"  Part="1" 
AR Path="/5FBBD4DB/5FBBDC14/5FB8852F" Ref="UAL114"  Part="1" 
F 0 "UAL114" H 5200 3165 50  0000 C CNN
F 1 "DFFCOO" H 5200 3074 50  0000 C CNN
F 2 "" H 5200 2800 50  0001 C CNN
F 3 "" H 5200 2800 50  0001 C CNN
	1    5200 2800
	1    0    0    -1  
$EndComp
$Comp
L A5C:DFFCOO UAZ?
U 1 1 5FB88535
P 5200 3550
AR Path="/60BA673A/5FB88535" Ref="UAZ?"  Part="1" 
AR Path="/5FB6D140/5FB88535" Ref="UAN111"  Part="1" 
AR Path="/5FB596E4/5FB88535" Ref="UAN111"  Part="1" 
AR Path="/5FBBD4DB/5FBBDC14/5FB88535" Ref="UAN111"  Part="1" 
F 0 "UAN111" H 5200 3915 50  0000 C CNN
F 1 "DFFCOO" H 5200 3824 50  0000 C CNN
F 2 "" H 5200 3550 50  0001 C CNN
F 3 "" H 5200 3550 50  0001 C CNN
	1    5200 3550
	1    0    0    -1  
$EndComp
$Comp
L A5C:DFFCOO UAZ?
U 1 1 5FB8853B
P 5200 4300
AR Path="/60BA673A/5FB8853B" Ref="UAZ?"  Part="1" 
AR Path="/5FB6D140/5FB8853B" Ref="UAN98"  Part="1" 
AR Path="/5FB596E4/5FB8853B" Ref="UAN98"  Part="1" 
AR Path="/5FBBD4DB/5FBBDC14/5FB8853B" Ref="UAN98"  Part="1" 
F 0 "UAN98" H 5200 4665 50  0000 C CNN
F 1 "DFFCOO" H 5200 4574 50  0000 C CNN
F 2 "" H 5200 4300 50  0001 C CNN
F 3 "" H 5200 4300 50  0001 C CNN
	1    5200 4300
	1    0    0    -1  
$EndComp
$Comp
L A5C:NOR04 UAZ?
U 1 1 5FB88541
P 6750 3950
AR Path="/60BA673A/5FB88541" Ref="UAZ?"  Part="1" 
AR Path="/5FB6D140/5FB88541" Ref="UAN108"  Part="1" 
AR Path="/5FB596E4/5FB88541" Ref="UAN108"  Part="1" 
AR Path="/5FBBD4DB/5FBBDC14/5FB88541" Ref="UAN108"  Part="1" 
F 0 "UAN108" H 6750 4292 50  0000 C CNN
F 1 "NOR04" H 6750 4201 50  0000 C CNN
F 2 "" H 6750 3950 50  0001 C CNN
F 3 "" H 6750 3950 50  0001 C CNN
	1    6750 3950
	1    0    0    -1  
$EndComp
$Comp
L A5C:OR04 UAZ?
U 1 1 5FB88547
P 6750 4600
AR Path="/60BA673A/5FB88547" Ref="UAZ?"  Part="1" 
AR Path="/5FB6D140/5FB88547" Ref="UAN95"  Part="1" 
AR Path="/5FB596E4/5FB88547" Ref="UAN95"  Part="1" 
AR Path="/5FBBD4DB/5FBBDC14/5FB88547" Ref="UAN95"  Part="1" 
F 0 "UAN95" H 6750 4942 50  0000 C CNN
F 1 "OR04" H 6750 4851 50  0000 C CNN
F 2 "" H 6750 4600 50  0001 C CNN
F 3 "" H 6750 4600 50  0001 C CNN
	1    6750 4600
	1    0    0    -1  
$EndComp
$Comp
L A5C:AOI22 UAY?
U 1 1 5FB8854D
P 4300 1900
AR Path="/60BA673A/5FB8854D" Ref="UAY?"  Part="1" 
AR Path="/5FB6D140/5FB8854D" Ref="UAL99"  Part="1" 
AR Path="/5FB596E4/5FB8854D" Ref="UAL99"  Part="1" 
AR Path="/5FBBD4DB/5FBBDC14/5FB8854D" Ref="UAL99"  Part="1" 
F 0 "UAL99" H 4325 2217 50  0000 C CNN
F 1 "AOI22" H 4325 2126 50  0000 C CNN
F 2 "" H 4450 1900 50  0001 C CNN
F 3 "" H 4450 1900 50  0001 C CNN
	1    4300 1900
	1    0    0    -1  
$EndComp
$Comp
L A5C:AOI22 UAY?
U 1 1 5FB88553
P 4300 2650
AR Path="/60BA673A/5FB88553" Ref="UAY?"  Part="1" 
AR Path="/5FB6D140/5FB88553" Ref="UAL111"  Part="1" 
AR Path="/5FB596E4/5FB88553" Ref="UAL111"  Part="1" 
AR Path="/5FBBD4DB/5FBBDC14/5FB88553" Ref="UAL111"  Part="1" 
F 0 "UAL111" H 4325 2967 50  0000 C CNN
F 1 "AOI22" H 4325 2876 50  0000 C CNN
F 2 "" H 4450 2650 50  0001 C CNN
F 3 "" H 4450 2650 50  0001 C CNN
	1    4300 2650
	1    0    0    -1  
$EndComp
$Comp
L A5C:AOI22 UAZ?
U 1 1 5FB88559
P 4300 3400
AR Path="/60BA673A/5FB88559" Ref="UAZ?"  Part="1" 
AR Path="/5FB6D140/5FB88559" Ref="UAN116"  Part="1" 
AR Path="/5FB596E4/5FB88559" Ref="UAN116"  Part="1" 
AR Path="/5FBBD4DB/5FBBDC14/5FB88559" Ref="UAN116"  Part="1" 
F 0 "UAN116" H 4325 3717 50  0000 C CNN
F 1 "AOI22" H 4325 3626 50  0000 C CNN
F 2 "" H 4450 3400 50  0001 C CNN
F 3 "" H 4450 3400 50  0001 C CNN
	1    4300 3400
	1    0    0    -1  
$EndComp
$Comp
L A5C:AOI22 UAZ?
U 1 1 5FB8855F
P 4300 4150
AR Path="/60BA673A/5FB8855F" Ref="UAZ?"  Part="1" 
AR Path="/5FB6D140/5FB8855F" Ref="UAN103"  Part="1" 
AR Path="/5FB596E4/5FB8855F" Ref="UAN103"  Part="1" 
AR Path="/5FBBD4DB/5FBBDC14/5FB8855F" Ref="UAN103"  Part="1" 
F 0 "UAN103" H 4325 4467 50  0000 C CNN
F 1 "AOI22" H 4325 4376 50  0000 C CNN
F 2 "" H 4450 4150 50  0001 C CNN
F 3 "" H 4450 4150 50  0001 C CNN
	1    4300 4150
	1    0    0    -1  
$EndComp
NoConn ~ 5450 2050
NoConn ~ 5450 2800
NoConn ~ 5450 3550
NoConn ~ 5450 4300
Wire Bus Line
	2500 1600 2500 3950
$EndSCHEMATC
