EESchema Schematic File Version 4
EELAYER 30 0
EELAYER END
$Descr A4 11693 8268
encoding utf-8
Sheet 55 69
Title ""
Date "2020-11-26"
Rev ""
Comp ""
Comment1 "Licence: CC-BY"
Comment2 "Author: Loïc *WydD* Petit"
Comment3 ""
Comment4 ""
$EndDescr
Connection ~ 4600 5250
Connection ~ 4600 5500
Wire Wire Line
	3450 5250 3550 5250
Wire Wire Line
	3450 5400 3550 5400
Wire Wire Line
	3450 6000 3900 6000
Wire Wire Line
	5950 1150 6100 1150
Wire Wire Line
	5950 1250 6100 1250
Wire Wire Line
	5950 1350 6100 1350
Wire Wire Line
	5950 1450 6100 1450
Wire Wire Line
	5950 1550 6100 1550
Wire Wire Line
	5950 1650 6100 1650
Wire Wire Line
	5950 1750 6100 1750
Wire Wire Line
	5950 1850 6100 1850
Wire Wire Line
	5950 1950 6100 1950
Wire Wire Line
	5950 2050 6100 2050
Wire Wire Line
	5950 2200 6100 2200
Wire Wire Line
	5950 2300 6100 2300
Wire Wire Line
	5950 2400 6100 2400
Wire Wire Line
	5950 2500 6100 2500
Wire Wire Line
	5950 2600 6100 2600
Wire Wire Line
	5950 2750 6100 2750
Wire Wire Line
	5950 2850 6100 2850
Wire Wire Line
	5950 3000 6100 3000
Wire Wire Line
	5950 4600 6100 4600
Wire Wire Line
	5950 4700 6100 4700
Wire Wire Line
	5950 4800 6100 4800
Wire Wire Line
	5950 4900 6100 4900
Wire Wire Line
	5950 5000 6100 5000
Wire Wire Line
	5950 5150 6100 5150
Wire Wire Line
	5950 5250 6100 5250
Wire Wire Line
	6100 3550 5950 3550
Wire Wire Line
	6100 3650 5950 3650
Wire Wire Line
	6100 3750 5950 3750
Wire Wire Line
	6100 3850 5950 3850
Wire Wire Line
	6100 3950 5950 3950
Wire Wire Line
	6100 4050 5950 4050
Wire Wire Line
	6100 4150 5950 4150
Wire Wire Line
	6100 4250 5950 4250
Wire Wire Line
	6100 4350 5950 4350
Wire Wire Line
	6100 4450 5950 4450
Wire Bus Line
	4450 5250 4600 5250
Wire Bus Line
	4600 3000 4600 3550
Wire Bus Line
	4600 3550 4700 3550
Wire Bus Line
	4600 3700 4600 5250
Wire Bus Line
	4600 3700 4700 3700
Wire Bus Line
	4600 5250 4600 5500
Wire Bus Line
	4600 5800 4600 5500
Wire Bus Line
	4700 3000 4600 3000
Wire Bus Line
	4700 5800 4600 5800
Wire Bus Line
	5950 5900 6100 5900
Wire Bus Line
	6100 5500 4600 5500
Text Notes 1900 4600 0    200  ~ 0
SECURITY CONFIG
$Sheet
S 4700 1000 1250 2150
U 5FBFA08D
F0 "addr-decoder" 50
F1 "addr-decoder.sch" 50
F2 "CA[1..5]" O L 4700 3000 50 
F3 "CA-IN[1..5]" I L 4700 1250 50 
F4 "LE" I L 4700 1150 50 
F5 "0x10" O R 5950 1950 50 
F6 "0x12" O R 5950 2050 50 
F7 "0x30" O R 5950 2750 50 
F8 "0x32" O R 5950 2850 50 
F9 "0x3E" O R 5950 3000 50 
F10 "0x00" O R 5950 1150 50 
F11 "0x02" O R 5950 1250 50 
F12 "0x04" O R 5950 1350 50 
F13 "0x06" O R 5950 1450 50 
F14 "0x08" O R 5950 1550 50 
F15 "0x0A" O R 5950 1650 50 
F16 "0x0C" O R 5950 1750 50 
F17 "0x0E" O R 5950 1850 50 
F18 "0x26" O R 5950 2200 50 
F19 "0x28" O R 5950 2300 50 
F20 "0x2A" O R 5950 2400 50 
F21 "0x2C" O R 5950 2500 50 
F22 "0x2E" O R 5950 2600 50 
$EndSheet
$Sheet
S 4700 3400 1250 1950
U 5FBFA07D
F0 "addr-decoder-registry" 50
F1 "addr-decoder-registry.sch" 50
F2 "CA[1..5]" I L 4700 3550 50 
F3 "~PAL-CTRL" O R 5950 5150 50 
F4 "~LAYER-CTRL" O R 5950 4600 50 
F5 "~PRIORITY1" O R 5950 4800 50 
F6 "~MULT-LSB" O R 5950 3750 50 
F7 "~PRIORITY2" O R 5950 4900 50 
F8 "~RASTER1" O R 5950 4250 50 
F9 "~PRIORITY0" O R 5950 4700 50 
F10 "~PRIORITY3" O R 5950 5000 50 
F11 "~MULT-MSB" O R 5950 3850 50 
F12 "~RASTER2" O R 5950 4350 50 
F13 "~CHECK2" O R 5950 4150 50 
F14 "~MULT-Y" O R 5950 3650 50 
F15 "~CPS-ID" O R 5950 5250 50 
F16 "~CHECK1" O R 5950 4050 50 
F17 "~RASTER3" O R 5950 4450 50 
F18 "~MULT-TC" O R 5950 3950 50 
F19 "~MULT-X" O R 5950 3550 50 
F20 "KEY[6..134]" I L 4700 3700 50 
$EndSheet
$Sheet
S 4700 5650 1250 500 
U 5FBFA073
F0 "bus-mux-key" 50
F1 "bus-mux-key.sch" 50
F2 "BUS-DATA[0..7]" I L 4700 6000 50 
F3 "KEY[11..137]" I L 4700 5800 50 
F4 "LAYER-D[1..5]" O R 5950 5900 50 
$EndSheet
$Sheet
S 2150 5100 1300 1050
U 5FBFA081
F0 "keyinject" 50
F1 "keyinject.sch" 50
F2 "E2" I L 2150 6000 50 
F3 "~E1" I L 2150 5900 50 
F4 "KEY-DATA" O R 3450 5250 50 
F5 "KEY-CLK" O R 3450 5400 50 
F6 "STAGE1-Q" O R 3450 6000 50 
F7 "S1-STROBE" I L 2150 5600 50 
F8 "SEC-DATA" I L 2150 5250 50 
F9 "SEC-CLK" I L 2150 5350 50 
$EndSheet
$Sheet
S 3550 5100 900  450 
U 5FBFA082
F0 "security-key" 50
F1 "security-key.sch" 50
F2 "KEY[0..143]" O R 4450 5250 50 
F3 "DATA" I L 3550 5250 50 
F4 "CLK" I L 3550 5400 50 
$EndSheet
Wire Bus Line
	7550 6000 7650 6000
Wire Bus Line
	7650 6000 7650 6350
Wire Bus Line
	7650 6350 4600 6350
Wire Bus Line
	4600 6350 4600 6000
Wire Bus Line
	4600 6000 4700 6000
Wire Bus Line
	4600 6350 4300 6350
Connection ~ 4600 6350
Text HLabel 4300 6350 0    50   Input ~ 0
BUS-DATA[0..7]
Text HLabel 2050 5600 0    50   Input ~ 0
SEC-STROBE
Wire Wire Line
	2050 5600 2150 5600
Text HLabel 2050 5900 0    50   Input ~ 0
~SEC-E1
Wire Wire Line
	2050 5900 2150 5900
Text HLabel 2050 6000 0    50   Input ~ 0
SEC-E2
Wire Wire Line
	2050 6000 2150 6000
Text HLabel 3900 6000 2    50   Output ~ 0
STAGE1-Q
Text HLabel 7650 2500 2    50   Output ~ 0
CHECK2-D[0..15]
Text HLabel 7650 2350 2    50   Output ~ 0
CHECK1-D[0..15]
Text HLabel 7650 2200 2    50   Output ~ 0
CPS-ID-D[0..15]
Wire Bus Line
	7550 2200 7650 2200
Wire Bus Line
	7650 2350 7550 2350
Wire Bus Line
	7550 2500 7650 2500
Wire Wire Line
	7550 1150 7650 1150
Text HLabel 7650 1150 2    50   Input ~ 0
DEFAULT
Text HLabel 7650 1450 2    50   3State ~ 0
TD[0..11]
Wire Bus Line
	7550 1450 7650 1450
Wire Wire Line
	7550 1550 7650 1550
Wire Wire Line
	7550 1650 7650 1650
Text HLabel 7650 1550 2    50   Input ~ 0
~BUS-RD
Text HLabel 7650 1650 2    50   Input ~ 0
~BUS-WR
Wire Bus Line
	4700 1250 4250 1250
Text HLabel 4250 1250 0    50   Input ~ 0
CA[1..5]
Text HLabel 4250 1150 0    50   Input ~ 0
~IO-READ
Wire Wire Line
	4250 1150 4700 1150
Wire Wire Line
	7550 3550 7650 3550
Text HLabel 7650 3550 2    50   Output ~ 0
~MULT-X
Wire Wire Line
	7550 3650 7650 3650
Text HLabel 7650 3650 2    50   Output ~ 0
~MULT-Y
Wire Wire Line
	7550 3750 7650 3750
Text HLabel 7650 3750 2    50   Output ~ 0
~MULT-LSB
Wire Wire Line
	7550 3850 7650 3850
Text HLabel 7650 3850 2    50   Output ~ 0
~MULT-MSB
Wire Wire Line
	7550 3950 7650 3950
Text HLabel 7650 3950 2    50   Output ~ 0
~MULT-TC
Wire Wire Line
	7550 4050 7650 4050
Text HLabel 7650 4050 2    50   Output ~ 0
~CHECK1
Wire Wire Line
	7550 4150 7650 4150
Text HLabel 7650 4150 2    50   Output ~ 0
~CHECK2
Wire Wire Line
	7550 4600 7650 4600
Text HLabel 7650 4600 2    50   Output ~ 0
~LAYER-CTRL
Wire Wire Line
	7550 5150 7650 5150
Text HLabel 7650 5150 2    50   Output ~ 0
~PAL-CTRL
Wire Wire Line
	7550 5250 7650 5250
Text HLabel 7650 5250 2    50   Output ~ 0
~CPS-ID
Wire Wire Line
	7550 5400 7650 5400
Text HLabel 7650 5400 2    50   Output ~ 0
~SCANLINE
Text HLabel 7650 5900 2    50   Output ~ 0
LAYER-D[1..5]
Wire Bus Line
	7550 5900 7650 5900
Text Label 8250 4700 0    50   ~ 0
~PRIORITY0
Text Label 8250 4800 0    50   ~ 0
~PRIORITY1
Text Label 8250 4900 0    50   ~ 0
~PRIORITY2
Text Label 8250 5000 0    50   ~ 0
~PRIORITY3
Entry Wire Line
	8650 4700 8750 4800
Entry Wire Line
	8650 4800 8750 4900
Entry Wire Line
	8650 4900 8750 5000
Wire Wire Line
	7550 4700 8650 4700
Wire Wire Line
	7550 4800 8650 4800
Wire Wire Line
	7550 4900 8650 4900
Entry Wire Line
	8650 5000 8750 5100
Wire Wire Line
	7550 5000 8650 5000
Text HLabel 7650 4250 2    50   Output ~ 0
~RASTER1
Text HLabel 7650 4350 2    50   Output ~ 0
~RASTER2
Text HLabel 7650 4450 2    50   Output ~ 0
~RASTER3
Wire Wire Line
	7650 4250 7550 4250
Wire Wire Line
	7650 4350 7550 4350
Wire Wire Line
	7650 4450 7550 4450
Wire Bus Line
	8750 5200 8850 5200
Text HLabel 8850 5200 2    50   Output ~ 0
~PRIORITY[0..3]
Text HLabel 2050 5250 0    50   Input ~ 0
SEC-DATA
Wire Wire Line
	2050 5250 2150 5250
Text HLabel 2050 5350 0    50   Input ~ 0
SEC-CLK
Wire Wire Line
	2050 5350 2150 5350
Text HLabel 7650 1350 2    50   Input ~ 0
~DEBUG[8..15]
Wire Bus Line
	7550 1350 7650 1350
Text Notes 2100 4950 0    50   ~ 0
Note: this whole section is powered by VBAT and not by VCC.
$Comp
L power:PWR_FLAG #FLG0103
U 1 1 62EB98BE
P 2250 6350
F 0 "#FLG0103" H 2250 6425 50  0001 C CNN
F 1 "PWR_FLAG" H 2250 6523 50  0001 C CNN
F 2 "" H 2250 6350 50  0001 C CNN
F 3 "~" H 2250 6350 50  0001 C CNN
	1    2250 6350
	1    0    0    -1  
$EndComp
Text HLabel 2000 6350 0    50   Input ~ 0
VBAT
Wire Wire Line
	2000 6350 2250 6350
$Sheet
S 6100 1000 1450 5150
U 5FBFA08C
F0 "security-decoder" 50
F1 "security-decoder.sch" 50
F2 "0x00" I L 6100 1150 50 
F3 "0x02" I L 6100 1250 50 
F4 "0x04" I L 6100 1350 50 
F5 "0x06" I L 6100 1450 50 
F6 "0x08" I L 6100 1550 50 
F7 "0x0A" I L 6100 1650 50 
F8 "0x0C" I L 6100 1750 50 
F9 "0x0E" I L 6100 1850 50 
F10 "0x10" I L 6100 1950 50 
F11 "0x12" I L 6100 2050 50 
F12 "0x30" I L 6100 2750 50 
F13 "0x32" I L 6100 2850 50 
F14 "0x3E" I L 6100 3000 50 
F15 "0x26" I L 6100 2200 50 
F16 "0x28" I L 6100 2300 50 
F17 "0x2A" I L 6100 2400 50 
F18 "0x2C" I L 6100 2500 50 
F19 "0x2E" I L 6100 2600 50 
F20 "~RD" I R 7550 1550 50 
F21 "~WR" I R 7550 1650 50 
F22 "DEFAULT" I R 7550 1150 50 
F23 "~RASTER3" O R 7550 4450 50 
F24 "~RASTER2" O R 7550 4350 50 
F25 "~LAYER-CTRL" O R 7550 4600 50 
F26 "~RASTER1" O R 7550 4250 50 
F27 "~CHECK2" O R 7550 4150 50 
F28 "~PRIORITY0" O R 7550 4700 50 
F29 "~CHECK1" O R 7550 4050 50 
F30 "~PRIORITY1" O R 7550 4800 50 
F31 "~MULT-TC" O R 7550 3950 50 
F32 "~PRIORITY2" O R 7550 4900 50 
F33 "~MULT-MSB" O R 7550 3850 50 
F34 "~PRIORITY3" O R 7550 5000 50 
F35 "~MULT-LSB" O R 7550 3750 50 
F36 "~PAL-CTRL" O R 7550 5150 50 
F37 "~MULT-Y" O R 7550 3650 50 
F38 "~CPS-ID" O R 7550 5250 50 
F39 "~MULT-X" O R 7550 3550 50 
F40 "~K-PRIORITY0" I L 6100 4700 50 
F41 "~K-PRIORITY1" I L 6100 4800 50 
F42 "~K-PRIORITY2" I L 6100 4900 50 
F43 "~K-PRIORITY3" I L 6100 5000 50 
F44 "~K-PAL-CTRL" I L 6100 5150 50 
F45 "~K-CPS-ID" I L 6100 5250 50 
F46 "~K-CHECK1" I L 6100 4050 50 
F47 "~K-CHECK2" I L 6100 4150 50 
F48 "~K-RASTER1" I L 6100 4250 50 
F49 "~K-RASTER2" I L 6100 4350 50 
F50 "~K-RASTER3" I L 6100 4450 50 
F51 "~K-LAYER-CTRL" I L 6100 4600 50 
F52 "~K-MULT-X" I L 6100 3550 50 
F53 "~K-MULT-Y" I L 6100 3650 50 
F54 "~K-MULT-LSB" I L 6100 3750 50 
F55 "~K-MULT-MSB" I L 6100 3850 50 
F56 "~K-MULT-TC" I L 6100 3950 50 
F57 "~SCANLINE" O R 7550 5400 50 
F58 "TD[0..11]" T R 7550 1450 50 
F59 "KEY[0..143]" I L 6100 5500 50 
F60 "CPS-ID-D[0..15]" O R 7550 2200 50 
F61 "CHECK2-D[0..15]" O R 7550 2500 50 
F62 "CHECK1-D[0..15]" O R 7550 2350 50 
F63 "~DEBUG[8..15]" I R 7550 1350 50 
F64 "K-LAYER-D[1..5]" I L 6100 5900 50 
F65 "BUS-DATA[1..5]" I R 7550 6000 50 
F66 "LAYER-D[1..5]" O R 7550 5900 50 
$EndSheet
Wire Bus Line
	8750 4800 8750 5200
$EndSCHEMATC
