EESchema Schematic File Version 4
EELAYER 30 0
EELAYER END
$Descr A3 16535 11693
encoding utf-8
Sheet 20 83
Title "CPS Reverse Engineering: DL-0311"
Date "2021-09-12"
Rev ""
Comp ""
Comment1 ""
Comment2 ""
Comment3 "Licence: CC-BY"
Comment4 "Author: Loïc *WydD* Petit"
$EndDescr
Connection ~ 9400 6150
Connection ~ 9400 5550
Connection ~ 9600 5750
Connection ~ 8450 5550
Connection ~ 9500 6250
Connection ~ 9400 6400
Connection ~ 9600 6350
Connection ~ 8450 6000
Connection ~ 9300 5950
Connection ~ 9500 6850
Connection ~ 8550 7300
Connection ~ 9600 6950
Connection ~ 10700 3800
Connection ~ 9600 3350
Connection ~ 11450 6200
Connection ~ 11550 6400
Connection ~ 8450 2700
Connection ~ 9500 5650
Connection ~ 9300 5450
Connection ~ 9200 5500
Connection ~ 10500 8200
Connection ~ 10400 8300
Connection ~ 10700 8000
Connection ~ 10600 8100
Connection ~ 9600 7300
Connection ~ 11450 6850
Connection ~ 8450 6450
Connection ~ 4000 8000
Connection ~ 4100 6750
Connection ~ 4100 6850
Connection ~ 4100 6650
Connection ~ 8400 7300
Connection ~ 11550 2850
Connection ~ 11450 2650
Connection ~ 12600 3550
Connection ~ 12600 5800
Connection ~ 11550 7050
Connection ~ 11450 7500
Connection ~ 11550 7700
Connection ~ 12600 7100
Connection ~ 12600 6450
Connection ~ 12600 2900
Connection ~ 13750 5700
Connection ~ 13650 6350
Connection ~ 13550 7000
Connection ~ 13450 7650
Connection ~ 13450 3450
Connection ~ 13550 2800
Connection ~ 3100 4000
Connection ~ 5450 7250
Connection ~ 10250 8950
Connection ~ 10250 1800
Connection ~ 7900 7300
Connection ~ 14500 4550
NoConn ~ 5200 4000
NoConn ~ 13200 3350
NoConn ~ 13200 6250
NoConn ~ 13200 5600
NoConn ~ 13200 6900
NoConn ~ 13200 7550
NoConn ~ 13200 2700
Entry Wire Line
	2200 7550 2300 7650
Entry Wire Line
	2200 7650 2300 7750
Entry Wire Line
	2200 7750 2300 7850
Entry Wire Line
	2300 3600 2400 3700
Entry Wire Line
	2300 3700 2400 3800
Entry Wire Line
	2300 3800 2400 3900
Entry Wire Line
	5350 6650 5450 6750
Entry Wire Line
	5350 6750 5450 6850
Entry Wire Line
	5350 6850 5450 6950
Entry Wire Line
	5350 6950 5450 7050
Entry Wire Line
	5350 7550 5450 7450
Entry Wire Line
	5350 7650 5450 7550
Entry Wire Line
	5350 7750 5450 7650
Entry Wire Line
	5350 7850 5450 7750
Entry Wire Line
	5600 3700 5700 3800
Entry Wire Line
	5600 3800 5700 3900
Entry Wire Line
	5600 3900 5700 4000
Entry Wire Line
	14400 2800 14500 2900
Entry Wire Line
	14400 3450 14500 3550
Entry Wire Line
	14400 5700 14500 5600
Entry Wire Line
	14400 6350 14500 6250
Entry Wire Line
	14400 7000 14500 6900
Entry Wire Line
	14400 7650 14500 7550
Wire Wire Line
	2250 8050 3100 8050
Wire Wire Line
	2300 7650 3100 7650
Wire Wire Line
	2300 7750 3100 7750
Wire Wire Line
	2300 7850 3100 7850
Wire Wire Line
	2400 3700 3200 3700
Wire Wire Line
	2400 3800 3200 3800
Wire Wire Line
	2400 3900 3200 3900
Wire Wire Line
	2500 4200 3200 4200
Wire Wire Line
	2700 7450 3100 7450
Wire Wire Line
	3000 7350 3000 8150
Wire Wire Line
	3000 8150 3100 8150
Wire Wire Line
	3100 4000 3100 3600
Wire Wire Line
	3100 4000 3100 4300
Wire Wire Line
	3100 4300 3200 4300
Wire Wire Line
	3100 7450 3100 7550
Wire Wire Line
	3200 4000 3100 4000
Wire Wire Line
	3800 8400 4000 8400
Wire Wire Line
	3900 4550 4100 4550
Wire Wire Line
	3900 7550 4100 7550
Wire Wire Line
	3900 7650 4100 7650
Wire Wire Line
	3900 7750 4100 7750
Wire Wire Line
	3900 7850 4100 7850
Wire Wire Line
	4000 3700 4200 3700
Wire Wire Line
	4000 3800 4200 3800
Wire Wire Line
	4000 3900 4200 3900
Wire Wire Line
	4000 4000 4200 4000
Wire Wire Line
	4000 7100 4000 8000
Wire Wire Line
	4000 8000 4100 8000
Wire Wire Line
	4000 8400 4000 8000
Wire Wire Line
	4100 4150 4200 4150
Wire Wire Line
	4100 4550 4100 4150
Wire Wire Line
	4100 6650 4100 6750
Wire Wire Line
	4100 6750 4100 6850
Wire Wire Line
	4100 6850 4100 6950
Wire Wire Line
	4100 7100 4000 7100
Wire Wire Line
	5100 6650 5350 6650
Wire Wire Line
	5100 6750 5350 6750
Wire Wire Line
	5100 6850 5350 6850
Wire Wire Line
	5100 6950 5350 6950
Wire Wire Line
	5100 7550 5350 7550
Wire Wire Line
	5100 7650 5350 7650
Wire Wire Line
	5100 7750 5350 7750
Wire Wire Line
	5100 7850 5350 7850
Wire Wire Line
	5200 3700 5600 3700
Wire Wire Line
	5200 3800 5600 3800
Wire Wire Line
	5200 3900 5600 3900
Wire Wire Line
	7700 7300 7900 7300
Wire Wire Line
	7900 4550 7900 7300
Wire Wire Line
	7900 7300 8400 7300
Wire Wire Line
	8000 5450 8550 5450
Wire Wire Line
	8000 8300 8000 5450
Wire Wire Line
	8000 8300 10400 8300
Wire Wire Line
	8100 5900 8550 5900
Wire Wire Line
	8100 8200 8100 5900
Wire Wire Line
	8100 8200 10500 8200
Wire Wire Line
	8200 6350 8550 6350
Wire Wire Line
	8200 8100 8200 6350
Wire Wire Line
	8200 8100 10600 8100
Wire Wire Line
	8300 2600 8550 2600
Wire Wire Line
	8300 3800 8300 2600
Wire Wire Line
	8300 3800 10700 3800
Wire Wire Line
	8300 6800 8550 6800
Wire Wire Line
	8300 8000 8300 6800
Wire Wire Line
	8300 8000 10700 8000
Wire Wire Line
	8400 7300 8550 7300
Wire Wire Line
	8400 7550 8400 7300
Wire Wire Line
	8400 7550 10800 7550
Wire Wire Line
	8450 1800 8250 1800
Wire Wire Line
	8450 1800 8450 2700
Wire Wire Line
	8450 2700 8450 5550
Wire Wire Line
	8450 5550 8450 6000
Wire Wire Line
	8450 6000 8450 6450
Wire Wire Line
	8450 6450 8450 6900
Wire Wire Line
	8450 6900 8550 6900
Wire Wire Line
	8550 2700 8450 2700
Wire Wire Line
	8550 5550 8450 5550
Wire Wire Line
	8550 6000 8450 6000
Wire Wire Line
	8550 6450 8450 6450
Wire Wire Line
	8550 7250 8550 7300
Wire Wire Line
	8550 7300 8550 7350
Wire Wire Line
	9100 2650 9750 2650
Wire Wire Line
	9100 5500 9200 5500
Wire Wire Line
	9100 5950 9300 5950
Wire Wire Line
	9100 6400 9400 6400
Wire Wire Line
	9100 7300 9600 7300
Wire Wire Line
	9200 4650 9200 5500
Wire Wire Line
	9200 4650 9300 4650
Wire Wire Line
	9200 5500 9200 7400
Wire Wire Line
	9300 4550 7900 4550
Wire Wire Line
	9300 4800 9300 5450
Wire Wire Line
	9300 4800 9850 4800
Wire Wire Line
	9300 5450 9300 5950
Wire Wire Line
	9300 5950 9300 7400
Wire Wire Line
	9400 4900 9400 5550
Wire Wire Line
	9400 4900 9850 4900
Wire Wire Line
	9400 5550 9400 6150
Wire Wire Line
	9400 5550 9700 5550
Wire Wire Line
	9400 6150 9400 6400
Wire Wire Line
	9400 6150 9750 6150
Wire Wire Line
	9400 6400 9400 7400
Wire Wire Line
	9500 5000 9500 5650
Wire Wire Line
	9500 5000 9850 5000
Wire Wire Line
	9500 5650 9500 6250
Wire Wire Line
	9500 5650 9700 5650
Wire Wire Line
	9500 6250 9500 6850
Wire Wire Line
	9500 6250 9750 6250
Wire Wire Line
	9500 6850 9100 6850
Wire Wire Line
	9500 6850 9500 7400
Wire Wire Line
	9500 6850 9750 6850
Wire Wire Line
	9600 2750 9600 3350
Wire Wire Line
	9600 2750 9750 2750
Wire Wire Line
	9600 3350 9600 4250
Wire Wire Line
	9600 3350 10800 3350
Wire Wire Line
	9600 5750 9600 5350
Wire Wire Line
	9600 5750 9600 6350
Wire Wire Line
	9600 6350 9600 6950
Wire Wire Line
	9600 6350 9750 6350
Wire Wire Line
	9600 6950 9600 7300
Wire Wire Line
	9600 6950 9750 6950
Wire Wire Line
	9600 7400 9600 7300
Wire Wire Line
	9700 5450 9300 5450
Wire Wire Line
	9700 5750 9600 5750
Wire Wire Line
	9850 4700 9850 4600
Wire Wire Line
	10250 1800 10050 1800
Wire Wire Line
	10250 1800 11550 1800
Wire Wire Line
	10250 2200 10250 1800
Wire Wire Line
	10250 8550 10250 8950
Wire Wire Line
	10250 8950 10050 8950
Wire Wire Line
	10250 8950 11550 8950
Wire Wire Line
	10300 2700 10800 2700
Wire Wire Line
	10300 5600 10800 5600
Wire Wire Line
	10300 6900 10800 6900
Wire Wire Line
	10400 5700 10800 5700
Wire Wire Line
	10400 8300 10400 5700
Wire Wire Line
	10500 6350 10800 6350
Wire Wire Line
	10500 8200 10500 6350
Wire Wire Line
	10600 2800 10600 3900
Wire Wire Line
	10600 3900 13550 3900
Wire Wire Line
	10600 7000 10600 8100
Wire Wire Line
	10600 8100 13550 8100
Wire Wire Line
	10700 3450 10800 3450
Wire Wire Line
	10700 3800 10700 3450
Wire Wire Line
	10700 7650 10800 7650
Wire Wire Line
	10700 8000 10700 7650
Wire Wire Line
	10800 2800 10600 2800
Wire Wire Line
	10800 6250 10300 6250
Wire Wire Line
	10800 7000 10600 7000
Wire Wire Line
	10850 2200 11450 2200
Wire Wire Line
	10850 8550 11450 8550
Wire Wire Line
	11050 4250 9600 4250
Wire Wire Line
	11050 4850 11050 4250
Wire Wire Line
	11350 2550 11650 2550
Wire Wire Line
	11350 3200 11650 3200
Wire Wire Line
	11350 5450 11650 5450
Wire Wire Line
	11350 6100 11650 6100
Wire Wire Line
	11350 6300 11650 6300
Wire Wire Line
	11350 6750 11650 6750
Wire Wire Line
	11350 7400 11650 7400
Wire Wire Line
	11450 2200 11450 2650
Wire Wire Line
	11450 2650 11450 3300
Wire Wire Line
	11450 3300 11650 3300
Wire Wire Line
	11450 5550 11450 6200
Wire Wire Line
	11450 6200 11450 6850
Wire Wire Line
	11450 6850 11450 7500
Wire Wire Line
	11450 7500 11450 8550
Wire Wire Line
	11450 7500 11650 7500
Wire Wire Line
	11550 1800 11550 2850
Wire Wire Line
	11550 2850 11550 3500
Wire Wire Line
	11550 3500 11650 3500
Wire Wire Line
	11550 5750 11550 6400
Wire Wire Line
	11550 6400 11550 7050
Wire Wire Line
	11550 7050 11550 7700
Wire Wire Line
	11550 7700 11550 8950
Wire Wire Line
	11550 7700 11650 7700
Wire Wire Line
	11650 2650 11450 2650
Wire Wire Line
	11650 2750 11350 2750
Wire Wire Line
	11650 2850 11550 2850
Wire Wire Line
	11650 3400 11350 3400
Wire Wire Line
	11650 5550 11450 5550
Wire Wire Line
	11650 5650 11350 5650
Wire Wire Line
	11650 5750 11550 5750
Wire Wire Line
	11650 6200 11450 6200
Wire Wire Line
	11650 6400 11550 6400
Wire Wire Line
	11650 6850 11450 6850
Wire Wire Line
	11650 6950 11350 6950
Wire Wire Line
	11650 7050 11550 7050
Wire Wire Line
	11650 7600 11350 7600
Wire Wire Line
	12500 2700 12700 2700
Wire Wire Line
	12500 3350 12700 3350
Wire Wire Line
	12500 6250 12700 6250
Wire Wire Line
	12500 6900 12700 6900
Wire Wire Line
	12500 7550 12700 7550
Wire Wire Line
	12600 1800 12400 1800
Wire Wire Line
	12600 2900 12600 1800
Wire Wire Line
	12600 2900 12600 3550
Wire Wire Line
	12600 3550 12600 5800
Wire Wire Line
	12600 3550 12700 3550
Wire Wire Line
	12600 6450 12600 5800
Wire Wire Line
	12600 6450 12600 7100
Wire Wire Line
	12600 7100 12600 7750
Wire Wire Line
	12600 7750 12700 7750
Wire Wire Line
	12700 2900 12600 2900
Wire Wire Line
	12700 5600 12500 5600
Wire Wire Line
	12700 5800 12600 5800
Wire Wire Line
	12700 6450 12600 6450
Wire Wire Line
	12700 7100 12600 7100
Wire Wire Line
	13200 2800 13550 2800
Wire Wire Line
	13200 3450 13450 3450
Wire Wire Line
	13200 5700 13750 5700
Wire Wire Line
	13200 6350 13650 6350
Wire Wire Line
	13200 7000 13550 7000
Wire Wire Line
	13200 7650 13450 7650
Wire Wire Line
	13450 3450 13450 3800
Wire Wire Line
	13450 3450 14400 3450
Wire Wire Line
	13450 3800 10700 3800
Wire Wire Line
	13450 7650 13450 8000
Wire Wire Line
	13450 7650 14400 7650
Wire Wire Line
	13450 8000 10700 8000
Wire Wire Line
	13550 2800 13550 3900
Wire Wire Line
	13550 2800 14400 2800
Wire Wire Line
	13550 7000 13550 8100
Wire Wire Line
	13550 7000 14400 7000
Wire Wire Line
	13650 6350 13650 8200
Wire Wire Line
	13650 6350 14400 6350
Wire Wire Line
	13650 8200 10500 8200
Wire Wire Line
	13750 5700 13750 8300
Wire Wire Line
	13750 5700 14400 5700
Wire Wire Line
	13750 8300 10400 8300
Wire Bus Line
	2200 7400 2100 7400
Wire Bus Line
	2300 3450 2200 3450
Wire Bus Line
	5450 7250 5600 7250
Wire Bus Line
	5700 4100 5850 4100
Wire Bus Line
	14500 4550 14750 4550
Text Notes 6200 7350 0    50   ~ 0
Y[0..7] BUS
Text Label 2800 7650 2    50   ~ 0
BUS-DATA2
Text Label 2800 7750 2    50   ~ 0
BUS-DATA1
Text Label 2800 7850 2    50   ~ 0
BUS-DATA0
Text Label 2900 3700 2    50   ~ 0
BUS-DATA2
Text Label 2900 3800 2    50   ~ 0
BUS-DATA1
Text Label 2900 3900 2    50   ~ 0
BUS-DATA0
Text Label 5150 6650 0    50   ~ 0
Y7
Text Label 5150 6750 0    50   ~ 0
Y6
Text Label 5150 6850 0    50   ~ 0
Y5
Text Label 5150 6950 0    50   ~ 0
Y4
Text Label 5150 7550 0    50   ~ 0
Y3
Text Label 5150 7650 0    50   ~ 0
Y2
Text Label 5150 7750 0    50   ~ 0
Y1
Text Label 5150 7850 0    50   ~ 0
Y0
Text Label 5250 3700 0    50   ~ 0
XSHIFT2
Text Label 5250 3800 0    50   ~ 0
XSHIFT1
Text Label 5250 3900 0    50   ~ 0
XSHIFT0
Text Label 13850 2800 0    50   ~ 0
SCROLL1-X5
Text Label 13850 3450 0    50   ~ 0
SCROLL1-X4
Text Label 13850 5700 0    50   ~ 0
SCROLL1-X3
Text Label 13850 6350 0    50   ~ 0
SCROLL1-X2
Text Label 13850 7000 0    50   ~ 0
SCROLL1-X1
Text Label 13850 7650 0    50   ~ 0
SCROLL1-X0
Text HLabel 1700 8000 0    50   Input ~ 0
~SCROLL1-Y
Text HLabel 1700 8100 0    50   Input ~ 0
~CLK4M
Text HLabel 1950 4150 0    50   Input ~ 0
~SCROLL1-X
Text HLabel 1950 4250 0    50   Input ~ 0
~CLK4M
Text HLabel 2100 7400 0    50   Input ~ 0
BUS-DATA[0..2]
Text HLabel 2200 3450 0    50   Input ~ 0
BUS-DATA[0..2]
Text HLabel 3800 8400 0    50   Input ~ 0
~SCROLL1-T
Text HLabel 3900 4550 0    50   Input ~ 0
~SCROLL1-T
Text HLabel 5600 7250 2    50   3State ~ 0
Y[0..7]
Text HLabel 5850 4100 2    50   3State ~ 0
XSHIFT[0..2]
Text HLabel 7700 7300 0    50   Input ~ 0
~SCROLL1-T
Text HLabel 8250 1800 0    50   Input ~ 0
~FLIP
Text HLabel 10050 1800 0    50   Input ~ 0
~LI
Text HLabel 10050 8950 0    50   Input ~ 0
~LI
Text HLabel 11350 2550 0    50   Input ~ 0
FLIP
Text HLabel 11350 3200 0    50   Input ~ 0
FLIP
Text HLabel 12400 1800 0    50   Input ~ 0
~CLK4M
Text HLabel 14750 4550 2    50   Output ~ 0
SCROLL1-X[0..5]
$Comp
L power:VCC #PWR0252
U 1 1 62D551BA
P 3000 7350
F 0 "#PWR0252" H 3000 7200 50  0001 C CNN
F 1 "VCC" H 3015 7523 50  0000 C CNN
F 2 "" H 3000 7350 50  0001 C CNN
F 3 "" H 3000 7350 50  0001 C CNN
	1    3000 7350
	1    0    0    -1  
$EndComp
$Comp
L power:VCC #PWR0253
U 1 1 62D1BD02
P 3100 3600
F 0 "#PWR0253" H 3100 3450 50  0001 C CNN
F 1 "VCC" H 3115 3773 50  0000 C CNN
F 2 "" H 3100 3600 50  0001 C CNN
F 3 "" H 3100 3600 50  0001 C CNN
	1    3100 3600
	1    0    0    -1  
$EndComp
$Comp
L power:VCC #PWR0177
U 1 1 61118ED4
P 4100 6650
F 0 "#PWR0177" H 4100 6500 50  0001 C CNN
F 1 "VCC" H 4115 6823 50  0000 C CNN
F 2 "" H 4100 6650 50  0001 C CNN
F 3 "" H 4100 6650 50  0001 C CNN
	1    4100 6650
	1    0    0    -1  
$EndComp
$Comp
L power:GND #PWR0178
U 1 1 61118ED8
P 2700 7450
F 0 "#PWR0178" H 2700 7200 50  0001 C CNN
F 1 "GND" H 2705 7277 50  0001 C CNN
F 2 "" H 2700 7450 50  0001 C CNN
F 3 "" H 2700 7450 50  0001 C CNN
	1    2700 7450
	1    0    0    -1  
$EndComp
$Comp
L power:GND #PWR0179
U 1 1 73A3C4C5
P 11350 5450
F 0 "#PWR0179" H 11350 5200 50  0001 C CNN
F 1 "GND" H 11355 5277 50  0001 C CNN
F 2 "" H 11350 5450 50  0001 C CNN
F 3 "" H 11350 5450 50  0001 C CNN
	1    11350 5450
	1    0    0    -1  
$EndComp
$Comp
L power:GND #PWR0180
U 1 1 61118EDE
P 11350 6100
F 0 "#PWR0180" H 11350 5850 50  0001 C CNN
F 1 "GND" H 11355 5927 50  0001 C CNN
F 2 "" H 11350 6100 50  0001 C CNN
F 3 "" H 11350 6100 50  0001 C CNN
	1    11350 6100
	1    0    0    -1  
$EndComp
$Comp
L power:GND #PWR0181
U 1 1 61118EDA
P 11350 6750
F 0 "#PWR0181" H 11350 6500 50  0001 C CNN
F 1 "GND" H 11355 6577 50  0001 C CNN
F 2 "" H 11350 6750 50  0001 C CNN
F 3 "" H 11350 6750 50  0001 C CNN
	1    11350 6750
	1    0    0    -1  
$EndComp
$Comp
L power:GND #PWR0182
U 1 1 61118EEB
P 11350 7400
F 0 "#PWR0182" H 11350 7150 50  0001 C CNN
F 1 "GND" H 11355 7227 50  0001 C CNN
F 2 "" H 11350 7400 50  0001 C CNN
F 3 "" H 11350 7400 50  0001 C CNN
	1    11350 7400
	1    0    0    -1  
$EndComp
$Comp
L A5C:OR02 UEI193
U 1 1 61118ED7
P 1950 8050
AR Path="/60EC0B61/61118ED7" Ref="UEI193"  Part="1" 
AR Path="/612D3239/612D3C97/61118ED7" Ref="UEI193"  Part="1" 
F 0 "UEI193" H 1975 8317 50  0000 C CNN
F 1 "OR02" H 1975 8226 50  0000 C CNN
F 2 "" H 2000 8050 50  0001 C CNN
F 3 "" H 2000 8050 50  0001 C CNN
	1    1950 8050
	1    0    0    -1  
$EndComp
$Comp
L A5C:OR02 UEA89
U 1 1 620286E6
P 2200 4200
AR Path="/60EC0B61/620286E6" Ref="UEA89"  Part="1" 
AR Path="/612D3239/612D3C97/620286E6" Ref="UEA89"  Part="1" 
F 0 "UEA89" H 2225 4467 50  0000 C CNN
F 1 "OR02" H 2225 4376 50  0000 C CNN
F 2 "" H 2250 4200 50  0001 C CNN
F 3 "" H 2250 4200 50  0001 C CNN
	1    2200 4200
	1    0    0    -1  
$EndComp
$Comp
L A5C:XNOR02 UEE56
U 1 1 61118EE4
P 8800 2650
AR Path="/60EC0B61/61118EE4" Ref="UEE56"  Part="1" 
AR Path="/612D3239/612D3C97/61118EE4" Ref="UEE56"  Part="1" 
F 0 "UEE56" H 8825 2917 50  0000 C CNN
F 1 "XNOR02" H 8825 2826 50  0000 C CNN
F 2 "" H 8825 2650 50  0001 C CNN
F 3 "" H 8825 2650 50  0001 C CNN
	1    8800 2650
	1    0    0    -1  
$EndComp
$Comp
L A5C:XOR02 UEE161
U 1 1 61118EE3
P 8800 5500
AR Path="/60EC0B61/61118EE3" Ref="UEE161"  Part="1" 
AR Path="/612D3239/612D3C97/61118EE3" Ref="UEE161"  Part="1" 
F 0 "UEE161" H 8825 5767 50  0000 C CNN
F 1 "XOR02" H 8825 5676 50  0000 C CNN
F 2 "" H 8800 5500 50  0001 C CNN
F 3 "" H 8800 5500 50  0001 C CNN
	1    8800 5500
	1    0    0    -1  
$EndComp
$Comp
L A5C:XNOR02 UEF180
U 1 1 61118EFA
P 8800 5950
AR Path="/60EC0B61/61118EFA" Ref="UEF180"  Part="1" 
AR Path="/612D3239/612D3C97/61118EFA" Ref="UEF180"  Part="1" 
F 0 "UEF180" H 8825 6217 50  0000 C CNN
F 1 "XNOR02" H 8825 6126 50  0000 C CNN
F 2 "" H 8825 5950 50  0001 C CNN
F 3 "" H 8825 5950 50  0001 C CNN
	1    8800 5950
	1    0    0    -1  
$EndComp
$Comp
L A5C:XNOR02 UEG200
U 1 1 61118EFB
P 8800 6400
AR Path="/60EC0B61/61118EFB" Ref="UEG200"  Part="1" 
AR Path="/612D3239/612D3C97/61118EFB" Ref="UEG200"  Part="1" 
F 0 "UEG200" H 8825 6667 50  0000 C CNN
F 1 "XNOR02" H 8825 6576 50  0000 C CNN
F 2 "" H 8825 6400 50  0001 C CNN
F 3 "" H 8825 6400 50  0001 C CNN
	1    8800 6400
	1    0    0    -1  
$EndComp
$Comp
L A5C:XNOR02 UEF168
U 1 1 61118EFC
P 8800 6850
AR Path="/60EC0B61/61118EFC" Ref="UEF168"  Part="1" 
AR Path="/612D3239/612D3C97/61118EFC" Ref="UEF168"  Part="1" 
F 0 "UEF168" H 8825 7117 50  0000 C CNN
F 1 "XNOR02" H 8825 7026 50  0000 C CNN
F 2 "" H 8825 6850 50  0001 C CNN
F 3 "" H 8825 6850 50  0001 C CNN
	1    8800 6850
	1    0    0    -1  
$EndComp
$Comp
L A5C:NOR02 UEF165
U 1 1 61118EF9
P 8800 7300
AR Path="/60EC0B61/61118EF9" Ref="UEF165"  Part="1" 
AR Path="/612D3239/612D3C97/61118EF9" Ref="UEF165"  Part="1" 
F 0 "UEF165" H 8825 7567 50  0000 C CNN
F 1 "NOR02" H 8825 7476 50  0000 C CNN
F 2 "" H 8800 7300 50  0001 C CNN
F 3 "" H 8800 7300 50  0001 C CNN
	1    8800 7300
	1    0    0    -1  
$EndComp
$Comp
L A5C:NOR02 UED165
U 1 1 61118EE2
P 9550 4600
AR Path="/60EC0B61/61118EE2" Ref="UED165"  Part="1" 
AR Path="/612D3239/612D3C97/61118EE2" Ref="UED165"  Part="1" 
F 0 "UED165" H 9575 4867 50  0000 C CNN
F 1 "NOR02" H 9575 4776 50  0000 C CNN
F 2 "" H 9550 4600 50  0001 C CNN
F 3 "" H 9550 4600 50  0001 C CNN
	1    9550 4600
	1    0    0    -1  
$EndComp
$Comp
L A5C:NAND02 UEE54
U 1 1 61118EE8
P 10000 2700
AR Path="/60EC0B61/61118EE8" Ref="UEE54"  Part="1" 
AR Path="/612D3239/612D3C97/61118EE8" Ref="UEE54"  Part="1" 
F 0 "UEE54" H 10025 2967 50  0000 C CNN
F 1 "NAND02" H 10025 2876 50  0000 C CNN
F 2 "" H 10000 2700 50  0001 C CNN
F 3 "" H 10000 2700 50  0001 C CNN
	1    10000 2700
	1    0    0    -1  
$EndComp
$Comp
L A5C:NAND02 UEF193
U 1 1 61118EF7
P 10000 6900
AR Path="/60EC0B61/61118EF7" Ref="UEF193"  Part="1" 
AR Path="/612D3239/612D3C97/61118EF7" Ref="UEF193"  Part="1" 
F 0 "UEF193" H 10025 7167 50  0000 C CNN
F 1 "NAND02" H 10025 7076 50  0000 C CNN
F 2 "" H 10000 6900 50  0001 C CNN
F 3 "" H 10000 6900 50  0001 C CNN
	1    10000 6900
	1    0    0    -1  
$EndComp
$Comp
L A5C:XNOR02 UED34
U 1 1 61118EF1
P 11050 2750
AR Path="/60EC0B61/61118EF1" Ref="UED34"  Part="1" 
AR Path="/612D3239/612D3C97/61118EF1" Ref="UED34"  Part="1" 
F 0 "UED34" H 11075 3017 50  0000 C CNN
F 1 "XNOR02" H 11075 2926 50  0000 C CNN
F 2 "" H 11075 2750 50  0001 C CNN
F 3 "" H 11075 2750 50  0001 C CNN
	1    11050 2750
	1    0    0    1   
$EndComp
$Comp
L A5C:XOR02 UEG65
U 1 1 61118EF2
P 11050 3400
AR Path="/60EC0B61/61118EF2" Ref="UEG65"  Part="1" 
AR Path="/612D3239/612D3C97/61118EF2" Ref="UEG65"  Part="1" 
F 0 "UEG65" H 11075 3667 50  0000 C CNN
F 1 "XOR02" H 11075 3576 50  0000 C CNN
F 2 "" H 11050 3400 50  0001 C CNN
F 3 "" H 11050 3400 50  0001 C CNN
	1    11050 3400
	1    0    0    1   
$EndComp
$Comp
L A5C:XNOR02 UEE157
U 1 1 61118EDD
P 11050 5650
AR Path="/60EC0B61/61118EDD" Ref="UEE157"  Part="1" 
AR Path="/612D3239/612D3C97/61118EDD" Ref="UEE157"  Part="1" 
F 0 "UEE157" H 11075 5917 50  0000 C CNN
F 1 "XNOR02" H 11075 5826 50  0000 C CNN
F 2 "" H 11075 5650 50  0001 C CNN
F 3 "" H 11075 5650 50  0001 C CNN
	1    11050 5650
	1    0    0    1   
$EndComp
$Comp
L A5C:XNOR02 UEE206
U 1 1 61118EDC
P 11050 6300
AR Path="/60EC0B61/61118EDC" Ref="UEE206"  Part="1" 
AR Path="/612D3239/612D3C97/61118EDC" Ref="UEE206"  Part="1" 
F 0 "UEE206" H 11075 6567 50  0000 C CNN
F 1 "XNOR02" H 11075 6476 50  0000 C CNN
F 2 "" H 11075 6300 50  0001 C CNN
F 3 "" H 11075 6300 50  0001 C CNN
	1    11050 6300
	1    0    0    1   
$EndComp
$Comp
L A5C:XNOR02 UEG196
U 1 1 61118EEF
P 11050 6950
AR Path="/60EC0B61/61118EEF" Ref="UEG196"  Part="1" 
AR Path="/612D3239/612D3C97/61118EEF" Ref="UEG196"  Part="1" 
F 0 "UEG196" H 11075 7217 50  0000 C CNN
F 1 "XNOR02" H 11075 7126 50  0000 C CNN
F 2 "" H 11075 6950 50  0001 C CNN
F 3 "" H 11075 6950 50  0001 C CNN
	1    11050 6950
	1    0    0    1   
$EndComp
$Comp
L A5C:XOR02 UEG167
U 1 1 61118EEA
P 11050 7600
AR Path="/60EC0B61/61118EEA" Ref="UEG167"  Part="1" 
AR Path="/612D3239/612D3C97/61118EEA" Ref="UEG167"  Part="1" 
F 0 "UEG167" H 11075 7867 50  0000 C CNN
F 1 "XOR02" H 11075 7776 50  0000 C CNN
F 2 "" H 11050 7600 50  0001 C CNN
F 3 "" H 11050 7600 50  0001 C CNN
	1    11050 7600
	1    0    0    1   
$EndComp
$Comp
L A5C:NAND03 UEE203
U 1 1 61118EF8
P 10000 6250
AR Path="/60EC0B61/61118EF8" Ref="UEE203"  Part="1" 
AR Path="/612D3239/612D3C97/61118EF8" Ref="UEE203"  Part="1" 
F 0 "UEE203" H 10025 6542 50  0000 C CNN
F 1 "NAND03" H 10025 6451 50  0000 C CNN
F 2 "" H 10000 6250 50  0001 C CNN
F 3 "" H 10000 6250 50  0001 C CNN
	1    10000 6250
	1    0    0    -1  
$EndComp
$Comp
L A5C:INV01 UED43
U 1 1 61118EE5
P 10550 2200
AR Path="/60EC0B61/61118EE5" Ref="UED43"  Part="1" 
AR Path="/612D3239/612D3C97/61118EE5" Ref="UED43"  Part="1" 
F 0 "UED43" H 10550 2517 50  0000 C CNN
F 1 "INV01" H 10550 2426 50  0000 C CNN
F 2 "" H 10550 2000 50  0001 C CNN
F 3 "" H 10550 2000 50  0001 C CNN
	1    10550 2200
	1    0    0    -1  
$EndComp
$Comp
L A5C:INV01 UEC144
U 1 1 61118EF0
P 10550 8550
AR Path="/60EC0B61/61118EF0" Ref="UEC144"  Part="1" 
AR Path="/612D3239/612D3C97/61118EF0" Ref="UEC144"  Part="1" 
F 0 "UEC144" H 10550 8233 50  0000 C CNN
F 1 "INV01" H 10550 8324 50  0000 C CNN
F 2 "" H 10550 8350 50  0001 C CNN
F 3 "" H 10550 8350 50  0001 C CNN
	1    10550 8550
	1    0    0    -1  
$EndComp
$Comp
L A5C:INV01 UED131
U 1 1 61118EE6
P 10750 4850
AR Path="/60EC0B61/61118EE6" Ref="UED131"  Part="1" 
AR Path="/612D3239/612D3C97/61118EE6" Ref="UED131"  Part="1" 
F 0 "UED131" H 10750 5167 50  0000 C CNN
F 1 "INV01" H 10750 5076 50  0000 C CNN
F 2 "" H 10750 4650 50  0001 C CNN
F 3 "" H 10750 4650 50  0001 C CNN
	1    10750 4850
	1    0    0    -1  
$EndComp
$Comp
L A5C:DFFCOO UED36
U 1 1 61118EF5
P 12950 2800
AR Path="/60EC0B61/61118EF5" Ref="UED36"  Part="1" 
AR Path="/612D3239/612D3C97/61118EF5" Ref="UED36"  Part="1" 
F 0 "UED36" H 12950 3165 50  0000 C CNN
F 1 "DFFCOO" H 12950 3074 50  0000 C CNN
F 2 "" H 12950 2800 50  0001 C CNN
F 3 "" H 12950 2800 50  0001 C CNN
	1    12950 2800
	1    0    0    -1  
$EndComp
$Comp
L A5C:DFFCOO UEG57
U 1 1 61118EF4
P 12950 3450
AR Path="/60EC0B61/61118EF4" Ref="UEG57"  Part="1" 
AR Path="/612D3239/612D3C97/61118EF4" Ref="UEG57"  Part="1" 
F 0 "UEG57" H 12950 3815 50  0000 C CNN
F 1 "DFFCOO" H 12950 3724 50  0000 C CNN
F 2 "" H 12950 3450 50  0001 C CNN
F 3 "" H 12950 3450 50  0001 C CNN
	1    12950 3450
	1    0    0    -1  
$EndComp
$Comp
L A5C:DFFCOO UED137
U 1 1 61118EE0
P 12950 5700
AR Path="/60EC0B61/61118EE0" Ref="UED137"  Part="1" 
AR Path="/612D3239/612D3C97/61118EE0" Ref="UED137"  Part="1" 
F 0 "UED137" H 12950 6065 50  0000 C CNN
F 1 "DFFCOO" H 12950 5974 50  0000 C CNN
F 2 "" H 12950 5700 50  0001 C CNN
F 3 "" H 12950 5700 50  0001 C CNN
	1    12950 5700
	1    0    0    -1  
$EndComp
$Comp
L A5C:DFFCOO UEG214
U 1 1 61118EE1
P 12950 6350
AR Path="/60EC0B61/61118EE1" Ref="UEG214"  Part="1" 
AR Path="/612D3239/612D3C97/61118EE1" Ref="UEG214"  Part="1" 
F 0 "UEG214" H 12950 6715 50  0000 C CNN
F 1 "DFFCOO" H 12950 6624 50  0000 C CNN
F 2 "" H 12950 6350 50  0001 C CNN
F 3 "" H 12950 6350 50  0001 C CNN
	1    12950 6350
	1    0    0    -1  
$EndComp
$Comp
L A5C:DFFCOO UEH172
U 1 1 61118EEE
P 12950 7000
AR Path="/60EC0B61/61118EEE" Ref="UEH172"  Part="1" 
AR Path="/612D3239/612D3C97/61118EEE" Ref="UEH172"  Part="1" 
F 0 "UEH172" H 12950 7365 50  0000 C CNN
F 1 "DFFCOO" H 12950 7274 50  0000 C CNN
F 2 "" H 12950 7000 50  0001 C CNN
F 3 "" H 12950 7000 50  0001 C CNN
	1    12950 7000
	1    0    0    -1  
$EndComp
$Comp
L A5C:DFFCOO UEI160
U 1 1 61118EED
P 12950 7650
AR Path="/60EC0B61/61118EED" Ref="UEI160"  Part="1" 
AR Path="/612D3239/612D3C97/61118EED" Ref="UEI160"  Part="1" 
F 0 "UEI160" H 12950 8015 50  0000 C CNN
F 1 "DFFCOO" H 12950 7924 50  0000 C CNN
F 2 "" H 12950 7650 50  0001 C CNN
F 3 "" H 12950 7650 50  0001 C CNN
	1    12950 7650
	1    0    0    -1  
$EndComp
$Comp
L A5C:NAND04 UEE197
U 1 1 61118EE9
P 10000 5600
AR Path="/60EC0B61/61118EE9" Ref="UEE197"  Part="1" 
AR Path="/612D3239/612D3C97/61118EE9" Ref="UEE197"  Part="1" 
F 0 "UEE197" H 10000 5942 50  0000 C CNN
F 1 "NAND04" H 10000 5851 50  0000 C CNN
F 2 "" H 10000 5350 50  0001 C CNN
F 3 "" H 10000 5350 50  0001 C CNN
	1    10000 5600
	1    0    0    -1  
$EndComp
$Comp
L A5C:NAND04 UED191
U 1 1 61118EE7
P 10150 4850
AR Path="/60EC0B61/61118EE7" Ref="UED191"  Part="1" 
AR Path="/612D3239/612D3C97/61118EE7" Ref="UED191"  Part="1" 
F 0 "UED191" H 10150 5192 50  0000 C CNN
F 1 "NAND04" H 10150 5101 50  0000 C CNN
F 2 "" H 10150 4600 50  0001 C CNN
F 3 "" H 10150 4600 50  0001 C CNN
	1    10150 4850
	1    0    0    -1  
$EndComp
$Comp
L A5C:AOI22 UED29
U 1 1 61118EF6
P 12050 2650
AR Path="/60EC0B61/61118EF6" Ref="UED29"  Part="1" 
AR Path="/612D3239/612D3C97/61118EF6" Ref="UED29"  Part="1" 
F 0 "UED29" H 12075 2967 50  0000 C CNN
F 1 "AOI22" H 12075 2876 50  0000 C CNN
F 2 "" H 12200 2650 50  0001 C CNN
F 3 "" H 12200 2650 50  0001 C CNN
	1    12050 2650
	1    0    0    -1  
$EndComp
$Comp
L A5C:AOI22 UEG54
U 1 1 61118EF3
P 12050 3300
AR Path="/60EC0B61/61118EF3" Ref="UEG54"  Part="1" 
AR Path="/612D3239/612D3C97/61118EF3" Ref="UEG54"  Part="1" 
F 0 "UEG54" H 12075 3617 50  0000 C CNN
F 1 "AOI22" H 12075 3526 50  0000 C CNN
F 2 "" H 12200 3300 50  0001 C CNN
F 3 "" H 12200 3300 50  0001 C CNN
	1    12050 3300
	1    0    0    -1  
$EndComp
$Comp
L A5C:AOI22 UED148
U 1 1 61118EDF
P 12050 5550
AR Path="/60EC0B61/61118EDF" Ref="UED148"  Part="1" 
AR Path="/612D3239/612D3C97/61118EDF" Ref="UED148"  Part="1" 
F 0 "UED148" H 12075 5867 50  0000 C CNN
F 1 "AOI22" H 12075 5776 50  0000 C CNN
F 2 "" H 12200 5550 50  0001 C CNN
F 3 "" H 12200 5550 50  0001 C CNN
	1    12050 5550
	1    0    0    -1  
$EndComp
$Comp
L A5C:AOI22 UEG207
U 1 1 61118EDB
P 12050 6200
AR Path="/60EC0B61/61118EDB" Ref="UEG207"  Part="1" 
AR Path="/612D3239/612D3C97/61118EDB" Ref="UEG207"  Part="1" 
F 0 "UEG207" H 12075 6517 50  0000 C CNN
F 1 "AOI22" H 12075 6426 50  0000 C CNN
F 2 "" H 12200 6200 50  0001 C CNN
F 3 "" H 12200 6200 50  0001 C CNN
	1    12050 6200
	1    0    0    -1  
$EndComp
$Comp
L A5C:AOI22 UEG177
U 1 1 61118ED9
P 12050 6850
AR Path="/60EC0B61/61118ED9" Ref="UEG177"  Part="1" 
AR Path="/612D3239/612D3C97/61118ED9" Ref="UEG177"  Part="1" 
F 0 "UEG177" H 12075 7167 50  0000 C CNN
F 1 "AOI22" H 12075 7076 50  0000 C CNN
F 2 "" H 12200 6850 50  0001 C CNN
F 3 "" H 12200 6850 50  0001 C CNN
	1    12050 6850
	1    0    0    -1  
$EndComp
$Comp
L A5C:AOI22 UEH168
U 1 1 61118EEC
P 12050 7500
AR Path="/60EC0B61/61118EEC" Ref="UEH168"  Part="1" 
AR Path="/612D3239/612D3C97/61118EEC" Ref="UEH168"  Part="1" 
F 0 "UEH168" H 12075 7817 50  0000 C CNN
F 1 "AOI22" H 12075 7726 50  0000 C CNN
F 2 "" H 12200 7500 50  0001 C CNN
F 3 "" H 12200 7500 50  0001 C CNN
	1    12050 7500
	1    0    0    -1  
$EndComp
$Comp
L A5C:M175CL UEJ187
U 1 1 61118ED6
P 3500 7850
AR Path="/60EC0B61/61118ED6" Ref="UEJ187"  Part="1" 
AR Path="/612D3239/612D3C97/61118ED6" Ref="UEJ187"  Part="1" 
F 0 "UEJ187" H 3500 8415 50  0000 C CNN
F 1 "M175CL" H 3500 8324 50  0000 C CNN
F 2 "" H 3500 7650 50  0001 C CNN
F 3 "" H 3500 7650 50  0001 C CNN
	1    3500 7850
	1    0    0    -1  
$EndComp
$Comp
L A5C:M175CL UEH88
U 1 1 60B92F8E
P 3600 4000
AR Path="/60EC0B61/60B92F8E" Ref="UEH88"  Part="1" 
AR Path="/612D3239/612D3C97/60B92F8E" Ref="UEH88"  Part="1" 
F 0 "UEH88" H 3600 4565 50  0000 C CNN
F 1 "M175CL" H 3600 4474 50  0000 C CNN
F 2 "" H 3600 3800 50  0001 C CNN
F 3 "" H 3600 3800 50  0001 C CNN
	1    3600 4000
	1    0    0    -1  
$EndComp
$Comp
L A5C:M368C UEJ?
U 1 1 61118ED3
P 4600 6900
AR Path="/604B5523/61118ED3" Ref="UEJ?"  Part="1" 
AR Path="/61118ED3" Ref="UEI3"  Part="1" 
AR Path="/60EC0B61/61118ED3" Ref="UEI3"  Part="1" 
AR Path="/612D3239/612D3C97/61118ED3" Ref="UEI3"  Part="1" 
F 0 "UEI3" H 4600 7410 50  0000 C CNN
F 1 "M368C" H 4600 7320 50  0000 C CNN
F 2 "" H 4900 6700 50  0001 C CNN
F 3 "" H 4900 6700 50  0001 C CNN
	1    4600 6900
	1    0    0    -1  
$EndComp
$Comp
L A5C:M368C UEJ?
U 1 1 61118ED5
P 4600 7800
AR Path="/604B5523/61118ED5" Ref="UEJ?"  Part="1" 
AR Path="/61118ED5" Ref="UEJ177"  Part="1" 
AR Path="/60EC0B61/61118ED5" Ref="UEJ177"  Part="1" 
AR Path="/612D3239/612D3C97/61118ED5" Ref="UEJ177"  Part="1" 
F 0 "UEJ177" H 4600 8310 50  0000 C CNN
F 1 "M368C" H 4600 8220 50  0000 C CNN
F 2 "" H 4900 7600 50  0001 C CNN
F 3 "" H 4900 7600 50  0001 C CNN
	1    4600 7800
	1    0    0    -1  
$EndComp
$Comp
L A5C:M368C UEJ?
U 1 1 721ED3EC
P 4700 3950
AR Path="/604B5523/721ED3EC" Ref="UEJ?"  Part="1" 
AR Path="/721ED3EC" Ref="UEG96"  Part="1" 
AR Path="/60EC0B61/721ED3EC" Ref="UEG96"  Part="1" 
AR Path="/612D3239/612D3C97/721ED3EC" Ref="UEG96"  Part="1" 
F 0 "UEG96" H 4700 4460 50  0000 C CNN
F 1 "M368C" H 4700 4370 50  0000 C CNN
F 2 "" H 5000 3750 50  0001 C CNN
F 3 "" H 5000 3750 50  0001 C CNN
	1    4700 3950
	1    0    0    -1  
$EndComp
Wire Bus Line
	14500 2900 14500 4550
Wire Bus Line
	2200 7400 2200 7750
Wire Bus Line
	2300 3450 2300 3800
Wire Bus Line
	5700 3800 5700 4100
Wire Bus Line
	5450 6750 5450 7250
Wire Bus Line
	5450 7250 5450 7750
Wire Bus Line
	14500 4550 14500 7550
$EndSCHEMATC
