EESchema Schematic File Version 4
EELAYER 30 0
EELAYER END
$Descr A4 11693 8268
encoding utf-8
Sheet 10 17
Title "Code ROM Bus"
Date "2019-10-17"
Rev ""
Comp ""
Comment1 ""
Comment2 "Licence: CC-BY"
Comment3 "Author: Loic *WydD* Petit"
Comment4 "Project: CPS2 Reverse Engineering: 93646B"
$EndDescr
Connection ~ 5600 3950
Connection ~ 7100 5950
Connection ~ 4800 5950
Connection ~ 6200 3100
Connection ~ 6300 3000
Connection ~ 4900 900 
Connection ~ 6500 3200
Connection ~ 3700 1250
Connection ~ 7500 1250
Connection ~ 2900 5950
Connection ~ 2900 900 
Connection ~ 8300 3200
Connection ~ 6400 3650
Connection ~ 4200 5750
Connection ~ 8100 2450
Connection ~ 8000 2650
Connection ~ 6200 5850
Entry Wire Line
	3000 1550 2900 1450
Entry Wire Line
	3000 1650 2900 1550
Entry Wire Line
	3000 1750 2900 1650
Entry Wire Line
	3000 1850 2900 1750
Entry Wire Line
	3000 1950 2900 1850
Entry Wire Line
	3000 2050 2900 1950
Entry Wire Line
	3000 2150 2900 2050
Entry Wire Line
	3000 4250 2900 4350
Entry Wire Line
	3000 4350 2900 4450
Entry Wire Line
	3000 4450 2900 4550
Entry Wire Line
	3000 4550 2900 4650
Entry Wire Line
	3000 4650 2900 4750
Entry Wire Line
	3000 4750 2900 4850
Entry Wire Line
	3000 4850 2900 4950
Entry Wire Line
	3000 4950 2900 5050
Entry Wire Line
	4400 2150 4500 2250
Entry Wire Line
	4500 1650 4400 1550
Entry Wire Line
	4500 1750 4400 1650
Entry Wire Line
	4500 1850 4400 1750
Entry Wire Line
	4500 1950 4400 1850
Entry Wire Line
	4500 2050 4400 1950
Entry Wire Line
	4500 2150 4400 2050
Entry Wire Line
	4500 4150 4400 4250
Entry Wire Line
	4500 4250 4400 4350
Entry Wire Line
	4500 4350 4400 4450
Entry Wire Line
	4500 4450 4400 4550
Entry Wire Line
	4500 4550 4400 4650
Entry Wire Line
	4500 4650 4400 4750
Entry Wire Line
	4500 4750 4400 4850
Entry Wire Line
	4500 4850 4400 4950
Entry Wire Line
	4900 4250 4800 4350
Entry Wire Line
	4900 4350 4800 4450
Entry Wire Line
	4900 4450 4800 4550
Entry Wire Line
	4900 4550 4800 4650
Entry Wire Line
	4900 4650 4800 4750
Entry Wire Line
	4900 4750 4800 4850
Entry Wire Line
	4900 4850 4800 4950
Entry Wire Line
	4900 4950 4800 5050
Entry Wire Line
	5000 1550 4900 1450
Entry Wire Line
	5000 1650 4900 1550
Entry Wire Line
	5000 1750 4900 1650
Entry Wire Line
	5000 1850 4900 1750
Entry Wire Line
	5000 1950 4900 1850
Entry Wire Line
	5000 2050 4900 1950
Entry Wire Line
	5000 2150 4900 2050
Entry Wire Line
	5000 2250 4900 2150
Entry Wire Line
	6400 4150 6300 4250
Entry Wire Line
	6400 4250 6300 4350
Entry Wire Line
	6400 4350 6300 4450
Entry Wire Line
	6400 4450 6300 4550
Entry Wire Line
	6400 4550 6300 4650
Entry Wire Line
	6400 4650 6300 4750
Entry Wire Line
	6400 4750 6300 4850
Entry Wire Line
	6400 4850 6300 4950
Entry Wire Line
	6500 1650 6400 1550
Entry Wire Line
	6500 1750 6400 1650
Entry Wire Line
	6500 1850 6400 1750
Entry Wire Line
	6500 1950 6400 1850
Entry Wire Line
	6500 2050 6400 1950
Entry Wire Line
	6500 2150 6400 2050
Entry Wire Line
	6500 2250 6400 2150
Entry Wire Line
	6500 2350 6400 2250
Entry Wire Line
	6700 2150 6800 2250
Entry Wire Line
	6800 1550 6700 1450
Entry Wire Line
	6800 1650 6700 1550
Entry Wire Line
	6800 1750 6700 1650
Entry Wire Line
	6800 1850 6700 1750
Entry Wire Line
	6800 1950 6700 1850
Entry Wire Line
	6800 2050 6700 1950
Entry Wire Line
	6800 2150 6700 2050
Entry Wire Line
	7100 5050 7200 4950
Entry Wire Line
	7100 5150 7200 5050
Entry Wire Line
	7100 5250 7200 5150
Entry Wire Line
	7100 5350 7200 5250
Entry Wire Line
	7100 5450 7200 5350
Entry Wire Line
	7100 5550 7200 5450
Entry Wire Line
	7100 5650 7200 5550
Entry Wire Line
	7100 5750 7200 5650
Entry Wire Line
	8000 5050 8100 4950
Entry Wire Line
	8000 5150 8100 5050
Entry Wire Line
	8000 5250 8100 5150
Entry Wire Line
	8000 5350 8100 5250
Entry Wire Line
	8000 5450 8100 5350
Entry Wire Line
	8000 5550 8100 5450
Entry Wire Line
	8000 5650 8100 5550
Entry Wire Line
	8000 5750 8100 5650
Entry Wire Line
	8200 2150 8300 2250
Entry Wire Line
	8200 2250 8300 2350
Entry Wire Line
	8300 1650 8200 1550
Entry Wire Line
	8300 1750 8200 1650
Entry Wire Line
	8300 1850 8200 1750
Entry Wire Line
	8300 1950 8200 1850
Entry Wire Line
	8300 2050 8200 1950
Entry Wire Line
	8300 2150 8200 2050
Wire Wire Line
	3000 1550 3200 1550
Wire Wire Line
	3000 1650 3200 1650
Wire Wire Line
	3000 1750 3200 1750
Wire Wire Line
	3000 1850 3200 1850
Wire Wire Line
	3000 1950 3200 1950
Wire Wire Line
	3000 2050 3200 2050
Wire Wire Line
	3000 2150 3200 2150
Wire Wire Line
	3200 4250 3000 4250
Wire Wire Line
	3200 4350 3000 4350
Wire Wire Line
	3200 4450 3000 4450
Wire Wire Line
	3200 4550 3000 4550
Wire Wire Line
	3200 4650 3000 4650
Wire Wire Line
	3200 4750 3000 4750
Wire Wire Line
	3200 4850 3000 4850
Wire Wire Line
	3200 4950 3000 4950
Wire Wire Line
	3400 1250 3700 1250
Wire Wire Line
	3700 1250 4000 1250
Wire Wire Line
	4100 3950 3700 3950
Wire Wire Line
	4100 5750 4200 5750
Wire Wire Line
	4200 1550 4400 1550
Wire Wire Line
	4200 1650 4400 1650
Wire Wire Line
	4200 1750 4400 1750
Wire Wire Line
	4200 1850 4400 1850
Wire Wire Line
	4200 1950 4400 1950
Wire Wire Line
	4200 2050 4400 2050
Wire Wire Line
	4200 2150 4400 2150
Wire Wire Line
	4200 2350 4200 2250
Wire Wire Line
	4200 2450 4300 2450
Wire Wire Line
	4200 3100 4200 2550
Wire Wire Line
	4200 5150 4300 5150
Wire Wire Line
	4200 5750 4200 5250
Wire Wire Line
	4200 5750 6100 5750
Wire Wire Line
	4300 2450 4300 3000
Wire Wire Line
	4300 3000 6300 3000
Wire Wire Line
	4300 5150 4300 5850
Wire Wire Line
	4400 2450 4400 2350
Wire Wire Line
	4400 4250 4200 4250
Wire Wire Line
	4400 4350 4200 4350
Wire Wire Line
	4400 4450 4200 4450
Wire Wire Line
	4400 4550 4200 4550
Wire Wire Line
	4400 4650 4200 4650
Wire Wire Line
	4400 4750 4200 4750
Wire Wire Line
	4400 4850 4200 4850
Wire Wire Line
	4400 4950 4200 4950
Wire Wire Line
	5000 1550 5200 1550
Wire Wire Line
	5000 1650 5200 1650
Wire Wire Line
	5000 1750 5200 1750
Wire Wire Line
	5000 1850 5200 1850
Wire Wire Line
	5000 1950 5200 1950
Wire Wire Line
	5000 2050 5200 2050
Wire Wire Line
	5000 2150 5200 2150
Wire Wire Line
	5000 2250 5200 2250
Wire Wire Line
	5100 4250 4900 4250
Wire Wire Line
	5100 4350 4900 4350
Wire Wire Line
	5100 4450 4900 4450
Wire Wire Line
	5100 4550 4900 4550
Wire Wire Line
	5100 4650 4900 4650
Wire Wire Line
	5100 4750 4900 4750
Wire Wire Line
	5100 4850 4900 4850
Wire Wire Line
	5100 4950 4900 4950
Wire Wire Line
	5400 1250 5700 1250
Wire Wire Line
	5600 3950 5300 3950
Wire Wire Line
	6000 3950 5600 3950
Wire Wire Line
	6100 5250 6100 5750
Wire Wire Line
	6200 1550 6400 1550
Wire Wire Line
	6200 1650 6400 1650
Wire Wire Line
	6200 1750 6400 1750
Wire Wire Line
	6200 1850 6400 1850
Wire Wire Line
	6200 1950 6400 1950
Wire Wire Line
	6200 2050 6400 2050
Wire Wire Line
	6200 2150 6400 2150
Wire Wire Line
	6200 2250 6400 2250
Wire Wire Line
	6200 2450 6300 2450
Wire Wire Line
	6200 2550 6200 3100
Wire Wire Line
	6200 3100 4200 3100
Wire Wire Line
	6200 3100 8000 3100
Wire Wire Line
	6200 5150 6100 5150
Wire Wire Line
	6200 5150 6200 5850
Wire Wire Line
	6200 5850 4300 5850
Wire Wire Line
	6300 3000 6300 2450
Wire Wire Line
	6300 4250 6100 4250
Wire Wire Line
	6300 4350 6100 4350
Wire Wire Line
	6300 4450 6100 4450
Wire Wire Line
	6300 4550 6100 4550
Wire Wire Line
	6300 4650 6100 4650
Wire Wire Line
	6300 4750 6100 4750
Wire Wire Line
	6300 4850 6100 4850
Wire Wire Line
	6300 4950 6100 4950
Wire Wire Line
	6300 5850 6200 5850
Wire Wire Line
	6800 1550 7000 1550
Wire Wire Line
	6800 1650 7000 1650
Wire Wire Line
	6800 1750 7000 1750
Wire Wire Line
	6800 1850 7000 1850
Wire Wire Line
	6800 1950 7000 1950
Wire Wire Line
	6800 2050 7000 2050
Wire Wire Line
	6800 2150 7000 2150
Wire Wire Line
	6800 2250 7000 2250
Wire Wire Line
	7200 1250 7500 1250
Wire Wire Line
	7200 4950 7450 4950
Wire Wire Line
	7200 5050 7450 5050
Wire Wire Line
	7200 5150 7450 5150
Wire Wire Line
	7200 5250 7450 5250
Wire Wire Line
	7200 5350 7450 5350
Wire Wire Line
	7200 5450 7450 5450
Wire Wire Line
	7200 5550 7450 5550
Wire Wire Line
	7200 5650 7450 5650
Wire Wire Line
	7500 1250 7800 1250
Wire Wire Line
	8000 1550 8200 1550
Wire Wire Line
	8000 1650 8200 1650
Wire Wire Line
	8000 1750 8200 1750
Wire Wire Line
	8000 1850 8200 1850
Wire Wire Line
	8000 1950 8200 1950
Wire Wire Line
	8000 2050 8200 2050
Wire Wire Line
	8000 2150 8200 2150
Wire Wire Line
	8000 2250 8200 2250
Wire Wire Line
	8000 2450 8100 2450
Wire Wire Line
	8000 2650 8000 2550
Wire Wire Line
	8000 3100 8000 2650
Wire Wire Line
	8100 2450 8100 3000
Wire Wire Line
	8100 3000 6300 3000
Wire Wire Line
	8100 4950 8350 4950
Wire Wire Line
	8100 5050 8350 5050
Wire Wire Line
	8100 5150 8350 5150
Wire Wire Line
	8100 5250 8350 5250
Wire Wire Line
	8100 5350 8350 5350
Wire Wire Line
	8100 5450 8350 5450
Wire Wire Line
	8100 5550 8350 5550
Wire Wire Line
	8100 5650 8350 5650
Wire Wire Line
	8650 2450 8100 2450
Wire Wire Line
	8650 2650 8000 2650
Wire Bus Line
	2900 900  2500 900 
Wire Bus Line
	2900 900  4900 900 
Wire Bus Line
	2900 5950 2500 5950
Wire Bus Line
	2900 5950 4800 5950
Wire Bus Line
	3300 900  2900 900 
Wire Bus Line
	3300 5950 2900 5950
Wire Bus Line
	4500 3200 6500 3200
Wire Bus Line
	4800 5950 7100 5950
Wire Bus Line
	4900 900  6700 900 
Wire Bus Line
	5950 3650 6400 3650
Wire Bus Line
	6400 3650 4500 3650
Wire Bus Line
	6400 3650 8650 3650
Wire Bus Line
	6500 3200 8300 3200
Wire Bus Line
	7850 3200 8300 3200
Wire Bus Line
	8000 5950 7100 5950
Wire Bus Line
	8300 3200 8650 3200
Text Label 2900 5950 0    50   ~ 0
CQ[0..15]
Text Label 3000 1550 0    50   ~ 0
CA23
Text Label 3000 1650 0    50   ~ 0
CA22
Text Label 3000 1750 0    50   ~ 0
CA21
Text Label 3000 1850 0    50   ~ 0
CA20
Text Label 3000 1950 0    50   ~ 0
CA19
Text Label 3000 2050 0    50   ~ 0
CA18
Text Label 3000 2150 0    50   ~ 0
CA17
Text Label 3200 4250 2    50   ~ 0
CQ15
Text Label 3200 4350 2    50   ~ 0
CQ14
Text Label 3200 4450 2    50   ~ 0
CQ13
Text Label 3200 4550 2    50   ~ 0
CQ12
Text Label 3200 4650 2    50   ~ 0
CQ11
Text Label 3200 4750 2    50   ~ 0
CQ10
Text Label 3200 4850 2    50   ~ 0
CQ9
Text Label 3200 4950 2    50   ~ 0
CQ8
Text Label 4250 1550 0    50   ~ 0
A23
Text Label 4250 1650 0    50   ~ 0
A22
Text Label 4250 1750 0    50   ~ 0
A21
Text Label 4250 1850 0    50   ~ 0
A20
Text Label 4250 1950 0    50   ~ 0
A19
Text Label 4250 2050 0    50   ~ 0
A18
Text Label 4250 2150 0    50   ~ 0
A17
Text Label 4350 4250 2    50   ~ 0
Q15
Text Label 4350 4350 2    50   ~ 0
Q14
Text Label 4350 4450 2    50   ~ 0
Q13
Text Label 4350 4550 2    50   ~ 0
Q12
Text Label 4350 4650 2    50   ~ 0
Q11
Text Label 4350 4750 2    50   ~ 0
Q10
Text Label 4350 4850 2    50   ~ 0
Q9
Text Label 4350 4950 2    50   ~ 0
Q8
Text Label 5000 1550 0    50   ~ 0
CA16
Text Label 5000 1650 0    50   ~ 0
CA15
Text Label 5000 1750 0    50   ~ 0
CA14
Text Label 5000 1850 0    50   ~ 0
CA13
Text Label 5000 1950 0    50   ~ 0
CA12
Text Label 5000 2050 0    50   ~ 0
CA11
Text Label 5000 2150 0    50   ~ 0
CA10
Text Label 5000 2250 0    50   ~ 0
CA9
Text Label 5100 4250 2    50   ~ 0
CQ7
Text Label 5100 4350 2    50   ~ 0
CQ6
Text Label 5100 4450 2    50   ~ 0
CQ5
Text Label 5100 4550 2    50   ~ 0
CQ4
Text Label 5100 4650 2    50   ~ 0
CQ3
Text Label 5100 4750 2    50   ~ 0
CQ2
Text Label 5100 4850 2    50   ~ 0
CQ1
Text Label 5100 4950 2    50   ~ 0
CQ0
Text Label 6250 1550 0    50   ~ 0
A16
Text Label 6250 1650 0    50   ~ 0
A15
Text Label 6250 1750 0    50   ~ 0
A14
Text Label 6250 1850 0    50   ~ 0
A13
Text Label 6250 1950 0    50   ~ 0
A12
Text Label 6250 2050 0    50   ~ 0
A11
Text Label 6250 2150 0    50   ~ 0
A10
Text Label 6250 2250 0    50   ~ 0
A9
Text Label 6250 4250 2    50   ~ 0
Q7
Text Label 6250 4350 2    50   ~ 0
Q6
Text Label 6250 4450 2    50   ~ 0
Q5
Text Label 6250 4550 2    50   ~ 0
Q4
Text Label 6250 4650 2    50   ~ 0
Q3
Text Label 6250 4750 2    50   ~ 0
Q2
Text Label 6250 4850 2    50   ~ 0
Q1
Text Label 6250 4950 2    50   ~ 0
Q0
Text Label 6400 3750 2    50   ~ 0
Q[0..15]
Text Label 6700 1000 2    50   ~ 0
CA[1..23]
Text Label 6800 1550 0    50   ~ 0
CA8
Text Label 6800 1650 0    50   ~ 0
CA7
Text Label 6800 1750 0    50   ~ 0
CA6
Text Label 6800 1850 0    50   ~ 0
CA5
Text Label 6800 1950 0    50   ~ 0
CA4
Text Label 6800 2050 0    50   ~ 0
CA3
Text Label 6800 2150 0    50   ~ 0
CA2
Text Label 6800 2250 0    50   ~ 0
CA1
Text Label 7250 4950 0    50   ~ 0
CQ0
Text Label 7250 5050 0    50   ~ 0
CQ2
Text Label 7250 5150 0    50   ~ 0
CQ4
Text Label 7250 5250 0    50   ~ 0
CQ6
Text Label 7250 5350 0    50   ~ 0
CQ8
Text Label 7250 5450 0    50   ~ 0
CQ10
Text Label 7250 5550 0    50   ~ 0
CQ12
Text Label 7250 5650 0    50   ~ 0
CQ14
Text Label 8050 1550 0    50   ~ 0
A8
Text Label 8050 1650 0    50   ~ 0
A7
Text Label 8050 1750 0    50   ~ 0
A6
Text Label 8050 1850 0    50   ~ 0
A5
Text Label 8050 1950 0    50   ~ 0
A4
Text Label 8050 2050 0    50   ~ 0
A3
Text Label 8050 2150 0    50   ~ 0
A2
Text Label 8050 2250 0    50   ~ 0
A1
Text Label 8150 4950 0    50   ~ 0
CQ1
Text Label 8150 5050 0    50   ~ 0
CQ3
Text Label 8150 5150 0    50   ~ 0
CQ5
Text Label 8150 5250 0    50   ~ 0
CQ7
Text Label 8150 5350 0    50   ~ 0
CQ9
Text Label 8150 5450 0    50   ~ 0
CQ11
Text Label 8150 5550 0    50   ~ 0
CQ13
Text Label 8150 5650 0    50   ~ 0
CQ15
Text Label 8300 3200 2    50   ~ 0
A[1..23]
Text HLabel 2500 900  0    50   Output ~ 0
B-ADDR[1..23]
Text HLabel 2500 5950 0    50   BiDi ~ 0
B-DATA[0..15]
Text HLabel 4100 5750 0    50   Input ~ 0
~DATA-E
Text HLabel 6300 5850 2    50   Input ~ 0
DATA-DIR
Text HLabel 8650 2450 2    50   Input ~ 0
ADDR-DIR
Text HLabel 8650 2650 2    50   Input ~ 0
~ADDR-E
Text HLabel 8650 3200 2    50   Input ~ 0
A-ADDR[1..23]
Text HLabel 8650 3650 2    50   BiDi ~ 0
A-DATA[0..15]
$Comp
L power:VCC #PWR0152
U 1 1 645B64E0
P 3200 2450
F 0 "#PWR0152" H 3200 2300 50  0001 C CNN
F 1 "VCC" V 3218 2577 50  0000 L CNN
F 2 "" H 3200 2450 50  0001 C CNN
F 3 "" H 3200 2450 50  0001 C CNN
	1    3200 2450
	-1   0    0    1   
$EndComp
$Comp
L power:VCC #PWR0146
U 1 1 63729EAF
P 3400 1250
F 0 "#PWR0146" H 3400 1100 50  0001 C CNN
F 1 "VCC" V 3418 1377 50  0000 L CNN
F 2 "" H 3400 1250 50  0001 C CNN
F 3 "" H 3400 1250 50  0001 C CNN
	1    3400 1250
	0    -1   -1   0   
$EndComp
$Comp
L power:VCC #PWR0142
U 1 1 635C62DC
P 4100 3950
F 0 "#PWR0142" H 4100 3800 50  0001 C CNN
F 1 "VCC" V 4118 4077 50  0000 L CNN
F 2 "" H 4100 3950 50  0001 C CNN
F 3 "" H 4100 3950 50  0001 C CNN
	1    4100 3950
	0    1    -1   0   
$EndComp
$Comp
L power:VCC #PWR0151
U 1 1 643B2474
P 4400 2450
F 0 "#PWR0151" H 4400 2300 50  0001 C CNN
F 1 "VCC" H 4418 2623 50  0000 C CNN
F 2 "" H 4400 2450 50  0001 C CNN
F 3 "" H 4400 2450 50  0001 C CNN
	1    4400 2450
	-1   0    0    1   
$EndComp
$Comp
L power:VCC #PWR0148
U 1 1 63AEA7C0
P 5400 1250
F 0 "#PWR0148" H 5400 1100 50  0001 C CNN
F 1 "VCC" V 5418 1377 50  0000 L CNN
F 2 "" H 5400 1250 50  0001 C CNN
F 3 "" H 5400 1250 50  0001 C CNN
	1    5400 1250
	0    -1   -1   0   
$EndComp
$Comp
L power:VCC #PWR0140
U 1 1 635C59A7
P 6000 3950
F 0 "#PWR0140" H 6000 3800 50  0001 C CNN
F 1 "VCC" V 6018 4077 50  0000 L CNN
F 2 "" H 6000 3950 50  0001 C CNN
F 3 "" H 6000 3950 50  0001 C CNN
	1    6000 3950
	0    1    -1   0   
$EndComp
$Comp
L power:VCC #PWR0150
U 1 1 63AF954A
P 7200 1250
F 0 "#PWR0150" H 7200 1100 50  0001 C CNN
F 1 "VCC" V 7218 1377 50  0000 L CNN
F 2 "" H 7200 1250 50  0001 C CNN
F 3 "" H 7200 1250 50  0001 C CNN
	1    7200 1250
	0    -1   -1   0   
$EndComp
$Comp
L power:VCC #PWR?
U 1 1 635E50C1
P 7850 4950
AR Path="/5D957A6E/635E50C1" Ref="#PWR?"  Part="1" 
AR Path="/635BEEB0/635E50C1" Ref="#PWR0143"  Part="1" 
F 0 "#PWR0143" H 7850 4800 50  0001 C CNN
F 1 "VCC" H 7867 5123 50  0000 C CNN
F 2 "" H 7850 4950 50  0001 C CNN
F 3 "" H 7850 4950 50  0001 C CNN
	1    7850 4950
	1    0    0    -1  
$EndComp
$Comp
L power:VCC #PWR?
U 1 1 635E50C7
P 8750 4950
AR Path="/5D957A6E/635E50C7" Ref="#PWR?"  Part="1" 
AR Path="/635BEEB0/635E50C7" Ref="#PWR0144"  Part="1" 
F 0 "#PWR0144" H 8750 4800 50  0001 C CNN
F 1 "VCC" H 8767 5123 50  0000 C CNN
F 2 "" H 8750 4950 50  0001 C CNN
F 3 "" H 8750 4950 50  0001 C CNN
	1    8750 4950
	1    0    0    -1  
$EndComp
$Comp
L power:GND #PWR0145
U 1 1 63729EA9
P 3700 2850
F 0 "#PWR0145" H 3700 2600 50  0001 C CNN
F 1 "GND" H 3705 2677 50  0001 C CNN
F 2 "" H 3700 2850 50  0001 C CNN
F 3 "" H 3700 2850 50  0001 C CNN
	1    3700 2850
	-1   0    0    -1  
$EndComp
$Comp
L power:GND #PWR0141
U 1 1 635C62D6
P 3700 5550
F 0 "#PWR0141" H 3700 5300 50  0001 C CNN
F 1 "GND" H 3705 5377 50  0001 C CNN
F 2 "" H 3700 5550 50  0001 C CNN
F 3 "" H 3700 5550 50  0001 C CNN
	1    3700 5550
	-1   0    0    -1  
$EndComp
$Comp
L power:GND #PWR0154
U 1 1 646B066C
P 4200 1250
F 0 "#PWR0154" H 4200 1000 50  0001 C CNN
F 1 "GND" H 4205 1077 50  0001 C CNN
F 2 "" H 4200 1250 50  0001 C CNN
F 3 "" H 4200 1250 50  0001 C CNN
	1    4200 1250
	-1   0    0    -1  
$EndComp
$Comp
L power:GND #PWR0138
U 1 1 635C4EFF
P 5100 3950
F 0 "#PWR0138" H 5100 3700 50  0001 C CNN
F 1 "GND" H 5105 3777 50  0001 C CNN
F 2 "" H 5100 3950 50  0001 C CNN
F 3 "" H 5100 3950 50  0001 C CNN
	1    5100 3950
	-1   0    0    -1  
$EndComp
$Comp
L power:GND #PWR0139
U 1 1 635C52B0
P 5600 5550
F 0 "#PWR0139" H 5600 5300 50  0001 C CNN
F 1 "GND" H 5605 5377 50  0001 C CNN
F 2 "" H 5600 5550 50  0001 C CNN
F 3 "" H 5600 5550 50  0001 C CNN
	1    5600 5550
	-1   0    0    -1  
$EndComp
$Comp
L power:GND #PWR0147
U 1 1 63AEA7BA
P 5700 2850
F 0 "#PWR0147" H 5700 2600 50  0001 C CNN
F 1 "GND" H 5705 2677 50  0001 C CNN
F 2 "" H 5700 2850 50  0001 C CNN
F 3 "" H 5700 2850 50  0001 C CNN
	1    5700 2850
	-1   0    0    -1  
$EndComp
$Comp
L power:GND #PWR0149
U 1 1 63AF9544
P 7500 2850
F 0 "#PWR0149" H 7500 2600 50  0001 C CNN
F 1 "GND" H 7505 2677 50  0001 C CNN
F 2 "" H 7500 2850 50  0001 C CNN
F 3 "" H 7500 2850 50  0001 C CNN
	1    7500 2850
	-1   0    0    -1  
$EndComp
$Comp
L power:GND #PWR0153
U 1 1 646B05EF
P 8000 1250
F 0 "#PWR0153" H 8000 1000 50  0001 C CNN
F 1 "GND" H 8005 1077 50  0001 C CNN
F 2 "" H 8000 1250 50  0001 C CNN
F 3 "" H 8000 1250 50  0001 C CNN
	1    8000 1250
	-1   0    0    -1  
$EndComp
$Comp
L Device:R_Small R8
U 1 1 645B646E
P 3200 2350
F 0 "R8" V 3004 2350 50  0000 C TNN
F 1 "4.7k" V 3095 2350 50  0000 C TNN
F 2 "" H 3200 2350 50  0001 C CNN
F 3 "~" H 3200 2350 50  0001 C CNN
	1    3200 2350
	1    0    0    -1  
$EndComp
$Comp
L Device:R_Small R7
U 1 1 6439CFE4
P 4300 2350
F 0 "R7" V 4104 2350 50  0000 C TNN
F 1 "4.7k" V 4195 2350 50  0000 C TNN
F 2 "" H 4300 2350 50  0001 C CNN
F 3 "~" H 4300 2350 50  0001 C CNN
	1    4300 2350
	0    1    1    0   
$EndComp
$Comp
L Device:C_Small CX10
U 1 1 646708F8
P 4100 1250
F 0 "CX10" V 3871 1250 50  0001 C CNN
F 1 "0.1u" V 3963 1250 50  0000 C TNN
F 2 "" H 4100 1250 50  0001 C CNN
F 3 "~" H 4100 1250 50  0001 C CNN
	1    4100 1250
	0    -1   1    0   
$EndComp
$Comp
L Device:C_Small CX11
U 1 1 635C4738
P 5200 3950
F 0 "CX11" V 4971 3950 50  0001 C CNN
F 1 "0.1u" V 5063 3950 50  0000 C TNN
F 2 "" H 5200 3950 50  0001 C CNN
F 3 "~" H 5200 3950 50  0001 C CNN
	1    5200 3950
	0    -1   1    0   
$EndComp
$Comp
L Device:C_Small CX12
U 1 1 64670919
P 7900 1250
F 0 "CX12" V 7671 1250 50  0001 C CNN
F 1 "0.1u" V 7763 1250 50  0000 C TNN
F 2 "" H 7900 1250 50  0001 C CNN
F 3 "~" H 7900 1250 50  0001 C CNN
	1    7900 1250
	0    -1   1    0   
$EndComp
$Comp
L Device:R_Network08 RA?
U 1 1 635E5093
P 7650 5350
AR Path="/5D957A6E/635E5093" Ref="RA?"  Part="1" 
AR Path="/635BEEB0/635E5093" Ref="RA4"  Part="1" 
F 0 "RA4" V 7033 5350 50  0000 C CNN
F 1 "10k" V 7124 5350 50  0000 C CNN
F 2 "Resistor_THT:R_Array_SIP9" V 8125 5350 50  0001 C CNN
F 3 "http://www.vishay.com/docs/31509/csc.pdf" H 7650 5350 50  0001 C CNN
	1    7650 5350
	0    1    1    0   
$EndComp
$Comp
L Device:R_Network08 RA?
U 1 1 635E509A
P 8550 5350
AR Path="/5D957A6E/635E509A" Ref="RA?"  Part="1" 
AR Path="/635BEEB0/635E509A" Ref="RA5"  Part="1" 
F 0 "RA5" V 7933 5350 50  0000 C CNN
F 1 "10k" V 8024 5350 50  0000 C CNN
F 2 "Resistor_THT:R_Array_SIP9" V 9025 5350 50  0001 C CNN
F 3 "http://www.vishay.com/docs/31509/csc.pdf" H 8550 5350 50  0001 C CNN
	1    8550 5350
	0    1    1    0   
$EndComp
$Comp
L 74xx:74LS245 UC10
U 1 1 63729EB6
P 3700 2050
F 0 "UC10" H 3700 3028 50  0000 C CNN
F 1 "74LS245" H 3700 2937 50  0000 C CNN
F 2 "" H 3700 2050 50  0001 C CNN
F 3 "http://www.ti.com/lit/gpn/sn74LS245" H 3700 2050 50  0001 C CNN
	1    3700 2050
	-1   0    0    -1  
$EndComp
$Comp
L 74xx:74LS245 UA10
U 1 1 635C6293
P 3700 4750
F 0 "UA10" H 3700 5728 50  0000 C CNN
F 1 "74LS245" H 3700 5637 50  0000 C CNN
F 2 "" H 3700 4750 50  0001 C CNN
F 3 "http://www.ti.com/lit/gpn/sn74LS245" H 3700 4750 50  0001 C CNN
	1    3700 4750
	-1   0    0    -1  
$EndComp
$Comp
L 74xx:74LS245 UB10
U 1 1 635C00DB
P 5600 4750
F 0 "UB10" H 5600 5728 50  0000 C CNN
F 1 "74LS245" H 5600 5637 50  0000 C CNN
F 2 "" H 5600 4750 50  0001 C CNN
F 3 "http://www.ti.com/lit/gpn/sn74LS245" H 5600 4750 50  0001 C CNN
	1    5600 4750
	-1   0    0    -1  
$EndComp
$Comp
L 74xx:74LS245 UD10
U 1 1 63AEA7C6
P 5700 2050
F 0 "UD10" H 5700 3028 50  0000 C CNN
F 1 "74LS245" H 5700 2937 50  0000 C CNN
F 2 "" H 5700 2050 50  0001 C CNN
F 3 "http://www.ti.com/lit/gpn/sn74LS245" H 5700 2050 50  0001 C CNN
	1    5700 2050
	-1   0    0    -1  
$EndComp
$Comp
L 74xx:74LS245 UE10
U 1 1 63AF9550
P 7500 2050
F 0 "UE10" H 7500 3028 50  0000 C CNN
F 1 "74LS245" H 7500 2937 50  0000 C CNN
F 2 "" H 7500 2050 50  0001 C CNN
F 3 "http://www.ti.com/lit/gpn/sn74LS245" H 7500 2050 50  0001 C CNN
	1    7500 2050
	-1   0    0    -1  
$EndComp
Wire Bus Line
	4500 1650 4500 3200
Wire Bus Line
	2900 900  2900 2050
Wire Bus Line
	4500 3650 4500 4850
Wire Bus Line
	6700 900  6700 2150
Wire Bus Line
	8300 1650 8300 3200
Wire Bus Line
	2900 4350 2900 5950
Wire Bus Line
	4800 4350 4800 5950
Wire Bus Line
	4900 900  4900 2150
Wire Bus Line
	6400 3650 6400 4850
Wire Bus Line
	6500 1650 6500 3200
Wire Bus Line
	7100 5050 7100 5950
Wire Bus Line
	8000 5050 8000 5950
$EndSCHEMATC
