EESchema Schematic File Version 4
EELAYER 30 0
EELAYER END
$Descr A3 11693 16535 portrait
encoding utf-8
Sheet 43 69
Title ""
Date "2020-11-26"
Rev ""
Comp ""
Comment1 "Licence: CC-BY"
Comment2 "Author: Loïc *WydD* Petit"
Comment3 ""
Comment4 ""
$EndDescr
Connection ~ 5850 2800
Connection ~ 5950 2900
Connection ~ 6050 3000
Connection ~ 6150 3100
Connection ~ 6250 3200
Connection ~ 6350 3300
Connection ~ 6450 3400
Connection ~ 6550 3500
Connection ~ 4750 4100
Connection ~ 4850 5800
Connection ~ 7500 2550
Connection ~ 4750 3750
Connection ~ 4850 5450
Connection ~ 4950 3850
Connection ~ 5050 5550
Connection ~ 5650 1750
Connection ~ 5850 6200
Connection ~ 5950 6300
Connection ~ 6050 6400
Connection ~ 6150 6500
Connection ~ 6250 6600
Connection ~ 6350 6700
Connection ~ 6450 6800
Connection ~ 6550 6900
Connection ~ 7500 5950
Connection ~ 4750 7150
Connection ~ 4750 7500
Connection ~ 4950 7250
Connection ~ 4850 8850
Connection ~ 4850 9200
Connection ~ 5050 8950
Connection ~ 6800 3900
Connection ~ 6900 3800
Connection ~ 7000 3650
Connection ~ 7100 4050
Connection ~ 4100 1550
Connection ~ 4000 1450
Connection ~ 3600 850 
Connection ~ 4100 1900
Connection ~ 5850 9600
Connection ~ 5950 9700
Connection ~ 6050 9800
Connection ~ 6150 9900
Connection ~ 6250 10000
Connection ~ 6350 10100
Connection ~ 6450 10200
Connection ~ 6550 10300
Connection ~ 4750 10900
Connection ~ 4850 12600
Connection ~ 7500 9350
Connection ~ 5850 13000
Connection ~ 5950 13100
Connection ~ 6050 13200
Connection ~ 6150 13300
Connection ~ 6250 13400
Connection ~ 6350 13500
Connection ~ 6450 13600
Connection ~ 6550 13700
Connection ~ 7500 12750
Connection ~ 4750 13950
Connection ~ 4850 15650
Connection ~ 4750 10550
Connection ~ 4850 12250
Connection ~ 4950 10650
Connection ~ 5050 12350
Connection ~ 6800 10700
Connection ~ 6800 7300
Connection ~ 6900 10600
Connection ~ 6900 7200
Connection ~ 7000 10450
Connection ~ 7000 7050
Connection ~ 7100 7450
Connection ~ 7100 10850
Connection ~ 8200 6300
Connection ~ 8300 6500
Connection ~ 8200 9700
Connection ~ 8300 9900
Connection ~ 8200 13100
Connection ~ 8300 13300
Connection ~ 9350 4600
Connection ~ 8200 4150
Connection ~ 8300 4600
Connection ~ 3450 3950
Connection ~ 3450 7350
Connection ~ 3450 10750
Connection ~ 3450 14150
Connection ~ 7950 1600
Connection ~ 8550 1600
Connection ~ 7600 1600
Connection ~ 4850 950 
Connection ~ 6150 2300
Connection ~ 7100 2150
NoConn ~ 7950 2900
NoConn ~ 7950 3000
NoConn ~ 7950 3100
NoConn ~ 7950 3200
NoConn ~ 7950 3300
NoConn ~ 7950 3400
NoConn ~ 7950 6300
NoConn ~ 7950 6400
NoConn ~ 7950 6500
NoConn ~ 7950 6600
NoConn ~ 7950 6700
NoConn ~ 7950 6800
NoConn ~ 7950 9700
NoConn ~ 7950 9800
NoConn ~ 7950 9900
NoConn ~ 7950 10000
NoConn ~ 7950 10100
NoConn ~ 7950 10200
NoConn ~ 7950 13100
NoConn ~ 7950 13200
NoConn ~ 7950 13300
NoConn ~ 7950 13400
NoConn ~ 7950 13500
NoConn ~ 7950 13600
Entry Wire Line
	3450 2900 3550 2800
Entry Wire Line
	3450 3000 3550 2900
Entry Wire Line
	3450 3100 3550 3000
Entry Wire Line
	3450 3200 3550 3100
Entry Wire Line
	3450 3300 3550 3200
Entry Wire Line
	3450 3400 3550 3300
Entry Wire Line
	3450 3500 3550 3400
Entry Wire Line
	3450 3600 3550 3500
Entry Wire Line
	3450 4400 3550 4500
Entry Wire Line
	3450 4500 3550 4600
Entry Wire Line
	3450 4600 3550 4700
Entry Wire Line
	3450 4700 3550 4800
Entry Wire Line
	3450 4800 3550 4900
Entry Wire Line
	3450 4900 3550 5000
Entry Wire Line
	3450 5000 3550 5100
Entry Wire Line
	3450 5100 3550 5200
Entry Wire Line
	3450 6300 3550 6200
Entry Wire Line
	3450 6400 3550 6300
Entry Wire Line
	3450 6500 3550 6400
Entry Wire Line
	3450 6600 3550 6500
Entry Wire Line
	3450 6700 3550 6600
Entry Wire Line
	3450 6800 3550 6700
Entry Wire Line
	3450 6900 3550 6800
Entry Wire Line
	3450 7000 3550 6900
Entry Wire Line
	3450 7800 3550 7900
Entry Wire Line
	3450 7900 3550 8000
Entry Wire Line
	3450 8000 3550 8100
Entry Wire Line
	3450 8100 3550 8200
Entry Wire Line
	3450 8200 3550 8300
Entry Wire Line
	3450 8300 3550 8400
Entry Wire Line
	3450 8400 3550 8500
Entry Wire Line
	3450 8500 3550 8600
Entry Wire Line
	3450 9700 3550 9600
Entry Wire Line
	3450 9800 3550 9700
Entry Wire Line
	3450 9900 3550 9800
Entry Wire Line
	3450 10000 3550 9900
Entry Wire Line
	3450 10100 3550 10000
Entry Wire Line
	3450 10200 3550 10100
Entry Wire Line
	3450 10300 3550 10200
Entry Wire Line
	3450 10400 3550 10300
Entry Wire Line
	3450 11200 3550 11300
Entry Wire Line
	3450 11300 3550 11400
Entry Wire Line
	3450 11400 3550 11500
Entry Wire Line
	3450 11500 3550 11600
Entry Wire Line
	3450 11600 3550 11700
Entry Wire Line
	3450 11700 3550 11800
Entry Wire Line
	3450 11800 3550 11900
Entry Wire Line
	3450 11900 3550 12000
Entry Wire Line
	3450 13100 3550 13000
Entry Wire Line
	3450 13200 3550 13100
Entry Wire Line
	3450 13300 3550 13200
Entry Wire Line
	3450 13400 3550 13300
Entry Wire Line
	3450 13500 3550 13400
Entry Wire Line
	3450 13600 3550 13500
Entry Wire Line
	3450 13700 3550 13600
Entry Wire Line
	3450 13800 3550 13700
Entry Wire Line
	3450 14600 3550 14700
Entry Wire Line
	3450 14700 3550 14800
Entry Wire Line
	3450 14800 3550 14900
Entry Wire Line
	3450 14900 3550 15000
Entry Wire Line
	3450 15000 3550 15100
Entry Wire Line
	3450 15100 3550 15200
Entry Wire Line
	3450 15200 3550 15300
Entry Wire Line
	3450 15300 3550 15400
Wire Wire Line
	3500 1900 4100 1900
Wire Wire Line
	3600 850  3500 850 
Wire Wire Line
	3600 1350 3600 850 
Wire Wire Line
	3850 3750 3850 4100
Wire Wire Line
	3850 3750 4050 3750
Wire Wire Line
	3850 4100 4750 4100
Wire Wire Line
	3850 5450 3850 5800
Wire Wire Line
	3850 5450 4050 5450
Wire Wire Line
	3850 5800 4850 5800
Wire Wire Line
	3850 7150 3850 7500
Wire Wire Line
	3850 7150 4050 7150
Wire Wire Line
	3850 7500 4750 7500
Wire Wire Line
	3850 8850 3850 9200
Wire Wire Line
	3850 8850 4050 8850
Wire Wire Line
	3850 9200 4850 9200
Wire Wire Line
	3850 10550 3850 10900
Wire Wire Line
	3850 10550 4050 10550
Wire Wire Line
	3850 10900 4750 10900
Wire Wire Line
	3850 12250 3850 12600
Wire Wire Line
	3850 12250 4050 12250
Wire Wire Line
	3850 12600 4850 12600
Wire Wire Line
	3850 13950 3850 14300
Wire Wire Line
	3850 13950 4050 13950
Wire Wire Line
	3850 14300 4750 14300
Wire Wire Line
	3850 15650 3850 16000
Wire Wire Line
	3850 15650 4050 15650
Wire Wire Line
	3850 16000 4850 16000
Wire Wire Line
	4000 950  4200 950 
Wire Wire Line
	4000 1450 3500 1450
Wire Wire Line
	4000 1450 4000 950 
Wire Wire Line
	4050 2800 3550 2800
Wire Wire Line
	4050 2900 3550 2900
Wire Wire Line
	4050 3000 3550 3000
Wire Wire Line
	4050 3100 3550 3100
Wire Wire Line
	4050 3200 3550 3200
Wire Wire Line
	4050 3300 3550 3300
Wire Wire Line
	4050 3400 3550 3400
Wire Wire Line
	4050 3500 3550 3500
Wire Wire Line
	4050 4500 3550 4500
Wire Wire Line
	4050 4600 3550 4600
Wire Wire Line
	4050 4700 3550 4700
Wire Wire Line
	4050 4800 3550 4800
Wire Wire Line
	4050 4900 3550 4900
Wire Wire Line
	4050 5000 3550 5000
Wire Wire Line
	4050 5100 3550 5100
Wire Wire Line
	4050 5200 3550 5200
Wire Wire Line
	4050 6200 3550 6200
Wire Wire Line
	4050 6300 3550 6300
Wire Wire Line
	4050 6400 3550 6400
Wire Wire Line
	4050 6500 3550 6500
Wire Wire Line
	4050 6600 3550 6600
Wire Wire Line
	4050 6700 3550 6700
Wire Wire Line
	4050 6800 3550 6800
Wire Wire Line
	4050 6900 3550 6900
Wire Wire Line
	4050 7900 3550 7900
Wire Wire Line
	4050 8000 3550 8000
Wire Wire Line
	4050 8100 3550 8100
Wire Wire Line
	4050 8200 3550 8200
Wire Wire Line
	4050 8300 3550 8300
Wire Wire Line
	4050 8400 3550 8400
Wire Wire Line
	4050 8500 3550 8500
Wire Wire Line
	4050 8600 3550 8600
Wire Wire Line
	4050 9600 3550 9600
Wire Wire Line
	4050 9700 3550 9700
Wire Wire Line
	4050 9800 3550 9800
Wire Wire Line
	4050 9900 3550 9900
Wire Wire Line
	4050 10000 3550 10000
Wire Wire Line
	4050 10100 3550 10100
Wire Wire Line
	4050 10200 3550 10200
Wire Wire Line
	4050 10300 3550 10300
Wire Wire Line
	4050 11300 3550 11300
Wire Wire Line
	4050 11400 3550 11400
Wire Wire Line
	4050 11500 3550 11500
Wire Wire Line
	4050 11600 3550 11600
Wire Wire Line
	4050 11700 3550 11700
Wire Wire Line
	4050 11800 3550 11800
Wire Wire Line
	4050 11900 3550 11900
Wire Wire Line
	4050 12000 3550 12000
Wire Wire Line
	4050 13000 3550 13000
Wire Wire Line
	4050 13100 3550 13100
Wire Wire Line
	4050 13200 3550 13200
Wire Wire Line
	4050 13300 3550 13300
Wire Wire Line
	4050 13400 3550 13400
Wire Wire Line
	4050 13500 3550 13500
Wire Wire Line
	4050 13600 3550 13600
Wire Wire Line
	4050 13700 3550 13700
Wire Wire Line
	4050 14700 3550 14700
Wire Wire Line
	4050 14800 3550 14800
Wire Wire Line
	4050 14900 3550 14900
Wire Wire Line
	4050 15000 3550 15000
Wire Wire Line
	4050 15100 3550 15100
Wire Wire Line
	4050 15200 3550 15200
Wire Wire Line
	4050 15300 3550 15300
Wire Wire Line
	4050 15400 3550 15400
Wire Wire Line
	4100 1050 4200 1050
Wire Wire Line
	4100 1550 3500 1550
Wire Wire Line
	4100 1550 4100 1050
Wire Wire Line
	4100 1900 4100 2300
Wire Wire Line
	4200 1350 3600 1350
Wire Wire Line
	4200 1450 4000 1450
Wire Wire Line
	4200 1550 4100 1550
Wire Wire Line
	4650 2800 5150 2800
Wire Wire Line
	4650 2900 5150 2900
Wire Wire Line
	4650 3000 5150 3000
Wire Wire Line
	4650 3100 5150 3100
Wire Wire Line
	4650 3200 5150 3200
Wire Wire Line
	4650 3300 5150 3300
Wire Wire Line
	4650 3400 5150 3400
Wire Wire Line
	4650 3500 5150 3500
Wire Wire Line
	4650 4500 5150 4500
Wire Wire Line
	4650 4600 5150 4600
Wire Wire Line
	4650 4700 5150 4700
Wire Wire Line
	4650 4800 5150 4800
Wire Wire Line
	4650 4900 5150 4900
Wire Wire Line
	4650 5000 5150 5000
Wire Wire Line
	4650 5100 5150 5100
Wire Wire Line
	4650 5200 5150 5200
Wire Wire Line
	4650 6200 5150 6200
Wire Wire Line
	4650 6300 5150 6300
Wire Wire Line
	4650 6400 5150 6400
Wire Wire Line
	4650 6500 5150 6500
Wire Wire Line
	4650 6600 5150 6600
Wire Wire Line
	4650 6700 5150 6700
Wire Wire Line
	4650 6800 5150 6800
Wire Wire Line
	4650 6900 5150 6900
Wire Wire Line
	4650 7900 5150 7900
Wire Wire Line
	4650 8000 5150 8000
Wire Wire Line
	4650 8100 5150 8100
Wire Wire Line
	4650 8200 5150 8200
Wire Wire Line
	4650 8300 5150 8300
Wire Wire Line
	4650 8400 5150 8400
Wire Wire Line
	4650 8500 5150 8500
Wire Wire Line
	4650 8600 5150 8600
Wire Wire Line
	4650 9600 5150 9600
Wire Wire Line
	4650 9700 5150 9700
Wire Wire Line
	4650 9800 5150 9800
Wire Wire Line
	4650 9900 5150 9900
Wire Wire Line
	4650 10000 5150 10000
Wire Wire Line
	4650 10100 5150 10100
Wire Wire Line
	4650 10200 5150 10200
Wire Wire Line
	4650 10300 5150 10300
Wire Wire Line
	4650 11300 5150 11300
Wire Wire Line
	4650 11400 5150 11400
Wire Wire Line
	4650 11500 5150 11500
Wire Wire Line
	4650 11600 5150 11600
Wire Wire Line
	4650 11700 5150 11700
Wire Wire Line
	4650 11800 5150 11800
Wire Wire Line
	4650 11900 5150 11900
Wire Wire Line
	4650 12000 5150 12000
Wire Wire Line
	4650 13000 5150 13000
Wire Wire Line
	4650 13100 5150 13100
Wire Wire Line
	4650 13200 5150 13200
Wire Wire Line
	4650 13300 5150 13300
Wire Wire Line
	4650 13400 5150 13400
Wire Wire Line
	4650 13500 5150 13500
Wire Wire Line
	4650 13600 5150 13600
Wire Wire Line
	4650 13700 5150 13700
Wire Wire Line
	4650 14700 5150 14700
Wire Wire Line
	4650 14800 5150 14800
Wire Wire Line
	4650 14900 5150 14900
Wire Wire Line
	4650 15000 5150 15000
Wire Wire Line
	4650 15100 5150 15100
Wire Wire Line
	4650 15200 5150 15200
Wire Wire Line
	4650 15300 5150 15300
Wire Wire Line
	4650 15400 5150 15400
Wire Wire Line
	4700 2300 4950 2300
Wire Wire Line
	4750 1450 4750 3750
Wire Wire Line
	4750 3750 4750 4100
Wire Wire Line
	4750 3750 5150 3750
Wire Wire Line
	4750 4100 4750 7150
Wire Wire Line
	4750 7150 4750 7500
Wire Wire Line
	4750 7150 5150 7150
Wire Wire Line
	4750 7500 4750 10550
Wire Wire Line
	4750 10550 4750 10900
Wire Wire Line
	4750 10550 5150 10550
Wire Wire Line
	4750 10900 4750 13950
Wire Wire Line
	4750 13950 4750 14300
Wire Wire Line
	4750 13950 5150 13950
Wire Wire Line
	4850 950  4750 950 
Wire Wire Line
	4850 950  4850 5450
Wire Wire Line
	4850 950  5050 950 
Wire Wire Line
	4850 5450 4850 5800
Wire Wire Line
	4850 5450 5150 5450
Wire Wire Line
	4850 5800 4850 8850
Wire Wire Line
	4850 8850 4850 9200
Wire Wire Line
	4850 8850 5150 8850
Wire Wire Line
	4850 9200 4850 12250
Wire Wire Line
	4850 12250 4850 12600
Wire Wire Line
	4850 12250 5150 12250
Wire Wire Line
	4850 12600 4850 15650
Wire Wire Line
	4850 15650 4850 16000
Wire Wire Line
	4850 15650 5150 15650
Wire Wire Line
	4950 2300 4950 3850
Wire Wire Line
	4950 3850 4950 7250
Wire Wire Line
	4950 7250 4950 10650
Wire Wire Line
	4950 10650 4950 14050
Wire Wire Line
	5050 1900 4100 1900
Wire Wire Line
	5050 1900 5050 5550
Wire Wire Line
	5050 5550 5050 8950
Wire Wire Line
	5050 8950 5050 12350
Wire Wire Line
	5050 12350 5050 15750
Wire Wire Line
	5150 3850 4950 3850
Wire Wire Line
	5150 5550 5050 5550
Wire Wire Line
	5150 7250 4950 7250
Wire Wire Line
	5150 8950 5050 8950
Wire Wire Line
	5150 10650 4950 10650
Wire Wire Line
	5150 12350 5050 12350
Wire Wire Line
	5150 14050 4950 14050
Wire Wire Line
	5150 15750 5050 15750
Wire Wire Line
	5650 1750 5450 1750
Wire Wire Line
	5650 2200 5650 1750
Wire Wire Line
	5700 2300 6150 2300
Wire Wire Line
	5750 2800 5850 2800
Wire Wire Line
	5750 2900 5950 2900
Wire Wire Line
	5750 3000 6050 3000
Wire Wire Line
	5750 3100 6150 3100
Wire Wire Line
	5750 3200 6250 3200
Wire Wire Line
	5750 3300 6350 3300
Wire Wire Line
	5750 3400 6450 3400
Wire Wire Line
	5750 3500 6550 3500
Wire Wire Line
	5750 4500 5850 4500
Wire Wire Line
	5750 4700 6050 4700
Wire Wire Line
	5750 4900 6250 4900
Wire Wire Line
	5750 5100 6450 5100
Wire Wire Line
	5750 6200 5850 6200
Wire Wire Line
	5750 6300 5950 6300
Wire Wire Line
	5750 6400 6050 6400
Wire Wire Line
	5750 6500 6150 6500
Wire Wire Line
	5750 6600 6250 6600
Wire Wire Line
	5750 6700 6350 6700
Wire Wire Line
	5750 6800 6450 6800
Wire Wire Line
	5750 6900 6550 6900
Wire Wire Line
	5750 7900 5850 7900
Wire Wire Line
	5750 8100 6050 8100
Wire Wire Line
	5750 8300 6250 8300
Wire Wire Line
	5750 8500 6450 8500
Wire Wire Line
	5750 9600 5850 9600
Wire Wire Line
	5750 9700 5950 9700
Wire Wire Line
	5750 9800 6050 9800
Wire Wire Line
	5750 9900 6150 9900
Wire Wire Line
	5750 10000 6250 10000
Wire Wire Line
	5750 10100 6350 10100
Wire Wire Line
	5750 10200 6450 10200
Wire Wire Line
	5750 10300 6550 10300
Wire Wire Line
	5750 11300 5850 11300
Wire Wire Line
	5750 11500 6050 11500
Wire Wire Line
	5750 11700 6250 11700
Wire Wire Line
	5750 11900 6450 11900
Wire Wire Line
	5750 13000 5850 13000
Wire Wire Line
	5750 13100 5950 13100
Wire Wire Line
	5750 13200 6050 13200
Wire Wire Line
	5750 13300 6150 13300
Wire Wire Line
	5750 13400 6250 13400
Wire Wire Line
	5750 13500 6350 13500
Wire Wire Line
	5750 13600 6450 13600
Wire Wire Line
	5750 13700 6550 13700
Wire Wire Line
	5750 14700 5850 14700
Wire Wire Line
	5750 14900 6050 14900
Wire Wire Line
	5750 15100 6250 15100
Wire Wire Line
	5750 15300 6450 15300
Wire Wire Line
	5850 2800 7150 2800
Wire Wire Line
	5850 4500 5850 2800
Wire Wire Line
	5850 6200 7150 6200
Wire Wire Line
	5850 7900 5850 6200
Wire Wire Line
	5850 9600 7150 9600
Wire Wire Line
	5850 11300 5850 9600
Wire Wire Line
	5850 13000 7150 13000
Wire Wire Line
	5850 14700 5850 13000
Wire Wire Line
	5950 2900 5950 4600
Wire Wire Line
	5950 2900 7150 2900
Wire Wire Line
	5950 4600 5750 4600
Wire Wire Line
	5950 6300 5950 8000
Wire Wire Line
	5950 6300 7150 6300
Wire Wire Line
	5950 8000 5750 8000
Wire Wire Line
	5950 9700 5950 11400
Wire Wire Line
	5950 9700 7150 9700
Wire Wire Line
	5950 11400 5750 11400
Wire Wire Line
	5950 13100 5950 14800
Wire Wire Line
	5950 13100 7150 13100
Wire Wire Line
	5950 14800 5750 14800
Wire Wire Line
	6050 3000 7150 3000
Wire Wire Line
	6050 4700 6050 3000
Wire Wire Line
	6050 6400 7150 6400
Wire Wire Line
	6050 8100 6050 6400
Wire Wire Line
	6050 9800 7150 9800
Wire Wire Line
	6050 11500 6050 9800
Wire Wire Line
	6050 13200 7150 13200
Wire Wire Line
	6050 14900 6050 13200
Wire Wire Line
	6150 1850 6150 2300
Wire Wire Line
	6150 1850 6250 1850
Wire Wire Line
	6150 3100 6150 4800
Wire Wire Line
	6150 3100 7150 3100
Wire Wire Line
	6150 4800 5750 4800
Wire Wire Line
	6150 6500 6150 8200
Wire Wire Line
	6150 6500 7150 6500
Wire Wire Line
	6150 8200 5750 8200
Wire Wire Line
	6150 9900 6150 11600
Wire Wire Line
	6150 9900 7150 9900
Wire Wire Line
	6150 11600 5750 11600
Wire Wire Line
	6150 13300 6150 15000
Wire Wire Line
	6150 13300 7150 13300
Wire Wire Line
	6150 15000 5750 15000
Wire Wire Line
	6250 2200 5650 2200
Wire Wire Line
	6250 2300 6150 2300
Wire Wire Line
	6250 3200 7150 3200
Wire Wire Line
	6250 4900 6250 3200
Wire Wire Line
	6250 6600 7150 6600
Wire Wire Line
	6250 8300 6250 6600
Wire Wire Line
	6250 10000 7150 10000
Wire Wire Line
	6250 11700 6250 10000
Wire Wire Line
	6250 13400 7150 13400
Wire Wire Line
	6250 15100 6250 13400
Wire Wire Line
	6350 3300 6350 5000
Wire Wire Line
	6350 3300 7150 3300
Wire Wire Line
	6350 5000 5750 5000
Wire Wire Line
	6350 6700 6350 8400
Wire Wire Line
	6350 6700 7150 6700
Wire Wire Line
	6350 8400 5750 8400
Wire Wire Line
	6350 10100 6350 11800
Wire Wire Line
	6350 10100 7150 10100
Wire Wire Line
	6350 11800 5750 11800
Wire Wire Line
	6350 13500 6350 15200
Wire Wire Line
	6350 13500 7150 13500
Wire Wire Line
	6350 15200 5750 15200
Wire Wire Line
	6450 3400 7150 3400
Wire Wire Line
	6450 5100 6450 3400
Wire Wire Line
	6450 6800 7150 6800
Wire Wire Line
	6450 8500 6450 6800
Wire Wire Line
	6450 10200 7150 10200
Wire Wire Line
	6450 11900 6450 10200
Wire Wire Line
	6450 13600 7150 13600
Wire Wire Line
	6450 15300 6450 13600
Wire Wire Line
	6550 3500 6550 5200
Wire Wire Line
	6550 3500 7150 3500
Wire Wire Line
	6550 5200 5750 5200
Wire Wire Line
	6550 6900 6550 8600
Wire Wire Line
	6550 6900 7150 6900
Wire Wire Line
	6550 8600 5750 8600
Wire Wire Line
	6550 10300 6550 12000
Wire Wire Line
	6550 10300 7150 10300
Wire Wire Line
	6550 12000 5750 12000
Wire Wire Line
	6550 13700 6550 15400
Wire Wire Line
	6550 13700 7150 13700
Wire Wire Line
	6550 15400 5750 15400
Wire Wire Line
	6800 1800 6900 1800
Wire Wire Line
	6800 2250 6800 3900
Wire Wire Line
	6800 3900 6800 7300
Wire Wire Line
	6800 3900 7150 3900
Wire Wire Line
	6800 7300 7150 7300
Wire Wire Line
	6800 10700 6800 7300
Wire Wire Line
	6800 10700 6800 14100
Wire Wire Line
	6800 10700 7150 10700
Wire Wire Line
	6800 14100 7150 14100
Wire Wire Line
	6900 1800 6900 3800
Wire Wire Line
	6900 3800 6900 7200
Wire Wire Line
	6900 7200 6900 10600
Wire Wire Line
	6900 10600 6900 14000
Wire Wire Line
	7000 1600 7000 3650
Wire Wire Line
	7000 1600 7600 1600
Wire Wire Line
	7000 3650 7000 7050
Wire Wire Line
	7000 10450 7000 7050
Wire Wire Line
	7000 10450 7000 13850
Wire Wire Line
	7100 2150 7100 1200
Wire Wire Line
	7100 2150 7200 2150
Wire Wire Line
	7100 4050 7100 2150
Wire Wire Line
	7100 4050 7100 7450
Wire Wire Line
	7100 7450 7100 10850
Wire Wire Line
	7100 10850 7100 14250
Wire Wire Line
	7150 3650 7000 3650
Wire Wire Line
	7150 3800 6900 3800
Wire Wire Line
	7150 4050 7100 4050
Wire Wire Line
	7150 7050 7000 7050
Wire Wire Line
	7150 7200 6900 7200
Wire Wire Line
	7150 7450 7100 7450
Wire Wire Line
	7150 10450 7000 10450
Wire Wire Line
	7150 10600 6900 10600
Wire Wire Line
	7150 10850 7100 10850
Wire Wire Line
	7150 13850 7000 13850
Wire Wire Line
	7150 14000 6900 14000
Wire Wire Line
	7150 14250 7100 14250
Wire Wire Line
	7500 1850 7600 1850
Wire Wire Line
	7500 2550 7600 2550
Wire Wire Line
	7500 5950 7600 5950
Wire Wire Line
	7500 9350 7600 9350
Wire Wire Line
	7500 12750 7600 12750
Wire Wire Line
	7600 1600 7950 1600
Wire Wire Line
	7600 1850 7600 1600
Wire Wire Line
	8050 3000 8050 3500
Wire Wire Line
	8050 3000 8400 3000
Wire Wire Line
	8050 3500 7950 3500
Wire Wire Line
	8050 6400 8050 6900
Wire Wire Line
	8050 6900 7950 6900
Wire Wire Line
	8050 9800 8050 10300
Wire Wire Line
	8050 10300 7950 10300
Wire Wire Line
	8050 13200 8050 13700
Wire Wire Line
	8050 13700 7950 13700
Wire Wire Line
	8200 2900 8200 4150
Wire Wire Line
	8200 4150 8200 6300
Wire Wire Line
	8200 6300 8200 9700
Wire Wire Line
	8200 9700 8200 13100
Wire Wire Line
	8200 13100 8200 13950
Wire Wire Line
	8200 13100 8400 13100
Wire Wire Line
	8300 3100 8300 4600
Wire Wire Line
	8300 3100 8400 3100
Wire Wire Line
	8300 4600 8300 6500
Wire Wire Line
	8300 6500 8300 9900
Wire Wire Line
	8300 9900 8300 13300
Wire Wire Line
	8300 13300 8300 13950
Wire Wire Line
	8400 2800 7950 2800
Wire Wire Line
	8400 2900 8200 2900
Wire Wire Line
	8400 6200 7950 6200
Wire Wire Line
	8400 6300 8200 6300
Wire Wire Line
	8400 6400 8050 6400
Wire Wire Line
	8400 6500 8300 6500
Wire Wire Line
	8400 9600 7950 9600
Wire Wire Line
	8400 9700 8200 9700
Wire Wire Line
	8400 9800 8050 9800
Wire Wire Line
	8400 9900 8300 9900
Wire Wire Line
	8400 13000 7950 13000
Wire Wire Line
	8400 13200 8050 13200
Wire Wire Line
	8400 13300 8300 13300
Wire Wire Line
	8550 1600 8750 1600
Wire Wire Line
	8750 4600 8300 4600
Wire Wire Line
	9350 4150 8200 4150
Wire Wire Line
	9350 4600 9350 4150
Wire Bus Line
	3450 3950 3150 3950
Wire Bus Line
	3450 7350 3150 7350
Wire Bus Line
	3450 10750 3150 10750
Wire Bus Line
	3450 14150 3150 14150
Text Notes 1150 8250 0    50   ~ 0
TOP MATRIX BUS\n0: MAIN-~RESETI\n1: CLK8M\n2: UBD337-Q (SERIAL-CHNL)\n3: UAA254-Q (SERIAL-LOAD)\n4: UBD383-Q (GFX-CHNL)\n\n5: BPD0 (P129)\n6: BPD1 (P130)\n7: BPD2 (P131)\n8: BPD3 (P132)\n9: BPD4 (P133)\n10: BPD5 (P134)\n11: BPD6 (P135)\n12: BPD7 (P136)\n\n13: APD0 (P137)\n14: APD1 (P138)\n15: APD2 (P139)\n16: APD3 (P140)\n17: APD4 (P141)\n18: APD5 (P142)\n19: APD6 (P143)\n20: APD7 (P144)\n\n21: DPD0 (P145)\n22: DPD1 (P146)\n23: DPD2 (P147)\n24: DPD3 (P148)\n25: DPD4 (P149)\n26: DPD5 (P150)\n27: DPD6 (P151)\n28: DPD7 (P152)\n\n29: CPD0 (P137)\n30: CPD1 (P138)\n31: CPD2 (P139)\n32: CPD3 (P140)\n33: CPD4 (P141)\n34: CPD5 (P142)\n35: CPD6 (P143)\n36: CPD7 (P144)
Text Notes 2400 1500 0    50   ~ 0
9, 11\nLoop at 16
Text Notes 2400 1950 0    50   ~ 0
8-15\nLoop at 16
Text Notes 2450 900  0    50   ~ 0
2-3\nLoop at 4
Text Notes 5150 2200 0    50   ~ 0
3\nLoop at 8
Text Label 3700 9600 0    50   ~ 0
APD0
Text Label 3700 9700 0    50   ~ 0
APD1
Text Label 3700 9800 0    50   ~ 0
APD2
Text Label 3700 9900 0    50   ~ 0
APD3
Text Label 3700 10000 0    50   ~ 0
APD4
Text Label 3700 10100 0    50   ~ 0
APD5
Text Label 3700 10200 0    50   ~ 0
APD6
Text Label 3700 10300 0    50   ~ 0
APD7
Text Label 3700 11300 0    50   ~ 0
APD0
Text Label 3700 11400 0    50   ~ 0
APD1
Text Label 3700 11500 0    50   ~ 0
APD2
Text Label 3700 11600 0    50   ~ 0
APD3
Text Label 3700 11700 0    50   ~ 0
APD4
Text Label 3700 11800 0    50   ~ 0
APD5
Text Label 3700 11900 0    50   ~ 0
APD6
Text Label 3700 12000 0    50   ~ 0
APD7
Text Label 3900 2800 2    50   ~ 0
BPD0
Text Label 3900 2900 2    50   ~ 0
BPD1
Text Label 3900 3000 2    50   ~ 0
BPD2
Text Label 3900 3100 2    50   ~ 0
BPD3
Text Label 3900 3200 2    50   ~ 0
BPD4
Text Label 3900 3300 2    50   ~ 0
BPD5
Text Label 3900 3400 2    50   ~ 0
BPD6
Text Label 3900 3500 2    50   ~ 0
BPD7
Text Label 3900 4500 2    50   ~ 0
BPD0
Text Label 3900 4600 2    50   ~ 0
BPD1
Text Label 3900 4700 2    50   ~ 0
BPD2
Text Label 3900 4800 2    50   ~ 0
BPD3
Text Label 3900 4900 2    50   ~ 0
BPD4
Text Label 3900 5000 2    50   ~ 0
BPD5
Text Label 3900 5100 2    50   ~ 0
BPD6
Text Label 3900 5200 2    50   ~ 0
BPD7
Text Label 3900 6200 2    50   ~ 0
DPD0
Text Label 3900 6300 2    50   ~ 0
DPD1
Text Label 3900 6400 2    50   ~ 0
DPD2
Text Label 3900 6500 2    50   ~ 0
DPD3
Text Label 3900 6600 2    50   ~ 0
DPD4
Text Label 3900 6700 2    50   ~ 0
DPD5
Text Label 3900 6800 2    50   ~ 0
DPD6
Text Label 3900 6900 2    50   ~ 0
DPD7
Text Label 3900 7900 2    50   ~ 0
DPD0
Text Label 3900 8000 2    50   ~ 0
DPD1
Text Label 3900 8100 2    50   ~ 0
DPD2
Text Label 3900 8200 2    50   ~ 0
DPD3
Text Label 3900 8300 2    50   ~ 0
DPD4
Text Label 3900 8400 2    50   ~ 0
DPD5
Text Label 3900 8500 2    50   ~ 0
DPD6
Text Label 3900 8600 2    50   ~ 0
DPD7
Text Label 3900 13000 2    50   ~ 0
CPD0
Text Label 3900 13100 2    50   ~ 0
CPD1
Text Label 3900 13200 2    50   ~ 0
CPD2
Text Label 3900 13300 2    50   ~ 0
CPD3
Text Label 3900 13400 2    50   ~ 0
CPD4
Text Label 3900 13500 2    50   ~ 0
CPD5
Text Label 3900 13600 2    50   ~ 0
CPD6
Text Label 3900 13700 2    50   ~ 0
CPD7
Text Label 3900 14700 2    50   ~ 0
CPD0
Text Label 3900 14800 2    50   ~ 0
CPD1
Text Label 3900 14900 2    50   ~ 0
CPD2
Text Label 3900 15000 2    50   ~ 0
CPD3
Text Label 3900 15100 2    50   ~ 0
CPD4
Text Label 3900 15200 2    50   ~ 0
CPD5
Text Label 3900 15300 2    50   ~ 0
CPD6
Text Label 3900 15400 2    50   ~ 0
CPD7
Text HLabel 3150 3950 0    50   Input ~ 0
BPD[0..7]
Text HLabel 3150 7350 0    50   Input ~ 0
DPD[0..7]
Text HLabel 3150 10750 0    50   Input ~ 0
APD[0..7]
Text HLabel 3150 14150 0    50   Input ~ 0
CPD[0..7]
Text HLabel 3500 850  0    50   Input ~ 0
GFX-CHNL
Text HLabel 3500 1450 0    50   Input ~ 0
GFX-LOAD
Text HLabel 3500 1550 0    50   Input ~ 0
CLK8M
Text HLabel 3500 1900 0    50   Input ~ 0
SERIAL-CHNL
Text HLabel 5050 950  2    50   Output ~ 0
LOAD-CHNLB
Text HLabel 5450 1750 0    50   Input ~ 0
XSEL
Text HLabel 5700 2300 0    50   Input ~ 0
SERIAL-LOAD
Text HLabel 6500 1200 0    50   Output ~ 0
~RESET-BUF
Text HLabel 7200 2150 2    50   Input ~ 0
~RESET
Text HLabel 7500 1850 0    50   Output ~ 0
~CLK8M
Text HLabel 8750 1600 2    50   Input ~ 0
CLK8M
Text HLabel 9250 2950 2    50   Output ~ 0
B
Text HLabel 9250 6350 2    50   Output ~ 0
D
Text HLabel 9250 9750 2    50   Output ~ 0
A
Text HLabel 9250 13150 2    50   Output ~ 0
C
Text HLabel 9950 4600 2    50   Input ~ 0
XSEL
$Comp
L power:VCC #PWR?
U 1 1 62119959
P 7500 2550
AR Path="/6428BC4C/62119959" Ref="#PWR?"  Part="1" 
AR Path="/620F934F/62119959" Ref="#PWR?"  Part="1" 
AR Path="/5FBBD4DB/5FBBDB8D/62119959" Ref="#PWR0155"  Part="1" 
F 0 "#PWR0155" H 7500 2400 50  0001 C CNN
F 1 "VCC" H 7515 2723 50  0000 C CNN
F 2 "" H 7500 2550 50  0001 C CNN
F 3 "" H 7500 2550 50  0001 C CNN
	1    7500 2550
	1    0    0    -1  
$EndComp
$Comp
L power:VCC #PWR?
U 1 1 6211995F
P 7500 5950
AR Path="/6428BC4C/6211995F" Ref="#PWR?"  Part="1" 
AR Path="/620F934F/6211995F" Ref="#PWR?"  Part="1" 
AR Path="/5FBBD4DB/5FBBDB8D/6211995F" Ref="#PWR0156"  Part="1" 
F 0 "#PWR0156" H 7500 5800 50  0001 C CNN
F 1 "VCC" H 7515 6123 50  0000 C CNN
F 2 "" H 7500 5950 50  0001 C CNN
F 3 "" H 7500 5950 50  0001 C CNN
	1    7500 5950
	1    0    0    -1  
$EndComp
$Comp
L power:VCC #PWR?
U 1 1 62119965
P 7500 9350
AR Path="/6428BC4C/62119965" Ref="#PWR?"  Part="1" 
AR Path="/620F934F/62119965" Ref="#PWR?"  Part="1" 
AR Path="/5FBBD4DB/5FBBDB8D/62119965" Ref="#PWR0157"  Part="1" 
F 0 "#PWR0157" H 7500 9200 50  0001 C CNN
F 1 "VCC" H 7515 9523 50  0000 C CNN
F 2 "" H 7500 9350 50  0001 C CNN
F 3 "" H 7500 9350 50  0001 C CNN
	1    7500 9350
	1    0    0    -1  
$EndComp
$Comp
L power:VCC #PWR?
U 1 1 6211996B
P 7500 12750
AR Path="/6428BC4C/6211996B" Ref="#PWR?"  Part="1" 
AR Path="/620F934F/6211996B" Ref="#PWR?"  Part="1" 
AR Path="/5FBBD4DB/5FBBDB8D/6211996B" Ref="#PWR0158"  Part="1" 
F 0 "#PWR0158" H 7500 12600 50  0001 C CNN
F 1 "VCC" H 7515 12923 50  0000 C CNN
F 2 "" H 7500 12750 50  0001 C CNN
F 3 "" H 7500 12750 50  0001 C CNN
	1    7500 12750
	1    0    0    -1  
$EndComp
$Comp
L power:GND #PWR?
U 1 1 62119971
P 4050 3850
AR Path="/6428BC4C/62119971" Ref="#PWR?"  Part="1" 
AR Path="/620F934F/62119971" Ref="#PWR?"  Part="1" 
AR Path="/5FBBD4DB/5FBBDB8D/62119971" Ref="#PWR0159"  Part="1" 
F 0 "#PWR0159" H 4050 3600 50  0001 C CNN
F 1 "GND" H 4055 3677 50  0000 C CNN
F 2 "" H 4050 3850 50  0001 C CNN
F 3 "" H 4050 3850 50  0001 C CNN
	1    4050 3850
	1    0    0    -1  
$EndComp
$Comp
L power:GND #PWR?
U 1 1 62119977
P 4050 5550
AR Path="/6428BC4C/62119977" Ref="#PWR?"  Part="1" 
AR Path="/620F934F/62119977" Ref="#PWR?"  Part="1" 
AR Path="/5FBBD4DB/5FBBDB8D/62119977" Ref="#PWR0160"  Part="1" 
F 0 "#PWR0160" H 4050 5300 50  0001 C CNN
F 1 "GND" H 4055 5377 50  0000 C CNN
F 2 "" H 4050 5550 50  0001 C CNN
F 3 "" H 4050 5550 50  0001 C CNN
	1    4050 5550
	1    0    0    -1  
$EndComp
$Comp
L power:GND #PWR?
U 1 1 6211997D
P 4050 7250
AR Path="/6428BC4C/6211997D" Ref="#PWR?"  Part="1" 
AR Path="/620F934F/6211997D" Ref="#PWR?"  Part="1" 
AR Path="/5FBBD4DB/5FBBDB8D/6211997D" Ref="#PWR0161"  Part="1" 
F 0 "#PWR0161" H 4050 7000 50  0001 C CNN
F 1 "GND" H 4055 7077 50  0000 C CNN
F 2 "" H 4050 7250 50  0001 C CNN
F 3 "" H 4050 7250 50  0001 C CNN
	1    4050 7250
	1    0    0    -1  
$EndComp
$Comp
L power:GND #PWR?
U 1 1 62119983
P 4050 8950
AR Path="/6428BC4C/62119983" Ref="#PWR?"  Part="1" 
AR Path="/620F934F/62119983" Ref="#PWR?"  Part="1" 
AR Path="/5FBBD4DB/5FBBDB8D/62119983" Ref="#PWR0162"  Part="1" 
F 0 "#PWR0162" H 4050 8700 50  0001 C CNN
F 1 "GND" H 4055 8777 50  0000 C CNN
F 2 "" H 4050 8950 50  0001 C CNN
F 3 "" H 4050 8950 50  0001 C CNN
	1    4050 8950
	1    0    0    -1  
$EndComp
$Comp
L power:GND #PWR?
U 1 1 62119989
P 4050 10650
AR Path="/6428BC4C/62119989" Ref="#PWR?"  Part="1" 
AR Path="/620F934F/62119989" Ref="#PWR?"  Part="1" 
AR Path="/5FBBD4DB/5FBBDB8D/62119989" Ref="#PWR0163"  Part="1" 
F 0 "#PWR0163" H 4050 10400 50  0001 C CNN
F 1 "GND" H 4055 10477 50  0000 C CNN
F 2 "" H 4050 10650 50  0001 C CNN
F 3 "" H 4050 10650 50  0001 C CNN
	1    4050 10650
	1    0    0    -1  
$EndComp
$Comp
L power:GND #PWR?
U 1 1 6211998F
P 4050 12350
AR Path="/6428BC4C/6211998F" Ref="#PWR?"  Part="1" 
AR Path="/620F934F/6211998F" Ref="#PWR?"  Part="1" 
AR Path="/5FBBD4DB/5FBBDB8D/6211998F" Ref="#PWR0164"  Part="1" 
F 0 "#PWR0164" H 4050 12100 50  0001 C CNN
F 1 "GND" H 4055 12177 50  0000 C CNN
F 2 "" H 4050 12350 50  0001 C CNN
F 3 "" H 4050 12350 50  0001 C CNN
	1    4050 12350
	1    0    0    -1  
$EndComp
$Comp
L power:GND #PWR?
U 1 1 62119995
P 4050 14050
AR Path="/6428BC4C/62119995" Ref="#PWR?"  Part="1" 
AR Path="/620F934F/62119995" Ref="#PWR?"  Part="1" 
AR Path="/5FBBD4DB/5FBBDB8D/62119995" Ref="#PWR0165"  Part="1" 
F 0 "#PWR0165" H 4050 13800 50  0001 C CNN
F 1 "GND" H 4055 13877 50  0000 C CNN
F 2 "" H 4050 14050 50  0001 C CNN
F 3 "" H 4050 14050 50  0001 C CNN
	1    4050 14050
	1    0    0    -1  
$EndComp
$Comp
L power:GND #PWR?
U 1 1 6211999B
P 4050 15750
AR Path="/6428BC4C/6211999B" Ref="#PWR?"  Part="1" 
AR Path="/620F934F/6211999B" Ref="#PWR?"  Part="1" 
AR Path="/5FBBD4DB/5FBBDB8D/6211999B" Ref="#PWR0166"  Part="1" 
F 0 "#PWR0166" H 4050 15500 50  0001 C CNN
F 1 "GND" H 4055 15577 50  0000 C CNN
F 2 "" H 4050 15750 50  0001 C CNN
F 3 "" H 4050 15750 50  0001 C CNN
	1    4050 15750
	1    0    0    -1  
$EndComp
$Comp
L A5C:OR02 UAI?
U 1 1 621199A1
P 6500 1800
AR Path="/6428BC4C/621199A1" Ref="UAI?"  Part="1" 
AR Path="/620F934F/621199A1" Ref="UAI165"  Part="1" 
AR Path="/5FBBD4DB/5FBBDB8D/621199A1" Ref="UAI165"  Part="1" 
F 0 "UAI165" H 6525 2067 50  0000 C CNN
F 1 "OR02" H 6525 1976 50  0000 C CNN
F 2 "" H 6550 1800 50  0001 C CNN
F 3 "" H 6550 1800 50  0001 C CNN
	1    6500 1800
	1    0    0    -1  
$EndComp
$Comp
L A5C:OR02 UAH?
U 1 1 621199A7
P 6500 2250
AR Path="/6428BC4C/621199A7" Ref="UAH?"  Part="1" 
AR Path="/620F934F/621199A7" Ref="UAG166"  Part="1" 
AR Path="/5FBBD4DB/5FBBDB8D/621199A7" Ref="UAG166"  Part="1" 
F 0 "UAG166" H 6525 2517 50  0000 C CNN
F 1 "OR02" H 6525 2426 50  0000 C CNN
F 2 "" H 6550 2250 50  0001 C CNN
F 3 "" H 6550 2250 50  0001 C CNN
	1    6500 2250
	1    0    0    -1  
$EndComp
$Comp
L A5C:NAND03 UAG?
U 1 1 621199AD
P 4450 950
AR Path="/6428BC4C/621199AD" Ref="UAG?"  Part="1" 
AR Path="/620F934F/621199AD" Ref="UAF166"  Part="1" 
AR Path="/5FBBD4DB/5FBBDB8D/621199AD" Ref="UAF166"  Part="1" 
F 0 "UAF166" H 4475 1242 50  0000 C CNN
F 1 "NAND03" H 4475 1151 50  0000 C CNN
F 2 "" H 4450 950 50  0001 C CNN
F 3 "" H 4450 950 50  0001 C CNN
	1    4450 950 
	1    0    0    -1  
$EndComp
$Comp
L A5C:NAND03 UAE?
U 1 1 621199B3
P 4450 1450
AR Path="/6428BC4C/621199B3" Ref="UAE?"  Part="1" 
AR Path="/620F934F/621199B3" Ref="UAE166"  Part="1" 
AR Path="/5FBBD4DB/5FBBDB8D/621199B3" Ref="UAE166"  Part="1" 
F 0 "UAE166" H 4475 1742 50  0000 C CNN
F 1 "NAND03" H 4475 1651 50  0000 C CNN
F 2 "" H 4450 1450 50  0001 C CNN
F 3 "" H 4450 1450 50  0001 C CNN
	1    4450 1450
	1    0    0    -1  
$EndComp
$Comp
L A5C:INV01 UAG?
U 1 1 621199B9
P 3900 850
AR Path="/6428BC4C/621199B9" Ref="UAG?"  Part="1" 
AR Path="/620F934F/621199B9" Ref="UAG165"  Part="1" 
AR Path="/5FBBD4DB/5FBBDB8D/621199B9" Ref="UAG165"  Part="1" 
F 0 "UAG165" H 3900 1167 50  0000 C CNN
F 1 "INV01" H 3900 1076 50  0000 C CNN
F 2 "" H 3900 650 50  0001 C CNN
F 3 "" H 3900 650 50  0001 C CNN
	1    3900 850 
	1    0    0    -1  
$EndComp
$Comp
L A5C:INV01 UAH?
U 1 1 621199BF
P 4400 2300
AR Path="/6428BC4C/621199BF" Ref="UAH?"  Part="1" 
AR Path="/620F934F/621199BF" Ref="UAH165"  Part="1" 
AR Path="/5FBBD4DB/5FBBDB8D/621199BF" Ref="UAH165"  Part="1" 
F 0 "UAH165" H 4400 2617 50  0000 C CNN
F 1 "INV01" H 4400 2526 50  0000 C CNN
F 2 "" H 4400 2100 50  0001 C CNN
F 3 "" H 4400 2100 50  0001 C CNN
	1    4400 2300
	1    0    0    -1  
$EndComp
$Comp
L A5C:INV01 UAI?
U 1 1 621199C5
P 5950 1750
AR Path="/6428BC4C/621199C5" Ref="UAI?"  Part="1" 
AR Path="/620F934F/621199C5" Ref="UAI167"  Part="1" 
AR Path="/5FBBD4DB/5FBBDB8D/621199C5" Ref="UAI167"  Part="1" 
F 0 "UAI167" H 5950 2067 50  0000 C CNN
F 1 "INV01" H 5950 1976 50  0000 C CNN
F 2 "" H 5950 1550 50  0001 C CNN
F 3 "" H 5950 1550 50  0001 C CNN
	1    5950 1750
	1    0    0    -1  
$EndComp
$Comp
L A5C:BUF12 UAO?
U 1 1 5FC4BC77
P 6800 1200
AR Path="/5FC4BC77" Ref="UAO?"  Part="1" 
AR Path="/60BA673A/5FC4BC77" Ref="UAO?"  Part="1" 
AR Path="/5FB6D140/5FC4BC77" Ref="UAO?"  Part="1" 
AR Path="/620F934F/5FC4BC77" Ref="UAO204"  Part="1" 
AR Path="/5FBBD4DB/5FBBDB8D/5FC4BC77" Ref="UAO204"  Part="1" 
F 0 "UAO204" H 6800 1517 50  0000 C CNN
F 1 "BUF12" H 6800 1426 50  0000 C CNN
F 2 "" H 6800 1200 50  0001 C CNN
F 3 "" H 6800 1200 50  0001 C CNN
	1    6800 1200
	-1   0    0    -1  
$EndComp
$Comp
L A5C:INV01 UAN?
U 1 1 621199E3
P 9050 4600
AR Path="/6428BC4C/621199E3" Ref="UAN?"  Part="1" 
AR Path="/620F934F/621199E3" Ref="UAN129"  Part="1" 
AR Path="/5FBBD4DB/5FBBDB8D/621199E3" Ref="UAN129"  Part="1" 
F 0 "UAN129" H 9050 4917 50  0000 C CNN
F 1 "INV01" H 9050 4826 50  0000 C CNN
F 2 "" H 9050 4400 50  0001 C CNN
F 3 "" H 9050 4400 50  0001 C CNN
	1    9050 4600
	-1   0    0    -1  
$EndComp
$Comp
L A5C:INV01 UAO?
U 1 1 621199E9
P 9650 4600
AR Path="/6428BC4C/621199E9" Ref="UAO?"  Part="1" 
AR Path="/620F934F/621199E9" Ref="UAO129"  Part="1" 
AR Path="/5FBBD4DB/5FBBDB8D/621199E9" Ref="UAO129"  Part="1" 
F 0 "UAO129" H 9650 4917 50  0000 C CNN
F 1 "INV01" H 9650 4826 50  0000 C CNN
F 2 "" H 9650 4400 50  0001 C CNN
F 3 "" H 9650 4400 50  0001 C CNN
	1    9650 4600
	-1   0    0    -1  
$EndComp
$Comp
L A5C:AO22 UAN?
U 1 1 621199EF
P 8800 2900
AR Path="/60BA673A/621199EF" Ref="UAN?"  Part="1" 
AR Path="/6428BC4C/621199EF" Ref="UAN?"  Part="1" 
AR Path="/620F934F/621199EF" Ref="UAN165"  Part="1" 
AR Path="/5FBBD4DB/5FBBDB8D/621199EF" Ref="UAN165"  Part="1" 
F 0 "UAN165" H 8825 3217 50  0000 C CNN
F 1 "AO22" H 8825 3126 50  0000 C CNN
F 2 "" H 8950 2900 50  0001 C CNN
F 3 "" H 8950 2900 50  0001 C CNN
	1    8800 2900
	1    0    0    -1  
$EndComp
$Comp
L A5C:AO22 UAL?
U 1 1 621199F5
P 8800 6300
AR Path="/60BA673A/621199F5" Ref="UAL?"  Part="1" 
AR Path="/6428BC4C/621199F5" Ref="UAL?"  Part="1" 
AR Path="/620F934F/621199F5" Ref="UAL165"  Part="1" 
AR Path="/5FBBD4DB/5FBBDB8D/621199F5" Ref="UAL165"  Part="1" 
F 0 "UAL165" H 8825 6617 50  0000 C CNN
F 1 "AO22" H 8825 6526 50  0000 C CNN
F 2 "" H 8950 6300 50  0001 C CNN
F 3 "" H 8950 6300 50  0001 C CNN
	1    8800 6300
	1    0    0    -1  
$EndComp
$Comp
L A5C:AO22 UAO?
U 1 1 621199FB
P 8800 9700
AR Path="/60BA673A/621199FB" Ref="UAO?"  Part="1" 
AR Path="/6428BC4C/621199FB" Ref="UAO?"  Part="1" 
AR Path="/620F934F/621199FB" Ref="UAO165"  Part="1" 
AR Path="/5FBBD4DB/5FBBDB8D/621199FB" Ref="UAO165"  Part="1" 
F 0 "UAO165" H 8825 10017 50  0000 C CNN
F 1 "AO22" H 8825 9926 50  0000 C CNN
F 2 "" H 8950 9700 50  0001 C CNN
F 3 "" H 8950 9700 50  0001 C CNN
	1    8800 9700
	1    0    0    -1  
$EndComp
$Comp
L A5C:AO22 UAM?
U 1 1 62119A01
P 8800 13100
AR Path="/60BA673A/62119A01" Ref="UAM?"  Part="1" 
AR Path="/6428BC4C/62119A01" Ref="UAM?"  Part="1" 
AR Path="/620F934F/62119A01" Ref="UAM165"  Part="1" 
AR Path="/5FBBD4DB/5FBBDB8D/62119A01" Ref="UAM165"  Part="1" 
F 0 "UAM165" H 8825 13417 50  0000 C CNN
F 1 "AO22" H 8825 13326 50  0000 C CNN
F 2 "" H 8950 13100 50  0001 C CNN
F 3 "" H 8950 13100 50  0001 C CNN
	1    8800 13100
	1    0    0    -1  
$EndComp
$Comp
L A5C:L8G UAL?
U 1 1 62119A07
P 4350 3200
AR Path="/6428BC4C/62119A07" Ref="UAL?"  Part="1" 
AR Path="/620F934F/62119A07" Ref="UAL168"  Part="1" 
AR Path="/5FBBD4DB/5FBBDB8D/62119A07" Ref="UAL168"  Part="1" 
F 0 "UAL168" H 4350 3865 50  0000 C CNN
F 1 "L8G" H 4350 3774 50  0000 C CNN
F 2 "" H 4300 3500 50  0001 C CNN
F 3 "" H 4300 3500 50  0001 C CNN
	1    4350 3200
	1    0    0    -1  
$EndComp
$Comp
L A5C:L8G UAN?
U 1 1 62119A0D
P 4350 4900
AR Path="/6428BC4C/62119A0D" Ref="UAN?"  Part="1" 
AR Path="/620F934F/62119A0D" Ref="UAN168"  Part="1" 
AR Path="/5FBBD4DB/5FBBDB8D/62119A0D" Ref="UAN168"  Part="1" 
F 0 "UAN168" H 4350 5565 50  0000 C CNN
F 1 "L8G" H 4350 5474 50  0000 C CNN
F 2 "" H 4300 5200 50  0001 C CNN
F 3 "" H 4300 5200 50  0001 C CNN
	1    4350 4900
	1    0    0    -1  
$EndComp
$Comp
L A5C:L8G UAE?
U 1 1 62119A13
P 4350 6600
AR Path="/6428BC4C/62119A13" Ref="UAE?"  Part="1" 
AR Path="/620F934F/62119A13" Ref="UAE168"  Part="1" 
AR Path="/5FBBD4DB/5FBBDB8D/62119A13" Ref="UAE168"  Part="1" 
F 0 "UAE168" H 4350 7265 50  0000 C CNN
F 1 "L8G" H 4350 7174 50  0000 C CNN
F 2 "" H 4300 6900 50  0001 C CNN
F 3 "" H 4300 6900 50  0001 C CNN
	1    4350 6600
	1    0    0    -1  
$EndComp
$Comp
L A5C:L8G UAH?
U 1 1 62119A19
P 4350 8300
AR Path="/6428BC4C/62119A19" Ref="UAH?"  Part="1" 
AR Path="/620F934F/62119A19" Ref="UAG168"  Part="1" 
AR Path="/5FBBD4DB/5FBBDB8D/62119A19" Ref="UAG168"  Part="1" 
F 0 "UAG168" H 4350 8965 50  0000 C CNN
F 1 "L8G" H 4350 8874 50  0000 C CNN
F 2 "" H 4300 8600 50  0001 C CNN
F 3 "" H 4300 8600 50  0001 C CNN
	1    4350 8300
	1    0    0    -1  
$EndComp
$Comp
L A5C:L8G UAL?
U 1 1 62119A1F
P 4350 10000
AR Path="/6428BC4C/62119A1F" Ref="UAL?"  Part="1" 
AR Path="/620F934F/62119A1F" Ref="UAL130"  Part="1" 
AR Path="/5FBBD4DB/5FBBDB8D/62119A1F" Ref="UAL130"  Part="1" 
F 0 "UAL130" H 4350 10665 50  0000 C CNN
F 1 "L8G" H 4350 10574 50  0000 C CNN
F 2 "" H 4300 10300 50  0001 C CNN
F 3 "" H 4300 10300 50  0001 C CNN
	1    4350 10000
	1    0    0    -1  
$EndComp
$Comp
L A5C:L8G UAN?
U 1 1 62119A25
P 4350 11700
AR Path="/6428BC4C/62119A25" Ref="UAN?"  Part="1" 
AR Path="/620F934F/62119A25" Ref="UAN130"  Part="1" 
AR Path="/5FBBD4DB/5FBBDB8D/62119A25" Ref="UAN130"  Part="1" 
F 0 "UAN130" H 4350 12365 50  0000 C CNN
F 1 "L8G" H 4350 12274 50  0000 C CNN
F 2 "" H 4300 12000 50  0001 C CNN
F 3 "" H 4300 12000 50  0001 C CNN
	1    4350 11700
	1    0    0    -1  
$EndComp
$Comp
L A5C:L8G UAE?
U 1 1 62119A2B
P 4350 13400
AR Path="/6428BC4C/62119A2B" Ref="UAE?"  Part="1" 
AR Path="/620F934F/62119A2B" Ref="UAE130"  Part="1" 
AR Path="/5FBBD4DB/5FBBDB8D/62119A2B" Ref="UAE130"  Part="1" 
F 0 "UAE130" H 4350 14065 50  0000 C CNN
F 1 "L8G" H 4350 13974 50  0000 C CNN
F 2 "" H 4300 13700 50  0001 C CNN
F 3 "" H 4300 13700 50  0001 C CNN
	1    4350 13400
	1    0    0    -1  
$EndComp
$Comp
L A5C:L8G UAH?
U 1 1 62119A31
P 4350 15100
AR Path="/6428BC4C/62119A31" Ref="UAH?"  Part="1" 
AR Path="/620F934F/62119A31" Ref="UAG130"  Part="1" 
AR Path="/5FBBD4DB/5FBBDB8D/62119A31" Ref="UAG130"  Part="1" 
F 0 "UAG130" H 4350 15765 50  0000 C CNN
F 1 "L8G" H 4350 15674 50  0000 C CNN
F 2 "" H 4300 15400 50  0001 C CNN
F 3 "" H 4300 15400 50  0001 C CNN
	1    4350 15100
	1    0    0    -1  
$EndComp
$Comp
L A5C:L8G UAM?
U 1 1 62119A37
P 5450 3200
AR Path="/6428BC4C/62119A37" Ref="UAM?"  Part="1" 
AR Path="/620F934F/62119A37" Ref="UAM168"  Part="1" 
AR Path="/5FBBD4DB/5FBBDB8D/62119A37" Ref="UAM168"  Part="1" 
F 0 "UAM168" H 5450 3865 50  0000 C CNN
F 1 "L8G" H 5450 3774 50  0000 C CNN
F 2 "" H 5400 3500 50  0001 C CNN
F 3 "" H 5400 3500 50  0001 C CNN
	1    5450 3200
	1    0    0    -1  
$EndComp
$Comp
L A5C:L8G UAO?
U 1 1 62119A3D
P 5450 4900
AR Path="/6428BC4C/62119A3D" Ref="UAO?"  Part="1" 
AR Path="/620F934F/62119A3D" Ref="UAO168"  Part="1" 
AR Path="/5FBBD4DB/5FBBDB8D/62119A3D" Ref="UAO168"  Part="1" 
F 0 "UAO168" H 5450 5565 50  0000 C CNN
F 1 "L8G" H 5450 5474 50  0000 C CNN
F 2 "" H 5400 5200 50  0001 C CNN
F 3 "" H 5400 5200 50  0001 C CNN
	1    5450 4900
	1    0    0    -1  
$EndComp
$Comp
L A5C:L8G UAF?
U 1 1 62119A43
P 5450 6600
AR Path="/6428BC4C/62119A43" Ref="UAF?"  Part="1" 
AR Path="/620F934F/62119A43" Ref="UAF168"  Part="1" 
AR Path="/5FBBD4DB/5FBBDB8D/62119A43" Ref="UAF168"  Part="1" 
F 0 "UAF168" H 5450 7265 50  0000 C CNN
F 1 "L8G" H 5450 7174 50  0000 C CNN
F 2 "" H 5400 6900 50  0001 C CNN
F 3 "" H 5400 6900 50  0001 C CNN
	1    5450 6600
	1    0    0    -1  
$EndComp
$Comp
L A5C:L8G UAI?
U 1 1 62119A49
P 5450 8300
AR Path="/6428BC4C/62119A49" Ref="UAI?"  Part="1" 
AR Path="/620F934F/62119A49" Ref="UAI168"  Part="1" 
AR Path="/5FBBD4DB/5FBBDB8D/62119A49" Ref="UAI168"  Part="1" 
F 0 "UAI168" H 5450 8965 50  0000 C CNN
F 1 "L8G" H 5450 8874 50  0000 C CNN
F 2 "" H 5400 8600 50  0001 C CNN
F 3 "" H 5400 8600 50  0001 C CNN
	1    5450 8300
	1    0    0    -1  
$EndComp
$Comp
L A5C:L8G UAM?
U 1 1 62119A4F
P 5450 10000
AR Path="/6428BC4C/62119A4F" Ref="UAM?"  Part="1" 
AR Path="/620F934F/62119A4F" Ref="UAM130"  Part="1" 
AR Path="/5FBBD4DB/5FBBDB8D/62119A4F" Ref="UAM130"  Part="1" 
F 0 "UAM130" H 5450 10665 50  0000 C CNN
F 1 "L8G" H 5450 10574 50  0000 C CNN
F 2 "" H 5400 10300 50  0001 C CNN
F 3 "" H 5400 10300 50  0001 C CNN
	1    5450 10000
	1    0    0    -1  
$EndComp
$Comp
L A5C:L8G UAO?
U 1 1 62119A55
P 5450 11700
AR Path="/6428BC4C/62119A55" Ref="UAO?"  Part="1" 
AR Path="/620F934F/62119A55" Ref="UAO130"  Part="1" 
AR Path="/5FBBD4DB/5FBBDB8D/62119A55" Ref="UAO130"  Part="1" 
F 0 "UAO130" H 5450 12365 50  0000 C CNN
F 1 "L8G" H 5450 12274 50  0000 C CNN
F 2 "" H 5400 12000 50  0001 C CNN
F 3 "" H 5400 12000 50  0001 C CNN
	1    5450 11700
	1    0    0    -1  
$EndComp
$Comp
L A5C:L8G UAF?
U 1 1 62119A5B
P 5450 13400
AR Path="/6428BC4C/62119A5B" Ref="UAF?"  Part="1" 
AR Path="/620F934F/62119A5B" Ref="UAF130"  Part="1" 
AR Path="/5FBBD4DB/5FBBDB8D/62119A5B" Ref="UAF130"  Part="1" 
F 0 "UAF130" H 5450 14065 50  0000 C CNN
F 1 "L8G" H 5450 13974 50  0000 C CNN
F 2 "" H 5400 13700 50  0001 C CNN
F 3 "" H 5400 13700 50  0001 C CNN
	1    5450 13400
	1    0    0    -1  
$EndComp
$Comp
L A5C:L8G UAI?
U 1 1 62119A61
P 5450 15100
AR Path="/6428BC4C/62119A61" Ref="UAI?"  Part="1" 
AR Path="/620F934F/62119A61" Ref="UAI130"  Part="1" 
AR Path="/5FBBD4DB/5FBBDB8D/62119A61" Ref="UAI130"  Part="1" 
F 0 "UAI130" H 5450 15765 50  0000 C CNN
F 1 "L8G" H 5450 15674 50  0000 C CNN
F 2 "" H 5400 15400 50  0001 C CNN
F 3 "" H 5400 15400 50  0001 C CNN
	1    5450 15100
	1    0    0    -1  
$EndComp
$Comp
L A5C:M198C UAP?
U 1 1 62119A67
P 7400 3050
AR Path="/6428BC4C/62119A67" Ref="UAP?"  Part="1" 
AR Path="/620F934F/62119A67" Ref="UAP167"  Part="1" 
AR Path="/5FBBD4DB/5FBBDB8D/62119A67" Ref="UAP167"  Part="1" 
F 0 "UAP167" H 7550 1877 50  0000 C CNN
F 1 "M198C" H 7550 1786 50  0000 C CNN
F 2 "" H 7400 3050 50  0001 C CNN
F 3 "" H 7400 3050 50  0001 C CNN
	1    7400 3050
	1    0    0    -1  
$EndComp
$Comp
L A5C:M198C UAJ?
U 1 1 62119A6D
P 7400 6450
AR Path="/6428BC4C/62119A6D" Ref="UAJ?"  Part="1" 
AR Path="/620F934F/62119A6D" Ref="UAJ167"  Part="1" 
AR Path="/5FBBD4DB/5FBBDB8D/62119A6D" Ref="UAJ167"  Part="1" 
F 0 "UAJ167" H 7550 5277 50  0000 C CNN
F 1 "M198C" H 7550 5186 50  0000 C CNN
F 2 "" H 7400 6450 50  0001 C CNN
F 3 "" H 7400 6450 50  0001 C CNN
	1    7400 6450
	1    0    0    -1  
$EndComp
$Comp
L A5C:M198C UAP?
U 1 1 62119A73
P 7400 9850
AR Path="/6428BC4C/62119A73" Ref="UAP?"  Part="1" 
AR Path="/620F934F/62119A73" Ref="UAP128"  Part="1" 
AR Path="/5FBBD4DB/5FBBDB8D/62119A73" Ref="UAP128"  Part="1" 
F 0 "UAP128" H 7550 8677 50  0000 C CNN
F 1 "M198C" H 7550 8586 50  0000 C CNN
F 2 "" H 7400 9850 50  0001 C CNN
F 3 "" H 7400 9850 50  0001 C CNN
	1    7400 9850
	1    0    0    -1  
$EndComp
$Comp
L A5C:M198C UAJ?
U 1 1 62119A79
P 7400 13250
AR Path="/6428BC4C/62119A79" Ref="UAJ?"  Part="1" 
AR Path="/620F934F/62119A79" Ref="UAJ128"  Part="1" 
AR Path="/5FBBD4DB/5FBBDB8D/62119A79" Ref="UAJ128"  Part="1" 
F 0 "UAJ128" H 7550 12077 50  0000 C CNN
F 1 "M198C" H 7550 11986 50  0000 C CNN
F 2 "" H 7400 13250 50  0001 C CNN
F 3 "" H 7400 13250 50  0001 C CNN
	1    7400 13250
	1    0    0    -1  
$EndComp
$Comp
L A5C:NBUF02 UAE?
U 1 1 647E0E53
P 8250 850
AR Path="/5FBBD4DB/5FBBDB9D/647E0E53" Ref="UAE?"  Part="1" 
AR Path="/5FBBD4DB/5FBBDB8D/647E0E53" Ref="UAE204"  Part="1" 
F 0 "UAE204" H 8250 1167 50  0000 C CNN
F 1 "INV01" H 8250 1076 50  0000 C CNN
F 2 "" H 8250 650 50  0001 C CNN
F 3 "" H 8250 650 50  0001 C CNN
	1    8250 850 
	-1   0    0    -1  
$EndComp
$Comp
L A5C:NBUF02 UAG?
U 1 1 647E0E59
P 8250 1350
AR Path="/5FBBD4DB/5FBBDB9D/647E0E59" Ref="UAG?"  Part="1" 
AR Path="/5FBBD4DB/5FBBDB8D/647E0E59" Ref="UAG204"  Part="1" 
F 0 "UAG204" H 8250 1667 50  0000 C CNN
F 1 "INV01" H 8250 1576 50  0000 C CNN
F 2 "" H 8250 1150 50  0001 C CNN
F 3 "" H 8250 1150 50  0001 C CNN
	1    8250 1350
	-1   0    0    -1  
$EndComp
$Comp
L A5C:NBUF02 UAH?
U 1 1 647E0E5F
P 8250 1850
AR Path="/5FBBD4DB/5FBBDB9D/647E0E5F" Ref="UAH?"  Part="1" 
AR Path="/5FBBD4DB/5FBBDB8D/647E0E5F" Ref="UAH204"  Part="1" 
F 0 "UAH204" H 8250 2167 50  0000 C CNN
F 1 "INV01" H 8250 2076 50  0000 C CNN
F 2 "" H 8250 1650 50  0001 C CNN
F 3 "" H 8250 1650 50  0001 C CNN
	1    8250 1850
	-1   0    0    -1  
$EndComp
$Comp
L A5C:NBUF02 UAI?
U 1 1 647E0E65
P 8250 2350
AR Path="/5FBBD4DB/5FBBDB9D/647E0E65" Ref="UAI?"  Part="1" 
AR Path="/5FBBD4DB/5FBBDB8D/647E0E65" Ref="UAI204"  Part="1" 
F 0 "UAI204" H 8250 2667 50  0000 C CNN
F 1 "INV01" H 8250 2576 50  0000 C CNN
F 2 "" H 8250 2150 50  0001 C CNN
F 3 "" H 8250 2150 50  0001 C CNN
	1    8250 2350
	-1   0    0    -1  
$EndComp
Wire Wire Line
	8550 850  8550 1350
Wire Wire Line
	7950 850  7950 1350
Wire Wire Line
	8550 1600 8550 1850
Wire Wire Line
	7950 1600 7950 1850
Connection ~ 7950 1350
Wire Wire Line
	7950 1350 7950 1600
Connection ~ 7950 1850
Wire Wire Line
	7950 1850 7950 2350
Connection ~ 8550 1350
Wire Wire Line
	8550 1350 8550 1600
Connection ~ 8550 1850
Wire Wire Line
	8550 1850 8550 2350
Wire Bus Line
	3450 2900 3450 3950
Wire Bus Line
	3450 3950 3450 5100
Wire Bus Line
	3450 6300 3450 7350
Wire Bus Line
	3450 7350 3450 8500
Wire Bus Line
	3450 9700 3450 10750
Wire Bus Line
	3450 10750 3450 11900
Wire Bus Line
	3450 13100 3450 14150
Wire Bus Line
	3450 14150 3450 15300
$EndSCHEMATC
