EESchema Schematic File Version 4
EELAYER 30 0
EELAYER END
$Descr A4 11693 8268
encoding utf-8
Sheet 62 83
Title "CPS Reverse Engineering: DL-0311"
Date "2021-09-12"
Rev ""
Comp ""
Comment1 ""
Comment2 ""
Comment3 "Licence: CC-BY"
Comment4 "Author: Loïc *WydD* Petit"
$EndDescr
Connection ~ 4450 5050
Connection ~ 4550 5150
Connection ~ 6200 3300
Entry Wire Line
	3550 4450 3650 4550
Entry Wire Line
	3550 4550 3650 4650
Entry Wire Line
	3550 4650 3650 4750
Entry Wire Line
	3550 4750 3650 4850
Entry Wire Line
	3550 5850 3650 5950
Entry Wire Line
	3550 5950 3650 6050
Entry Wire Line
	3550 6050 3650 6150
Entry Wire Line
	3550 6150 3650 6250
Entry Wire Line
	3850 3950 3950 4050
Entry Wire Line
	3850 4050 3950 4150
Entry Wire Line
	3850 4150 3950 4250
Entry Wire Line
	3850 4250 3950 4350
Entry Wire Line
	3850 5350 3950 5450
Entry Wire Line
	3850 5450 3950 5550
Entry Wire Line
	3850 5550 3950 5650
Entry Wire Line
	3850 5650 3950 5750
Entry Wire Line
	3950 1150 4050 1250
Entry Wire Line
	3950 1250 4050 1350
Entry Wire Line
	3950 1350 4050 1450
Entry Wire Line
	3950 1450 4050 1550
Entry Wire Line
	3950 2050 4050 2150
Entry Wire Line
	3950 2150 4050 2250
Entry Wire Line
	3950 2250 4050 2350
Entry Wire Line
	3950 2350 4050 2450
Entry Wire Line
	6100 1250 6200 1350
Entry Wire Line
	6100 1350 6200 1450
Entry Wire Line
	6100 1450 6200 1550
Entry Wire Line
	6100 1550 6200 1650
Entry Wire Line
	6100 2150 6200 2250
Entry Wire Line
	6100 2250 6200 2350
Entry Wire Line
	6100 2350 6200 2450
Entry Wire Line
	6100 2450 6200 2550
Entry Wire Line
	6100 4300 6200 4200
Entry Wire Line
	6100 4400 6200 4300
Entry Wire Line
	6100 4500 6200 4400
Entry Wire Line
	6100 4600 6200 4500
Entry Wire Line
	6100 5700 6200 5600
Entry Wire Line
	6100 5800 6200 5700
Entry Wire Line
	6100 5900 6200 5800
Entry Wire Line
	6100 6000 6200 5900
Wire Wire Line
	3650 4550 4650 4550
Wire Wire Line
	3650 4650 4650 4650
Wire Wire Line
	3650 4750 4650 4750
Wire Wire Line
	3650 4850 4650 4850
Wire Wire Line
	3650 5950 4650 5950
Wire Wire Line
	3650 6050 4650 6050
Wire Wire Line
	3650 6150 4650 6150
Wire Wire Line
	3650 6250 4650 6250
Wire Wire Line
	3950 4050 4650 4050
Wire Wire Line
	3950 4150 4650 4150
Wire Wire Line
	3950 4250 4650 4250
Wire Wire Line
	3950 4350 4650 4350
Wire Wire Line
	3950 5450 4650 5450
Wire Wire Line
	3950 5550 4650 5550
Wire Wire Line
	3950 5650 4650 5650
Wire Wire Line
	3950 5750 4650 5750
Wire Wire Line
	4050 1250 4650 1250
Wire Wire Line
	4050 1350 4650 1350
Wire Wire Line
	4050 1450 4650 1450
Wire Wire Line
	4050 1550 4650 1550
Wire Wire Line
	4050 2150 4650 2150
Wire Wire Line
	4050 2250 4650 2250
Wire Wire Line
	4050 2350 4650 2350
Wire Wire Line
	4050 2450 4650 2450
Wire Wire Line
	4450 3400 4450 5050
Wire Wire Line
	4450 5050 4450 6450
Wire Wire Line
	4450 5050 4650 5050
Wire Wire Line
	4550 2850 4550 5150
Wire Wire Line
	4550 5150 4650 5150
Wire Wire Line
	4550 6550 4550 5150
Wire Wire Line
	4650 6450 4450 6450
Wire Wire Line
	4650 6550 4550 6550
Wire Wire Line
	5650 1250 6100 1250
Wire Wire Line
	5650 1350 6100 1350
Wire Wire Line
	5650 1450 6100 1450
Wire Wire Line
	5650 1550 6100 1550
Wire Wire Line
	5650 2150 6100 2150
Wire Wire Line
	5650 2250 6100 2250
Wire Wire Line
	5650 2350 6100 2350
Wire Wire Line
	5650 2450 6100 2450
Wire Wire Line
	5650 4300 6100 4300
Wire Wire Line
	5650 4400 6100 4400
Wire Wire Line
	5650 4500 6100 4500
Wire Wire Line
	5650 4600 6100 4600
Wire Wire Line
	5650 5700 6100 5700
Wire Wire Line
	5650 5800 6100 5800
Wire Wire Line
	5650 5900 6100 5900
Wire Wire Line
	5650 6000 6100 6000
Wire Bus Line
	3450 3800 3850 3800
Wire Bus Line
	3550 3900 3450 3900
Wire Bus Line
	3950 1000 3850 1000
Wire Bus Line
	6200 3300 6700 3300
Text Notes 4600 3600 0    50   ~ 0
A channel = when mem is written\nB channel = when mem is read
Text Notes 7800 4200 1    157  ~ 0
MEM-ADDR[7..0]
Text Label 4000 4050 0    50   ~ 0
WR-ADDR7
Text Label 4000 4150 0    50   ~ 0
WR-ADDR6
Text Label 4000 4250 0    50   ~ 0
WR-ADDR5
Text Label 4000 4350 0    50   ~ 0
WR-ADDR4
Text Label 4000 4550 0    50   ~ 0
RD-ADDR7
Text Label 4000 4650 0    50   ~ 0
RD-ADDR6
Text Label 4000 4750 0    50   ~ 0
RD-ADDR5
Text Label 4000 4850 0    50   ~ 0
RD-ADDR4
Text Label 4000 5450 0    50   ~ 0
WR-ADDR3
Text Label 4000 5550 0    50   ~ 0
WR-ADDR2
Text Label 4000 5650 0    50   ~ 0
WR-ADDR1
Text Label 4000 5750 0    50   ~ 0
WR-ADDR0
Text Label 4000 5950 0    50   ~ 0
RD-ADDR3
Text Label 4000 6050 0    50   ~ 0
RD-ADDR2
Text Label 4000 6150 0    50   ~ 0
RD-ADDR1
Text Label 4000 6250 0    50   ~ 0
RD-ADDR0
Text Label 4350 1250 2    50   ~ 0
CA17
Text Label 4350 1350 2    50   ~ 0
CA16
Text Label 4350 1450 2    50   ~ 0
CA15
Text Label 4350 1550 2    50   ~ 0
CA14
Text Label 4350 2150 2    50   ~ 0
CA13
Text Label 4350 2250 2    50   ~ 0
CA12
Text Label 4350 2350 2    50   ~ 0
CA11
Text Label 4350 2450 2    50   ~ 0
CA10
Text Label 5700 1250 0    50   ~ 0
ADDR7
Text Label 5700 1350 0    50   ~ 0
ADDR6
Text Label 5700 1450 0    50   ~ 0
ADDR5
Text Label 5700 1550 0    50   ~ 0
ADDR4
Text Label 5700 2150 0    50   ~ 0
ADDR3
Text Label 5700 2250 0    50   ~ 0
ADDR2
Text Label 5700 2350 0    50   ~ 0
ADDR1
Text Label 5700 2450 0    50   ~ 0
ADDR0
Text Label 5700 4300 0    50   ~ 0
ADDR7
Text Label 5700 4400 0    50   ~ 0
ADDR6
Text Label 5700 4500 0    50   ~ 0
ADDR5
Text Label 5700 4600 0    50   ~ 0
ADDR4
Text Label 5700 5700 0    50   ~ 0
ADDR3
Text Label 5700 5800 0    50   ~ 0
ADDR2
Text Label 5700 5900 0    50   ~ 0
ADDR1
Text Label 5700 6000 0    50   ~ 0
ADDR0
Text HLabel 3450 3800 0    50   Input ~ 0
WR-ADDR[0..7]
Text HLabel 3450 3900 0    50   Input ~ 0
RD-ADDR[0..7]
Text HLabel 3850 1000 0    50   Input ~ 0
CA[10..17]
Text HLabel 6700 3300 2    50   Output ~ 0
ADDR[0..7]
$Comp
L A5C:M368C UCC?
U 1 1 6F2ECD4E
P 5150 2400
AR Path="/604B5523/6F2ECD4E" Ref="UCC?"  Part="1" 
AR Path="/6F2ECD4E" Ref="UAB133"  Part="1" 
AR Path="/6029E0E8/6F2ECD4E" Ref="UCC?"  Part="1" 
AR Path="/61116467/611BE427/6F2ECD4E" Ref="UAB133"  Part="1" 
AR Path="/6112ED2E/6F2ECD4E" Ref="UAB133"  Part="1" 
AR Path="/612E497E/612E4DF0/6F2ECD4E" Ref="UAB133"  Part="1" 
F 0 "UAB133" H 5150 2910 50  0000 C CNN
F 1 "M368C" H 5150 2820 50  0000 C CNN
F 2 "" H 5450 2200 50  0001 C CNN
F 3 "" H 5450 2200 50  0001 C CNN
	1    5150 2400
	1    0    0    -1  
$EndComp
$Comp
L A5C:MUX24GH UCA171
U 1 1 6244503C
P 5150 4650
AR Path="/61116467/611BE427/6244503C" Ref="UCA171"  Part="1" 
AR Path="/6112ED2E/6244503C" Ref="UCA171"  Part="1" 
AR Path="/612E497E/612E4DF0/6244503C" Ref="UCA171"  Part="1" 
F 0 "UCA171" H 5150 5515 50  0000 C CNN
F 1 "MUX24GH" H 5150 5424 50  0000 C CNN
F 2 "" H 5150 4650 50  0001 C CNN
F 3 "" H 5150 4650 50  0001 C CNN
	1    5150 4650
	1    0    0    -1  
$EndComp
$Comp
L A5C:MUX24GH UCC171
U 1 1 684C7B32
P 5150 6050
AR Path="/61116467/611BE427/684C7B32" Ref="UCC171"  Part="1" 
AR Path="/6112ED2E/684C7B32" Ref="UCC171"  Part="1" 
AR Path="/612E497E/612E4DF0/684C7B32" Ref="UCC171"  Part="1" 
F 0 "UCC171" H 5150 5285 50  0000 C CNN
F 1 "MUX24GH" H 5150 5376 50  0000 C CNN
F 2 "" H 5150 6050 50  0001 C CNN
F 3 "" H 5150 6050 50  0001 C CNN
	1    5150 6050
	1    0    0    -1  
$EndComp
$Comp
L A5C:M368C UAB?
U 1 1 6F2ECD48
P 5150 1500
AR Path="/604B5523/6F2ECD48" Ref="UAB?"  Part="1" 
AR Path="/6F2ECD48" Ref="UAB92"  Part="1" 
AR Path="/6029E0E8/6F2ECD48" Ref="UAB?"  Part="1" 
AR Path="/61116467/611BE427/6F2ECD48" Ref="UAB92"  Part="1" 
AR Path="/6112ED2E/6F2ECD48" Ref="UAB92"  Part="1" 
AR Path="/612E497E/612E4DF0/6F2ECD48" Ref="UAA92"  Part="1" 
F 0 "UAA92" H 5150 2010 50  0000 C CNN
F 1 "M368C" H 5150 1920 50  0000 C CNN
F 2 "" H 5450 1300 50  0001 C CNN
F 3 "" H 5450 1300 50  0001 C CNN
	1    5150 1500
	1    0    0    -1  
$EndComp
$Comp
L A5C:INV01 UCB144
U 1 1 61118D4A
P 4250 2850
AR Path="/61116467/611BE427/61118D4A" Ref="UCB144"  Part="1" 
AR Path="/6112ED2E/61118D4A" Ref="UCB144"  Part="1" 
AR Path="/612E497E/612E4DF0/61118D4A" Ref="UCB144"  Part="1" 
F 0 "UCB144" H 4250 3167 50  0000 C CNN
F 1 "INV01" H 4250 3076 50  0000 C CNN
F 2 "" H 4250 2650 50  0001 C CNN
F 3 "" H 4250 2650 50  0001 C CNN
	1    4250 2850
	1    0    0    1   
$EndComp
Text HLabel 2750 3400 0    50   Input ~ 0
~W~R
$Comp
L A5C:BUF12 UCB168
U 1 1 61118D48
P 3050 3400
AR Path="/61116467/611BE427/61118D48" Ref="UCB168"  Part="1" 
AR Path="/6112ED2E/61118D48" Ref="UCB168"  Part="1" 
AR Path="/612E497E/612E4DF0/61118D48" Ref="UCB168"  Part="1" 
F 0 "UCB168" H 3050 3717 50  0000 C CNN
F 1 "BUF12" H 3050 3626 50  0000 C CNN
F 2 "" H 3050 3400 50  0001 C CNN
F 3 "" H 3050 3400 50  0001 C CNN
	1    3050 3400
	1    0    0    -1  
$EndComp
$Comp
L A5C:BUF12 UCB169
U 1 1 61118D49
P 3650 3400
AR Path="/61116467/611BE427/61118D49" Ref="UCB169"  Part="1" 
AR Path="/6112ED2E/61118D49" Ref="UCB169"  Part="1" 
AR Path="/612E497E/612E4DF0/61118D49" Ref="UCB169"  Part="1" 
F 0 "UCB169" H 3650 3717 50  0000 C CNN
F 1 "BUF12" H 3650 3626 50  0000 C CNN
F 2 "" H 3650 3400 50  0001 C CNN
F 3 "" H 3650 3400 50  0001 C CNN
	1    3650 3400
	1    0    0    -1  
$EndComp
Wire Wire Line
	3950 3400 4450 3400
Wire Wire Line
	3450 2850 3850 2850
Text HLabel 3450 2850 0    50   Input ~ 0
~DEBUG3
Connection ~ 3850 2850
Wire Wire Line
	3850 2850 3950 2850
Wire Wire Line
	3850 1700 3850 2600
Wire Wire Line
	3850 2600 4650 2600
Connection ~ 3850 2600
Wire Wire Line
	3850 2600 3850 2850
Wire Wire Line
	3850 1700 4650 1700
Wire Bus Line
	3550 3900 3550 6150
Wire Bus Line
	3850 3800 3850 5650
Wire Bus Line
	3950 1000 3950 2350
Wire Bus Line
	6200 1350 6200 3300
Wire Bus Line
	6200 3300 6200 5900
$EndSCHEMATC
