EESchema Schematic File Version 4
EELAYER 30 0
EELAYER END
$Descr A4 11693 8268
encoding utf-8
Sheet 53 83
Title "CPS Reverse Engineering: DL-0311"
Date "2021-09-12"
Rev ""
Comp ""
Comment1 ""
Comment2 ""
Comment3 "Licence: CC-BY"
Comment4 "Author: Loïc *WydD* Petit"
$EndDescr
Connection ~ 3650 4650
Connection ~ 3650 3900
Connection ~ 3650 2100
Connection ~ 3650 3150
NoConn ~ 5150 4450
NoConn ~ 5150 3700
NoConn ~ 5150 5350
Entry Wire Line
	4000 1500 4100 1600
Entry Wire Line
	4000 1600 4100 1700
Entry Wire Line
	4000 1700 4100 1800
Entry Wire Line
	4000 1800 4100 1900
Entry Wire Line
	4000 2550 4100 2650
Entry Wire Line
	4000 2650 4100 2750
Entry Wire Line
	4000 2750 4100 2850
Entry Wire Line
	4000 2850 4100 2950
Entry Wire Line
	4000 3600 4100 3700
Entry Wire Line
	4000 4350 4100 4450
Entry Wire Line
	4000 5150 4100 5250
Entry Wire Line
	6500 1500 6400 1600
Entry Wire Line
	6500 1600 6400 1700
Entry Wire Line
	6500 1700 6400 1800
Entry Wire Line
	6500 1800 6400 1900
Entry Wire Line
	6500 2550 6400 2650
Entry Wire Line
	6500 2650 6400 2750
Entry Wire Line
	6500 2750 6400 2850
Entry Wire Line
	6500 2850 6400 2950
Entry Wire Line
	6500 3700 6400 3800
Entry Wire Line
	6500 4450 6400 4550
Wire Wire Line
	3550 2100 3650 2100
Wire Wire Line
	3650 2100 3650 3150
Wire Wire Line
	3650 2100 4650 2100
Wire Wire Line
	3650 3150 3650 3900
Wire Wire Line
	3650 3150 4650 3150
Wire Wire Line
	3650 3900 3650 4650
Wire Wire Line
	3650 3900 4650 3900
Wire Wire Line
	3650 4650 3650 5450
Wire Wire Line
	3650 4650 4650 4650
Wire Wire Line
	3650 5450 4650 5450
Wire Wire Line
	4500 2350 4650 2350
Wire Wire Line
	4500 3400 4650 3400
Wire Wire Line
	4650 1600 4100 1600
Wire Wire Line
	4650 1700 4100 1700
Wire Wire Line
	4650 1800 4100 1800
Wire Wire Line
	4650 1900 4100 1900
Wire Wire Line
	4650 2350 4650 2200
Wire Wire Line
	4650 2650 4100 2650
Wire Wire Line
	4650 2750 4100 2750
Wire Wire Line
	4650 2850 4100 2850
Wire Wire Line
	4650 2950 4100 2950
Wire Wire Line
	4650 3400 4650 3250
Wire Wire Line
	4650 3700 4100 3700
Wire Wire Line
	4650 4450 4100 4450
Wire Wire Line
	4650 5250 4100 5250
Wire Wire Line
	5150 3800 6400 3800
Wire Wire Line
	5150 4550 6400 4550
Wire Wire Line
	5250 5250 5150 5250
Wire Wire Line
	6400 1600 5450 1600
Wire Wire Line
	6400 1700 5450 1700
Wire Wire Line
	6400 1800 5450 1800
Wire Wire Line
	6400 1900 5450 1900
Wire Wire Line
	6400 2650 5450 2650
Wire Wire Line
	6400 2750 5450 2750
Wire Wire Line
	6400 2850 5450 2850
Wire Wire Line
	6400 2950 5450 2950
Wire Bus Line
	4000 1350 3900 1350
Wire Bus Line
	6500 1300 6650 1300
Text Label 4650 1600 2    50   ~ 0
BUS-DATA15
Text Label 4650 1700 2    50   ~ 0
BUS-DATA14
Text Label 4650 1800 2    50   ~ 0
BUS-DATA13
Text Label 4650 1900 2    50   ~ 0
BUS-DATA12
Text Label 4650 2650 2    50   ~ 0
BUS-DATA11
Text Label 4650 2750 2    50   ~ 0
BUS-DATA10
Text Label 4650 2850 2    50   ~ 0
BUS-DATA9
Text Label 4650 2950 2    50   ~ 0
BUS-DATA8
Text Label 4650 3700 2    50   ~ 0
BUS-DATA7
Text Label 4650 4450 2    50   ~ 0
BUS-DATA6
Text Label 4650 5250 2    50   ~ 0
BUS-DATA0
Text Label 6350 1600 2    50   ~ 0
~OBJRAM-BASE15
Text Label 6350 1700 2    50   ~ 0
~OBJRAM-BASE14
Text Label 6350 1800 2    50   ~ 0
~OBJRAM-BASE13
Text Label 6350 1900 2    50   ~ 0
~OBJRAM-BASE12
Text Label 6350 2650 2    50   ~ 0
~OBJRAM-BASE11
Text Label 6350 2750 2    50   ~ 0
~OBJRAM-BASE10
Text Label 6350 2850 2    50   ~ 0
~OBJRAM-BASE9
Text Label 6350 2950 2    50   ~ 0
~OBJRAM-BASE8
Text Label 6350 3800 2    50   ~ 0
~OBJRAM-BASE7
Text Label 6350 4550 2    50   ~ 0
~OBJRAM-BASE6
Text HLabel 3000 2050 0    50   Input ~ 0
~OBJRAM-BASE
Text HLabel 3000 2150 0    50   Input ~ 0
~CLK4M
Text HLabel 3900 1350 0    50   Input ~ 0
BUS-DATA[0..15]
Text HLabel 5250 5250 2    50   Output ~ 0
X8-MODE
Text HLabel 6650 1300 2    50   Output ~ 0
~OBJRAM-BASE[6..15]
$Comp
L power:VCC #PWR0118
U 1 1 6118B358
P 4500 2350
F 0 "#PWR0118" H 4500 2200 50  0001 C CNN
F 1 "VCC" H 4515 2523 50  0000 C CNN
F 2 "" H 4500 2350 50  0001 C CNN
F 3 "" H 4500 2350 50  0001 C CNN
	1    4500 2350
	1    0    0    -1  
$EndComp
$Comp
L power:VCC #PWR0119
U 1 1 6156F0E3
P 4500 3400
F 0 "#PWR0119" H 4500 3250 50  0001 C CNN
F 1 "VCC" H 4515 3573 50  0000 C CNN
F 2 "" H 4500 3400 50  0001 C CNN
F 3 "" H 4500 3400 50  0001 C CNN
	1    4500 3400
	1    0    0    -1  
$EndComp
$Comp
L A5C:OR02 UCA279
U 1 1 61118D61
P 3250 2100
F 0 "UCA279" H 3275 2367 50  0000 C CNN
F 1 "OR02" H 3275 2276 50  0000 C CNN
F 2 "" H 3300 2100 50  0001 C CNN
F 3 "" H 3300 2100 50  0001 C CNN
	1    3250 2100
	1    0    0    -1  
$EndComp
$Comp
L A5C:DFFCOO UBI?
U 1 1 61118D69
P 4900 3800
AR Path="/611F0159/61118D69" Ref="UBI?"  Part="1" 
AR Path="/61118D69" Ref="UAD288"  Part="1" 
AR Path="/611D9E77/61118D69" Ref="UAD288"  Part="1" 
AR Path="/612CA5FA/612CADBA/61118D69" Ref="UAD288"  Part="1" 
F 0 "UAD288" H 4900 4165 50  0000 C CNN
F 1 "DFFCOO" H 4900 4074 50  0000 C CNN
F 2 "" H 4900 3800 50  0001 C CNN
F 3 "" H 4900 3800 50  0001 C CNN
	1    4900 3800
	1    0    0    -1  
$EndComp
$Comp
L A5C:DFFCOO UAD?
U 1 1 61118D6B
P 4900 4550
AR Path="/611F0159/61118D6B" Ref="UAD?"  Part="1" 
AR Path="/61118D6B" Ref="UAC285"  Part="1" 
AR Path="/611D9E77/61118D6B" Ref="UAC285"  Part="1" 
AR Path="/612CA5FA/612CADBA/61118D6B" Ref="UAC285"  Part="1" 
F 0 "UAC285" H 4900 4915 50  0000 C CNN
F 1 "DFFCOO" H 4900 4824 50  0000 C CNN
F 2 "" H 4900 4550 50  0001 C CNN
F 3 "" H 4900 4550 50  0001 C CNN
	1    4900 4550
	1    0    0    -1  
$EndComp
$Comp
L A5C:DFFCOO UBA?
U 1 1 61118DBE
P 4900 5350
AR Path="/611F0159/61118DBE" Ref="UBA?"  Part="1" 
AR Path="/61118DBE" Ref="UBI40"  Part="1" 
AR Path="/611D9E77/61118DBE" Ref="UBI40"  Part="1" 
AR Path="/612CA5FA/612CADBA/61118DBE" Ref="UBI40"  Part="1" 
F 0 "UBI40" H 4900 5715 50  0000 C CNN
F 1 "DFFCOO" H 4900 5624 50  0000 C CNN
F 2 "" H 4900 5350 50  0001 C CNN
F 3 "" H 4900 5350 50  0001 C CNN
	1    4900 5350
	1    0    0    -1  
$EndComp
$Comp
L A5C:M175CL UEK?
U 1 1 61118D68
P 5050 1900
AR Path="/60DE1519/61118D68" Ref="UEK?"  Part="1" 
AR Path="/61118D68" Ref="UBG159"  Part="1" 
AR Path="/611D9E77/61118D68" Ref="UBG159"  Part="1" 
AR Path="/612CA5FA/612CADBA/61118D68" Ref="UBG159"  Part="1" 
F 0 "UBG159" H 5050 2465 50  0000 C CNN
F 1 "M175CL" H 5050 2374 50  0000 C CNN
F 2 "" H 5050 1700 50  0001 C CNN
F 3 "" H 5050 1700 50  0001 C CNN
	1    5050 1900
	1    0    0    -1  
$EndComp
$Comp
L A5C:M175CL UEK?
U 1 1 61118D6A
P 5050 2950
AR Path="/60DE1519/61118D6A" Ref="UEK?"  Part="1" 
AR Path="/61118D6A" Ref="UEG306"  Part="1" 
AR Path="/611D9E77/61118D6A" Ref="UEG306"  Part="1" 
AR Path="/612CA5FA/612CADBA/61118D6A" Ref="UEG306"  Part="1" 
F 0 "UEG306" H 5050 3515 50  0000 C CNN
F 1 "M175CL" H 5050 3424 50  0000 C CNN
F 2 "" H 5050 2750 50  0001 C CNN
F 3 "" H 5050 2750 50  0001 C CNN
	1    5050 2950
	1    0    0    -1  
$EndComp
Wire Bus Line
	4000 1350 4000 5150
Wire Bus Line
	6500 1300 6500 4450
$EndSCHEMATC
