EESchema Schematic File Version 4
EELAYER 30 0
EELAYER END
$Descr A2 23386 16535
encoding utf-8
Sheet 83 83
Title "CPS Reverse Engineering: DL-0311"
Date "2021-09-12"
Rev ""
Comp ""
Comment1 ""
Comment2 ""
Comment3 "Licence: CC-BY"
Comment4 "Author: Loïc *WydD* Petit"
$EndDescr
Connection ~ 5850 9800
Connection ~ 5850 10450
Connection ~ 5850 11100
Connection ~ 7100 6750
Connection ~ 7100 6100
Connection ~ 5850 6700
Connection ~ 5200 13950
Connection ~ 7100 10500
Connection ~ 7100 11150
Connection ~ 5850 11750
Connection ~ 7100 9850
Connection ~ 7100 7400
Connection ~ 7000 6950
Connection ~ 7000 6300
Connection ~ 7000 11350
Connection ~ 7000 10700
Connection ~ 10300 5200
Connection ~ 10500 5750
Connection ~ 10300 5650
Connection ~ 10200 5850
Connection ~ 10500 6400
Connection ~ 10300 6300
Connection ~ 10200 6200
Connection ~ 10100 6500
Connection ~ 10000 7150
Connection ~ 10100 6750
Connection ~ 10200 6850
Connection ~ 10300 6950
Connection ~ 10500 5100
Connection ~ 10300 9600
Connection ~ 10500 10150
Connection ~ 10300 10050
Connection ~ 10200 10250
Connection ~ 10500 10800
Connection ~ 10300 10700
Connection ~ 10200 10600
Connection ~ 10100 10900
Connection ~ 10000 11550
Connection ~ 10100 11150
Connection ~ 10200 11250
Connection ~ 10300 11350
Connection ~ 10500 9500
Connection ~ 11350 8000
Connection ~ 3400 10100
Connection ~ 13100 4700
Connection ~ 8150 6350
Connection ~ 8150 7000
Connection ~ 8150 7650
Connection ~ 8150 10100
Connection ~ 8150 10750
Connection ~ 8150 11400
Connection ~ 7000 7600
Connection ~ 7000 10050
Connection ~ 4100 8750
Connection ~ 4100 8250
Connection ~ 4100 9250
Connection ~ 3400 8650
Connection ~ 4100 10200
Connection ~ 3400 9150
Connection ~ 15700 9300
Connection ~ 15700 9950
Connection ~ 15700 10600
Connection ~ 16950 6750
Connection ~ 16950 6100
Connection ~ 15700 6700
Connection ~ 16950 10000
Connection ~ 16950 10650
Connection ~ 15700 11250
Connection ~ 16950 9350
Connection ~ 16950 7400
Connection ~ 16850 6950
Connection ~ 16850 6300
Connection ~ 16850 10850
Connection ~ 16850 10200
Connection ~ 20150 5200
Connection ~ 20350 5750
Connection ~ 20150 5650
Connection ~ 20350 6400
Connection ~ 20150 6300
Connection ~ 20050 6200
Connection ~ 19950 6750
Connection ~ 20050 6850
Connection ~ 20150 6950
Connection ~ 20350 5100
Connection ~ 20150 9100
Connection ~ 20350 9650
Connection ~ 20150 9550
Connection ~ 20350 10300
Connection ~ 20150 10200
Connection ~ 20050 10100
Connection ~ 19950 10650
Connection ~ 20050 10750
Connection ~ 20150 10850
Connection ~ 20350 9000
Connection ~ 21200 8000
Connection ~ 15700 7350
Connection ~ 21200 7650
Connection ~ 15050 4350
Connection ~ 15050 4700
Connection ~ 18000 6350
Connection ~ 18000 7000
Connection ~ 18000 7650
Connection ~ 18000 9600
Connection ~ 18000 10250
Connection ~ 18000 10900
Connection ~ 16850 7600
Connection ~ 16850 9550
Connection ~ 15700 6050
Connection ~ 13950 8750
Connection ~ 13950 8250
Connection ~ 13250 8650
Connection ~ 18000 8150
Connection ~ 13950 9250
Connection ~ 4100 10800
Connection ~ 19600 8150
Connection ~ 19850 7150
Connection ~ 19950 6500
Connection ~ 20050 5850
Connection ~ 19850 11050
Connection ~ 19950 10400
Connection ~ 20050 9750
Connection ~ 11350 7650
Connection ~ 13100 4350
Connection ~ 2500 9750
Connection ~ 2900 4600
Connection ~ 2800 4500
Connection ~ 2800 3450
Connection ~ 2900 3550
Connection ~ 2800 2400
Connection ~ 2900 5650
Connection ~ 5900 13950
Connection ~ 3400 8150
Connection ~ 13250 7650
Connection ~ 13250 8150
Connection ~ 19250 12500
Connection ~ 16700 12900
Connection ~ 17300 12900
Connection ~ 17850 12150
Connection ~ 10000 11850
Connection ~ 10100 11950
Connection ~ 10200 12050
Connection ~ 10300 12150
Connection ~ 5850 12750
Connection ~ 8150 12050
Connection ~ 9350 13000
Connection ~ 5850 7350
Connection ~ 9750 8750
Connection ~ 8150 8400
Connection ~ 4750 15250
Connection ~ 5350 15250
Connection ~ 5100 15350
Connection ~ 4500 15350
Connection ~ 4150 15250
Connection ~ 2750 14800
Connection ~ 3000 15250
Connection ~ 2500 10000
Connection ~ 14950 5700
Connection ~ 20550 12450
Connection ~ 5950 15250
Connection ~ 2150 15350
Connection ~ 3900 15350
Connection ~ 3100 10000
Connection ~ 21600 13100
Connection ~ 9900 3950
NoConn ~ 20050 12900
NoConn ~ 4400 14950
NoConn ~ 5000 14950
NoConn ~ 5600 14950
NoConn ~ 6200 14850
NoConn ~ 2650 14900
NoConn ~ 3250 14800
NoConn ~ 20750 12550
Entry Wire Line
	1250 8000 1350 8100
Entry Wire Line
	1250 8150 1350 8250
Entry Wire Line
	2100 1800 2200 1900
Entry Wire Line
	2100 1900 2200 2000
Entry Wire Line
	2100 2000 2200 2100
Entry Wire Line
	2100 2100 2200 2200
Entry Wire Line
	2100 2850 2200 2950
Entry Wire Line
	2100 2950 2200 3050
Entry Wire Line
	2100 3050 2200 3150
Entry Wire Line
	2100 3150 2200 3250
Entry Wire Line
	2100 3900 2200 4000
Entry Wire Line
	2100 4000 2200 4100
Entry Wire Line
	2100 4100 2200 4200
Entry Wire Line
	2100 4200 2200 4300
Entry Wire Line
	2100 4950 2200 5050
Entry Wire Line
	2100 5050 2200 5150
Entry Wire Line
	2100 5150 2200 5250
Entry Wire Line
	2100 5250 2200 5350
Entry Wire Line
	7000 1150 6900 1250
Entry Wire Line
	7000 1250 6900 1350
Entry Wire Line
	7000 1350 6900 1450
Entry Wire Line
	7000 1450 6900 1550
Entry Wire Line
	7000 1550 6900 1650
Entry Wire Line
	7000 1650 6900 1750
Entry Wire Line
	7000 1750 6900 1850
Entry Wire Line
	7000 1850 6900 1950
Entry Wire Line
	7850 1150 7750 1250
Entry Wire Line
	7850 1250 7750 1350
Entry Wire Line
	7850 1350 7750 1450
Entry Wire Line
	7850 1450 7750 1550
Entry Wire Line
	7850 1550 7750 1650
Entry Wire Line
	7850 1650 7750 1750
Entry Wire Line
	7850 1750 7750 1850
Entry Wire Line
	7850 1850 7750 1950
Entry Wire Line
	8800 1050 8700 1150
Entry Wire Line
	8800 1150 8700 1250
Entry Wire Line
	8800 1250 8700 1350
Entry Wire Line
	8800 1350 8700 1450
Entry Wire Line
	8800 1450 8700 1550
Entry Wire Line
	8800 1550 8700 1650
Entry Wire Line
	8800 1650 8700 1750
Entry Wire Line
	8800 1750 8700 1850
Entry Wire Line
	8800 1850 8700 1950
Entry Wire Line
	9750 1050 9650 1150
Entry Wire Line
	9750 1150 9650 1250
Entry Wire Line
	9750 1250 9650 1350
Entry Wire Line
	9750 1350 9650 1450
Entry Wire Line
	9750 1450 9650 1550
Entry Wire Line
	9750 1550 9650 1650
Entry Wire Line
	9750 1650 9650 1750
Entry Wire Line
	9750 1750 9650 1850
Entry Wire Line
	9750 1850 9650 1950
Entry Wire Line
	9750 5700 9650 5600
Entry Wire Line
	9750 6350 9650 6250
Entry Wire Line
	9750 7000 9650 6900
Entry Wire Line
	9750 7650 9650 7550
Entry Wire Line
	9750 9900 9650 10000
Entry Wire Line
	9750 10550 9650 10650
Entry Wire Line
	9750 11200 9650 11300
Entry Wire Line
	9750 11850 9650 11950
Entry Wire Line
	9750 12900 9650 13000
Entry Wire Line
	19600 5700 19500 5600
Entry Wire Line
	19600 6350 19500 6250
Entry Wire Line
	19600 7000 19500 6900
Entry Wire Line
	19600 7650 19500 7550
Entry Wire Line
	19600 9400 19500 9500
Entry Wire Line
	19600 10050 19500 10150
Entry Wire Line
	19600 10700 19500 10800
Entry Wire Line
	19600 11350 19500 11450
Wire Wire Line
	1000 9850 1000 14250
Wire Wire Line
	1100 9950 1100 15400
Wire Wire Line
	1100 15400 1600 15400
Wire Wire Line
	1650 9850 1000 9850
Wire Wire Line
	1650 9950 1100 9950
Wire Wire Line
	1650 10150 1650 13350
Wire Wire Line
	1850 1300 2250 1300
Wire Wire Line
	2000 9100 2500 9100
Wire Wire Line
	2150 15000 2150 15350
Wire Wire Line
	2200 1900 3000 1900
Wire Wire Line
	2200 2000 3000 2000
Wire Wire Line
	2200 2100 3000 2100
Wire Wire Line
	2200 2200 3000 2200
Wire Wire Line
	2200 2950 3000 2950
Wire Wire Line
	2200 3050 3000 3050
Wire Wire Line
	2200 3150 3000 3150
Wire Wire Line
	2200 3250 3000 3250
Wire Wire Line
	2200 4000 3000 4000
Wire Wire Line
	2200 4100 3000 4100
Wire Wire Line
	2200 4200 3000 4200
Wire Wire Line
	2200 4300 3000 4300
Wire Wire Line
	2200 5050 3000 5050
Wire Wire Line
	2200 5150 3000 5150
Wire Wire Line
	2200 5250 3000 5250
Wire Wire Line
	2200 5350 3000 5350
Wire Wire Line
	2350 8100 1350 8100
Wire Wire Line
	2350 8250 1350 8250
Wire Wire Line
	2400 15250 2400 15200
Wire Wire Line
	2400 15250 3000 15250
Wire Wire Line
	2500 9750 2500 9200
Wire Wire Line
	2500 9750 2500 10000
Wire Wire Line
	2500 10000 2500 10250
Wire Wire Line
	2600 4600 2900 4600
Wire Wire Line
	2600 5650 2900 5650
Wire Wire Line
	2650 14800 2750 14800
Wire Wire Line
	2750 14450 2750 14800
Wire Wire Line
	2750 15000 2750 15350
Wire Wire Line
	2750 15350 2150 15350
Wire Wire Line
	2800 2400 2800 1350
Wire Wire Line
	2800 2400 2800 3450
Wire Wire Line
	2800 2400 3000 2400
Wire Wire Line
	2800 3450 2800 4500
Wire Wire Line
	2800 3450 3000 3450
Wire Wire Line
	2800 4500 2800 5550
Wire Wire Line
	2800 4500 3000 4500
Wire Wire Line
	2800 5550 3000 5550
Wire Wire Line
	2900 2500 3000 2500
Wire Wire Line
	2900 3550 2900 2500
Wire Wire Line
	2900 3550 2900 4600
Wire Wire Line
	2900 4600 2900 5650
Wire Wire Line
	2900 4600 3000 4600
Wire Wire Line
	2900 5650 3000 5650
Wire Wire Line
	3000 3550 2900 3550
Wire Wire Line
	3000 15200 3000 15250
Wire Wire Line
	3000 15250 4150 15250
Wire Wire Line
	3050 9150 3400 9150
Wire Wire Line
	3100 9750 3100 10000
Wire Wire Line
	3100 10000 3100 10250
Wire Wire Line
	3100 10000 3200 10000
Wire Wire Line
	3350 14450 2750 14450
Wire Wire Line
	3350 14800 3350 14450
Wire Wire Line
	3350 14900 3250 14900
Wire Wire Line
	3400 7650 3400 8150
Wire Wire Line
	3400 8150 3400 8650
Wire Wire Line
	3400 8650 3400 9150
Wire Wire Line
	3400 8650 4150 8650
Wire Wire Line
	3400 9150 3400 10100
Wire Wire Line
	3400 9150 4150 9150
Wire Wire Line
	3400 10700 3400 10100
Wire Wire Line
	3400 10700 4150 10700
Wire Wire Line
	3800 1900 4150 1900
Wire Wire Line
	3800 2000 4150 2000
Wire Wire Line
	3800 2100 4150 2100
Wire Wire Line
	3800 2200 4150 2200
Wire Wire Line
	3800 2950 4150 2950
Wire Wire Line
	3800 3050 4150 3050
Wire Wire Line
	3800 3150 4150 3150
Wire Wire Line
	3800 3250 4150 3250
Wire Wire Line
	3800 4000 4150 4000
Wire Wire Line
	3800 4100 4150 4100
Wire Wire Line
	3800 4200 4150 4200
Wire Wire Line
	3800 4300 4150 4300
Wire Wire Line
	3800 5050 4150 5050
Wire Wire Line
	3800 5150 4150 5150
Wire Wire Line
	3800 5250 4150 5250
Wire Wire Line
	3800 5350 4150 5350
Wire Wire Line
	3800 15350 3900 15350
Wire Wire Line
	3900 15050 3900 15350
Wire Wire Line
	3900 15350 4500 15350
Wire Wire Line
	3950 11100 4100 11100
Wire Wire Line
	4000 7650 4150 7650
Wire Wire Line
	4000 8150 4150 8150
Wire Wire Line
	4000 10100 4150 10100
Wire Wire Line
	4100 7750 4150 7750
Wire Wire Line
	4100 8250 4100 7750
Wire Wire Line
	4100 8250 4150 8250
Wire Wire Line
	4100 8750 4100 8250
Wire Wire Line
	4100 8750 4150 8750
Wire Wire Line
	4100 9250 4100 8750
Wire Wire Line
	4100 9250 4100 10200
Wire Wire Line
	4100 10200 4150 10200
Wire Wire Line
	4100 10800 4100 10200
Wire Wire Line
	4100 11100 4100 10800
Wire Wire Line
	4150 9250 4100 9250
Wire Wire Line
	4150 10800 4100 10800
Wire Wire Line
	4150 15250 4750 15250
Wire Wire Line
	4500 14850 4400 14850
Wire Wire Line
	4500 15350 4500 15050
Wire Wire Line
	4700 7700 7100 7700
Wire Wire Line
	4700 8700 4850 8700
Wire Wire Line
	4700 10150 5150 10150
Wire Wire Line
	4700 13950 5200 13950
Wire Wire Line
	4750 7800 4750 8200
Wire Wire Line
	4750 8200 4700 8200
Wire Wire Line
	4750 15250 5350 15250
Wire Wire Line
	4850 7900 7000 7900
Wire Wire Line
	4850 8700 4850 7900
Wire Wire Line
	4950 8000 4950 9200
Wire Wire Line
	4950 9200 4700 9200
Wire Wire Line
	5050 10750 4700 10750
Wire Wire Line
	5050 10750 5050 13050
Wire Wire Line
	5050 13050 7200 13050
Wire Wire Line
	5100 14850 5000 14850
Wire Wire Line
	5100 15350 4500 15350
Wire Wire Line
	5100 15350 5100 15050
Wire Wire Line
	5150 10150 5150 12850
Wire Wire Line
	5200 13550 5200 13950
Wire Wire Line
	5200 13550 5850 13550
Wire Wire Line
	5300 5950 5950 5950
Wire Wire Line
	5300 13950 5200 13950
Wire Wire Line
	5350 15250 5950 15250
Wire Wire Line
	5700 14850 5600 14850
Wire Wire Line
	5700 15050 5700 15350
Wire Wire Line
	5700 15350 5100 15350
Wire Wire Line
	5850 5400 5950 5400
Wire Wire Line
	5850 6700 5850 5400
Wire Wire Line
	5850 6700 5850 7350
Wire Wire Line
	5850 7350 5850 9800
Wire Wire Line
	5850 9800 5850 10450
Wire Wire Line
	5850 10450 5850 11100
Wire Wire Line
	5850 11100 5850 11750
Wire Wire Line
	5850 11750 5850 12750
Wire Wire Line
	5850 12750 5850 13550
Wire Wire Line
	5900 6050 5900 13950
Wire Wire Line
	5950 5300 5300 5300
Wire Wire Line
	5950 6050 5900 6050
Wire Wire Line
	5950 6600 5300 6600
Wire Wire Line
	5950 6700 5850 6700
Wire Wire Line
	5950 7250 5300 7250
Wire Wire Line
	5950 7350 5850 7350
Wire Wire Line
	5950 9700 5300 9700
Wire Wire Line
	5950 9800 5850 9800
Wire Wire Line
	5950 10350 5300 10350
Wire Wire Line
	5950 10450 5850 10450
Wire Wire Line
	5950 11000 5300 11000
Wire Wire Line
	5950 11100 5850 11100
Wire Wire Line
	5950 11650 5300 11650
Wire Wire Line
	5950 11750 5850 11750
Wire Wire Line
	6200 14950 6300 14950
Wire Wire Line
	6300 14250 1000 14250
Wire Wire Line
	6300 14950 6300 14250
Wire Wire Line
	6300 15250 5950 15250
Wire Wire Line
	6500 5350 7200 5350
Wire Wire Line
	6500 7300 7200 7300
Wire Wire Line
	6500 10400 7200 10400
Wire Wire Line
	6500 11700 7200 11700
Wire Wire Line
	6600 4500 6600 7500
Wire Wire Line
	6600 4500 12100 4500
Wire Wire Line
	6600 7500 7200 7500
Wire Wire Line
	6600 8900 6600 11900
Wire Wire Line
	6600 8900 12100 8900
Wire Wire Line
	6600 11900 7200 11900
Wire Wire Line
	6700 4600 6700 6850
Wire Wire Line
	6700 4600 12000 4600
Wire Wire Line
	6700 6850 7200 6850
Wire Wire Line
	6700 9000 6700 11250
Wire Wire Line
	6700 9000 12000 9000
Wire Wire Line
	6700 11250 7200 11250
Wire Wire Line
	6800 4700 6800 6200
Wire Wire Line
	6800 4700 11900 4700
Wire Wire Line
	6800 6200 7200 6200
Wire Wire Line
	6800 9100 6800 10600
Wire Wire Line
	6800 9100 11900 9100
Wire Wire Line
	6800 10600 7200 10600
Wire Wire Line
	6900 1250 6600 1250
Wire Wire Line
	6900 1350 6600 1350
Wire Wire Line
	6900 1450 6600 1450
Wire Wire Line
	6900 1550 6600 1550
Wire Wire Line
	6900 1650 6600 1650
Wire Wire Line
	6900 1750 6600 1750
Wire Wire Line
	6900 1850 6600 1850
Wire Wire Line
	6900 1950 6600 1950
Wire Wire Line
	6900 4800 6900 5550
Wire Wire Line
	6900 4800 11800 4800
Wire Wire Line
	6900 5550 7200 5550
Wire Wire Line
	6900 9200 6900 9950
Wire Wire Line
	6900 9200 11800 9200
Wire Wire Line
	6900 9950 7200 9950
Wire Wire Line
	7000 5650 7000 6300
Wire Wire Line
	7000 6300 7000 6950
Wire Wire Line
	7000 6950 7000 7600
Wire Wire Line
	7000 7600 7200 7600
Wire Wire Line
	7000 7900 7000 7600
Wire Wire Line
	7000 8000 4950 8000
Wire Wire Line
	7000 8000 7000 10050
Wire Wire Line
	7000 10050 7000 10700
Wire Wire Line
	7000 10700 7000 11350
Wire Wire Line
	7000 11350 7000 12000
Wire Wire Line
	7000 12000 7200 12000
Wire Wire Line
	7050 12450 7050 12950
Wire Wire Line
	7050 12450 12000 12450
Wire Wire Line
	7050 12950 7200 12950
Wire Wire Line
	7100 5450 7100 6100
Wire Wire Line
	7100 6100 7100 6750
Wire Wire Line
	7100 6750 7100 7400
Wire Wire Line
	7100 7400 7200 7400
Wire Wire Line
	7100 7700 7100 7400
Wire Wire Line
	7100 7800 4750 7800
Wire Wire Line
	7100 7800 7100 9850
Wire Wire Line
	7100 9850 7200 9850
Wire Wire Line
	7100 10500 7100 9850
Wire Wire Line
	7100 11150 7100 10500
Wire Wire Line
	7100 11800 7100 11150
Wire Wire Line
	7200 5450 7100 5450
Wire Wire Line
	7200 5650 7000 5650
Wire Wire Line
	7200 6000 6500 6000
Wire Wire Line
	7200 6100 7100 6100
Wire Wire Line
	7200 6300 7000 6300
Wire Wire Line
	7200 6650 6500 6650
Wire Wire Line
	7200 6750 7100 6750
Wire Wire Line
	7200 6950 7000 6950
Wire Wire Line
	7200 9750 6500 9750
Wire Wire Line
	7200 10050 7000 10050
Wire Wire Line
	7200 10500 7100 10500
Wire Wire Line
	7200 10700 7000 10700
Wire Wire Line
	7200 11050 6500 11050
Wire Wire Line
	7200 11150 7100 11150
Wire Wire Line
	7200 11350 7000 11350
Wire Wire Line
	7200 11800 7100 11800
Wire Wire Line
	7200 12750 5850 12750
Wire Wire Line
	7200 12850 5150 12850
Wire Wire Line
	7750 1250 7450 1250
Wire Wire Line
	7750 1350 7450 1350
Wire Wire Line
	7750 1450 7450 1450
Wire Wire Line
	7750 1550 7450 1550
Wire Wire Line
	7750 1650 7450 1650
Wire Wire Line
	7750 1750 7450 1750
Wire Wire Line
	7750 1850 7450 1850
Wire Wire Line
	7750 1950 7450 1950
Wire Wire Line
	8050 5500 8250 5500
Wire Wire Line
	8050 12900 8250 12900
Wire Wire Line
	8150 5700 8250 5700
Wire Wire Line
	8150 6350 8150 5700
Wire Wire Line
	8150 7000 8150 6350
Wire Wire Line
	8150 7650 8150 7000
Wire Wire Line
	8150 7650 8150 8400
Wire Wire Line
	8150 8400 8150 10100
Wire Wire Line
	8150 10750 8150 10100
Wire Wire Line
	8150 11400 8150 10750
Wire Wire Line
	8150 12050 8150 11400
Wire Wire Line
	8150 12050 8150 13100
Wire Wire Line
	8250 6150 8050 6150
Wire Wire Line
	8250 6350 8150 6350
Wire Wire Line
	8250 6800 8050 6800
Wire Wire Line
	8250 7000 8150 7000
Wire Wire Line
	8250 7450 8050 7450
Wire Wire Line
	8250 7650 8150 7650
Wire Wire Line
	8250 9900 8050 9900
Wire Wire Line
	8250 10100 8150 10100
Wire Wire Line
	8250 10550 8050 10550
Wire Wire Line
	8250 10750 8150 10750
Wire Wire Line
	8250 11200 8050 11200
Wire Wire Line
	8250 11400 8150 11400
Wire Wire Line
	8250 11850 8050 11850
Wire Wire Line
	8250 12050 8150 12050
Wire Wire Line
	8250 13100 8150 13100
Wire Wire Line
	8700 1150 8400 1150
Wire Wire Line
	8700 1250 8400 1250
Wire Wire Line
	8700 1350 8400 1350
Wire Wire Line
	8700 1450 8400 1450
Wire Wire Line
	8700 1550 8400 1550
Wire Wire Line
	8700 1650 8400 1650
Wire Wire Line
	8700 1750 8400 1750
Wire Wire Line
	8700 1850 8400 1850
Wire Wire Line
	8700 1950 8400 1950
Wire Wire Line
	8750 5200 8750 5500
Wire Wire Line
	8750 5200 10300 5200
Wire Wire Line
	8750 5850 8750 6150
Wire Wire Line
	8750 5850 10200 5850
Wire Wire Line
	8750 6500 8750 6800
Wire Wire Line
	8750 6500 10100 6500
Wire Wire Line
	8750 7150 8750 7450
Wire Wire Line
	8750 7150 10000 7150
Wire Wire Line
	8750 9600 8750 9900
Wire Wire Line
	8750 9600 10300 9600
Wire Wire Line
	8750 10250 10200 10250
Wire Wire Line
	8750 10550 8750 10250
Wire Wire Line
	8750 10900 10100 10900
Wire Wire Line
	8750 11200 8750 10900
Wire Wire Line
	8750 11550 10000 11550
Wire Wire Line
	8750 11850 8750 11550
Wire Wire Line
	8750 12350 8750 12900
Wire Wire Line
	9350 5600 9650 5600
Wire Wire Line
	9350 6250 9650 6250
Wire Wire Line
	9350 6900 9650 6900
Wire Wire Line
	9350 7550 9650 7550
Wire Wire Line
	9350 10000 9650 10000
Wire Wire Line
	9350 10650 9650 10650
Wire Wire Line
	9350 11300 9650 11300
Wire Wire Line
	9350 11950 9650 11950
Wire Wire Line
	9350 13000 9650 13000
Wire Wire Line
	9350 13150 9350 13000
Wire Wire Line
	9350 13150 10600 13150
Wire Wire Line
	9650 1150 9350 1150
Wire Wire Line
	9650 1250 9350 1250
Wire Wire Line
	9650 1350 9350 1350
Wire Wire Line
	9650 1450 9350 1450
Wire Wire Line
	9650 1550 9350 1550
Wire Wire Line
	9650 1650 9350 1650
Wire Wire Line
	9650 1750 9350 1750
Wire Wire Line
	9650 1850 9350 1850
Wire Wire Line
	9650 1950 9350 1950
Wire Wire Line
	9900 3950 9800 3950
Wire Wire Line
	9900 3950 13100 3950
Wire Wire Line
	9900 8150 9900 3950
Wire Wire Line
	10000 7150 11250 7150
Wire Wire Line
	10000 7450 10000 7150
Wire Wire Line
	10000 11550 10000 11850
Wire Wire Line
	10000 11550 11250 11550
Wire Wire Line
	10100 6500 11250 6500
Wire Wire Line
	10100 6750 10100 6500
Wire Wire Line
	10100 6750 10100 7550
Wire Wire Line
	10100 7550 10600 7550
Wire Wire Line
	10100 10900 11250 10900
Wire Wire Line
	10100 11150 10100 10900
Wire Wire Line
	10100 11150 10100 11950
Wire Wire Line
	10100 11950 10600 11950
Wire Wire Line
	10200 5850 11250 5850
Wire Wire Line
	10200 6200 10200 5850
Wire Wire Line
	10200 6850 10200 6200
Wire Wire Line
	10200 7650 10200 6850
Wire Wire Line
	10200 10250 11250 10250
Wire Wire Line
	10200 10600 10200 10250
Wire Wire Line
	10200 11250 10200 10600
Wire Wire Line
	10200 12050 10200 11250
Wire Wire Line
	10300 5200 10300 5650
Wire Wire Line
	10300 5200 11250 5200
Wire Wire Line
	10300 5650 10300 6300
Wire Wire Line
	10300 5650 10600 5650
Wire Wire Line
	10300 6950 10300 6300
Wire Wire Line
	10300 6950 10300 7750
Wire Wire Line
	10300 7750 10600 7750
Wire Wire Line
	10300 9600 10300 10050
Wire Wire Line
	10300 9600 11250 9600
Wire Wire Line
	10300 10050 10300 10700
Wire Wire Line
	10300 10050 10600 10050
Wire Wire Line
	10300 11350 10300 10700
Wire Wire Line
	10300 11350 10300 12150
Wire Wire Line
	10300 12150 10300 12750
Wire Wire Line
	10300 12150 10600 12150
Wire Wire Line
	10450 4350 10450 7850
Wire Wire Line
	10450 4350 12500 4350
Wire Wire Line
	10450 7850 10600 7850
Wire Wire Line
	10450 8700 10450 12250
Wire Wire Line
	10450 12250 10600 12250
Wire Wire Line
	10500 4400 10500 5100
Wire Wire Line
	10500 5100 11250 5100
Wire Wire Line
	10500 5750 10500 5100
Wire Wire Line
	10500 6400 10500 5750
Wire Wire Line
	10500 7050 10500 6400
Wire Wire Line
	10500 8750 10500 9500
Wire Wire Line
	10500 8750 12100 8750
Wire Wire Line
	10500 9500 11250 9500
Wire Wire Line
	10500 10150 10500 9500
Wire Wire Line
	10500 10800 10500 10150
Wire Wire Line
	10500 11450 10500 10800
Wire Wire Line
	10600 5750 10500 5750
Wire Wire Line
	10600 6200 10200 6200
Wire Wire Line
	10600 6300 10300 6300
Wire Wire Line
	10600 6400 10500 6400
Wire Wire Line
	10600 6750 10100 6750
Wire Wire Line
	10600 6850 10200 6850
Wire Wire Line
	10600 6950 10300 6950
Wire Wire Line
	10600 7050 10500 7050
Wire Wire Line
	10600 7450 10000 7450
Wire Wire Line
	10600 7650 10200 7650
Wire Wire Line
	10600 8150 9900 8150
Wire Wire Line
	10600 8250 10200 8250
Wire Wire Line
	10600 8350 10200 8350
Wire Wire Line
	10600 8450 10200 8450
Wire Wire Line
	10600 8550 10200 8550
Wire Wire Line
	10600 10150 10500 10150
Wire Wire Line
	10600 10600 10200 10600
Wire Wire Line
	10600 10700 10300 10700
Wire Wire Line
	10600 10800 10500 10800
Wire Wire Line
	10600 11150 10100 11150
Wire Wire Line
	10600 11250 10200 11250
Wire Wire Line
	10600 11350 10300 11350
Wire Wire Line
	10600 11450 10500 11450
Wire Wire Line
	10600 11850 10000 11850
Wire Wire Line
	10600 12050 10200 12050
Wire Wire Line
	11100 13350 1650 13350
Wire Wire Line
	11150 5700 11200 5700
Wire Wire Line
	11150 10100 11200 10100
Wire Wire Line
	11200 5700 11200 5750
Wire Wire Line
	11200 5750 11250 5750
Wire Wire Line
	11200 6300 11250 6300
Wire Wire Line
	11200 10100 11200 10150
Wire Wire Line
	11200 10150 11250 10150
Wire Wire Line
	11200 10700 11250 10700
Wire Wire Line
	11250 6300 11250 6400
Wire Wire Line
	11250 6900 11200 6900
Wire Wire Line
	11250 6900 11250 7050
Wire Wire Line
	11250 8350 12200 8350
Wire Wire Line
	11250 10700 11250 10800
Wire Wire Line
	11250 11300 11200 11300
Wire Wire Line
	11250 11450 11250 11300
Wire Wire Line
	11250 12950 11650 12950
Wire Wire Line
	11350 7650 11350 8000
Wire Wire Line
	11350 8100 11350 8000
Wire Wire Line
	11350 12050 11450 12050
Wire Wire Line
	11450 12150 11450 12350
Wire Wire Line
	11450 12350 8750 12350
Wire Wire Line
	11550 8000 11350 8000
Wire Wire Line
	11550 8100 11350 8100
Wire Wire Line
	11650 12950 11650 13300
Wire Wire Line
	11650 13400 12200 13400
Wire Wire Line
	11800 5150 11800 4800
Wire Wire Line
	11800 5800 11900 5800
Wire Wire Line
	11800 7100 12100 7100
Wire Wire Line
	11800 9550 11800 9200
Wire Wire Line
	11800 10200 11900 10200
Wire Wire Line
	11800 10850 12000 10850
Wire Wire Line
	11900 5800 11900 4700
Wire Wire Line
	11900 10200 11900 9100
Wire Wire Line
	11950 7650 12150 7650
Wire Wire Line
	12000 4600 12000 6450
Wire Wire Line
	12000 6450 11800 6450
Wire Wire Line
	12000 10850 12000 9000
Wire Wire Line
	12000 12100 12000 12450
Wire Wire Line
	12100 4500 12100 7100
Wire Wire Line
	12100 8050 12100 8750
Wire Wire Line
	12100 8900 12100 11500
Wire Wire Line
	12100 11500 11800 11500
Wire Wire Line
	12150 7650 12150 8700
Wire Wire Line
	12150 8700 10450 8700
Wire Wire Line
	12200 4400 10500 4400
Wire Wire Line
	12200 4750 12200 4400
Wire Wire Line
	12200 8350 12200 13400
Wire Wire Line
	12350 4750 12200 4750
Wire Wire Line
	12900 4700 13100 4700
Wire Wire Line
	12900 4800 13100 4800
Wire Wire Line
	13100 3950 13100 4350
Wire Wire Line
	13100 4350 13100 4700
Wire Wire Line
	13100 4700 13100 4800
Wire Wire Line
	13250 5750 13250 7650
Wire Wire Line
	13250 7650 13250 8150
Wire Wire Line
	13250 8150 13250 8650
Wire Wire Line
	13250 8650 13250 9150
Wire Wire Line
	13250 8650 14000 8650
Wire Wire Line
	13250 9150 14000 9150
Wire Wire Line
	13650 4300 15050 4300
Wire Wire Line
	13650 4400 14950 4400
Wire Wire Line
	13800 5700 14950 5700
Wire Wire Line
	13800 9550 13950 9550
Wire Wire Line
	13850 7650 14000 7650
Wire Wire Line
	13850 8150 14000 8150
Wire Wire Line
	13950 7750 14000 7750
Wire Wire Line
	13950 8250 13950 7750
Wire Wire Line
	13950 8250 14000 8250
Wire Wire Line
	13950 8750 13950 8250
Wire Wire Line
	13950 8750 14000 8750
Wire Wire Line
	13950 9250 13950 8750
Wire Wire Line
	13950 9550 13950 9250
Wire Wire Line
	14000 9250 13950 9250
Wire Wire Line
	14450 4700 15050 4700
Wire Wire Line
	14550 7700 16950 7700
Wire Wire Line
	14550 8700 14700 8700
Wire Wire Line
	14600 7800 14600 8200
Wire Wire Line
	14600 7800 16950 7800
Wire Wire Line
	14600 8200 14550 8200
Wire Wire Line
	14700 7900 16850 7900
Wire Wire Line
	14700 8700 14700 7900
Wire Wire Line
	14800 8000 14800 9200
Wire Wire Line
	14800 8000 16850 8000
Wire Wire Line
	14800 9200 14550 9200
Wire Wire Line
	14950 4400 14950 5700
Wire Wire Line
	14950 12150 14950 5700
Wire Wire Line
	15050 4300 15050 4350
Wire Wire Line
	15050 4350 15050 4700
Wire Wire Line
	15050 4700 15050 4800
Wire Wire Line
	15250 4700 15050 4700
Wire Wire Line
	15250 4800 15050 4800
Wire Wire Line
	15650 4350 20300 4350
Wire Wire Line
	15700 5400 15800 5400
Wire Wire Line
	15700 6050 15700 5400
Wire Wire Line
	15700 6050 15800 6050
Wire Wire Line
	15700 6700 15700 6050
Wire Wire Line
	15700 6700 15700 7350
Wire Wire Line
	15700 7350 15700 9300
Wire Wire Line
	15700 9300 15700 9950
Wire Wire Line
	15700 9950 15700 10600
Wire Wire Line
	15700 10600 15700 11250
Wire Wire Line
	15700 11250 15700 13950
Wire Wire Line
	15800 4750 15950 4750
Wire Wire Line
	15800 5300 15150 5300
Wire Wire Line
	15800 5950 15150 5950
Wire Wire Line
	15800 6600 15150 6600
Wire Wire Line
	15800 6700 15700 6700
Wire Wire Line
	15800 7250 15150 7250
Wire Wire Line
	15800 7350 15700 7350
Wire Wire Line
	15800 9200 15150 9200
Wire Wire Line
	15800 9300 15700 9300
Wire Wire Line
	15800 9850 15150 9850
Wire Wire Line
	15800 9950 15700 9950
Wire Wire Line
	15800 10500 15150 10500
Wire Wire Line
	15800 10600 15700 10600
Wire Wire Line
	15800 11150 15150 11150
Wire Wire Line
	15800 11250 15700 11250
Wire Wire Line
	15950 4400 20350 4400
Wire Wire Line
	15950 4750 15950 4400
Wire Wire Line
	16350 5350 17050 5350
Wire Wire Line
	16350 7300 17050 7300
Wire Wire Line
	16350 9900 17050 9900
Wire Wire Line
	16350 11200 17050 11200
Wire Wire Line
	16450 4500 16450 7500
Wire Wire Line
	16450 4500 21950 4500
Wire Wire Line
	16450 7500 17050 7500
Wire Wire Line
	16450 8400 16450 11400
Wire Wire Line
	16450 8400 21950 8400
Wire Wire Line
	16450 11400 17050 11400
Wire Wire Line
	16550 4600 16550 6850
Wire Wire Line
	16550 4600 21850 4600
Wire Wire Line
	16550 6850 17050 6850
Wire Wire Line
	16550 8500 16550 10750
Wire Wire Line
	16550 8500 21850 8500
Wire Wire Line
	16550 10750 17050 10750
Wire Wire Line
	16650 4700 16650 6200
Wire Wire Line
	16650 4700 21750 4700
Wire Wire Line
	16650 6200 17050 6200
Wire Wire Line
	16650 8600 16650 10100
Wire Wire Line
	16650 8600 21750 8600
Wire Wire Line
	16650 10100 17050 10100
Wire Wire Line
	16700 12900 16200 12900
Wire Wire Line
	16700 12900 16700 12650
Wire Wire Line
	16700 13150 16700 12900
Wire Wire Line
	16750 4800 16750 5550
Wire Wire Line
	16750 4800 21650 4800
Wire Wire Line
	16750 5550 17050 5550
Wire Wire Line
	16750 8700 16750 9450
Wire Wire Line
	16750 8700 21650 8700
Wire Wire Line
	16750 9450 17050 9450
Wire Wire Line
	16850 5650 16850 6300
Wire Wire Line
	16850 6300 16850 6950
Wire Wire Line
	16850 6950 16850 7600
Wire Wire Line
	16850 7600 17050 7600
Wire Wire Line
	16850 7900 16850 7600
Wire Wire Line
	16850 9550 16850 8000
Wire Wire Line
	16850 9550 16850 10200
Wire Wire Line
	16850 10200 16850 10850
Wire Wire Line
	16850 10850 16850 11500
Wire Wire Line
	16850 11500 17050 11500
Wire Wire Line
	16950 5450 16950 6100
Wire Wire Line
	16950 6100 16950 6750
Wire Wire Line
	16950 6750 16950 7400
Wire Wire Line
	16950 7400 17050 7400
Wire Wire Line
	16950 7700 16950 7400
Wire Wire Line
	16950 7800 16950 9350
Wire Wire Line
	16950 9350 17050 9350
Wire Wire Line
	16950 10000 16950 9350
Wire Wire Line
	16950 10650 16950 10000
Wire Wire Line
	16950 11300 16950 10650
Wire Wire Line
	17050 5450 16950 5450
Wire Wire Line
	17050 5650 16850 5650
Wire Wire Line
	17050 6000 16350 6000
Wire Wire Line
	17050 6100 16950 6100
Wire Wire Line
	17050 6300 16850 6300
Wire Wire Line
	17050 6650 16350 6650
Wire Wire Line
	17050 6750 16950 6750
Wire Wire Line
	17050 6950 16850 6950
Wire Wire Line
	17050 9250 16350 9250
Wire Wire Line
	17050 9550 16850 9550
Wire Wire Line
	17050 10000 16950 10000
Wire Wire Line
	17050 10200 16850 10200
Wire Wire Line
	17050 10550 16350 10550
Wire Wire Line
	17050 10650 16950 10650
Wire Wire Line
	17050 10850 16850 10850
Wire Wire Line
	17050 11300 16950 11300
Wire Wire Line
	17300 12650 17300 12900
Wire Wire Line
	17300 12900 17300 13150
Wire Wire Line
	17300 12900 17850 12900
Wire Wire Line
	17850 8150 18000 8150
Wire Wire Line
	17850 12150 14950 12150
Wire Wire Line
	17850 12900 17850 12150
Wire Wire Line
	18000 5700 18100 5700
Wire Wire Line
	18000 6350 18000 5700
Wire Wire Line
	18000 7000 18000 6350
Wire Wire Line
	18000 7650 18000 7000
Wire Wire Line
	18000 8150 18000 7650
Wire Wire Line
	18000 9600 18000 8150
Wire Wire Line
	18000 10250 18000 9600
Wire Wire Line
	18000 10900 18000 10250
Wire Wire Line
	18000 11550 18000 10900
Wire Wire Line
	18100 5500 17900 5500
Wire Wire Line
	18100 6150 17900 6150
Wire Wire Line
	18100 6350 18000 6350
Wire Wire Line
	18100 6800 17900 6800
Wire Wire Line
	18100 7000 18000 7000
Wire Wire Line
	18100 7450 17900 7450
Wire Wire Line
	18100 7650 18000 7650
Wire Wire Line
	18100 9400 17900 9400
Wire Wire Line
	18100 9600 18000 9600
Wire Wire Line
	18100 10050 17900 10050
Wire Wire Line
	18100 10250 18000 10250
Wire Wire Line
	18100 10700 17900 10700
Wire Wire Line
	18100 10900 18000 10900
Wire Wire Line
	18100 11350 17900 11350
Wire Wire Line
	18100 11550 18000 11550
Wire Wire Line
	18400 12150 17850 12150
Wire Wire Line
	18600 5200 18600 5500
Wire Wire Line
	18600 5200 20150 5200
Wire Wire Line
	18600 5850 18600 6150
Wire Wire Line
	18600 5850 20050 5850
Wire Wire Line
	18600 6500 18600 6800
Wire Wire Line
	18600 6500 19950 6500
Wire Wire Line
	18600 7150 18600 7450
Wire Wire Line
	18600 7150 19850 7150
Wire Wire Line
	18600 9100 18600 9400
Wire Wire Line
	18600 9100 20150 9100
Wire Wire Line
	18600 9750 20050 9750
Wire Wire Line
	18600 10050 18600 9750
Wire Wire Line
	18600 10400 19950 10400
Wire Wire Line
	18600 10700 18600 10400
Wire Wire Line
	18600 11050 19850 11050
Wire Wire Line
	18600 11350 18600 11050
Wire Wire Line
	19200 5600 19500 5600
Wire Wire Line
	19200 6250 19500 6250
Wire Wire Line
	19200 6900 19500 6900
Wire Wire Line
	19200 7550 19500 7550
Wire Wire Line
	19200 9500 19500 9500
Wire Wire Line
	19200 10150 19500 10150
Wire Wire Line
	19200 10800 19500 10800
Wire Wire Line
	19200 11450 19500 11450
Wire Wire Line
	19250 12150 21350 12150
Wire Wire Line
	19250 12500 18800 12500
Wire Wire Line
	19250 12500 19250 12250
Wire Wire Line
	19800 12450 20550 12450
Wire Wire Line
	19800 13000 19800 12550
Wire Wire Line
	19850 7150 21100 7150
Wire Wire Line
	19850 7450 19850 7150
Wire Wire Line
	19850 11050 21100 11050
Wire Wire Line
	19850 11350 19850 11050
Wire Wire Line
	19950 6500 21100 6500
Wire Wire Line
	19950 6750 19950 6500
Wire Wire Line
	19950 6750 19950 7550
Wire Wire Line
	19950 7550 20450 7550
Wire Wire Line
	19950 10400 21100 10400
Wire Wire Line
	19950 10650 19950 10400
Wire Wire Line
	19950 10650 19950 11450
Wire Wire Line
	19950 11450 20450 11450
Wire Wire Line
	20050 5850 21100 5850
Wire Wire Line
	20050 6200 20050 5850
Wire Wire Line
	20050 6850 20050 6200
Wire Wire Line
	20050 7650 20050 6850
Wire Wire Line
	20050 9750 21100 9750
Wire Wire Line
	20050 10100 20050 9750
Wire Wire Line
	20050 10750 20050 10100
Wire Wire Line
	20050 11550 20050 10750
Wire Wire Line
	20050 13000 19800 13000
Wire Wire Line
	20150 5200 20150 5650
Wire Wire Line
	20150 5200 21100 5200
Wire Wire Line
	20150 5650 20150 6300
Wire Wire Line
	20150 5650 20450 5650
Wire Wire Line
	20150 6950 20150 6300
Wire Wire Line
	20150 6950 20150 7750
Wire Wire Line
	20150 7750 20450 7750
Wire Wire Line
	20150 9100 20150 9550
Wire Wire Line
	20150 9100 21100 9100
Wire Wire Line
	20150 9550 20150 10200
Wire Wire Line
	20150 9550 20450 9550
Wire Wire Line
	20150 10850 20150 10200
Wire Wire Line
	20150 10850 20150 11650
Wire Wire Line
	20150 11650 20450 11650
Wire Wire Line
	20300 4350 20300 7850
Wire Wire Line
	20300 7850 20450 7850
Wire Wire Line
	20300 8200 20300 11750
Wire Wire Line
	20300 11750 20450 11750
Wire Wire Line
	20350 4400 20350 5100
Wire Wire Line
	20350 5100 21100 5100
Wire Wire Line
	20350 5750 20350 5100
Wire Wire Line
	20350 6400 20350 5750
Wire Wire Line
	20350 7050 20350 6400
Wire Wire Line
	20350 8250 20350 9000
Wire Wire Line
	20350 8250 21950 8250
Wire Wire Line
	20350 9000 21100 9000
Wire Wire Line
	20350 9650 20350 9000
Wire Wire Line
	20350 10300 20350 9650
Wire Wire Line
	20350 10950 20350 10300
Wire Wire Line
	20450 5750 20350 5750
Wire Wire Line
	20450 6200 20050 6200
Wire Wire Line
	20450 6300 20150 6300
Wire Wire Line
	20450 6400 20350 6400
Wire Wire Line
	20450 6750 19950 6750
Wire Wire Line
	20450 6850 20050 6850
Wire Wire Line
	20450 6950 20150 6950
Wire Wire Line
	20450 7050 20350 7050
Wire Wire Line
	20450 7450 19850 7450
Wire Wire Line
	20450 7650 20050 7650
Wire Wire Line
	20450 9650 20350 9650
Wire Wire Line
	20450 10100 20050 10100
Wire Wire Line
	20450 10200 20150 10200
Wire Wire Line
	20450 10300 20350 10300
Wire Wire Line
	20450 10650 19950 10650
Wire Wire Line
	20450 10750 20050 10750
Wire Wire Line
	20450 10850 20150 10850
Wire Wire Line
	20450 10950 20350 10950
Wire Wire Line
	20450 11350 19850 11350
Wire Wire Line
	20450 11550 20050 11550
Wire Wire Line
	20550 12450 20750 12450
Wire Wire Line
	20550 12900 20550 12450
Wire Wire Line
	20550 13100 21600 13100
Wire Wire Line
	21000 5700 21050 5700
Wire Wire Line
	21000 9600 21050 9600
Wire Wire Line
	21050 5700 21050 5750
Wire Wire Line
	21050 5750 21100 5750
Wire Wire Line
	21050 6300 21100 6300
Wire Wire Line
	21050 9600 21050 9650
Wire Wire Line
	21050 9650 21100 9650
Wire Wire Line
	21050 10200 21100 10200
Wire Wire Line
	21100 6300 21100 6400
Wire Wire Line
	21100 6900 21050 6900
Wire Wire Line
	21100 7050 21100 6900
Wire Wire Line
	21100 10200 21100 10300
Wire Wire Line
	21100 10800 21050 10800
Wire Wire Line
	21100 10950 21100 10800
Wire Wire Line
	21200 7650 21200 8000
Wire Wire Line
	21200 8100 21200 8000
Wire Wire Line
	21200 11550 21350 11550
Wire Wire Line
	21250 12850 21000 12850
Wire Wire Line
	21350 11550 21350 12150
Wire Wire Line
	21400 8000 21200 8000
Wire Wire Line
	21400 8100 21200 8100
Wire Wire Line
	21600 12650 21250 12650
Wire Wire Line
	21600 13100 21600 12650
Wire Wire Line
	21600 13100 21950 13100
Wire Wire Line
	21650 5150 21650 4800
Wire Wire Line
	21650 5800 21750 5800
Wire Wire Line
	21650 7100 21950 7100
Wire Wire Line
	21650 9050 21650 8700
Wire Wire Line
	21650 9700 21750 9700
Wire Wire Line
	21650 10350 21850 10350
Wire Wire Line
	21750 5800 21750 4700
Wire Wire Line
	21750 9700 21750 8600
Wire Wire Line
	21800 7650 22000 7650
Wire Wire Line
	21850 4600 21850 6450
Wire Wire Line
	21850 6450 21650 6450
Wire Wire Line
	21850 10350 21850 8500
Wire Wire Line
	21950 4500 21950 7100
Wire Wire Line
	21950 8250 21950 8050
Wire Wire Line
	21950 8400 21950 11000
Wire Wire Line
	21950 11000 21650 11000
Wire Wire Line
	22000 7650 22000 8200
Wire Wire Line
	22000 8200 20300 8200
Wire Bus Line
	1150 7850 1250 7850
Wire Bus Line
	2100 1600 1950 1600
Wire Bus Line
	7000 950  7100 950 
Wire Bus Line
	7850 950  7950 950 
Wire Bus Line
	8800 950  8900 950 
Wire Bus Line
	9750 950  9850 950 
Wire Bus Line
	9750 8750 9850 8750
Wire Bus Line
	19600 8150 19700 8150
Text Notes 12350 12950 0    50   ~ 0
0b100000010
Text Notes 12350 13050 0    50   ~ 0
258
Text Label 1400 8100 0    50   ~ 0
~DEBUG4
Text Label 1400 8250 0    50   ~ 0
~DEBUG1
Text Label 1400 9100 2    50   ~ 0
~COUNTER-SET
Text Label 1600 15300 2    50   ~ 0
CLK4M
Text Label 1600 15400 2    50   ~ 0
E-VSYNC
Text Label 1650 9950 2    50   ~ 0
E-VSYNC
Text Label 2000 9100 0    50   ~ 0
~DEBUG4-B
Text Label 2250 1400 2    50   ~ 0
~CLK4M
Text Label 2350 8100 2    50   ~ 0
~COUNTER-SET
Text Label 2350 8250 2    50   ~ 0
~COUNTER-STOP
Text Label 2700 1900 2    50   ~ 0
BUS-DATA3
Text Label 2700 2000 2    50   ~ 0
BUS-DATA2
Text Label 2700 2100 2    50   ~ 0
BUS-DATA1
Text Label 2700 2200 2    50   ~ 0
BUS-DATA0
Text Label 2700 2950 2    50   ~ 0
BUS-DATA7
Text Label 2700 3050 2    50   ~ 0
BUS-DATA6
Text Label 2700 3150 2    50   ~ 0
BUS-DATA5
Text Label 2700 3250 2    50   ~ 0
BUS-DATA4
Text Label 2700 4000 2    50   ~ 0
BUS-DATA8
Text Label 2700 4100 2    50   ~ 0
BUS-DATA9
Text Label 2700 4200 2    50   ~ 0
BUS-DATA10
Text Label 2700 4300 2    50   ~ 0
BUS-DATA11
Text Label 2700 5050 2    50   ~ 0
BUS-DATA12
Text Label 2700 5150 2    50   ~ 0
BUS-DATA13
Text Label 2700 5250 2    50   ~ 0
BUS-DATA14
Text Label 2700 5350 2    50   ~ 0
BUS-DATA15
Text Label 3800 15350 2    50   ~ 0
~CLK4M
Text Label 3850 1900 0    50   ~ 0
DATA3
Text Label 3850 2000 0    50   ~ 0
DATA2
Text Label 3850 2100 0    50   ~ 0
DATA1
Text Label 3850 2200 0    50   ~ 0
DATA0
Text Label 3850 2950 0    50   ~ 0
DATA7
Text Label 3850 3050 0    50   ~ 0
DATA6
Text Label 3850 3150 0    50   ~ 0
DATA5
Text Label 3850 3250 0    50   ~ 0
DATA4
Text Label 3850 4000 0    50   ~ 0
DATA8
Text Label 3850 4100 0    50   ~ 0
DATA9
Text Label 3850 4200 0    50   ~ 0
DATA10
Text Label 3850 4300 0    50   ~ 0
DATA11
Text Label 3850 5050 0    50   ~ 0
DATA12
Text Label 3850 5150 0    50   ~ 0
DATA13
Text Label 3850 5250 0    50   ~ 0
DATA14
Text Label 3850 5350 0    50   ~ 0
DATA15
Text Label 4700 13950 2    50   ~ 0
~DEBUG4-B
Text Label 5750 5300 2    50   ~ 0
DATA8
Text Label 5750 5950 2    50   ~ 0
DATA9
Text Label 5750 6600 2    50   ~ 0
DATA10
Text Label 5750 7250 2    50   ~ 0
DATA11
Text Label 5750 9700 2    50   ~ 0
DATA12
Text Label 5750 10350 2    50   ~ 0
DATA13
Text Label 5750 11000 2    50   ~ 0
DATA14
Text Label 5750 11650 2    50   ~ 0
DATA15
Text Label 6850 1250 2    50   ~ 0
~COL1
Text Label 6850 1350 2    50   ~ 0
~COL2
Text Label 6850 1450 2    50   ~ 0
~COL3
Text Label 6850 1550 2    50   ~ 0
~COL4
Text Label 6850 1650 2    50   ~ 0
~COL5
Text Label 6850 1750 2    50   ~ 0
~COL6
Text Label 6850 1850 2    50   ~ 0
~COL7
Text Label 6850 1950 2    50   ~ 0
~COL8
Text Label 7700 1250 2    50   ~ 0
COL1
Text Label 7700 1350 2    50   ~ 0
COL2
Text Label 7700 1450 2    50   ~ 0
COL3
Text Label 7700 1550 2    50   ~ 0
COL4
Text Label 7700 1650 2    50   ~ 0
COL5
Text Label 7700 1750 2    50   ~ 0
COL6
Text Label 7700 1850 2    50   ~ 0
COL7
Text Label 7700 1950 2    50   ~ 0
COL8
Text Label 8150 8400 0    50   ~ 0
~CLK4M
Text Label 8650 1150 2    50   ~ 0
~LINE0
Text Label 8650 1250 2    50   ~ 0
~LINE1
Text Label 8650 1350 2    50   ~ 0
~LINE2
Text Label 8650 1450 2    50   ~ 0
~LINE3
Text Label 8650 1550 2    50   ~ 0
~LINE4
Text Label 8650 1650 2    50   ~ 0
~LINE5
Text Label 8650 1750 2    50   ~ 0
~LINE6
Text Label 8650 1850 2    50   ~ 0
~LINE7
Text Label 8650 1950 2    50   ~ 0
~LINE8
Text Label 9400 12350 0    50   ~ 0
~LINE8
Text Label 9400 13000 0    50   ~ 0
LINE8
Text Label 9600 1150 2    50   ~ 0
LINE0
Text Label 9600 1250 2    50   ~ 0
LINE1
Text Label 9600 1350 2    50   ~ 0
LINE2
Text Label 9600 1450 2    50   ~ 0
LINE3
Text Label 9600 1550 2    50   ~ 0
LINE4
Text Label 9600 1650 2    50   ~ 0
LINE5
Text Label 9600 1750 2    50   ~ 0
LINE6
Text Label 9600 1850 2    50   ~ 0
LINE7
Text Label 9600 1950 2    50   ~ 0
LINE8
Text Label 9650 5200 2    50   ~ 0
~LINE0
Text Label 9650 5600 2    50   ~ 0
LINE0
Text Label 9650 5850 2    50   ~ 0
~LINE1
Text Label 9650 6250 2    50   ~ 0
LINE1
Text Label 9650 6500 2    50   ~ 0
~LINE2
Text Label 9650 6900 2    50   ~ 0
LINE2
Text Label 9650 7150 2    50   ~ 0
~LINE3
Text Label 9650 7550 2    50   ~ 0
LINE3
Text Label 9650 9600 2    50   ~ 0
~LINE4
Text Label 9650 10000 2    50   ~ 0
LINE4
Text Label 9650 10250 2    50   ~ 0
~LINE5
Text Label 9650 10650 2    50   ~ 0
LINE5
Text Label 9650 10900 2    50   ~ 0
~LINE6
Text Label 9650 11300 2    50   ~ 0
LINE6
Text Label 9650 11550 2    50   ~ 0
~LINE7
Text Label 9650 11950 2    50   ~ 0
LINE7
Text Label 10500 8250 2    50   ~ 0
~LINE0
Text Label 10500 8350 2    50   ~ 0
LINE1
Text Label 10500 8450 2    50   ~ 0
~LINE2
Text Label 10500 8550 2    50   ~ 0
~LINE3
Text Label 13100 3950 2    50   ~ 0
LINE-INC
Text Label 13800 5800 0    50   ~ 0
~DEBUG4-B
Text Label 14450 4700 2    50   ~ 0
~COUNTER-STOP
Text Label 15600 5300 2    50   ~ 0
DATA0
Text Label 15600 5950 2    50   ~ 0
DATA1
Text Label 15600 6600 2    50   ~ 0
DATA2
Text Label 15600 7250 2    50   ~ 0
DATA3
Text Label 15600 9200 2    50   ~ 0
DATA4
Text Label 15600 9850 2    50   ~ 0
DATA5
Text Label 15600 10500 2    50   ~ 0
DATA6
Text Label 15600 11150 2    50   ~ 0
DATA7
Text Label 17850 8150 2    50   ~ 0
~CLK4M
Text Label 18800 12500 2    50   ~ 0
E-VSYNC
Text Label 19250 5600 0    50   ~ 0
COL1
Text Label 19250 6250 0    50   ~ 0
COL2
Text Label 19250 6900 0    50   ~ 0
COL3
Text Label 19250 7550 0    50   ~ 0
COL4
Text Label 19250 9500 0    50   ~ 0
COL5
Text Label 19250 10150 0    50   ~ 0
COL6
Text Label 19250 10800 0    50   ~ 0
COL7
Text Label 19250 11450 0    50   ~ 0
COL8
Text Label 21650 13100 0    50   ~ 0
~CLK4M
Text HLabel 1150 7850 0    50   Input ~ 0
~DEBUG[1..4]
Text HLabel 1550 14800 0    50   Input ~ 0
HSYNC
Text HLabel 1650 10050 0    50   Input ~ 0
HSYNC
Text HLabel 1850 1300 0    50   Input ~ 0
~SCANLINE
Text HLabel 1950 1600 0    50   Input ~ 0
BUS-DATA[0..15]
Text HLabel 3200 10000 2    50   Output ~ 0
FI
Text HLabel 6300 15250 2    50   Input ~ 0
~RESETI
Text HLabel 7100 950  2    50   Output ~ 0
~COL[1..8]
Text HLabel 7550 8400 0    50   Input ~ 0
CLK4M
Text HLabel 7950 950  2    50   Output ~ 0
COL[1..8]
Text HLabel 8900 950  2    50   Output ~ 0
~LINE[0..8]
Text HLabel 9800 3950 0    50   Output ~ 0
LINE-INC
Text HLabel 9850 950  2    50   Output ~ 0
LINE[0..8]
Text HLabel 9850 8750 2    50   Output ~ 0
LINE[0..8]
Text HLabel 13800 9550 0    50   Input ~ 0
~RESETI
Text HLabel 16200 12900 0    50   Output ~ 0
LI
Text HLabel 19250 12050 2    50   Input ~ 0
VSYNC
Text HLabel 19700 8150 2    50   Output ~ 0
COL[1..8]
Text HLabel 21250 12850 2    50   Input ~ 0
~RESETI
Text HLabel 21850 12450 2    50   Input ~ 0
VSYNC
$Comp
L power:VCC #PWR0214
U 1 1 65F26D39
P 2600 4600
F 0 "#PWR0214" H 2600 4450 50  0001 C CNN
F 1 "VCC" H 2615 4773 50  0000 C CNN
F 2 "" H 2600 4600 50  0001 C CNN
F 3 "" H 2600 4600 50  0001 C CNN
	1    2600 4600
	1    0    0    -1  
$EndComp
$Comp
L power:VCC #PWR0215
U 1 1 67215B63
P 2600 5650
F 0 "#PWR0215" H 2600 5500 50  0001 C CNN
F 1 "VCC" H 2615 5823 50  0000 C CNN
F 2 "" H 2600 5650 50  0001 C CNN
F 3 "" H 2600 5650 50  0001 C CNN
	1    2600 5650
	1    0    0    -1  
$EndComp
$Comp
L A5C:NAND02 UBI136
U 1 1 6217BE4C
P 1850 15350
F 0 "UBI136" H 1875 15617 50  0000 C CNN
F 1 "NAND02" H 1875 15526 50  0000 C CNN
F 2 "" H 1850 15350 50  0001 C CNN
F 3 "" H 1850 15350 50  0001 C CNN
	1    1850 15350
	1    0    0    -1  
$EndComp
$Comp
L A5C:OR02 UBH37
U 1 1 65B72309
P 2500 1350
F 0 "UBH37" H 2525 1617 50  0000 C CNN
F 1 "OR02" H 2525 1526 50  0000 C CNN
F 2 "" H 2550 1350 50  0001 C CNN
F 3 "" H 2550 1350 50  0001 C CNN
	1    2500 1350
	1    0    0    -1  
$EndComp
$Comp
L A5C:AND02 UAA285
U 1 1 633FDBFC
P 2750 9150
F 0 "UAA285" H 2775 9417 50  0000 C CNN
F 1 "AND02" H 2775 9326 50  0000 C CNN
F 2 "" H 2750 9150 50  0001 C CNN
F 3 "" H 2750 9150 50  0001 C CNN
	1    2750 9150
	1    0    0    -1  
$EndComp
$Comp
L A5C:NAND02 UEI308
U 1 1 6126CEF7
P 3600 14850
F 0 "UEI308" H 3625 15117 50  0000 C CNN
F 1 "NAND02" H 3625 15026 50  0000 C CNN
F 2 "" H 3600 14850 50  0001 C CNN
F 3 "" H 3600 14850 50  0001 C CNN
	1    3600 14850
	1    0    0    -1  
$EndComp
$Comp
L A5C:AND02 UAA483
U 1 1 627BBD47
P 4400 7700
F 0 "UAA483" H 4425 7967 50  0000 C CNN
F 1 "AND02" H 4425 7876 50  0000 C CNN
F 2 "" H 4400 7700 50  0001 C CNN
F 3 "" H 4400 7700 50  0001 C CNN
	1    4400 7700
	1    0    0    -1  
$EndComp
$Comp
L A5C:AND02 UCL205
U 1 1 5F9D9D6C
P 4400 8200
AR Path="/5F79F49D/5F9D9D6C" Ref="UCL205"  Part="1" 
AR Path="/5FC16B93/5FC17149/5F9D9D6C" Ref="UCL205"  Part="1" 
AR Path="/60A4D282/5F9D9D6C" Ref="UAA367"  Part="1" 
F 0 "UAA367" H 4425 8467 50  0000 C CNN
F 1 "AND02" H 4425 8376 50  0000 C CNN
F 2 "" H 4400 8200 50  0001 C CNN
F 3 "" H 4400 8200 50  0001 C CNN
	1    4400 8200
	1    0    0    -1  
$EndComp
$Comp
L A5C:AND02 UAA408
U 1 1 627B853D
P 4400 8700
F 0 "UAA408" H 4425 8967 50  0000 C CNN
F 1 "AND02" H 4425 8876 50  0000 C CNN
F 2 "" H 4400 8700 50  0001 C CNN
F 3 "" H 4400 8700 50  0001 C CNN
	1    4400 8700
	1    0    0    -1  
$EndComp
$Comp
L A5C:AND02 UCG200
U 1 1 60FC2581
P 4400 9200
AR Path="/5F79F49D/60FC2581" Ref="UCG200"  Part="1" 
AR Path="/5FC16B93/5FC17149/60FC2581" Ref="UCG200"  Part="1" 
AR Path="/60A4D282/60FC2581" Ref="UAA353"  Part="1" 
F 0 "UAA353" H 4425 9467 50  0000 C CNN
F 1 "AND02" H 4425 9376 50  0000 C CNN
F 2 "" H 4400 9200 50  0001 C CNN
F 3 "" H 4400 9200 50  0001 C CNN
	1    4400 9200
	1    0    0    -1  
$EndComp
$Comp
L A5C:AND02 UCG409
U 1 1 5FF70132
P 4400 10150
AR Path="/5F79F49D/5FF70132" Ref="UCG409"  Part="1" 
AR Path="/5FC16B93/5FC17149/5FF70132" Ref="UCG409"  Part="1" 
AR Path="/60A4D282/5FF70132" Ref="UAA340"  Part="1" 
F 0 "UAA340" H 4425 10417 50  0000 C CNN
F 1 "AND02" H 4425 10326 50  0000 C CNN
F 2 "" H 4400 10150 50  0001 C CNN
F 3 "" H 4400 10150 50  0001 C CNN
	1    4400 10150
	1    0    0    -1  
$EndComp
$Comp
L A5C:AND02 UCG403
U 1 1 5FF8B2CF
P 4400 10750
AR Path="/5F79F49D/5FF8B2CF" Ref="UCG403"  Part="1" 
AR Path="/5FC16B93/5FC17149/5FF8B2CF" Ref="UCG403"  Part="1" 
AR Path="/60A4D282/5FF8B2CF" Ref="UAA343"  Part="1" 
F 0 "UAA343" H 4425 11017 50  0000 C CNN
F 1 "AND02" H 4425 10926 50  0000 C CNN
F 2 "" H 4400 10750 50  0001 C CNN
F 3 "" H 4400 10750 50  0001 C CNN
	1    4400 10750
	1    0    0    -1  
$EndComp
$Comp
L A5C:OR02 UAD400
U 1 1 6B55065E
P 6200 5350
F 0 "UAD400" H 6225 5617 50  0000 C CNN
F 1 "OR02" H 6225 5526 50  0000 C CNN
F 2 "" H 6250 5350 50  0001 C CNN
F 3 "" H 6250 5350 50  0001 C CNN
	1    6200 5350
	1    0    0    -1  
$EndComp
$Comp
L A5C:AND02 UAB416
U 1 1 6660A3D8
P 6200 6000
F 0 "UAB416" H 6225 6267 50  0000 C CNN
F 1 "AND02" H 6225 6176 50  0000 C CNN
F 2 "" H 6200 6000 50  0001 C CNN
F 3 "" H 6200 6000 50  0001 C CNN
	1    6200 6000
	1    0    0    -1  
$EndComp
$Comp
L A5C:OR02 UBA73
U 1 1 6CF5595C
P 6200 6650
F 0 "UBA73" H 6225 6917 50  0000 C CNN
F 1 "OR02" H 6225 6826 50  0000 C CNN
F 2 "" H 6250 6650 50  0001 C CNN
F 3 "" H 6250 6650 50  0001 C CNN
	1    6200 6650
	1    0    0    -1  
$EndComp
$Comp
L A5C:OR02 UAD408
U 1 1 68B80D33
P 6200 7300
F 0 "UAD408" H 6225 7567 50  0000 C CNN
F 1 "OR02" H 6225 7476 50  0000 C CNN
F 2 "" H 6250 7300 50  0001 C CNN
F 3 "" H 6250 7300 50  0001 C CNN
	1    6200 7300
	1    0    0    -1  
$EndComp
$Comp
L A5C:OR02 UBW496
U 1 1 5FCED8FC
P 6200 9750
AR Path="/5F79F49D/5FCED8FC" Ref="UBW496"  Part="1" 
AR Path="/5FC16B93/5FC17149/5FCED8FC" Ref="UBW496"  Part="1" 
AR Path="/60A4D282/5FCED8FC" Ref="UAC361"  Part="1" 
F 0 "UAC361" H 6225 10017 50  0000 C CNN
F 1 "OR02" H 6225 9926 50  0000 C CNN
F 2 "" H 6250 9750 50  0001 C CNN
F 3 "" H 6250 9750 50  0001 C CNN
	1    6200 9750
	1    0    0    -1  
$EndComp
$Comp
L A5C:OR02 UBU496
U 1 1 5FCF1DBC
P 6200 10400
AR Path="/5F79F49D/5FCF1DBC" Ref="UBU496"  Part="1" 
AR Path="/5FC16B93/5FC17149/5FCF1DBC" Ref="UBU496"  Part="1" 
AR Path="/60A4D282/5FCF1DBC" Ref="UAC351"  Part="1" 
F 0 "UAC351" H 6225 10667 50  0000 C CNN
F 1 "OR02" H 6225 10576 50  0000 C CNN
F 2 "" H 6250 10400 50  0001 C CNN
F 3 "" H 6250 10400 50  0001 C CNN
	1    6200 10400
	1    0    0    -1  
$EndComp
$Comp
L A5C:OR02 UBN451
U 1 1 5FCF609A
P 6200 11050
AR Path="/5F79F49D/5FCF609A" Ref="UBN451"  Part="1" 
AR Path="/5FC16B93/5FC17149/5FCF609A" Ref="UBN451"  Part="1" 
AR Path="/60A4D282/5FCF609A" Ref="UBA0"  Part="1" 
F 0 "UBA0" H 6225 11317 50  0000 C CNN
F 1 "OR02" H 6225 11226 50  0000 C CNN
F 2 "" H 6250 11050 50  0001 C CNN
F 3 "" H 6250 11050 50  0001 C CNN
	1    6200 11050
	1    0    0    -1  
$EndComp
$Comp
L A5C:OR02 UBU453
U 1 1 5FCFA418
P 6200 11700
AR Path="/5F79F49D/5FCFA418" Ref="UBU453"  Part="1" 
AR Path="/5FC16B93/5FC17149/5FCFA418" Ref="UBU453"  Part="1" 
AR Path="/60A4D282/5FCFA418" Ref="UAB340"  Part="1" 
F 0 "UAB340" H 6225 11967 50  0000 C CNN
F 1 "OR02" H 6225 11876 50  0000 C CNN
F 2 "" H 6250 11700 50  0001 C CNN
F 3 "" H 6250 11700 50  0001 C CNN
	1    6200 11700
	1    0    0    -1  
$EndComp
$Comp
L A5C:NOR02 UAA381
U 1 1 60F6C5C9
P 10850 5700
F 0 "UAA381" H 10875 5967 50  0000 C CNN
F 1 "NOR02" H 10875 5876 50  0000 C CNN
F 2 "" H 10850 5700 50  0001 C CNN
F 3 "" H 10850 5700 50  0001 C CNN
	1    10850 5700
	1    0    0    -1  
$EndComp
$Comp
L A5C:NOR02 UCL164
U 1 1 5FC55E32
P 10850 10100
AR Path="/5F79F49D/5FC55E32" Ref="UCL164"  Part="1" 
AR Path="/5FC16B93/5FC17149/5FC55E32" Ref="UCL164"  Part="1" 
AR Path="/60A4D282/5FC55E32" Ref="UAB308"  Part="1" 
F 0 "UAB308" H 10875 10367 50  0000 C CNN
F 1 "NOR02" H 10875 10276 50  0000 C CNN
F 2 "" H 10850 10100 50  0001 C CNN
F 3 "" H 10850 10100 50  0001 C CNN
	1    10850 10100
	1    0    0    -1  
$EndComp
$Comp
L A5C:NOR02 UAD391
U 1 1 635ECEB6
P 11400 13350
F 0 "UAD391" H 11425 13617 50  0000 C CNN
F 1 "NOR02" H 11425 13526 50  0000 C CNN
F 2 "" H 11400 13350 50  0001 C CNN
F 3 "" H 11400 13350 50  0001 C CNN
	1    11400 13350
	-1   0    0    -1  
$EndComp
$Comp
L A5C:XOR02 UAA400
U 1 1 60F6C5CF
P 11500 5150
F 0 "UAA400" H 11525 5417 50  0000 C CNN
F 1 "XOR02" H 11525 5326 50  0000 C CNN
F 2 "" H 11500 5150 50  0001 C CNN
F 3 "" H 11500 5150 50  0001 C CNN
	1    11500 5150
	1    0    0    -1  
$EndComp
$Comp
L A5C:XNOR02 UAA385
U 1 1 60F6C5D5
P 11500 5800
F 0 "UAA385" H 11525 6067 50  0000 C CNN
F 1 "XNOR02" H 11525 5976 50  0000 C CNN
F 2 "" H 11525 5800 50  0001 C CNN
F 3 "" H 11525 5800 50  0001 C CNN
	1    11500 5800
	1    0    0    -1  
$EndComp
$Comp
L A5C:XNOR02 UAC407
U 1 1 60F6C5DB
P 11500 6450
F 0 "UAC407" H 11525 6717 50  0000 C CNN
F 1 "XNOR02" H 11525 6626 50  0000 C CNN
F 2 "" H 11525 6450 50  0001 C CNN
F 3 "" H 11525 6450 50  0001 C CNN
	1    11500 6450
	1    0    0    -1  
$EndComp
$Comp
L A5C:XNOR02 UAC388
U 1 1 60F6C5E1
P 11500 7100
F 0 "UAC388" H 11525 7367 50  0000 C CNN
F 1 "XNOR02" H 11525 7276 50  0000 C CNN
F 2 "" H 11525 7100 50  0001 C CNN
F 3 "" H 11525 7100 50  0001 C CNN
	1    11500 7100
	1    0    0    -1  
$EndComp
$Comp
L A5C:XOR02 UCJ159
U 1 1 5FC55E26
P 11500 9550
AR Path="/5F79F49D/5FC55E26" Ref="UCJ159"  Part="1" 
AR Path="/5FC16B93/5FC17149/5FC55E26" Ref="UCJ159"  Part="1" 
AR Path="/60A4D282/5FC55E26" Ref="UAC342"  Part="1" 
F 0 "UAC342" H 11525 9283 50  0000 C CNN
F 1 "XOR02" H 11525 9374 50  0000 C CNN
F 2 "" H 11500 9550 50  0001 C CNN
F 3 "" H 11500 9550 50  0001 C CNN
	1    11500 9550
	1    0    0    1   
$EndComp
$Comp
L A5C:XNOR02 UAB316
U 1 1 5FDA0413
P 11500 10200
F 0 "UAB316" H 11525 10467 50  0000 C CNN
F 1 "XNOR02" H 11525 10376 50  0000 C CNN
F 2 "" H 11525 10200 50  0001 C CNN
F 3 "" H 11525 10200 50  0001 C CNN
	1    11500 10200
	1    0    0    -1  
$EndComp
$Comp
L A5C:XNOR02 UAB304
U 1 1 5FF437B0
P 11500 10850
F 0 "UAB304" H 11525 11117 50  0000 C CNN
F 1 "XNOR02" H 11525 11026 50  0000 C CNN
F 2 "" H 11525 10850 50  0001 C CNN
F 3 "" H 11525 10850 50  0001 C CNN
	1    11500 10850
	1    0    0    -1  
$EndComp
$Comp
L A5C:XNOR02 UAA279
U 1 1 5FF43987
P 11500 11500
F 0 "UAA279" H 11525 11767 50  0000 C CNN
F 1 "XNOR02" H 11525 11676 50  0000 C CNN
F 2 "" H 11525 11500 50  0001 C CNN
F 3 "" H 11525 11500 50  0001 C CNN
	1    11500 11500
	1    0    0    -1  
$EndComp
$Comp
L A5C:XNOR02 UAA321
U 1 1 5FF43B86
P 11700 12100
F 0 "UAA321" H 11725 12367 50  0000 C CNN
F 1 "XNOR02" H 11725 12276 50  0000 C CNN
F 2 "" H 11725 12100 50  0001 C CNN
F 3 "" H 11725 12100 50  0001 C CNN
	1    11700 12100
	1    0    0    -1  
$EndComp
$Comp
L A5C:NAND02 UCG169
U 1 1 5FC55E8C
P 11800 8050
AR Path="/5F79F49D/5FC55E8C" Ref="UCG169"  Part="1" 
AR Path="/5FC16B93/5FC17149/5FC55E8C" Ref="UCG169"  Part="1" 
AR Path="/60A4D282/5FC55E8C" Ref="UAB334"  Part="1" 
F 0 "UAB334" H 11825 8317 50  0000 C CNN
F 1 "NAND02" H 11825 8226 50  0000 C CNN
F 2 "" H 11800 8050 50  0001 C CNN
F 3 "" H 11800 8050 50  0001 C CNN
	1    11800 8050
	1    0    0    -1  
$EndComp
$Comp
L A5C:NAND02 UAB383
U 1 1 6A551DA4
P 12650 4750
F 0 "UAB383" H 12675 5017 50  0000 C CNN
F 1 "NAND02" H 12675 4926 50  0000 C CNN
F 2 "" H 12650 4750 50  0001 C CNN
F 3 "" H 12650 4750 50  0001 C CNN
	1    12650 4750
	-1   0    0    -1  
$EndComp
$Comp
L A5C:NAND02 UAC375
U 1 1 6A752796
P 13400 4350
F 0 "UAC375" H 13425 4617 50  0000 C CNN
F 1 "NAND02" H 13425 4526 50  0000 C CNN
F 2 "" H 13400 4350 50  0001 C CNN
F 3 "" H 13400 4350 50  0001 C CNN
	1    13400 4350
	-1   0    0    -1  
$EndComp
$Comp
L A5C:AND02 UAA434
U 1 1 640391D6
P 13550 5750
F 0 "UAA434" H 13575 6017 50  0000 C CNN
F 1 "AND02" H 13575 5926 50  0000 C CNN
F 2 "" H 13550 5750 50  0001 C CNN
F 3 "" H 13550 5750 50  0001 C CNN
	1    13550 5750
	-1   0    0    -1  
$EndComp
$Comp
L A5C:AND02 UBU182
U 1 1 63938380
P 14250 7700
AR Path="/5F79F49D/63938380" Ref="UBU182"  Part="1" 
AR Path="/5FC16B93/5FC17149/63938380" Ref="UBU182"  Part="1" 
AR Path="/60A4D282/63938380" Ref="UAA488"  Part="1" 
F 0 "UAA488" H 14275 7967 50  0000 C CNN
F 1 "AND02" H 14275 7876 50  0000 C CNN
F 2 "" H 14250 7700 50  0001 C CNN
F 3 "" H 14250 7700 50  0001 C CNN
	1    14250 7700
	1    0    0    -1  
$EndComp
$Comp
L A5C:AND02 UCG167
U 1 1 6393838C
P 14250 8200
AR Path="/5F79F49D/6393838C" Ref="UCG167"  Part="1" 
AR Path="/5FC16B93/5FC17149/6393838C" Ref="UCG167"  Part="1" 
AR Path="/60A4D282/6393838C" Ref="UAA438"  Part="1" 
F 0 "UAA438" H 14275 8467 50  0000 C CNN
F 1 "AND02" H 14275 8376 50  0000 C CNN
F 2 "" H 14250 8200 50  0001 C CNN
F 3 "" H 14250 8200 50  0001 C CNN
	1    14250 8200
	1    0    0    -1  
$EndComp
$Comp
L A5C:AND02 UCC185
U 1 1 639383A3
P 14250 8700
AR Path="/5F79F49D/639383A3" Ref="UCC185"  Part="1" 
AR Path="/5FC16B93/5FC17149/639383A3" Ref="UCC185"  Part="1" 
AR Path="/60A4D282/639383A3" Ref="UAA495"  Part="1" 
F 0 "UAA495" H 14275 8967 50  0000 C CNN
F 1 "AND02" H 14275 8876 50  0000 C CNN
F 2 "" H 14250 8700 50  0001 C CNN
F 3 "" H 14250 8700 50  0001 C CNN
	1    14250 8700
	1    0    0    -1  
$EndComp
$Comp
L A5C:AND02 UBW175
U 1 1 6393839D
P 14250 9200
AR Path="/5F79F49D/6393839D" Ref="UBW175"  Part="1" 
AR Path="/5FC16B93/5FC17149/6393839D" Ref="UBW175"  Part="1" 
AR Path="/60A4D282/6393839D" Ref="UAA475"  Part="1" 
F 0 "UAA475" H 14275 9467 50  0000 C CNN
F 1 "AND02" H 14275 9376 50  0000 C CNN
F 2 "" H 14250 9200 50  0001 C CNN
F 3 "" H 14250 9200 50  0001 C CNN
	1    14250 9200
	1    0    0    -1  
$EndComp
$Comp
L A5C:NAND02 UBZ155
U 1 1 61ED650F
P 15500 4750
AR Path="/5F79F49D/61ED650F" Ref="UBZ155"  Part="1" 
AR Path="/5FC16B93/5FC17149/61ED650F" Ref="UBZ155"  Part="1" 
AR Path="/60A4D282/61ED650F" Ref="UAC450"  Part="1" 
F 0 "UAC450" H 15525 5017 50  0000 C CNN
F 1 "NAND02" H 15525 4926 50  0000 C CNN
F 2 "" H 15500 4750 50  0001 C CNN
F 3 "" H 15500 4750 50  0001 C CNN
	1    15500 4750
	1    0    0    -1  
$EndComp
$Comp
L A5C:AND02 UAB519
U 1 1 65FCC186
P 16050 5350
F 0 "UAB519" H 16075 5617 50  0000 C CNN
F 1 "AND02" H 16075 5526 50  0000 C CNN
F 2 "" H 16050 5350 50  0001 C CNN
F 3 "" H 16050 5350 50  0001 C CNN
	1    16050 5350
	1    0    0    -1  
$EndComp
$Comp
L A5C:AND02 UBA177
U 1 1 66353A79
P 16050 6000
F 0 "UBA177" H 16075 6267 50  0000 C CNN
F 1 "AND02" H 16075 6176 50  0000 C CNN
F 2 "" H 16050 6000 50  0001 C CNN
F 3 "" H 16050 6000 50  0001 C CNN
	1    16050 6000
	1    0    0    -1  
$EndComp
$Comp
L A5C:AND02 UAD514
U 1 1 66270727
P 16050 6650
F 0 "UAD514" H 16075 6917 50  0000 C CNN
F 1 "AND02" H 16075 6826 50  0000 C CNN
F 2 "" H 16050 6650 50  0001 C CNN
F 3 "" H 16050 6650 50  0001 C CNN
	1    16050 6650
	1    0    0    -1  
$EndComp
$Comp
L A5C:AND02 UBC162
U 1 1 66354689
P 16050 7300
F 0 "UBC162" H 16075 7567 50  0000 C CNN
F 1 "AND02" H 16075 7476 50  0000 C CNN
F 2 "" H 16050 7300 50  0001 C CNN
F 3 "" H 16050 7300 50  0001 C CNN
	1    16050 7300
	1    0    0    -1  
$EndComp
$Comp
L A5C:AND02 UAC462
U 1 1 65E0B0B4
P 16050 9250
F 0 "UAC462" H 16075 9517 50  0000 C CNN
F 1 "AND02" H 16075 9426 50  0000 C CNN
F 2 "" H 16050 9250 50  0001 C CNN
F 3 "" H 16050 9250 50  0001 C CNN
	1    16050 9250
	1    0    0    -1  
$EndComp
$Comp
L A5C:AND02 UAD456
U 1 1 65E082BD
P 16050 9900
F 0 "UAD456" H 16075 10167 50  0000 C CNN
F 1 "AND02" H 16075 10076 50  0000 C CNN
F 2 "" H 16050 9900 50  0001 C CNN
F 3 "" H 16050 9900 50  0001 C CNN
	1    16050 9900
	1    0    0    -1  
$EndComp
$Comp
L A5C:AND02 UAB446
U 1 1 65EEBC51
P 16050 10550
F 0 "UAB446" H 16075 10817 50  0000 C CNN
F 1 "AND02" H 16075 10726 50  0000 C CNN
F 2 "" H 16050 10550 50  0001 C CNN
F 3 "" H 16050 10550 50  0001 C CNN
	1    16050 10550
	1    0    0    -1  
$EndComp
$Comp
L A5C:AND02 UAC440
U 1 1 6651F0E5
P 16050 11200
F 0 "UAC440" H 16075 11467 50  0000 C CNN
F 1 "AND02" H 16075 11376 50  0000 C CNN
F 2 "" H 16050 11200 50  0001 C CNN
F 3 "" H 16050 11200 50  0001 C CNN
	1    16050 11200
	1    0    0    -1  
$EndComp
$Comp
L A5C:AND02 UAB511
U 1 1 648BF4E5
P 19550 12500
F 0 "UAB511" H 19575 12233 50  0000 C CNN
F 1 "AND02" H 19575 12324 50  0000 C CNN
F 2 "" H 19550 12500 50  0001 C CNN
F 3 "" H 19550 12500 50  0001 C CNN
	1    19550 12500
	-1   0    0    1   
$EndComp
$Comp
L A5C:NOR02 UBZ173
U 1 1 61ED63BD
P 20700 5700
AR Path="/5F79F49D/61ED63BD" Ref="UBZ173"  Part="1" 
AR Path="/5FC16B93/5FC17149/61ED63BD" Ref="UBZ173"  Part="1" 
AR Path="/60A4D282/61ED63BD" Ref="UAC504"  Part="1" 
F 0 "UAC504" H 20725 5967 50  0000 C CNN
F 1 "NOR02" H 20725 5876 50  0000 C CNN
F 2 "" H 20700 5700 50  0001 C CNN
F 3 "" H 20700 5700 50  0001 C CNN
	1    20700 5700
	1    0    0    -1  
$EndComp
$Comp
L A5C:NOR02 UCC169
U 1 1 61ED6421
P 20700 9600
AR Path="/5F79F49D/61ED6421" Ref="UCC169"  Part="1" 
AR Path="/5FC16B93/5FC17149/61ED6421" Ref="UCC169"  Part="1" 
AR Path="/60A4D282/61ED6421" Ref="UAA472"  Part="1" 
F 0 "UAA472" H 20725 9867 50  0000 C CNN
F 1 "NOR02" H 20725 9776 50  0000 C CNN
F 2 "" H 20700 9600 50  0001 C CNN
F 3 "" H 20700 9600 50  0001 C CNN
	1    20700 9600
	1    0    0    -1  
$EndComp
$Comp
L A5C:XOR02 UBZ165
U 1 1 61ED63B1
P 21350 5150
AR Path="/5F79F49D/61ED63B1" Ref="UBZ165"  Part="1" 
AR Path="/5FC16B93/5FC17149/61ED63B1" Ref="UBZ165"  Part="1" 
AR Path="/60A4D282/61ED63B1" Ref="UAB508"  Part="1" 
F 0 "UAB508" H 21375 4883 50  0000 C CNN
F 1 "XOR02" H 21375 4974 50  0000 C CNN
F 2 "" H 21350 5150 50  0001 C CNN
F 3 "" H 21350 5150 50  0001 C CNN
	1    21350 5150
	1    0    0    1   
$EndComp
$Comp
L A5C:XNOR02 UAC500
U 1 1 600E7951
P 21350 5800
F 0 "UAC500" H 21375 6067 50  0000 C CNN
F 1 "XNOR02" H 21375 5976 50  0000 C CNN
F 2 "" H 21375 5800 50  0001 C CNN
F 3 "" H 21375 5800 50  0001 C CNN
	1    21350 5800
	1    0    0    -1  
$EndComp
$Comp
L A5C:XNOR02 UAC475
U 1 1 600E7957
P 21350 6450
F 0 "UAC475" H 21375 6717 50  0000 C CNN
F 1 "XNOR02" H 21375 6626 50  0000 C CNN
F 2 "" H 21375 6450 50  0001 C CNN
F 3 "" H 21375 6450 50  0001 C CNN
	1    21350 6450
	1    0    0    -1  
$EndComp
$Comp
L A5C:XNOR02 UAC486
U 1 1 600E795D
P 21350 7100
F 0 "UAC486" H 21375 7367 50  0000 C CNN
F 1 "XNOR02" H 21375 7276 50  0000 C CNN
F 2 "" H 21375 7100 50  0001 C CNN
F 3 "" H 21375 7100 50  0001 C CNN
	1    21350 7100
	1    0    0    -1  
$EndComp
$Comp
L A5C:XOR02 UCC166
U 1 1 61ED6415
P 21350 9050
AR Path="/5F79F49D/61ED6415" Ref="UCC166"  Part="1" 
AR Path="/5FC16B93/5FC17149/61ED6415" Ref="UCC166"  Part="1" 
AR Path="/60A4D282/61ED6415" Ref="UAB459"  Part="1" 
F 0 "UAB459" H 21375 8783 50  0000 C CNN
F 1 "XOR02" H 21375 8874 50  0000 C CNN
F 2 "" H 21350 9050 50  0001 C CNN
F 3 "" H 21350 9050 50  0001 C CNN
	1    21350 9050
	1    0    0    1   
$EndComp
$Comp
L A5C:XNOR02 UAA459
U 1 1 6013BC9B
P 21350 9700
F 0 "UAA459" H 21375 9967 50  0000 C CNN
F 1 "XNOR02" H 21375 9876 50  0000 C CNN
F 2 "" H 21375 9700 50  0001 C CNN
F 3 "" H 21375 9700 50  0001 C CNN
	1    21350 9700
	1    0    0    -1  
$EndComp
$Comp
L A5C:XNOR02 UAA445
U 1 1 6013BCA1
P 21350 10350
F 0 "UAA445" H 21375 10617 50  0000 C CNN
F 1 "XNOR02" H 21375 10526 50  0000 C CNN
F 2 "" H 21375 10350 50  0001 C CNN
F 3 "" H 21375 10350 50  0001 C CNN
	1    21350 10350
	1    0    0    -1  
$EndComp
$Comp
L A5C:XNOR02 UAB424
U 1 1 6013BCA7
P 21350 11000
F 0 "UAB424" H 21375 11267 50  0000 C CNN
F 1 "XNOR02" H 21375 11176 50  0000 C CNN
F 2 "" H 21375 11000 50  0001 C CNN
F 3 "" H 21375 11000 50  0001 C CNN
	1    21350 11000
	1    0    0    -1  
$EndComp
$Comp
L A5C:NAND02 UCC143
U 1 1 61ED6518
P 21650 8050
AR Path="/5F79F49D/61ED6518" Ref="UCC143"  Part="1" 
AR Path="/5FC16B93/5FC17149/61ED6518" Ref="UCC143"  Part="1" 
AR Path="/60A4D282/61ED6518" Ref="UAC469"  Part="1" 
F 0 "UAC469" H 21675 8317 50  0000 C CNN
F 1 "NAND02" H 21675 8226 50  0000 C CNN
F 2 "" H 21650 8050 50  0001 C CNN
F 3 "" H 21650 8050 50  0001 C CNN
	1    21650 8050
	1    0    0    -1  
$EndComp
$Comp
L A5C:BUF12 UAC128
U 1 1 633F6226
P 1700 9100
F 0 "UAC128" H 1700 9417 50  0000 C CNN
F 1 "BUF12" H 1700 9326 50  0000 C CNN
F 2 "" H 1700 9100 50  0001 C CNN
F 3 "" H 1700 9100 50  0001 C CNN
	1    1700 9100
	1    0    0    -1  
$EndComp
$Comp
L A5C:INV01 UBD168
U 1 1 621F1187
P 1850 14800
F 0 "UBD168" H 1850 15117 50  0000 C CNN
F 1 "INV01" H 1850 15026 50  0000 C CNN
F 2 "" H 1850 14600 50  0001 C CNN
F 3 "" H 1850 14600 50  0001 C CNN
	1    1850 14800
	1    0    0    -1  
$EndComp
$Comp
L A5C:NBUF03 UAB266
U 1 1 63B0461D
P 2800 9750
F 0 "UAB266" H 2800 10067 50  0000 C CNN
F 1 "NBUF03" H 2800 9976 50  0000 C CNN
F 2 "" H 2800 9550 50  0001 C CNN
F 3 "" H 2800 9550 50  0001 C CNN
	1    2800 9750
	1    0    0    -1  
$EndComp
$Comp
L A5C:NBUF03 UAA265
U 1 1 63B08083
P 2800 10250
F 0 "UAA265" H 2800 10567 50  0000 C CNN
F 1 "NBUF03" H 2800 10476 50  0000 C CNN
F 2 "" H 2800 10050 50  0001 C CNN
F 3 "" H 2800 10050 50  0001 C CNN
	1    2800 10250
	1    0    0    -1  
$EndComp
$Comp
L A5C:INV01 UAB472
U 1 1 62B356F6
P 3700 7650
F 0 "UAB472" H 3700 7967 50  0000 C CNN
F 1 "INV01" H 3700 7876 50  0000 C CNN
F 2 "" H 3700 7450 50  0001 C CNN
F 3 "" H 3700 7450 50  0001 C CNN
	1    3700 7650
	1    0    0    -1  
$EndComp
$Comp
L A5C:INV01 UCL201
U 1 1 5FA103EB
P 3700 8150
AR Path="/5F79F49D/5FA103EB" Ref="UCL201"  Part="1" 
AR Path="/5FC16B93/5FC17149/5FA103EB" Ref="UCL201"  Part="1" 
AR Path="/60A4D282/5FA103EB" Ref="UAB397"  Part="1" 
F 0 "UAB397" H 3700 8467 50  0000 C CNN
F 1 "INV01" H 3700 8376 50  0000 C CNN
F 2 "" H 3700 7950 50  0001 C CNN
F 3 "" H 3700 7950 50  0001 C CNN
	1    3700 8150
	1    0    0    -1  
$EndComp
$Comp
L A5C:INV01 UCG412
U 1 1 5FF6CB2E
P 3700 10100
AR Path="/5F79F49D/5FF6CB2E" Ref="UCG412"  Part="1" 
AR Path="/5FC16B93/5FC17149/5FF6CB2E" Ref="UCG412"  Part="1" 
AR Path="/60A4D282/5FF6CB2E" Ref="UAA295"  Part="1" 
F 0 "UAA295" H 3700 10417 50  0000 C CNN
F 1 "INV01" H 3700 10326 50  0000 C CNN
F 2 "" H 3700 9900 50  0001 C CNN
F 3 "" H 3700 9900 50  0001 C CNN
	1    3700 10100
	1    0    0    -1  
$EndComp
$Comp
L A5C:INV01 UAC413
U 1 1 666085B2
P 5600 13950
F 0 "UAC413" H 5600 14267 50  0000 C CNN
F 1 "INV02" H 5600 14176 50  0000 C CNN
F 2 "" H 5600 13750 50  0001 C CNN
F 3 "" H 5600 13750 50  0001 C CNN
	1    5600 13950
	1    0    0    -1  
$EndComp
$Comp
L A5C:NBUF02 UAB320
U 1 1 69D582B7
P 7850 8400
F 0 "UAB320" H 7850 8717 50  0000 C CNN
F 1 "NBUF02" H 7850 8626 50  0000 C CNN
F 2 "" H 7850 8200 50  0001 C CNN
F 3 "" H 7850 8200 50  0001 C CNN
	1    7850 8400
	1    0    0    -1  
$EndComp
$Comp
L A5C:BUF12 UAC421
U 1 1 6094B506
P 9050 5600
F 0 "UAC421" H 9050 5917 50  0000 C CNN
F 1 "BUF12" H 9050 5826 50  0000 C CNN
F 2 "" H 9050 5600 50  0001 C CNN
F 3 "" H 9050 5600 50  0001 C CNN
	1    9050 5600
	1    0    0    -1  
$EndComp
$Comp
L A5C:BUF12 UAC367
U 1 1 61D429B4
P 9050 6250
F 0 "UAC367" H 9050 6567 50  0000 C CNN
F 1 "BUF12" H 9050 6476 50  0000 C CNN
F 2 "" H 9050 6250 50  0001 C CNN
F 3 "" H 9050 6250 50  0001 C CNN
	1    9050 6250
	1    0    0    -1  
$EndComp
$Comp
L A5C:BUF12 UBD56
U 1 1 61D433ED
P 9050 6900
F 0 "UBD56" H 9050 7217 50  0000 C CNN
F 1 "BUF12" H 9050 7126 50  0000 C CNN
F 2 "" H 9050 6900 50  0001 C CNN
F 3 "" H 9050 6900 50  0001 C CNN
	1    9050 6900
	1    0    0    -1  
$EndComp
$Comp
L A5C:BUF12 UBB13
U 1 1 61D43A0C
P 9050 7550
F 0 "UBB13" H 9050 7867 50  0000 C CNN
F 1 "BUF12" H 9050 7776 50  0000 C CNN
F 2 "" H 9050 7550 50  0001 C CNN
F 3 "" H 9050 7550 50  0001 C CNN
	1    9050 7550
	1    0    0    -1  
$EndComp
$Comp
L A5C:BUF12 UCL283
U 1 1 60635C47
P 9050 10000
AR Path="/5F79F49D/60635C47" Ref="UCL283"  Part="1" 
AR Path="/5FC16B93/5FC17149/60635C47" Ref="UCL283"  Part="1" 
AR Path="/60A4D282/60635C47" Ref="UAC348"  Part="1" 
F 0 "UAC348" H 9050 10317 50  0000 C CNN
F 1 "BUF12" H 9050 10226 50  0000 C CNN
F 2 "" H 9050 10000 50  0001 C CNN
F 3 "" H 9050 10000 50  0001 C CNN
	1    9050 10000
	1    0    0    -1  
$EndComp
$Comp
L A5C:BUF12 UCO265
U 1 1 60635DCB
P 9050 10650
AR Path="/5F79F49D/60635DCB" Ref="UCO265"  Part="1" 
AR Path="/5FC16B93/5FC17149/60635DCB" Ref="UCO265"  Part="1" 
AR Path="/60A4D282/60635DCB" Ref="UAC358"  Part="1" 
F 0 "UAC358" H 9050 10967 50  0000 C CNN
F 1 "BUF12" H 9050 10876 50  0000 C CNN
F 2 "" H 9050 10650 50  0001 C CNN
F 3 "" H 9050 10650 50  0001 C CNN
	1    9050 10650
	1    0    0    -1  
$EndComp
$Comp
L A5C:BUF12 UCT312
U 1 1 60635F01
P 9050 11300
AR Path="/5F79F49D/60635F01" Ref="UCT312"  Part="1" 
AR Path="/5FC16B93/5FC17149/60635F01" Ref="UCT312"  Part="1" 
AR Path="/60A4D282/60635F01" Ref="UAC321"  Part="1" 
F 0 "UAC321" H 9050 11617 50  0000 C CNN
F 1 "BUF12" H 9050 11526 50  0000 C CNN
F 2 "" H 9050 11300 50  0001 C CNN
F 3 "" H 9050 11300 50  0001 C CNN
	1    9050 11300
	1    0    0    -1  
$EndComp
$Comp
L A5C:BUF12 UCL259
U 1 1 60636161
P 9050 11950
AR Path="/5F79F49D/60636161" Ref="UCL259"  Part="1" 
AR Path="/5FC16B93/5FC17149/60636161" Ref="UCL259"  Part="1" 
AR Path="/60A4D282/60636161" Ref="UAB328"  Part="1" 
F 0 "UAB328" H 9050 12267 50  0000 C CNN
F 1 "BUF12" H 9050 12176 50  0000 C CNN
F 2 "" H 9050 11950 50  0001 C CNN
F 3 "" H 9050 11950 50  0001 C CNN
	1    9050 11950
	1    0    0    -1  
$EndComp
$Comp
L A5C:BUF12 UCJ330
U 1 1 61B74124
P 9050 13000
AR Path="/5F79F49D/61B74124" Ref="UCJ330"  Part="1" 
AR Path="/5FC16B93/5FC17149/61B74124" Ref="UCJ330"  Part="1" 
AR Path="/60A4D282/61B74124" Ref="UAA301"  Part="1" 
F 0 "UAA301" H 9050 13317 50  0000 C CNN
F 1 "BUF12" H 9050 13226 50  0000 C CNN
F 2 "" H 9050 13000 50  0001 C CNN
F 3 "" H 9050 13000 50  0001 C CNN
	1    9050 13000
	1    0    0    -1  
$EndComp
$Comp
L A5C:NOR03 UAC397
U 1 1 60F6C5E7
P 10900 6300
F 0 "UAC397" H 10900 6617 50  0000 C CNN
F 1 "NOR03" H 10900 6526 50  0000 C CNN
F 2 "" H 10900 6300 50  0001 C CNN
F 3 "" H 10900 6300 50  0001 C CNN
	1    10900 6300
	1    0    0    -1  
$EndComp
$Comp
L A5C:NOR03 UCJ151
U 1 1 5FC55E43
P 10900 10700
AR Path="/5F79F49D/5FC55E43" Ref="UCJ151"  Part="1" 
AR Path="/5FC16B93/5FC17149/5FC55E43" Ref="UCJ151"  Part="1" 
AR Path="/60A4D282/5FC55E43" Ref="UAB269"  Part="1" 
F 0 "UAB269" H 10900 11017 50  0000 C CNN
F 1 "NOR03" H 10900 10926 50  0000 C CNN
F 2 "" H 10900 10700 50  0001 C CNN
F 3 "" H 10900 10700 50  0001 C CNN
	1    10900 10700
	1    0    0    -1  
$EndComp
$Comp
L A5C:INV01 UCJ188
U 1 1 5FC55E92
P 11650 7650
AR Path="/5F79F49D/5FC55E92" Ref="UCJ188"  Part="1" 
AR Path="/5FC16B93/5FC17149/5FC55E92" Ref="UCJ188"  Part="1" 
AR Path="/60A4D282/5FC55E92" Ref="UAB355"  Part="1" 
F 0 "UAB355" H 11650 7333 50  0000 C CNN
F 1 "INV01" H 11650 7424 50  0000 C CNN
F 2 "" H 11650 7450 50  0001 C CNN
F 3 "" H 11650 7450 50  0001 C CNN
	1    11650 7650
	1    0    0    1   
$EndComp
$Comp
L A5C:INV01 UBA44
U 1 1 6A15E2F7
P 12800 4350
F 0 "UBA44" H 12800 4667 50  0000 C CNN
F 1 "INV01" H 12800 4576 50  0000 C CNN
F 2 "" H 12800 4150 50  0001 C CNN
F 3 "" H 12800 4150 50  0001 C CNN
	1    12800 4350
	-1   0    0    -1  
$EndComp
$Comp
L A5C:INV01 UCG166
U 1 1 63938392
P 13550 7650
AR Path="/5F79F49D/63938392" Ref="UCG166"  Part="1" 
AR Path="/5FC16B93/5FC17149/63938392" Ref="UCG166"  Part="1" 
AR Path="/60A4D282/63938392" Ref="UAA486"  Part="1" 
F 0 "UAA486" H 13550 7967 50  0000 C CNN
F 1 "INV01" H 13550 7876 50  0000 C CNN
F 2 "" H 13550 7450 50  0001 C CNN
F 3 "" H 13550 7450 50  0001 C CNN
	1    13550 7650
	1    0    0    -1  
$EndComp
$Comp
L A5C:INV01 UBU180
U 1 1 63938386
P 13550 8150
AR Path="/5F79F49D/63938386" Ref="UBU180"  Part="1" 
AR Path="/5FC16B93/5FC17149/63938386" Ref="UBU180"  Part="1" 
AR Path="/60A4D282/63938386" Ref="UAA437"  Part="1" 
F 0 "UAA437" H 13550 8467 50  0000 C CNN
F 1 "INV01" H 13550 8376 50  0000 C CNN
F 2 "" H 13550 7950 50  0001 C CNN
F 3 "" H 13550 7950 50  0001 C CNN
	1    13550 8150
	1    0    0    -1  
$EndComp
$Comp
L A5C:INV01 UCC130
U 1 1 61ED64FE
P 15350 4350
AR Path="/5F79F49D/61ED64FE" Ref="UCC130"  Part="1" 
AR Path="/5FC16B93/5FC17149/61ED64FE" Ref="UCC130"  Part="1" 
AR Path="/60A4D282/61ED64FE" Ref="UAC391"  Part="1" 
F 0 "UAC391" H 15350 4033 50  0000 C CNN
F 1 "INV01" H 15350 4124 50  0000 C CNN
F 2 "" H 15350 4150 50  0001 C CNN
F 3 "" H 15350 4150 50  0001 C CNN
	1    15350 4350
	1    0    0    1   
$EndComp
$Comp
L A5C:NBUF03 UAA?
U 1 1 656420C5
P 17000 12650
AR Path="/656420C5" Ref="UAA?"  Part="1" 
AR Path="/60A4D282/656420C5" Ref="UAA282"  Part="1" 
F 0 "UAA282" H 17000 12967 50  0000 C CNN
F 1 "NBUF03" H 17000 12876 50  0000 C CNN
F 2 "" H 17000 12450 50  0001 C CNN
F 3 "" H 17000 12450 50  0001 C CNN
	1    17000 12650
	-1   0    0    -1  
$EndComp
$Comp
L A5C:NBUF03 UAA?
U 1 1 656420CB
P 17000 13150
AR Path="/656420CB" Ref="UAA?"  Part="1" 
AR Path="/60A4D282/656420CB" Ref="UAA257"  Part="1" 
F 0 "UAA257" H 17000 13467 50  0000 C CNN
F 1 "NBUF03" H 17000 13376 50  0000 C CNN
F 2 "" H 17000 12950 50  0001 C CNN
F 3 "" H 17000 12950 50  0001 C CNN
	1    17000 13150
	-1   0    0    -1  
$EndComp
$Comp
L A5C:BUF12 UBW154
U 1 1 61ED648A
P 18900 5600
AR Path="/5F79F49D/61ED648A" Ref="UBW154"  Part="1" 
AR Path="/5FC16B93/5FC17149/61ED648A" Ref="UBW154"  Part="1" 
AR Path="/60A4D282/61ED648A" Ref="UAB502"  Part="1" 
F 0 "UAB502" H 18900 5917 50  0000 C CNN
F 1 "BUF12" H 18900 5826 50  0000 C CNN
F 2 "" H 18900 5600 50  0001 C CNN
F 3 "" H 18900 5600 50  0001 C CNN
	1    18900 5600
	1    0    0    -1  
$EndComp
$Comp
L A5C:BUF12 UCG?
U 1 1 62AECF8B
P 18900 6250
AR Path="/62AECF8B" Ref="UCG?"  Part="1" 
AR Path="/5F79F49D/62AECF8B" Ref="UCG283"  Part="1" 
AR Path="/5FC16B93/5FC17149/62AECF8B" Ref="UCG283"  Part="1" 
AR Path="/60A4D282/62AECF8B" Ref="UAC443"  Part="1" 
F 0 "UAC443" H 18900 6567 50  0000 C CNN
F 1 "BUF12" H 18900 6476 50  0000 C CNN
F 2 "" H 18900 6250 50  0001 C CNN
F 3 "" H 18900 6250 50  0001 C CNN
	1    18900 6250
	1    0    0    -1  
$EndComp
$Comp
L A5C:BUF12 UBZ?
U 1 1 62C610D0
P 18900 6900
AR Path="/62C610D0" Ref="UBZ?"  Part="1" 
AR Path="/5F79F49D/62C610D0" Ref="UBZ131"  Part="1" 
AR Path="/5FC16B93/5FC17149/62C610D0" Ref="UBZ131"  Part="1" 
AR Path="/60A4D282/62C610D0" Ref="UAD477"  Part="1" 
F 0 "UAD477" H 18900 7216 50  0000 C CNN
F 1 "BUF12" H 18900 7125 50  0000 C CNN
F 2 "" H 18900 6900 50  0001 C CNN
F 3 "" H 18900 6900 50  0001 C CNN
	1    18900 6900
	1    0    0    -1  
$EndComp
$Comp
L A5C:BUF12 UBW278
U 1 1 61ED64A6
P 18900 7550
AR Path="/5F79F49D/61ED64A6" Ref="UBW278"  Part="1" 
AR Path="/5FC16B93/5FC17149/61ED64A6" Ref="UBW278"  Part="1" 
AR Path="/60A4D282/61ED64A6" Ref="UAC266"  Part="1" 
F 0 "UAC266" H 18900 7867 50  0000 C CNN
F 1 "BUF12" H 18900 7776 50  0000 C CNN
F 2 "" H 18900 7550 50  0001 C CNN
F 3 "" H 18900 7550 50  0001 C CNN
	1    18900 7550
	1    0    0    -1  
$EndComp
$Comp
L A5C:BUF12 UCC192
U 1 1 61ED64B2
P 18900 9500
AR Path="/5F79F49D/61ED64B2" Ref="UCC192"  Part="1" 
AR Path="/5FC16B93/5FC17149/61ED64B2" Ref="UCC192"  Part="1" 
AR Path="/60A4D282/61ED64B2" Ref="UAB491"  Part="1" 
F 0 "UAB491" H 18900 9817 50  0000 C CNN
F 1 "BUF12" H 18900 9726 50  0000 C CNN
F 2 "" H 18900 9500 50  0001 C CNN
F 3 "" H 18900 9500 50  0001 C CNN
	1    18900 9500
	1    0    0    -1  
$EndComp
$Comp
L A5C:BUF12 UCC172
U 1 1 61ED64B8
P 18900 10150
AR Path="/5F79F49D/61ED64B8" Ref="UCC172"  Part="1" 
AR Path="/5FC16B93/5FC17149/61ED64B8" Ref="UCC172"  Part="1" 
AR Path="/60A4D282/61ED64B8" Ref="UAC437"  Part="1" 
F 0 "UAC437" H 18900 10467 50  0000 C CNN
F 1 "BUF12" H 18900 10376 50  0000 C CNN
F 2 "" H 18900 10150 50  0001 C CNN
F 3 "" H 18900 10150 50  0001 C CNN
	1    18900 10150
	1    0    0    -1  
$EndComp
$Comp
L A5C:BUF12 UCC198
U 1 1 61ED64BE
P 18900 10800
AR Path="/5F79F49D/61ED64BE" Ref="UCC198"  Part="1" 
AR Path="/5FC16B93/5FC17149/61ED64BE" Ref="UCC198"  Part="1" 
AR Path="/60A4D282/61ED64BE" Ref="UAC431"  Part="1" 
F 0 "UAC431" H 18900 11117 50  0000 C CNN
F 1 "BUF12" H 18900 11026 50  0000 C CNN
F 2 "" H 18900 10800 50  0001 C CNN
F 3 "" H 18900 10800 50  0001 C CNN
	1    18900 10800
	1    0    0    -1  
$EndComp
$Comp
L A5C:BUF12 UCJ217
U 1 1 61ED64C4
P 18900 11450
AR Path="/5F79F49D/61ED64C4" Ref="UCJ217"  Part="1" 
AR Path="/5FC16B93/5FC17149/61ED64C4" Ref="UCJ217"  Part="1" 
AR Path="/60A4D282/61ED64C4" Ref="UAC446"  Part="1" 
F 0 "UAC446" H 18900 11767 50  0000 C CNN
F 1 "BUF12" H 18900 11676 50  0000 C CNN
F 2 "" H 18900 11450 50  0001 C CNN
F 3 "" H 18900 11450 50  0001 C CNN
	1    18900 11450
	1    0    0    -1  
$EndComp
$Comp
L A5C:NOR03 UBZ138
U 1 1 61ED63CC
P 20750 6300
AR Path="/5F79F49D/61ED63CC" Ref="UBZ138"  Part="1" 
AR Path="/5FC16B93/5FC17149/61ED63CC" Ref="UBZ138"  Part="1" 
AR Path="/60A4D282/61ED63CC" Ref="UAC472"  Part="1" 
F 0 "UAC472" H 20750 6617 50  0000 C CNN
F 1 "NOR03" H 20750 6526 50  0000 C CNN
F 2 "" H 20750 6300 50  0001 C CNN
F 3 "" H 20750 6300 50  0001 C CNN
	1    20750 6300
	1    0    0    -1  
$EndComp
$Comp
L A5C:NOR03 UCC147
U 1 1 61ED6430
P 20750 10200
AR Path="/5F79F49D/61ED6430" Ref="UCC147"  Part="1" 
AR Path="/5FC16B93/5FC17149/61ED6430" Ref="UCC147"  Part="1" 
AR Path="/60A4D282/61ED6430" Ref="UAA448"  Part="1" 
F 0 "UAA448" H 20750 10517 50  0000 C CNN
F 1 "NOR03" H 20750 10426 50  0000 C CNN
F 2 "" H 20750 10200 50  0001 C CNN
F 3 "" H 20750 10200 50  0001 C CNN
	1    20750 10200
	1    0    0    -1  
$EndComp
$Comp
L A5C:INV01 UCC141
U 1 1 61ED647F
P 21500 7650
AR Path="/5F79F49D/61ED647F" Ref="UCC141"  Part="1" 
AR Path="/5FC16B93/5FC17149/61ED647F" Ref="UCC141"  Part="1" 
AR Path="/60A4D282/61ED647F" Ref="UAC461"  Part="1" 
F 0 "UAC461" H 21500 7333 50  0000 C CNN
F 1 "INV01" H 21500 7424 50  0000 C CNN
F 2 "" H 21500 7450 50  0001 C CNN
F 3 "" H 21500 7450 50  0001 C CNN
	1    21500 7650
	1    0    0    1   
$EndComp
$Comp
L A5C:INV01 UAA?
U 1 1 64987F66
P 21550 12450
AR Path="/5F79F49D/64987F66" Ref="UAA?"  Part="1" 
AR Path="/5FC16B93/5FC17149/64987F66" Ref="UAA?"  Part="1" 
AR Path="/60A4D282/64987F66" Ref="UAC516"  Part="1" 
F 0 "UAC516" H 21550 12767 50  0000 C CNN
F 1 "INV01" H 21550 12676 50  0000 C CNN
F 2 "" H 21550 12250 50  0001 C CNN
F 3 "" H 21550 12250 50  0001 C CNN
	1    21550 12450
	-1   0    0    -1  
$EndComp
$Comp
L A5C:DFFCOO UAC417
U 1 1 60F6C5FF
P 8500 5600
F 0 "UAC417" H 8500 5965 50  0000 C CNN
F 1 "DFFCOO" H 8500 5874 50  0000 C CNN
F 2 "" H 8500 5600 50  0001 C CNN
F 3 "" H 8500 5600 50  0001 C CNN
	1    8500 5600
	1    0    0    -1  
$EndComp
$Comp
L A5C:DFFCOO UAC380
U 1 1 60F6C5ED
P 8500 6250
F 0 "UAC380" H 8500 6615 50  0000 C CNN
F 1 "DFFCOO" H 8500 6524 50  0000 C CNN
F 2 "" H 8500 6250 50  0001 C CNN
F 3 "" H 8500 6250 50  0001 C CNN
	1    8500 6250
	1    0    0    -1  
$EndComp
$Comp
L A5C:DFFCOO UBA58
U 1 1 60F6C5F3
P 8500 6900
F 0 "UBA58" H 8500 7265 50  0000 C CNN
F 1 "DFFCOO" H 8500 7174 50  0000 C CNN
F 2 "" H 8500 6900 50  0001 C CNN
F 3 "" H 8500 6900 50  0001 C CNN
	1    8500 6900
	1    0    0    -1  
$EndComp
$Comp
L A5C:DFFCOO UAC353
U 1 1 60F6C5F9
P 8500 7550
F 0 "UAC353" H 8500 7915 50  0000 C CNN
F 1 "DFFCOO" H 8500 7824 50  0000 C CNN
F 2 "" H 8500 7550 50  0001 C CNN
F 3 "" H 8500 7550 50  0001 C CNN
	1    8500 7550
	1    0    0    -1  
$EndComp
$Comp
L A5C:DFFCOO UCL186
U 1 1 5FD85CB4
P 8500 10000
AR Path="/5F79F49D/5FD85CB4" Ref="UCL186"  Part="1" 
AR Path="/5FC16B93/5FC17149/5FD85CB4" Ref="UCL186"  Part="1" 
AR Path="/60A4D282/5FD85CB4" Ref="UAC338"  Part="1" 
F 0 "UAC338" H 8500 10365 50  0000 C CNN
F 1 "DFFCOO" H 8500 10274 50  0000 C CNN
F 2 "" H 8500 10000 50  0001 C CNN
F 3 "" H 8500 10000 50  0001 C CNN
	1    8500 10000
	1    0    0    -1  
$EndComp
$Comp
L A5C:DFFCOO UCL207
U 1 1 5FD8D64D
P 8500 10650
AR Path="/5F79F49D/5FD8D64D" Ref="UCL207"  Part="1" 
AR Path="/5FC16B93/5FC17149/5FD8D64D" Ref="UCL207"  Part="1" 
AR Path="/60A4D282/5FD8D64D" Ref="UAC332"  Part="1" 
F 0 "UAC332" H 8500 11015 50  0000 C CNN
F 1 "DFFCOO" H 8500 10924 50  0000 C CNN
F 2 "" H 8500 10650 50  0001 C CNN
F 3 "" H 8500 10650 50  0001 C CNN
	1    8500 10650
	1    0    0    -1  
$EndComp
$Comp
L A5C:DFFCOO UCJ162
U 1 1 5FD920AA
P 8500 11300
AR Path="/5F79F49D/5FD920AA" Ref="UCJ162"  Part="1" 
AR Path="/5FC16B93/5FC17149/5FD920AA" Ref="UCJ162"  Part="1" 
AR Path="/60A4D282/5FD920AA" Ref="UAC324"  Part="1" 
F 0 "UAC324" H 8500 11665 50  0000 C CNN
F 1 "DFFCOO" H 8500 11574 50  0000 C CNN
F 2 "" H 8500 11300 50  0001 C CNN
F 3 "" H 8500 11300 50  0001 C CNN
	1    8500 11300
	1    0    0    -1  
$EndComp
$Comp
L A5C:DFFCOO UCJ222
U 1 1 5FD96D46
P 8500 11950
AR Path="/5F79F49D/5FD96D46" Ref="UCJ222"  Part="1" 
AR Path="/5FC16B93/5FC17149/5FD96D46" Ref="UCJ222"  Part="1" 
AR Path="/60A4D282/5FD96D46" Ref="UAB330"  Part="1" 
F 0 "UAB330" H 8500 12315 50  0000 C CNN
F 1 "DFFCOO" H 8500 12224 50  0000 C CNN
F 2 "" H 8500 11950 50  0001 C CNN
F 3 "" H 8500 11950 50  0001 C CNN
	1    8500 11950
	1    0    0    -1  
$EndComp
$Comp
L A5C:DFFCOO UCJ280
U 1 1 6017A4F0
P 8500 13000
AR Path="/5F79F49D/6017A4F0" Ref="UCJ280"  Part="1" 
AR Path="/5FC16B93/5FC17149/6017A4F0" Ref="UCJ280"  Part="1" 
AR Path="/60A4D282/6017A4F0" Ref="UAB343"  Part="1" 
F 0 "UAB343" H 8500 13365 50  0000 C CNN
F 1 "DFFCOO" H 8500 13274 50  0000 C CNN
F 2 "" H 8500 13000 50  0001 C CNN
F 3 "" H 8500 13000 50  0001 C CNN
	1    8500 13000
	1    0    0    -1  
$EndComp
$Comp
L A5C:DFFCOO UBW150
U 1 1 5FD9BE4D
P 18350 5600
AR Path="/5F79F49D/5FD9BE4D" Ref="UBW150"  Part="1" 
AR Path="/5FC16B93/5FC17149/5FD9BE4D" Ref="UBW150"  Part="1" 
AR Path="/60A4D282/5FD9BE4D" Ref="UAB493"  Part="1" 
F 0 "UAB493" H 18350 5965 50  0000 C CNN
F 1 "DFFCOO" H 18350 5874 50  0000 C CNN
F 2 "" H 18350 5600 50  0001 C CNN
F 3 "" H 18350 5600 50  0001 C CNN
	1    18350 5600
	1    0    0    -1  
$EndComp
$Comp
L A5C:DFFCOO UCC181
U 1 1 5FDA16CE
P 18350 6250
AR Path="/5F79F49D/5FDA16CE" Ref="UCC181"  Part="1" 
AR Path="/5FC16B93/5FC17149/5FDA16CE" Ref="UCC181"  Part="1" 
AR Path="/60A4D282/5FDA16CE" Ref="UAC456"  Part="1" 
F 0 "UAC456" H 18350 6615 50  0000 C CNN
F 1 "DFFCOO" H 18350 6524 50  0000 C CNN
F 2 "" H 18350 6250 50  0001 C CNN
F 3 "" H 18350 6250 50  0001 C CNN
	1    18350 6250
	1    0    0    -1  
$EndComp
$Comp
L A5C:DFFCOO UBZ126
U 1 1 5FDA6745
P 18350 6900
AR Path="/5F79F49D/5FDA6745" Ref="UBZ126"  Part="1" 
AR Path="/5FC16B93/5FC17149/5FDA6745" Ref="UBZ126"  Part="1" 
AR Path="/60A4D282/5FDA6745" Ref="UAD472"  Part="1" 
F 0 "UAD472" H 18350 7265 50  0000 C CNN
F 1 "DFFCOO" H 18350 7174 50  0000 C CNN
F 2 "" H 18350 6900 50  0001 C CNN
F 3 "" H 18350 6900 50  0001 C CNN
	1    18350 6900
	1    0    0    -1  
$EndComp
$Comp
L A5C:DFFCOO UBZ187
U 1 1 5FDAEAA9
P 18350 7550
AR Path="/5F79F49D/5FDAEAA9" Ref="UBZ187"  Part="1" 
AR Path="/5FC16B93/5FC17149/5FDAEAA9" Ref="UBZ187"  Part="1" 
AR Path="/60A4D282/5FDAEAA9" Ref="UAC478"  Part="1" 
F 0 "UAC478" H 18350 7915 50  0000 C CNN
F 1 "DFFCOO" H 18350 7824 50  0000 C CNN
F 2 "" H 18350 7550 50  0001 C CNN
F 3 "" H 18350 7550 50  0001 C CNN
	1    18350 7550
	1    0    0    -1  
$EndComp
$Comp
L A5C:DFFCOO UCC176
U 1 1 5FDB3E66
P 18350 9500
AR Path="/5F79F49D/5FDB3E66" Ref="UCC176"  Part="1" 
AR Path="/5FC16B93/5FC17149/5FDB3E66" Ref="UCC176"  Part="1" 
AR Path="/60A4D282/5FDB3E66" Ref="UAB467"  Part="1" 
F 0 "UAB467" H 18350 9865 50  0000 C CNN
F 1 "DFFCOO" H 18350 9774 50  0000 C CNN
F 2 "" H 18350 9500 50  0001 C CNN
F 3 "" H 18350 9500 50  0001 C CNN
	1    18350 9500
	1    0    0    -1  
$EndComp
$Comp
L A5C:DFFCOO UBZ150
U 1 1 5FDB93DF
P 18350 10150
AR Path="/5F79F49D/5FDB93DF" Ref="UBZ150"  Part="1" 
AR Path="/5FC16B93/5FC17149/5FDB93DF" Ref="UBZ150"  Part="1" 
AR Path="/60A4D282/5FDB93DF" Ref="UAB454"  Part="1" 
F 0 "UAB454" H 18350 10515 50  0000 C CNN
F 1 "DFFCOO" H 18350 10424 50  0000 C CNN
F 2 "" H 18350 10150 50  0001 C CNN
F 3 "" H 18350 10150 50  0001 C CNN
	1    18350 10150
	1    0    0    -1  
$EndComp
$Comp
L A5C:DFFCOO UCC161
U 1 1 5FDBEA8E
P 18350 10800
AR Path="/5F79F49D/5FDBEA8E" Ref="UCC161"  Part="1" 
AR Path="/5FC16B93/5FC17149/5FDBEA8E" Ref="UCC161"  Part="1" 
AR Path="/60A4D282/5FDBEA8E" Ref="UAB433"  Part="1" 
F 0 "UAB433" H 18350 11165 50  0000 C CNN
F 1 "DFFCOO" H 18350 11074 50  0000 C CNN
F 2 "" H 18350 10800 50  0001 C CNN
F 3 "" H 18350 10800 50  0001 C CNN
	1    18350 10800
	1    0    0    -1  
$EndComp
$Comp
L A5C:DFFCOO UCG161
U 1 1 5FDC7705
P 18350 11450
AR Path="/5F79F49D/5FDC7705" Ref="UCG161"  Part="1" 
AR Path="/5FC16B93/5FC17149/5FDC7705" Ref="UCG161"  Part="1" 
AR Path="/60A4D282/5FDC7705" Ref="UAB448"  Part="1" 
F 0 "UAB448" H 18350 11815 50  0000 C CNN
F 1 "DFFCOO" H 18350 11724 50  0000 C CNN
F 2 "" H 18350 11450 50  0001 C CNN
F 3 "" H 18350 11450 50  0001 C CNN
	1    18350 11450
	1    0    0    -1  
$EndComp
$Comp
L A5C:DFFCOO UAB?
U 1 1 64D5F65E
P 20300 13000
AR Path="/5F79F49D/64D5F65E" Ref="UAB?"  Part="1" 
AR Path="/5FC16B93/5FC17149/64D5F65E" Ref="UAB?"  Part="1" 
AR Path="/60A4D282/64D5F65E" Ref="UAB504"  Part="1" 
F 0 "UAB504" H 20300 13365 50  0000 C CNN
F 1 "DFFCOO" H 20300 13274 50  0000 C CNN
F 2 "" H 20300 13000 50  0001 C CNN
F 3 "" H 20300 13000 50  0001 C CNN
	1    20300 13000
	-1   0    0    -1  
$EndComp
$Comp
L A5C:NOR04 UAC385
U 1 1 60F6C605
P 10900 6900
F 0 "UAC385" H 10900 7242 50  0000 C CNN
F 1 "NOR04" H 10900 7151 50  0000 C CNN
F 2 "" H 10900 6900 50  0001 C CNN
F 3 "" H 10900 6900 50  0001 C CNN
	1    10900 6900
	1    0    0    -1  
$EndComp
$Comp
L A5C:NOR04 UCJ147
U 1 1 5FC55E5D
P 10900 11300
AR Path="/5F79F49D/5FC55E5D" Ref="UCJ147"  Part="1" 
AR Path="/5FC16B93/5FC17149/5FC55E5D" Ref="UCJ147"  Part="1" 
AR Path="/60A4D282/5FC55E5D" Ref="UAB273"  Part="1" 
F 0 "UAB273" H 10900 11642 50  0000 C CNN
F 1 "NOR04" H 10900 11551 50  0000 C CNN
F 2 "" H 10900 11300 50  0001 C CNN
F 3 "" H 10900 11300 50  0001 C CNN
	1    10900 11300
	1    0    0    -1  
$EndComp
$Comp
L A5C:NOR04 UBZ141
U 1 1 61ED63E5
P 20750 6900
AR Path="/5F79F49D/61ED63E5" Ref="UBZ141"  Part="1" 
AR Path="/5FC16B93/5FC17149/61ED63E5" Ref="UBZ141"  Part="1" 
AR Path="/60A4D282/61ED63E5" Ref="UAC483"  Part="1" 
F 0 "UAC483" H 20750 7242 50  0000 C CNN
F 1 "NOR04" H 20750 7151 50  0000 C CNN
F 2 "" H 20750 6900 50  0001 C CNN
F 3 "" H 20750 6900 50  0001 C CNN
	1    20750 6900
	1    0    0    -1  
$EndComp
$Comp
L A5C:NOR04 UCC153
U 1 1 61ED6449
P 20750 10800
AR Path="/5F79F49D/61ED6449" Ref="UCC153"  Part="1" 
AR Path="/5FC16B93/5FC17149/61ED6449" Ref="UCC153"  Part="1" 
AR Path="/60A4D282/61ED6449" Ref="UAB443"  Part="1" 
F 0 "UAB443" H 20750 11142 50  0000 C CNN
F 1 "NOR04" H 20750 11051 50  0000 C CNN
F 2 "" H 20750 10800 50  0001 C CNN
F 3 "" H 20750 10800 50  0001 C CNN
	1    20750 10800
	1    0    0    -1  
$EndComp
$Comp
L A5C:AOI21 UAC?
U 1 1 646D7255
P 18850 12150
AR Path="/646D7255" Ref="UAC?"  Part="1" 
AR Path="/60A4D282/646D7255" Ref="UAC454"  Part="1" 
F 0 "UAC454" H 18875 12467 50  0000 C CNN
F 1 "AOI21" H 18875 12376 50  0000 C CNN
F 2 "" H 19000 12150 50  0001 C CNN
F 3 "" H 19000 12150 50  0001 C CNN
	1    18850 12150
	-1   0    0    -1  
$EndComp
$Comp
L A5C:DFFCOR UEI288
U 1 1 612DB059
P 2400 14900
F 0 "UEI288" H 2400 15265 50  0000 C CNN
F 1 "DFFCOR" H 2400 15174 50  0000 C CNN
F 2 "" H 2400 14900 50  0001 C CNN
F 3 "" H 2400 14900 50  0001 C CNN
	1    2400 14900
	1    0    0    -1  
$EndComp
$Comp
L A5C:DFFCOR UEI293
U 1 1 612DC625
P 3000 14900
F 0 "UEI293" H 3000 15265 50  0000 C CNN
F 1 "DFFCOR" H 3000 15174 50  0000 C CNN
F 2 "" H 3000 14900 50  0001 C CNN
F 3 "" H 3000 14900 50  0001 C CNN
	1    3000 14900
	1    0    0    -1  
$EndComp
$Comp
L A5C:DFFCOR UBJ163
U 1 1 60A01015
P 4150 14950
F 0 "UBJ163" H 4150 15315 50  0000 C CNN
F 1 "DFFCOR" H 4150 15224 50  0000 C CNN
F 2 "" H 4150 14950 50  0001 C CNN
F 3 "" H 4150 14950 50  0001 C CNN
	1    4150 14950
	1    0    0    -1  
$EndComp
$Comp
L A5C:DFFCOR UBJ165
U 1 1 60A01BCF
P 4750 14950
F 0 "UBJ165" H 4750 15315 50  0000 C CNN
F 1 "DFFCOR" H 4750 15224 50  0000 C CNN
F 2 "" H 4750 14950 50  0001 C CNN
F 3 "" H 4750 14950 50  0001 C CNN
	1    4750 14950
	1    0    0    -1  
$EndComp
$Comp
L A5C:DFFCOR UBJ167
U 1 1 60A02599
P 5350 14950
F 0 "UBJ167" H 5350 15315 50  0000 C CNN
F 1 "DFFCOR" H 5350 15224 50  0000 C CNN
F 2 "" H 5350 14950 50  0001 C CNN
F 3 "" H 5350 14950 50  0001 C CNN
	1    5350 14950
	1    0    0    -1  
$EndComp
$Comp
L A5C:DFFCOR UBJ169
U 1 1 60A02A72
P 5950 14950
F 0 "UBJ169" H 5950 15315 50  0000 C CNN
F 1 "DFFCOR" H 5950 15224 50  0000 C CNN
F 2 "" H 5950 14950 50  0001 C CNN
F 3 "" H 5950 14950 50  0001 C CNN
	1    5950 14950
	1    0    0    -1  
$EndComp
$Comp
L A5C:DFFCOR UAC507
U 1 1 64A4C736
P 21000 12550
F 0 "UAC507" H 21000 12915 50  0000 C CNN
F 1 "DFFCOR" H 21000 12824 50  0000 C CNN
F 2 "" H 21000 12550 50  0001 C CNN
F 3 "" H 21000 12550 50  0001 C CNN
	1    21000 12550
	-1   0    0    -1  
$EndComp
$Comp
L A5C:NAND05 UAD377
U 1 1 617D337B
P 10900 8350
F 0 "UAD377" H 10925 8740 50  0000 C CNN
F 1 "NAND05" H 10925 8649 50  0000 C CNN
F 2 "" H 10900 8050 50  0001 C CNN
F 3 "" H 10900 8050 50  0001 C CNN
	1    10900 8350
	1    0    0    -1  
$EndComp
$Comp
L A5C:NAND05 UAC293
U 1 1 62357D46
P 10900 12950
F 0 "UAC293" H 10925 13340 50  0000 C CNN
F 1 "NAND05" H 10925 13249 50  0000 C CNN
F 2 "" H 10900 12650 50  0001 C CNN
F 3 "" H 10900 12650 50  0001 C CNN
	1    10900 12950
	1    0    0    -1  
$EndComp
$Comp
L A5C:AOI22 UBA168
U 1 1 63782620
P 2050 9950
F 0 "UBA168" H 2075 10267 50  0000 C CNN
F 1 "AOI22" H 2075 10176 50  0000 C CNN
F 2 "" H 2200 9950 50  0001 C CNN
F 3 "" H 2200 9950 50  0001 C CNN
	1    2050 9950
	1    0    0    -1  
$EndComp
$Comp
L A5C:AOI22 UAC404
U 1 1 60F6C61D
P 7600 5450
F 0 "UAC404" H 7625 5767 50  0000 C CNN
F 1 "AOI22" H 7625 5676 50  0000 C CNN
F 2 "" H 7750 5450 50  0001 C CNN
F 3 "" H 7750 5450 50  0001 C CNN
	1    7600 5450
	1    0    0    -1  
$EndComp
$Comp
L A5C:AOI22 UAB404
U 1 1 60F6C60B
P 7600 6100
F 0 "UAB404" H 7625 6417 50  0000 C CNN
F 1 "AOI22" H 7625 6326 50  0000 C CNN
F 2 "" H 7750 6100 50  0001 C CNN
F 3 "" H 7750 6100 50  0001 C CNN
	1    7600 6100
	1    0    0    -1  
$EndComp
$Comp
L A5C:AOI22 UAC410
U 1 1 60F6C611
P 7600 6750
F 0 "UAC410" H 7625 7067 50  0000 C CNN
F 1 "AOI22" H 7625 6976 50  0000 C CNN
F 2 "" H 7750 6750 50  0001 C CNN
F 3 "" H 7750 6750 50  0001 C CNN
	1    7600 6750
	1    0    0    -1  
$EndComp
$Comp
L A5C:AOI22 UAC401
U 1 1 60F6C617
P 7600 7400
F 0 "UAC401" H 7625 7717 50  0000 C CNN
F 1 "AOI22" H 7625 7626 50  0000 C CNN
F 2 "" H 7750 7400 50  0001 C CNN
F 3 "" H 7750 7400 50  0001 C CNN
	1    7600 7400
	1    0    0    -1  
$EndComp
$Comp
L A5C:AOI22 UCJ185
U 1 1 5FD4926C
P 7600 9850
AR Path="/5F79F49D/5FD4926C" Ref="UCJ185"  Part="1" 
AR Path="/5FC16B93/5FC17149/5FD4926C" Ref="UCJ185"  Part="1" 
AR Path="/60A4D282/5FD4926C" Ref="UAC345"  Part="1" 
F 0 "UAC345" H 7625 10167 50  0000 C CNN
F 1 "AOI22" H 7625 10076 50  0000 C CNN
F 2 "" H 7750 9850 50  0001 C CNN
F 3 "" H 7750 9850 50  0001 C CNN
	1    7600 9850
	1    0    0    -1  
$EndComp
$Comp
L A5C:AOI22 UCL202
U 1 1 5FD49D7E
P 7600 10500
AR Path="/5F79F49D/5FD49D7E" Ref="UCL202"  Part="1" 
AR Path="/5FC16B93/5FC17149/5FD49D7E" Ref="UCL202"  Part="1" 
AR Path="/60A4D282/5FD49D7E" Ref="UAC329"  Part="1" 
F 0 "UAC329" H 7625 10817 50  0000 C CNN
F 1 "AOI22" H 7625 10726 50  0000 C CNN
F 2 "" H 7750 10500 50  0001 C CNN
F 3 "" H 7750 10500 50  0001 C CNN
	1    7600 10500
	1    0    0    -1  
$EndComp
$Comp
L A5C:AOI22 UCJ180
U 1 1 5FD4A492
P 7600 11150
AR Path="/5F79F49D/5FD4A492" Ref="UCJ180"  Part="1" 
AR Path="/5FC16B93/5FC17149/5FD4A492" Ref="UCJ180"  Part="1" 
AR Path="/60A4D282/5FD4A492" Ref="UAB324"  Part="1" 
F 0 "UAB324" H 7625 11467 50  0000 C CNN
F 1 "AOI22" H 7625 11376 50  0000 C CNN
F 2 "" H 7750 11150 50  0001 C CNN
F 3 "" H 7750 11150 50  0001 C CNN
	1    7600 11150
	1    0    0    -1  
$EndComp
$Comp
L A5C:AOI22 UCJ182
U 1 1 5FD4AB5F
P 7600 11800
AR Path="/5F79F49D/5FD4AB5F" Ref="UCJ182"  Part="1" 
AR Path="/5FC16B93/5FC17149/5FD4AB5F" Ref="UCJ182"  Part="1" 
AR Path="/60A4D282/5FD4AB5F" Ref="UAA324"  Part="1" 
F 0 "UAA324" H 7625 12117 50  0000 C CNN
F 1 "AOI22" H 7625 12026 50  0000 C CNN
F 2 "" H 7750 11800 50  0001 C CNN
F 3 "" H 7750 11800 50  0001 C CNN
	1    7600 11800
	1    0    0    -1  
$EndComp
$Comp
L A5C:AOI22 UCG405
U 1 1 5FD38BF4
P 7600 12850
AR Path="/5F79F49D/5FD38BF4" Ref="UCG405"  Part="1" 
AR Path="/5FC16B93/5FC17149/5FD38BF4" Ref="UCG405"  Part="1" 
AR Path="/60A4D282/5FD38BF4" Ref="UAA332"  Part="1" 
F 0 "UAA332" H 7625 13167 50  0000 C CNN
F 1 "AOI22" H 7625 13076 50  0000 C CNN
F 2 "" H 7750 12850 50  0001 C CNN
F 3 "" H 7750 12850 50  0001 C CNN
	1    7600 12850
	1    0    0    -1  
$EndComp
$Comp
L A5C:AOI22 UBW177
U 1 1 5FD4E549
P 17450 5450
AR Path="/5F79F49D/5FD4E549" Ref="UBW177"  Part="1" 
AR Path="/5FC16B93/5FC17149/5FD4E549" Ref="UBW177"  Part="1" 
AR Path="/60A4D282/5FD4E549" Ref="UAB499"  Part="1" 
F 0 "UAB499" H 17475 5767 50  0000 C CNN
F 1 "AOI22" H 17475 5676 50  0000 C CNN
F 2 "" H 17600 5450 50  0001 C CNN
F 3 "" H 17600 5450 50  0001 C CNN
	1    17450 5450
	1    0    0    -1  
$EndComp
$Comp
L A5C:AOI22 UBZ179
U 1 1 5FD51E61
P 17450 6100
AR Path="/5F79F49D/5FD51E61" Ref="UBZ179"  Part="1" 
AR Path="/5FC16B93/5FC17149/5FD51E61" Ref="UBZ179"  Part="1" 
AR Path="/60A4D282/5FD51E61" Ref="UAC497"  Part="1" 
F 0 "UAC497" H 17475 6417 50  0000 C CNN
F 1 "AOI22" H 17475 6326 50  0000 C CNN
F 2 "" H 17600 6100 50  0001 C CNN
F 3 "" H 17600 6100 50  0001 C CNN
	1    17450 6100
	1    0    0    -1  
$EndComp
$Comp
L A5C:AOI22 UBW180
U 1 1 5FD5975D
P 17450 6750
AR Path="/5F79F49D/5FD5975D" Ref="UBW180"  Part="1" 
AR Path="/5FC16B93/5FC17149/5FD5975D" Ref="UBW180"  Part="1" 
AR Path="/60A4D282/5FD5975D" Ref="UAC492"  Part="1" 
F 0 "UAC492" H 17475 7067 50  0000 C CNN
F 1 "AOI22" H 17475 6976 50  0000 C CNN
F 2 "" H 17600 6750 50  0001 C CNN
F 3 "" H 17600 6750 50  0001 C CNN
	1    17450 6750
	1    0    0    -1  
$EndComp
$Comp
L A5C:AOI22 UBZ185
U 1 1 5FD59F8B
P 17450 7400
AR Path="/5F79F49D/5FD59F8B" Ref="UBZ185"  Part="1" 
AR Path="/5FC16B93/5FC17149/5FD59F8B" Ref="UBZ185"  Part="1" 
AR Path="/60A4D282/5FD59F8B" Ref="UAC489"  Part="1" 
F 0 "UAC489" H 17475 7717 50  0000 C CNN
F 1 "AOI22" H 17475 7626 50  0000 C CNN
F 2 "" H 17600 7400 50  0001 C CNN
F 3 "" H 17600 7400 50  0001 C CNN
	1    17450 7400
	1    0    0    -1  
$EndComp
$Comp
L A5C:AOI22 UCC174
U 1 1 5FD5DACE
P 17450 9350
AR Path="/5F79F49D/5FD5DACE" Ref="UCC174"  Part="1" 
AR Path="/5FC16B93/5FC17149/5FD5DACE" Ref="UCC174"  Part="1" 
AR Path="/60A4D282/5FD5DACE" Ref="UAB462"  Part="1" 
F 0 "UAB462" H 17475 9667 50  0000 C CNN
F 1 "AOI22" H 17475 9576 50  0000 C CNN
F 2 "" H 17600 9350 50  0001 C CNN
F 3 "" H 17600 9350 50  0001 C CNN
	1    17450 9350
	1    0    0    -1  
$EndComp
$Comp
L A5C:AOI22 UBZ171
U 1 1 5FD5DF80
P 17450 10000
AR Path="/5F79F49D/5FD5DF80" Ref="UBZ171"  Part="1" 
AR Path="/5FC16B93/5FC17149/5FD5DF80" Ref="UBZ171"  Part="1" 
AR Path="/60A4D282/5FD5DF80" Ref="UAA451"  Part="1" 
F 0 "UAA451" H 17475 10317 50  0000 C CNN
F 1 "AOI22" H 17475 10226 50  0000 C CNN
F 2 "" H 17600 10000 50  0001 C CNN
F 3 "" H 17600 10000 50  0001 C CNN
	1    17450 10000
	1    0    0    -1  
$EndComp
$Comp
L A5C:AOI22 UBZ159
U 1 1 5FD5E58C
P 17450 10650
AR Path="/5F79F49D/5FD5E58C" Ref="UBZ159"  Part="1" 
AR Path="/5FC16B93/5FC17149/5FD5E58C" Ref="UBZ159"  Part="1" 
AR Path="/60A4D282/5FD5E58C" Ref="UAB440"  Part="1" 
F 0 "UAB440" H 17475 10967 50  0000 C CNN
F 1 "AOI22" H 17475 10876 50  0000 C CNN
F 2 "" H 17600 10650 50  0001 C CNN
F 3 "" H 17600 10650 50  0001 C CNN
	1    17450 10650
	1    0    0    -1  
$EndComp
$Comp
L A5C:AOI22 UBZ162
U 1 1 5FD60F4A
P 17450 11300
AR Path="/5F79F49D/5FD60F4A" Ref="UBZ162"  Part="1" 
AR Path="/5FC16B93/5FC17149/5FD60F4A" Ref="UBZ162"  Part="1" 
AR Path="/60A4D282/5FD60F4A" Ref="UAB437"  Part="1" 
F 0 "UAB437" H 17475 11617 50  0000 C CNN
F 1 "AOI22" H 17475 11526 50  0000 C CNN
F 2 "" H 17600 11300 50  0001 C CNN
F 3 "" H 17600 11300 50  0001 C CNN
	1    17450 11300
	1    0    0    -1  
$EndComp
$Comp
L A5C:NOR05 UAC377
U 1 1 60F6C623
P 10900 7650
F 0 "UAC377" H 10975 8065 50  0000 C CNN
F 1 "NOR05" H 10975 7974 50  0000 C CNN
F 2 "" H 10900 7700 50  0001 C CNN
F 3 "" H 10900 7700 50  0001 C CNN
	1    10900 7650
	1    0    0    -1  
$EndComp
$Comp
L A5C:NOR05 UCJ172
U 1 1 5FC55E78
P 10900 12050
AR Path="/5F79F49D/5FC55E78" Ref="UCJ172"  Part="1" 
AR Path="/5FC16B93/5FC17149/5FC55E78" Ref="UCJ172"  Part="1" 
AR Path="/60A4D282/5FC55E78" Ref="UAB321"  Part="1" 
F 0 "UAB321" H 10975 12465 50  0000 C CNN
F 1 "NOR05" H 10975 12374 50  0000 C CNN
F 2 "" H 10900 12100 50  0001 C CNN
F 3 "" H 10900 12100 50  0001 C CNN
	1    10900 12050
	1    0    0    -1  
$EndComp
$Comp
L A5C:NOR05 UCC131
U 1 1 61ED6400
P 20750 7650
AR Path="/5F79F49D/61ED6400" Ref="UCC131"  Part="1" 
AR Path="/5FC16B93/5FC17149/61ED6400" Ref="UCC131"  Part="1" 
AR Path="/60A4D282/61ED6400" Ref="UAC465"  Part="1" 
F 0 "UAC465" H 20825 8065 50  0000 C CNN
F 1 "NOR05" H 20825 7974 50  0000 C CNN
F 2 "" H 20750 7700 50  0001 C CNN
F 3 "" H 20750 7700 50  0001 C CNN
	1    20750 7650
	1    0    0    -1  
$EndComp
$Comp
L A5C:NOR05 UCC144
U 1 1 61ED6464
P 20750 11550
AR Path="/5F79F49D/61ED6464" Ref="UCC144"  Part="1" 
AR Path="/5FC16B93/5FC17149/61ED6464" Ref="UCC144"  Part="1" 
AR Path="/60A4D282/61ED6464" Ref="UAC451"  Part="1" 
F 0 "UAC451" H 20825 11965 50  0000 C CNN
F 1 "NOR05" H 20825 11874 50  0000 C CNN
F 2 "" H 20750 11600 50  0001 C CNN
F 3 "" H 20750 11600 50  0001 C CNN
	1    20750 11550
	1    0    0    -1  
$EndComp
$Comp
L A5C:M175C UBF163
U 1 1 619407F4
P 3400 2200
F 0 "UBF163" H 3400 2765 50  0000 C CNN
F 1 "M175C" H 3400 2674 50  0000 C CNN
F 2 "" H 3400 2000 50  0001 C CNN
F 3 "" H 3400 2000 50  0001 C CNN
	1    3400 2200
	1    0    0    -1  
$EndComp
$Comp
L A5C:M175C UEC254
U 1 1 64CD4CC5
P 3400 3250
F 0 "UEC254" H 3400 3815 50  0000 C CNN
F 1 "M175C" H 3400 3724 50  0000 C CNN
F 2 "" H 3400 3050 50  0001 C CNN
F 3 "" H 3400 3050 50  0001 C CNN
	1    3400 3250
	1    0    0    -1  
$EndComp
$Comp
L A5C:M175C UBI57
U 1 1 643E14EF
P 3400 4300
F 0 "UBI57" H 3400 4865 50  0000 C CNN
F 1 "M175C" H 3400 4774 50  0000 C CNN
F 2 "" H 3400 4100 50  0001 C CNN
F 3 "" H 3400 4100 50  0001 C CNN
	1    3400 4300
	1    0    0    -1  
$EndComp
$Comp
L A5C:M175C UBC22
U 1 1 67215B58
P 3400 5350
F 0 "UBC22" H 3400 5915 50  0000 C CNN
F 1 "M175C" H 3400 5824 50  0000 C CNN
F 2 "" H 3400 5150 50  0001 C CNN
F 3 "" H 3400 5150 50  0001 C CNN
	1    3400 5350
	1    0    0    -1  
$EndComp
Wire Wire Line
	5900 13950 15700 13950
Text Label 10550 13050 2    50   ~ 0
~LINE7
Text Label 10550 12950 2    50   ~ 0
~LINE6
Text Label 10550 12850 2    50   ~ 0
~LINE5
Text Label 10550 12750 2    50   ~ 0
~LINE4
Wire Wire Line
	10300 12750 10600 12750
Wire Wire Line
	10200 12850 10600 12850
Wire Wire Line
	10200 12850 10200 12050
Wire Wire Line
	10100 11950 10100 12950
Wire Wire Line
	10100 12950 10600 12950
Wire Wire Line
	10000 11850 10000 13050
Wire Wire Line
	10000 13050 10600 13050
Text HLabel 3950 11100 0    50   Input ~ 0
~RESETI
Text Label 19250 5200 0    50   ~ 0
~COL1
Text Label 19250 5850 0    50   ~ 0
~COL2
Text Label 19250 6500 0    50   ~ 0
~COL3
Text Label 19250 7150 0    50   ~ 0
~COL4
Text Label 19250 9100 0    50   ~ 0
~COL5
Text Label 19250 9750 0    50   ~ 0
~COL6
Text Label 19250 10400 0    50   ~ 0
~COL7
Text Label 19250 11050 0    50   ~ 0
~COL8
Wire Bus Line
	1250 7850 1250 8150
Wire Bus Line
	19600 8150 19600 11350
Wire Bus Line
	19600 5700 19600 8150
Wire Bus Line
	9750 8750 9750 12900
Wire Bus Line
	9750 5700 9750 8750
Wire Bus Line
	9750 950  9750 1850
Wire Bus Line
	8800 950  8800 1850
Wire Bus Line
	7850 950  7850 1850
Wire Bus Line
	7000 950  7000 1850
Wire Bus Line
	2100 1600 2100 5250
$EndSCHEMATC
