EESchema Schematic File Version 4
EELAYER 30 0
EELAYER END
$Descr A4 11693 8268
encoding utf-8
Sheet 39 83
Title "CPS Reverse Engineering: DL-0311"
Date "2021-09-12"
Rev ""
Comp ""
Comment1 ""
Comment2 ""
Comment3 "Licence: CC-BY"
Comment4 "Author: Loïc *WydD* Petit"
$EndDescr
Connection ~ 6300 4150
Connection ~ 6500 4350
Connection ~ 6300 3850
Connection ~ 6400 4250
Connection ~ 6500 3050
Connection ~ 6400 3250
Connection ~ 6650 3150
Connection ~ 6500 3650
Connection ~ 6650 3750
Connection ~ 6650 4450
Connection ~ 4300 2700
Connection ~ 4300 3500
Connection ~ 4300 4300
Connection ~ 5050 3650
Connection ~ 5050 4450
Connection ~ 5050 5250
Connection ~ 6200 4850
Connection ~ 6300 4250
Connection ~ 6400 3450
Connection ~ 6400 3550
Connection ~ 6050 950 
Connection ~ 6500 2650
Connection ~ 6200 4550
NoConn ~ 7500 5050
Entry Wire Line
	6600 5650 6700 5550
Entry Wire Line
	6600 5750 6700 5650
Entry Wire Line
	6600 5850 6700 5750
Entry Wire Line
	6600 5950 6700 5850
Wire Wire Line
	3900 1850 3900 5000
Wire Wire Line
	3900 1850 8450 1850
Wire Wire Line
	3900 5000 4400 5000
Wire Wire Line
	4000 1950 4000 4200
Wire Wire Line
	4000 1950 8350 1950
Wire Wire Line
	4000 4200 4400 4200
Wire Wire Line
	4100 2050 4100 3400
Wire Wire Line
	4100 2050 8250 2050
Wire Wire Line
	4100 3400 4400 3400
Wire Wire Line
	4200 2150 8150 2150
Wire Wire Line
	4200 2600 4200 2150
Wire Wire Line
	4200 2600 4400 2600
Wire Wire Line
	4300 2700 3800 2700
Wire Wire Line
	4300 2700 4300 3500
Wire Wire Line
	4300 3500 4300 4300
Wire Wire Line
	4300 4300 4300 5100
Wire Wire Line
	4300 5100 4400 5100
Wire Wire Line
	4400 2700 4300 2700
Wire Wire Line
	4400 3500 4300 3500
Wire Wire Line
	4400 4300 4300 4300
Wire Wire Line
	4850 950  6050 950 
Wire Wire Line
	4950 2650 5150 2650
Wire Wire Line
	4950 3450 5150 3450
Wire Wire Line
	4950 4250 5150 4250
Wire Wire Line
	4950 5050 5150 5050
Wire Wire Line
	5050 3650 5050 2850
Wire Wire Line
	5050 4450 5050 3650
Wire Wire Line
	5050 4450 5150 4450
Wire Wire Line
	5050 5250 5050 4450
Wire Wire Line
	5050 5250 5050 5400
Wire Wire Line
	5050 5400 4900 5400
Wire Wire Line
	5150 2850 5050 2850
Wire Wire Line
	5150 3650 5050 3650
Wire Wire Line
	5150 5250 5050 5250
Wire Wire Line
	5650 2650 6500 2650
Wire Wire Line
	5650 2750 6050 2750
Wire Wire Line
	5650 3450 6400 3450
Wire Wire Line
	5650 3550 5950 3550
Wire Wire Line
	5650 4250 6300 4250
Wire Wire Line
	5650 5050 6200 5050
Wire Wire Line
	5650 5150 5750 5150
Wire Wire Line
	5750 5150 5750 5950
Wire Wire Line
	5750 5950 6600 5950
Wire Wire Line
	5850 4350 5650 4350
Wire Wire Line
	5850 5850 5850 4350
Wire Wire Line
	5950 3550 5950 5750
Wire Wire Line
	5950 5750 6600 5750
Wire Wire Line
	6050 950  6050 1350
Wire Wire Line
	6050 2750 6050 5650
Wire Wire Line
	6050 5650 6600 5650
Wire Wire Line
	6200 2400 6200 4550
Wire Wire Line
	6200 4550 6200 4850
Wire Wire Line
	6200 4550 7500 4550
Wire Wire Line
	6200 4850 6200 5050
Wire Wire Line
	6300 2400 6300 3850
Wire Wire Line
	6300 3850 6300 4150
Wire Wire Line
	6300 3850 7500 3850
Wire Wire Line
	6300 4150 6300 4250
Wire Wire Line
	6300 4250 6300 4950
Wire Wire Line
	6400 2400 6400 3250
Wire Wire Line
	6400 3250 6400 3450
Wire Wire Line
	6400 3250 7500 3250
Wire Wire Line
	6400 3450 6400 3550
Wire Wire Line
	6400 3550 6400 4250
Wire Wire Line
	6400 4250 6400 5050
Wire Wire Line
	6500 2400 6500 2650
Wire Wire Line
	6500 2650 6500 3050
Wire Wire Line
	6500 3050 6500 3650
Wire Wire Line
	6500 3650 6500 4350
Wire Wire Line
	6500 4350 6500 5150
Wire Wire Line
	6600 5850 5850 5850
Wire Wire Line
	6650 1350 6650 3150
Wire Wire Line
	6650 3150 6650 3750
Wire Wire Line
	6650 3150 6750 3150
Wire Wire Line
	6650 3750 6650 4450
Wire Wire Line
	6650 3750 6750 3750
Wire Wire Line
	6650 4450 6650 5250
Wire Wire Line
	6650 4450 6750 4450
Wire Wire Line
	6650 5250 6750 5250
Wire Wire Line
	6750 950  6050 950 
Wire Wire Line
	6750 950  6750 2550
Wire Wire Line
	6750 2550 7500 2550
Wire Wire Line
	6750 3050 6500 3050
Wire Wire Line
	6750 3550 6400 3550
Wire Wire Line
	6750 3650 6500 3650
Wire Wire Line
	6750 4150 6300 4150
Wire Wire Line
	6750 4250 6400 4250
Wire Wire Line
	6750 4350 6500 4350
Wire Wire Line
	6750 4850 6200 4850
Wire Wire Line
	6750 4950 6300 4950
Wire Wire Line
	6750 5050 6400 5050
Wire Wire Line
	6750 5150 6500 5150
Wire Wire Line
	7300 3100 7300 3150
Wire Wire Line
	7300 3150 7500 3150
Wire Wire Line
	7350 3750 7350 3650
Wire Wire Line
	7350 4450 7350 4300
Wire Wire Line
	7500 2650 6500 2650
Wire Wire Line
	7500 3750 7350 3750
Wire Wire Line
	7500 4450 7350 4450
Wire Wire Line
	8050 3200 8250 3200
Wire Wire Line
	8050 3800 8350 3800
Wire Wire Line
	8050 4500 8450 4500
Wire Wire Line
	8150 2150 8150 2600
Wire Wire Line
	8150 2600 8050 2600
Wire Wire Line
	8250 3200 8250 2050
Wire Wire Line
	8350 3800 8350 1950
Wire Wire Line
	8450 1850 8450 4500
Wire Bus Line
	6700 5450 6850 5450
Text Notes 2050 3500 0    50   ~ 0
RESET:\nSYNC(SPRITE-BLOCK-READY & LI) + RESET\n\nINC:\nSYNC(SPRITE-X-READY & LI)
Text Label 6600 5650 2    50   ~ 0
WY-C4
Text Label 6600 5750 2    50   ~ 0
WY-C5
Text Label 6600 5850 2    50   ~ 0
WY-C6
Text Label 6600 5950 2    50   ~ 0
WY-C7
Text HLabel 3250 2650 0    50   Input ~ 0
~ZERO
Text HLabel 3250 2750 0    50   Input ~ 0
~RESET
Text HLabel 4850 950  0    50   Input ~ 0
INC
Text HLabel 4900 5400 0    50   Input ~ 0
~CLK8M
Text HLabel 6850 5450 2    50   Output ~ 0
WY-C[4..7]
$Comp
L A5C:AND02 UDE97
U 1 1 61118E82
P 3500 2700
F 0 "UDE97" H 3525 2967 50  0000 C CNN
F 1 "AND02" H 3525 2876 50  0000 C CNN
F 2 "" H 3500 2700 50  0001 C CNN
F 3 "" H 3500 2700 50  0001 C CNN
	1    3500 2700
	1    0    0    -1  
$EndComp
$Comp
L A5C:NAND02 UDD?
U 1 1 61118E9B
P 4650 2650
AR Path="/61118E9B" Ref="UDD?"  Part="1" 
AR Path="/613100A2/61118E9B" Ref="UDE96"  Part="1" 
AR Path="/613100A2/612E85AC/61118E9B" Ref="UDE96"  Part="1" 
F 0 "UDE96" H 4675 2917 50  0000 C CNN
F 1 "NAND02" H 4675 2826 50  0000 C CNN
F 2 "" H 4650 2650 50  0001 C CNN
F 3 "" H 4650 2650 50  0001 C CNN
	1    4650 2650
	1    0    0    -1  
$EndComp
$Comp
L A5C:NAND02 UDD?
U 1 1 61118E99
P 4650 3450
AR Path="/611F0159/61118E99" Ref="UDD?"  Part="1" 
AR Path="/61118E99" Ref="UDD?"  Part="1" 
AR Path="/613100A2/61118E99" Ref="UDA132"  Part="1" 
AR Path="/613100A2/612E85AC/61118E99" Ref="UDA132"  Part="1" 
F 0 "UDA132" H 4675 3717 50  0000 C CNN
F 1 "NAND02" H 4675 3626 50  0000 C CNN
F 2 "" H 4650 3450 50  0001 C CNN
F 3 "" H 4650 3450 50  0001 C CNN
	1    4650 3450
	1    0    0    -1  
$EndComp
$Comp
L A5C:NAND02 UDB?
U 1 1 61118E9A
P 4650 4250
AR Path="/611F0159/61118E9A" Ref="UDB?"  Part="1" 
AR Path="/61118E9A" Ref="UDB?"  Part="1" 
AR Path="/613100A2/61118E9A" Ref="UDA134"  Part="1" 
AR Path="/613100A2/612E85AC/61118E9A" Ref="UDA134"  Part="1" 
F 0 "UDA134" H 4675 4517 50  0000 C CNN
F 1 "NAND02" H 4675 4426 50  0000 C CNN
F 2 "" H 4650 4250 50  0001 C CNN
F 3 "" H 4650 4250 50  0001 C CNN
	1    4650 4250
	1    0    0    -1  
$EndComp
$Comp
L A5C:NAND02 UDC?
U 1 1 61118E9C
P 4650 5050
AR Path="/611F0159/61118E9C" Ref="UDC?"  Part="1" 
AR Path="/61118E9C" Ref="UDC?"  Part="1" 
AR Path="/613100A2/61118E9C" Ref="UDE107"  Part="1" 
AR Path="/613100A2/612E85AC/61118E9C" Ref="UDE107"  Part="1" 
F 0 "UDE107" H 4675 5317 50  0000 C CNN
F 1 "NAND02" H 4675 5226 50  0000 C CNN
F 2 "" H 4650 5050 50  0001 C CNN
F 3 "" H 4650 5050 50  0001 C CNN
	1    4650 5050
	1    0    0    -1  
$EndComp
$Comp
L A5C:NOR02 UDE?
U 1 1 61118EBB
P 7000 3100
AR Path="/611F0159/61118EBB" Ref="UDE?"  Part="1" 
AR Path="/61118EBB" Ref="UDE?"  Part="1" 
AR Path="/613100A2/61118EBB" Ref="UDA127"  Part="1" 
AR Path="/613100A2/612E85AC/61118EBB" Ref="UDA127"  Part="1" 
F 0 "UDA127" H 7025 3367 50  0000 C CNN
F 1 "NOR02" H 7025 3276 50  0000 C CNN
F 2 "" H 7000 3100 50  0001 C CNN
F 3 "" H 7000 3100 50  0001 C CNN
	1    7000 3100
	1    0    0    -1  
$EndComp
$Comp
L A5C:XNOR02 UDD?
U 1 1 61118EBC
P 7750 2600
AR Path="/61118EBC" Ref="UDD?"  Part="1" 
AR Path="/613100A2/61118EBC" Ref="UDE93"  Part="1" 
AR Path="/613100A2/612E85AC/61118EBC" Ref="UDE93"  Part="1" 
F 0 "UDE93" H 7775 2867 50  0000 C CNN
F 1 "XNOR02" H 7775 2776 50  0000 C CNN
F 2 "" H 7775 2600 50  0001 C CNN
F 3 "" H 7775 2600 50  0001 C CNN
	1    7750 2600
	1    0    0    -1  
$EndComp
$Comp
L A5C:XNOR02 UDE?
U 1 1 61118EC0
P 7750 3200
AR Path="/611F0159/61118EC0" Ref="UDE?"  Part="1" 
AR Path="/61118EC0" Ref="UDE?"  Part="1" 
AR Path="/613100A2/61118EC0" Ref="UDA129"  Part="1" 
AR Path="/613100A2/612E85AC/61118EC0" Ref="UDA129"  Part="1" 
F 0 "UDA129" H 7775 3467 50  0000 C CNN
F 1 "XNOR02" H 7775 3376 50  0000 C CNN
F 2 "" H 7775 3200 50  0001 C CNN
F 3 "" H 7775 3200 50  0001 C CNN
	1    7750 3200
	1    0    0    -1  
$EndComp
$Comp
L A5C:XNOR02 UDB?
U 1 1 61118EBF
P 7750 3800
AR Path="/611F0159/61118EBF" Ref="UDB?"  Part="1" 
AR Path="/61118EBF" Ref="UDB?"  Part="1" 
AR Path="/613100A2/61118EBF" Ref="UDA125"  Part="1" 
AR Path="/613100A2/612E85AC/61118EBF" Ref="UDA125"  Part="1" 
F 0 "UDA125" H 7775 4067 50  0000 C CNN
F 1 "XNOR02" H 7775 3976 50  0000 C CNN
F 2 "" H 7775 3800 50  0001 C CNN
F 3 "" H 7775 3800 50  0001 C CNN
	1    7750 3800
	1    0    0    -1  
$EndComp
$Comp
L A5C:XNOR02 UDC?
U 1 1 61118EBE
P 7750 4500
AR Path="/611F0159/61118EBE" Ref="UDC?"  Part="1" 
AR Path="/61118EBE" Ref="UDC?"  Part="1" 
AR Path="/613100A2/61118EBE" Ref="UDE108"  Part="1" 
AR Path="/613100A2/612E85AC/61118EBE" Ref="UDE108"  Part="1" 
F 0 "UDE108" H 7775 4767 50  0000 C CNN
F 1 "XNOR02" H 7775 4676 50  0000 C CNN
F 2 "" H 7775 4500 50  0001 C CNN
F 3 "" H 7775 4500 50  0001 C CNN
	1    7750 4500
	1    0    0    -1  
$EndComp
$Comp
L A5C:INV01 UDF?
U 1 1 61118E83
P 6350 1350
AR Path="/611F0159/61118E83" Ref="UDF?"  Part="1" 
AR Path="/61118E83" Ref="UDF?"  Part="1" 
AR Path="/613100A2/61118E83" Ref="UDE106"  Part="1" 
AR Path="/613100A2/612E85AC/61118E83" Ref="UDE106"  Part="1" 
F 0 "UDE106" H 6350 1667 50  0000 C CNN
F 1 "INV01" H 6350 1576 50  0000 C CNN
F 2 "" H 6350 1150 50  0001 C CNN
F 3 "" H 6350 1150 50  0001 C CNN
	1    6350 1350
	1    0    0    -1  
$EndComp
$Comp
L A5C:NOR03 UDD?
U 1 1 61118EBA
P 7050 3650
AR Path="/611F0159/61118EBA" Ref="UDD?"  Part="1" 
AR Path="/61118EBA" Ref="UDD?"  Part="1" 
AR Path="/613100A2/61118EBA" Ref="UDA122"  Part="1" 
AR Path="/613100A2/612E85AC/61118EBA" Ref="UDA122"  Part="1" 
F 0 "UDA122" H 7050 3967 50  0000 C CNN
F 1 "NOR03" H 7050 3876 50  0000 C CNN
F 2 "" H 7050 3650 50  0001 C CNN
F 3 "" H 7050 3650 50  0001 C CNN
	1    7050 3650
	1    0    0    -1  
$EndComp
$Comp
L A5C:DFFCOO UDD?
U 1 1 61118EB7
P 5400 2750
AR Path="/61118EB7" Ref="UDD?"  Part="1" 
AR Path="/613100A2/61118EB7" Ref="UDE89"  Part="1" 
AR Path="/613100A2/612E85AC/61118EB7" Ref="UDE89"  Part="1" 
F 0 "UDE89" H 5400 3115 50  0000 C CNN
F 1 "DFFCOO" H 5400 3024 50  0000 C CNN
F 2 "" H 5400 2750 50  0001 C CNN
F 3 "" H 5400 2750 50  0001 C CNN
	1    5400 2750
	1    0    0    -1  
$EndComp
$Comp
L A5C:DFFCOO UDI?
U 1 1 61118EB8
P 5400 3550
AR Path="/611F0159/61118EB8" Ref="UDI?"  Part="1" 
AR Path="/61118EB8" Ref="UDI?"  Part="1" 
AR Path="/613100A2/61118EB8" Ref="UDI131"  Part="1" 
AR Path="/613100A2/612E85AC/61118EB8" Ref="UDI131"  Part="1" 
F 0 "UDI131" H 5400 3915 50  0000 C CNN
F 1 "DFFCOO" H 5400 3824 50  0000 C CNN
F 2 "" H 5400 3550 50  0001 C CNN
F 3 "" H 5400 3550 50  0001 C CNN
	1    5400 3550
	1    0    0    -1  
$EndComp
$Comp
L A5C:DFFCOO UDB?
U 1 1 61118EB6
P 5400 4350
AR Path="/61118EB6" Ref="UDB?"  Part="1" 
AR Path="/613100A2/61118EB6" Ref="UDG118"  Part="1" 
AR Path="/613100A2/612E85AC/61118EB6" Ref="UDG118"  Part="1" 
F 0 "UDG118" H 5400 4715 50  0000 C CNN
F 1 "DFFCOO" H 5400 4624 50  0000 C CNN
F 2 "" H 5400 4350 50  0001 C CNN
F 3 "" H 5400 4350 50  0001 C CNN
	1    5400 4350
	1    0    0    -1  
$EndComp
$Comp
L A5C:DFFCOO UDC?
U 1 1 61118EB5
P 5400 5150
AR Path="/611F0159/61118EB5" Ref="UDC?"  Part="1" 
AR Path="/61118EB5" Ref="UDC?"  Part="1" 
AR Path="/613100A2/61118EB5" Ref="UDG109"  Part="1" 
AR Path="/613100A2/612E85AC/61118EB5" Ref="UDG109"  Part="1" 
F 0 "UDG109" H 5400 5515 50  0000 C CNN
F 1 "DFFCOO" H 5400 5424 50  0000 C CNN
F 2 "" H 5400 5150 50  0001 C CNN
F 3 "" H 5400 5150 50  0001 C CNN
	1    5400 5150
	1    0    0    -1  
$EndComp
$Comp
L A5C:NOR04 UDD?
U 1 1 61118EBD
P 7050 4300
AR Path="/611F0159/61118EBD" Ref="UDD?"  Part="1" 
AR Path="/61118EBD" Ref="UDD?"  Part="1" 
AR Path="/613100A2/61118EBD" Ref="UDE103"  Part="1" 
AR Path="/613100A2/612E85AC/61118EBD" Ref="UDE103"  Part="1" 
F 0 "UDE103" H 7050 4642 50  0000 C CNN
F 1 "NOR04" H 7050 4551 50  0000 C CNN
F 2 "" H 7050 4300 50  0001 C CNN
F 3 "" H 7050 4300 50  0001 C CNN
	1    7050 4300
	1    0    0    -1  
$EndComp
$Comp
L A5C:NOR05 UDD?
U 1 1 61118EB9
P 7050 5050
AR Path="/611F0159/61118EB9" Ref="UDD?"  Part="1" 
AR Path="/61118EB9" Ref="UDD?"  Part="1" 
AR Path="/613100A2/61118EB9" Ref="UDE99"  Part="1" 
AR Path="/613100A2/612E85AC/61118EB9" Ref="UDE99"  Part="1" 
F 0 "UDE99" H 7125 5465 50  0000 C CNN
F 1 "NOR05" H 7125 5374 50  0000 C CNN
F 2 "" H 7050 5100 50  0001 C CNN
F 3 "" H 7050 5100 50  0001 C CNN
	1    7050 5050
	1    0    0    -1  
$EndComp
Wire Bus Line
	6700 5450 6700 5850
$EndSCHEMATC
