EESchema Schematic File Version 4
EELAYER 30 0
EELAYER END
$Descr A4 11693 8268
encoding utf-8
Sheet 23 83
Title "CPS Reverse Engineering: DL-0311"
Date "2021-09-12"
Rev ""
Comp ""
Comment1 ""
Comment2 ""
Comment3 "Licence: CC-BY"
Comment4 "Author: Loïc *WydD* Petit"
$EndDescr
Connection ~ 2150 5250
Connection ~ 2150 6800
Connection ~ 2050 5150
Connection ~ 2050 3600
Connection ~ 4950 4600
Connection ~ 2150 3700
Connection ~ 4850 1500
Connection ~ 2050 2050
Connection ~ 3700 1850
Connection ~ 6500 1850
Connection ~ 4850 4500
Connection ~ 1300 650 
Connection ~ 1450 750 
Connection ~ 4950 7300
Entry Wire Line
	1150 6650 1250 6750
Entry Wire Line
	1150 6750 1250 6850
Entry Wire Line
	1300 1450 1400 1550
Entry Wire Line
	1300 1550 1400 1650
Entry Wire Line
	1300 1650 1400 1750
Entry Wire Line
	1300 1750 1400 1850
Entry Wire Line
	1300 3000 1400 3100
Entry Wire Line
	1300 3100 1400 3200
Entry Wire Line
	1300 3200 1400 3300
Entry Wire Line
	1300 3300 1400 3400
Entry Wire Line
	1300 4550 1400 4650
Entry Wire Line
	1300 4650 1400 4750
Entry Wire Line
	1300 4750 1400 4850
Entry Wire Line
	1300 4850 1400 4950
Entry Wire Line
	1300 6100 1400 6200
Entry Wire Line
	1300 6200 1400 6300
Entry Wire Line
	1300 6300 1400 6400
Entry Wire Line
	1300 6400 1400 6500
Entry Wire Line
	1450 950  1550 1050
Entry Wire Line
	1450 1050 1550 1150
Entry Wire Line
	1450 1150 1550 1250
Entry Wire Line
	1450 1250 1550 1350
Entry Wire Line
	1450 2500 1550 2600
Entry Wire Line
	1450 2600 1550 2700
Entry Wire Line
	1450 2700 1550 2800
Entry Wire Line
	1450 2800 1550 2900
Entry Wire Line
	1450 4050 1550 4150
Entry Wire Line
	1450 4150 1550 4250
Entry Wire Line
	1450 4250 1550 4350
Entry Wire Line
	1450 4350 1550 4450
Entry Wire Line
	1450 5600 1550 5700
Entry Wire Line
	1450 5700 1550 5800
Entry Wire Line
	1450 5800 1550 5900
Entry Wire Line
	1450 5900 1550 6000
Entry Wire Line
	3600 1300 3700 1400
Entry Wire Line
	3600 1400 3700 1500
Entry Wire Line
	3600 1500 3700 1600
Entry Wire Line
	3600 1600 3700 1700
Entry Wire Line
	3600 2850 3700 2750
Entry Wire Line
	3600 2950 3700 2850
Entry Wire Line
	3600 3050 3700 2950
Entry Wire Line
	3600 3150 3700 3050
Entry Wire Line
	3600 4400 3700 4300
Entry Wire Line
	3600 4500 3700 4400
Entry Wire Line
	3600 4600 3700 4500
Entry Wire Line
	3600 4700 3700 4600
Entry Wire Line
	3600 5950 3700 5850
Entry Wire Line
	3600 6050 3700 5950
Entry Wire Line
	3600 6150 3700 6050
Entry Wire Line
	3600 6250 3700 6150
Entry Wire Line
	4100 3900 4200 4000
Entry Wire Line
	4100 4000 4200 4100
Entry Wire Line
	4100 4100 4200 4200
Entry Wire Line
	4100 4200 4200 4300
Entry Wire Line
	4250 3400 4350 3500
Entry Wire Line
	4250 3500 4350 3600
Entry Wire Line
	4250 3600 4350 3700
Entry Wire Line
	4250 3700 4350 3800
Entry Wire Line
	6400 2100 6500 2000
Entry Wire Line
	6400 2500 6500 2400
Entry Wire Line
	6400 3050 6500 2950
Entry Wire Line
	6400 3750 6500 3650
Entry Wire Line
	6400 3850 6500 3750
Entry Wire Line
	6400 3950 6500 3850
Entry Wire Line
	6400 4050 6500 3950
Wire Wire Line
	1250 6850 1600 6850
Wire Wire Line
	1400 1550 2250 1550
Wire Wire Line
	1400 1650 2250 1650
Wire Wire Line
	1400 1750 2250 1750
Wire Wire Line
	1400 1850 2250 1850
Wire Wire Line
	1400 3100 2250 3100
Wire Wire Line
	1400 3200 2250 3200
Wire Wire Line
	1400 3300 2250 3300
Wire Wire Line
	1400 3400 2250 3400
Wire Wire Line
	1400 4650 2250 4650
Wire Wire Line
	1400 4750 2250 4750
Wire Wire Line
	1400 4850 2250 4850
Wire Wire Line
	1400 4950 2250 4950
Wire Wire Line
	1400 6200 2250 6200
Wire Wire Line
	1400 6300 2250 6300
Wire Wire Line
	1400 6400 2250 6400
Wire Wire Line
	1400 6500 2250 6500
Wire Wire Line
	1550 1050 2250 1050
Wire Wire Line
	1550 1150 2250 1150
Wire Wire Line
	1550 1250 2250 1250
Wire Wire Line
	1550 1350 2250 1350
Wire Wire Line
	1550 2600 2250 2600
Wire Wire Line
	1550 2700 2250 2700
Wire Wire Line
	1550 2800 2250 2800
Wire Wire Line
	1550 2900 2250 2900
Wire Wire Line
	1550 4150 2250 4150
Wire Wire Line
	1550 4250 2250 4250
Wire Wire Line
	1550 4350 2250 4350
Wire Wire Line
	1550 4450 2250 4450
Wire Wire Line
	1550 5700 2250 5700
Wire Wire Line
	1550 5800 2250 5800
Wire Wire Line
	1550 5900 2250 5900
Wire Wire Line
	1550 6000 2250 6000
Wire Wire Line
	1600 6750 1250 6750
Wire Wire Line
	1600 7300 1250 7300
Wire Wire Line
	1950 2050 2050 2050
Wire Wire Line
	2050 3600 2050 2050
Wire Wire Line
	2050 5150 2050 3600
Wire Wire Line
	2050 5150 2050 6700
Wire Wire Line
	2050 6700 2250 6700
Wire Wire Line
	2150 2150 2150 3700
Wire Wire Line
	2150 2150 2250 2150
Wire Wire Line
	2150 5250 2150 3700
Wire Wire Line
	2150 5250 2150 6800
Wire Wire Line
	2150 6800 2250 6800
Wire Wire Line
	2150 6950 2150 6800
Wire Wire Line
	2150 6950 6600 6950
Wire Wire Line
	2200 7300 4950 7300
Wire Wire Line
	2250 2050 2050 2050
Wire Wire Line
	2250 3600 2050 3600
Wire Wire Line
	2250 3700 2150 3700
Wire Wire Line
	2250 5150 2050 5150
Wire Wire Line
	2250 5250 2150 5250
Wire Wire Line
	3250 1300 3600 1300
Wire Wire Line
	3250 1400 3600 1400
Wire Wire Line
	3250 1500 3600 1500
Wire Wire Line
	3250 1600 3600 1600
Wire Wire Line
	3250 2850 3600 2850
Wire Wire Line
	3250 2950 3600 2950
Wire Wire Line
	3250 3050 3600 3050
Wire Wire Line
	3250 3150 3600 3150
Wire Wire Line
	3250 4400 3600 4400
Wire Wire Line
	3250 4500 3600 4500
Wire Wire Line
	3250 4600 3600 4600
Wire Wire Line
	3250 4700 3600 4700
Wire Wire Line
	3250 5950 3600 5950
Wire Wire Line
	3250 6050 3600 6050
Wire Wire Line
	3250 6150 3600 6150
Wire Wire Line
	3250 6250 3600 6250
Wire Wire Line
	4200 4000 5050 4000
Wire Wire Line
	4200 4100 5050 4100
Wire Wire Line
	4200 4200 5050 4200
Wire Wire Line
	4200 4300 5050 4300
Wire Wire Line
	4350 3500 5050 3500
Wire Wire Line
	4350 3600 5050 3600
Wire Wire Line
	4350 3700 5050 3700
Wire Wire Line
	4350 3800 5050 3800
Wire Wire Line
	4750 4500 4850 4500
Wire Wire Line
	4850 1300 4850 1500
Wire Wire Line
	4850 1500 4850 4500
Wire Wire Line
	4850 1500 6000 1500
Wire Wire Line
	4850 4500 5050 4500
Wire Wire Line
	4950 2700 4950 4600
Wire Wire Line
	4950 4600 4950 7300
Wire Wire Line
	4950 4600 5050 4600
Wire Wire Line
	4950 7300 5050 7300
Wire Wire Line
	5350 2100 6400 2100
Wire Wire Line
	5450 1300 6000 1300
Wire Wire Line
	5650 2600 5750 2600
Wire Wire Line
	5650 3150 6600 3150
Wire Wire Line
	5750 2500 6400 2500
Wire Wire Line
	5750 2700 4950 2700
Wire Wire Line
	5750 2700 5750 2600
Wire Wire Line
	5750 3050 6400 3050
Wire Wire Line
	6050 3750 6400 3750
Wire Wire Line
	6050 3850 6400 3850
Wire Wire Line
	6050 3950 6400 3950
Wire Wire Line
	6050 4050 6400 4050
Wire Wire Line
	6600 3150 6600 6950
Wire Bus Line
	1150 6550 1050 6550
Wire Bus Line
	1200 650  1300 650 
Wire Bus Line
	1200 750  1450 750 
Wire Bus Line
	1300 650  4100 650 
Wire Bus Line
	4250 750  1450 750 
Wire Bus Line
	6500 1850 3700 1850
Wire Bus Line
	6600 1850 6500 1850
Text Label 1250 6750 0    50   ~ 0
~DEBUG2
Text Label 1250 6850 0    50   ~ 0
~DEBUG3
Text Label 1250 7300 0    50   ~ 0
~DEBUG3
Text Label 1600 1050 0    50   ~ 0
A-ROMA15
Text Label 1600 1150 0    50   ~ 0
A-ROMA14
Text Label 1600 1250 0    50   ~ 0
A-ROMA13
Text Label 1600 1350 0    50   ~ 0
A-ROMA12
Text Label 1600 1550 0    50   ~ 0
B-ROMA15
Text Label 1600 1650 0    50   ~ 0
B-ROMA14
Text Label 1600 1750 0    50   ~ 0
B-ROMA13
Text Label 1600 1850 0    50   ~ 0
B-ROMA12
Text Label 1600 2600 0    50   ~ 0
A-ROMA11
Text Label 1600 2700 0    50   ~ 0
A-ROMA10
Text Label 1600 2800 0    50   ~ 0
A-ROMA9
Text Label 1600 2900 0    50   ~ 0
A-ROMA8
Text Label 1600 3100 0    50   ~ 0
B-ROMA11
Text Label 1600 3200 0    50   ~ 0
B-ROMA10
Text Label 1600 3300 0    50   ~ 0
B-ROMA9
Text Label 1600 3400 0    50   ~ 0
B-ROMA8
Text Label 1600 4150 0    50   ~ 0
A-ROMA7
Text Label 1600 4250 0    50   ~ 0
A-ROMA6
Text Label 1600 4350 0    50   ~ 0
A-ROMA5
Text Label 1600 4450 0    50   ~ 0
A-ROMA4
Text Label 1600 4650 0    50   ~ 0
B-ROMA7
Text Label 1600 4750 0    50   ~ 0
B-ROMA6
Text Label 1600 4850 0    50   ~ 0
B-ROMA5
Text Label 1600 4950 0    50   ~ 0
B-ROMA4
Text Label 1600 5700 0    50   ~ 0
A-ROMA3
Text Label 1600 5800 0    50   ~ 0
A-ROMA2
Text Label 1600 5900 0    50   ~ 0
A-ROMA1
Text Label 1600 6000 0    50   ~ 0
A-ROMA0
Text Label 1600 6200 0    50   ~ 0
B-ROMA3
Text Label 1600 6300 0    50   ~ 0
B-ROMA2
Text Label 1600 6400 0    50   ~ 0
B-ROMA1
Text Label 1600 6500 0    50   ~ 0
B-ROMA0
Text Label 3250 1300 0    50   ~ 0
ROMA15
Text Label 3250 1400 0    50   ~ 0
ROMA14
Text Label 3250 1500 0    50   ~ 0
ROMA13
Text Label 3250 1600 0    50   ~ 0
ROMA12
Text Label 3250 2850 0    50   ~ 0
ROMA11
Text Label 3250 2950 0    50   ~ 0
ROMA10
Text Label 3250 3050 0    50   ~ 0
ROMA9
Text Label 3250 3150 0    50   ~ 0
ROMA8
Text Label 3250 4400 0    50   ~ 0
ROMA7
Text Label 3250 4500 0    50   ~ 0
ROMA6
Text Label 3250 4600 0    50   ~ 0
ROMA5
Text Label 3250 4700 0    50   ~ 0
ROMA4
Text Label 3250 5950 0    50   ~ 0
ROMA3
Text Label 3250 6050 0    50   ~ 0
ROMA2
Text Label 3250 6150 0    50   ~ 0
ROMA1
Text Label 3250 6250 0    50   ~ 0
ROMA0
Text Label 4400 3500 0    50   ~ 0
A-ROMA19
Text Label 4400 3600 0    50   ~ 0
A-ROMA18
Text Label 4400 3700 0    50   ~ 0
A-ROMA17
Text Label 4400 3800 0    50   ~ 0
A-ROMA16
Text Label 4400 4000 0    50   ~ 0
B-ROMA19
Text Label 4400 4100 0    50   ~ 0
B-ROMA18
Text Label 4400 4200 0    50   ~ 0
B-ROMA17
Text Label 4400 4300 0    50   ~ 0
B-ROMA16
Text Label 6050 2100 0    50   ~ 0
ROMA22
Text Label 6050 2500 0    50   ~ 0
ROMA21
Text Label 6050 3050 0    50   ~ 0
ROMA20
Text Label 6050 3750 0    50   ~ 0
ROMA19
Text Label 6050 3850 0    50   ~ 0
ROMA18
Text Label 6050 3950 0    50   ~ 0
ROMA17
Text Label 6050 4050 0    50   ~ 0
ROMA16
Text HLabel 1050 6550 0    50   Input ~ 0
~DEBUG[2..3]
Text HLabel 1200 650  0    50   Input ~ 0
A-ROMA[0..19]
Text HLabel 1200 750  0    50   Input ~ 0
B-ROMA[0..19]
Text HLabel 1950 2050 0    50   Input ~ 0
GFX-CHNL
Text HLabel 4750 4500 0    50   Input ~ 0
GFX-CHNL
Text HLabel 5050 7300 2    50   Output ~ 0
~ENABLE-ATTR
Text HLabel 5350 2100 0    50   Input ~ 0
ROMA22
Text HLabel 5350 2500 0    50   Input ~ 0
~ROMA21
Text HLabel 5350 3050 0    50   Input ~ 0
~ROMA20
Text HLabel 6000 1200 0    50   Input ~ 0
~A-CDEN
Text HLabel 6000 1400 0    50   Input ~ 0
~B-CDEN
Text HLabel 6600 1850 2    50   3State ~ 0
ROMA[0..22]
Text HLabel 6850 1350 2    50   Output ~ 0
CDEN
$Comp
L A5C:TINVBF UEA198
U 1 1 6C5D51F7
P 5550 2500
F 0 "UEA198" H 5550 2765 50  0000 C CNN
F 1 "TINVBF" H 5550 2674 50  0000 C CNN
F 2 "" H 5050 2450 50  0001 C CNN
F 3 "" H 5050 2450 50  0001 C CNN
	1    5550 2500
	1    0    0    -1  
$EndComp
$Comp
L A5C:TINVBF UEF219
U 1 1 6B3FF82E
P 5550 3050
F 0 "UEF219" H 5550 3315 50  0000 C CNN
F 1 "TINVBF" H 5550 3224 50  0000 C CNN
F 2 "" H 5050 3000 50  0001 C CNN
F 3 "" H 5050 3000 50  0001 C CNN
	1    5550 3050
	1    0    0    -1  
$EndComp
$Comp
L A5C:NAND02 UEA218
U 1 1 6A278412
P 1850 6800
F 0 "UEA218" H 1875 7067 50  0000 C CNN
F 1 "NAND02" H 1875 6976 50  0000 C CNN
F 2 "" H 1850 6800 50  0001 C CNN
F 3 "" H 1850 6800 50  0001 C CNN
	1    1850 6800
	1    0    0    1   
$EndComp
$Comp
L A5C:INV01 UEA196
U 1 1 699E2B6D
P 1900 7300
F 0 "UEA196" H 1900 7617 50  0000 C CNN
F 1 "INV01" H 1900 7526 50  0000 C CNN
F 2 "" H 1900 7100 50  0001 C CNN
F 3 "" H 1900 7100 50  0001 C CNN
	1    1900 7300
	1    0    0    1   
$EndComp
$Comp
L A5C:INV01 UEF33
U 1 1 6105BFBD
P 5150 1300
F 0 "UEF33" H 5150 1617 50  0000 C CNN
F 1 "INV01" H 5150 1526 50  0000 C CNN
F 2 "" H 5150 1100 50  0001 C CNN
F 3 "" H 5150 1100 50  0001 C CNN
	1    5150 1300
	1    0    0    -1  
$EndComp
$Comp
L A5C:AOI22 UEG31
U 1 1 71DBE445
P 6400 1300
F 0 "UEG31" H 6425 1617 50  0000 C CNN
F 1 "AOI22" H 6425 1526 50  0000 C CNN
F 2 "" H 6550 1300 50  0001 C CNN
F 3 "" H 6550 1300 50  0001 C CNN
	1    6400 1300
	1    0    0    -1  
$EndComp
$Comp
L A5C:MUX24GH UEI80
U 1 1 6356DCAC
P 2750 1650
F 0 "UEI80" H 2750 2515 50  0000 C CNN
F 1 "MUX24GH" H 2750 2424 50  0000 C CNN
F 2 "" H 2750 1650 50  0001 C CNN
F 3 "" H 2750 1650 50  0001 C CNN
	1    2750 1650
	1    0    0    -1  
$EndComp
$Comp
L A5C:MUX24GH UEB152
U 1 1 64DC73C3
P 2750 3200
F 0 "UEB152" H 2750 4065 50  0000 C CNN
F 1 "MUX24GH" H 2750 3974 50  0000 C CNN
F 2 "" H 2750 3200 50  0001 C CNN
F 3 "" H 2750 3200 50  0001 C CNN
	1    2750 3200
	1    0    0    -1  
$EndComp
$Comp
L A5C:MUX24GH UEF137
U 1 1 651DE48E
P 2750 4750
F 0 "UEF137" H 2750 5615 50  0000 C CNN
F 1 "MUX24GH" H 2750 5524 50  0000 C CNN
F 2 "" H 2750 4750 50  0001 C CNN
F 3 "" H 2750 4750 50  0001 C CNN
	1    2750 4750
	1    0    0    -1  
$EndComp
$Comp
L A5C:MUX24GH UEF2
U 1 1 6574B2F9
P 2750 6300
F 0 "UEF2" H 2750 7165 50  0000 C CNN
F 1 "MUX24GH" H 2750 7074 50  0000 C CNN
F 2 "" H 2750 6300 50  0001 C CNN
F 3 "" H 2750 6300 50  0001 C CNN
	1    2750 6300
	1    0    0    -1  
$EndComp
$Comp
L A5C:MUX24GH UEB104
U 1 1 65F69AC8
P 5550 4100
F 0 "UEB104" H 5550 4965 50  0000 C CNN
F 1 "MUX24GH" H 5550 4874 50  0000 C CNN
F 2 "" H 5550 4100 50  0001 C CNN
F 3 "" H 5550 4100 50  0001 C CNN
	1    5550 4100
	1    0    0    -1  
$EndComp
Wire Bus Line
	1150 6550 1150 6750
Wire Bus Line
	3700 1400 3700 1850
Wire Bus Line
	4100 650  4100 4200
Wire Bus Line
	4250 750  4250 3700
Wire Bus Line
	6500 1850 6500 3950
Wire Bus Line
	3700 1850 3700 6150
Wire Bus Line
	1300 650  1300 6400
Wire Bus Line
	1450 750  1450 5900
$EndSCHEMATC
