EESchema Schematic File Version 4
EELAYER 30 0
EELAYER END
$Descr A3 16535 11693
encoding utf-8
Sheet 1 1
Title "QSound Amplifier CPB-001A"
Date "2020-12-05"
Rev ""
Comp ""
Comment1 ""
Comment2 "Author: Loïc *WydD* Petit"
Comment3 "Licence: CC-BY"
Comment4 "Project: CPS2 Reverse Engineering: CPB-001A"
$EndDescr
$Comp
L Device:CP C6
U 1 1 5FCF29CB
P 3850 3000
F 0 "C6" H 3968 3046 50  0000 L CNN
F 1 "470u" H 3968 2955 50  0000 L CNN
F 2 "" H 3888 2850 50  0001 C CNN
F 3 "~" H 3850 3000 50  0001 C CNN
	1    3850 3000
	1    0    0    -1  
$EndComp
$Comp
L Device:R_Small R30
U 1 1 5FCEF800
P 4150 2850
F 0 "R30" V 3954 2850 50  0000 C CNN
F 1 "100" V 4045 2850 50  0000 C CNN
F 2 "" H 4150 2850 50  0001 C CNN
F 3 "~" H 4150 2850 50  0001 C CNN
	1    4150 2850
	0    1    1    0   
$EndComp
$Comp
L Device:CP C7
U 1 1 5FD06929
P 3850 7450
F 0 "C7" H 3968 7496 50  0000 L CNN
F 1 "470u" H 3968 7405 50  0000 L CNN
F 2 "" H 3888 7300 50  0001 C CNN
F 3 "~" H 3850 7450 50  0001 C CNN
	1    3850 7450
	1    0    0    -1  
$EndComp
$Comp
L Device:R_Small R31
U 1 1 5FD06939
P 4150 7300
F 0 "R31" V 3954 7300 50  0000 C CNN
F 1 "100" V 4045 7300 50  0000 C CNN
F 2 "" H 4150 7300 50  0001 C CNN
F 3 "~" H 4150 7300 50  0001 C CNN
	1    4150 7300
	0    1    1    0   
$EndComp
Wire Wire Line
	4050 7300 3850 7300
Wire Wire Line
	3450 7350 3450 7300
$Comp
L Device:CP C20
U 1 1 5FD13690
P 4350 3000
F 0 "C20" H 4468 3046 50  0000 L CNN
F 1 "470u" H 4468 2955 50  0000 L CNN
F 2 "" H 4388 2850 50  0001 C CNN
F 3 "~" H 4350 3000 50  0001 C CNN
	1    4350 3000
	1    0    0    -1  
$EndComp
$Comp
L Device:CP C21
U 1 1 5FD15CAF
P 4350 7450
F 0 "C21" H 4468 7496 50  0000 L CNN
F 1 "470u" H 4468 7405 50  0000 L CNN
F 2 "" H 4388 7300 50  0001 C CNN
F 3 "~" H 4350 7450 50  0001 C CNN
	1    4350 7450
	1    0    0    -1  
$EndComp
Wire Wire Line
	4250 7300 4350 7300
Connection ~ 4350 7300
$Comp
L power:GND #PWR0103
U 1 1 5FD23791
P 1150 6050
F 0 "#PWR0103" H 1150 5800 50  0001 C CNN
F 1 "GND" H 1155 5877 50  0000 C CNN
F 2 "" H 1150 6050 50  0001 C CNN
F 3 "" H 1150 6050 50  0001 C CNN
	1    1150 6050
	1    0    0    -1  
$EndComp
$Comp
L CPS2-Custom:C4570HA IC1
U 1 1 5FD4CD67
P 3700 4900
F 0 "IC1" H 3750 5250 50  0000 C CNN
F 1 "C4570HA" H 3750 5150 50  0000 C CNN
F 2 "" V 3700 4950 50  0001 C CNN
F 3 "" V 3700 4950 50  0001 C CNN
	1    3700 4900
	1    0    0    -1  
$EndComp
$Comp
L Device:R_Small R24
U 1 1 5FD04F72
P 5000 4900
F 0 "R24" V 4804 4900 50  0000 C CNN
F 1 "2.2k" V 4895 4900 50  0000 C CNN
F 2 "" H 5000 4900 50  0001 C CNN
F 3 "~" H 5000 4900 50  0001 C CNN
	1    5000 4900
	0    1    1    0   
$EndComp
$Comp
L Device:CP C18
U 1 1 5FDB63CB
P 5350 4900
F 0 "C18" V 5605 4900 50  0000 C CNN
F 1 "2.2u" V 5514 4900 50  0000 C CNN
F 2 "" H 5388 4750 50  0001 C CNN
F 3 "~" H 5350 4900 50  0001 C CNN
	1    5350 4900
	0    -1   -1   0   
$EndComp
Wire Wire Line
	5200 4900 5100 4900
Wire Wire Line
	5500 4900 5550 4900
$Comp
L CPS2-Custom:uPC2500AH IC5
U 1 1 600B3270
P 8200 7400
F 0 "IC5" H 8900 8000 50  0000 R CNN
F 1 "uPC2500AH" H 8900 6800 50  0000 R CNN
F 2 "" H 8450 7400 50  0001 C CNN
F 3 "" H 8450 7400 50  0001 C CNN
	1    8200 7400
	1    0    0    -1  
$EndComp
$Comp
L power:GND #PWR0104
U 1 1 600B5397
P 7400 7700
F 0 "#PWR0104" H 7400 7450 50  0001 C CNN
F 1 "GND" H 7405 7527 50  0000 C CNN
F 2 "" H 7400 7700 50  0001 C CNN
F 3 "" H 7400 7700 50  0001 C CNN
	1    7400 7700
	1    0    0    -1  
$EndComp
$Comp
L power:GND #PWR0105
U 1 1 600D981B
P 9250 7400
F 0 "#PWR0105" H 9250 7150 50  0001 C CNN
F 1 "GND" H 9255 7227 50  0001 C CNN
F 2 "" H 9250 7400 50  0001 C CNN
F 3 "" H 9250 7400 50  0001 C CNN
	1    9250 7400
	1    0    0    -1  
$EndComp
$Comp
L Device:R R45
U 1 1 600F136B
P 9200 6300
F 0 "R45" V 8993 6300 50  0000 C CNN
F 1 "1k" V 9084 6300 50  0000 C CNN
F 2 "" V 9130 6300 50  0001 C CNN
F 3 "~" H 9200 6300 50  0001 C CNN
	1    9200 6300
	0    1    1    0   
$EndComp
$Comp
L Device:CP C27
U 1 1 60112790
P 8500 6300
F 0 "C27" V 8245 6300 50  0000 C CNN
F 1 "47u" V 8336 6300 50  0000 C CNN
F 2 "" H 8538 6150 50  0001 C CNN
F 3 "~" H 8500 6300 50  0001 C CNN
	1    8500 6300
	0    -1   1    0   
$EndComp
Wire Wire Line
	8250 6300 8250 6750
$Comp
L Device:R R39
U 1 1 600FCA78
P 8750 6450
F 0 "R39" H 8680 6404 50  0000 R CNN
F 1 "22" H 8680 6495 50  0000 R CNN
F 2 "" V 8680 6450 50  0001 C CNN
F 3 "~" H 8750 6450 50  0001 C CNN
	1    8750 6450
	-1   0    0    1   
$EndComp
Wire Wire Line
	8750 6300 8650 6300
Wire Wire Line
	8350 6300 8250 6300
$Comp
L power:GND #PWR0106
U 1 1 601A3CC3
P 8750 6600
F 0 "#PWR0106" H 8750 6350 50  0001 C CNN
F 1 "GND" H 8755 6427 50  0001 C CNN
F 2 "" H 8750 6600 50  0001 C CNN
F 3 "" H 8750 6600 50  0001 C CNN
	1    8750 6600
	1    0    0    -1  
$EndComp
Wire Wire Line
	9050 6300 8750 6300
Connection ~ 8750 6300
Wire Wire Line
	9600 7200 9600 6300
$Comp
L Device:R R43
U 1 1 601EBC65
P 9200 8500
F 0 "R43" V 9407 8500 50  0000 C CNN
F 1 "1k" V 9316 8500 50  0000 C CNN
F 2 "" V 9130 8500 50  0001 C CNN
F 3 "~" H 9200 8500 50  0001 C CNN
	1    9200 8500
	0    1    -1   0   
$EndComp
$Comp
L Device:CP C29
U 1 1 601EBC6B
P 8500 8500
F 0 "C29" V 8755 8500 50  0000 C CNN
F 1 "47u" V 8664 8500 50  0000 C CNN
F 2 "" H 8538 8350 50  0001 C CNN
F 3 "~" H 8500 8500 50  0001 C CNN
	1    8500 8500
	0    -1   -1   0   
$EndComp
Wire Wire Line
	8250 8500 8250 8050
$Comp
L Device:R R41
U 1 1 601EBC72
P 8750 8650
F 0 "R41" H 8680 8604 50  0000 R CNN
F 1 "22" H 8680 8695 50  0000 R CNN
F 2 "" V 8680 8650 50  0001 C CNN
F 3 "~" H 8750 8650 50  0001 C CNN
	1    8750 8650
	-1   0    0    1   
$EndComp
Wire Wire Line
	8750 8500 8650 8500
Wire Wire Line
	8350 8500 8250 8500
$Comp
L power:GND #PWR0107
U 1 1 601EBC7A
P 8750 8800
F 0 "#PWR0107" H 8750 8550 50  0001 C CNN
F 1 "GND" H 8755 8627 50  0001 C CNN
F 2 "" H 8750 8800 50  0001 C CNN
F 3 "" H 8750 8800 50  0001 C CNN
	1    8750 8800
	1    0    0    -1  
$EndComp
Wire Wire Line
	9050 8500 8750 8500
Connection ~ 8750 8500
Wire Wire Line
	9600 7600 9600 8500
$Comp
L Device:R_Small R61
U 1 1 602ABBC6
P 7200 8400
F 0 "R61" H 7259 8446 50  0000 L CNN
F 1 "100k" H 7259 8355 50  0000 L CNN
F 2 "" H 7200 8400 50  0001 C CNN
F 3 "~" H 7200 8400 50  0001 C CNN
	1    7200 8400
	1    0    0    -1  
$EndComp
$Comp
L Device:R_Small R59
U 1 1 602ACCDC
P 7200 8100
F 0 "R59" H 7259 8146 50  0000 L CNN
F 1 "100k" H 7259 8055 50  0000 L CNN
F 2 "" H 7200 8100 50  0001 C CNN
F 3 "~" H 7200 8100 50  0001 C CNN
	1    7200 8100
	1    0    0    -1  
$EndComp
Wire Wire Line
	7200 7700 7400 7700
$Comp
L Device:CP C43
U 1 1 6031646D
P 6850 8100
F 0 "C43" H 6732 8054 50  0000 R CNN
F 1 "47u" H 6732 8145 50  0000 R CNN
F 2 "" H 6888 7950 50  0001 C CNN
F 3 "~" H 6850 8100 50  0001 C CNN
	1    6850 8100
	-1   0    0    1   
$EndComp
Wire Wire Line
	6850 7950 6850 7700
Wire Wire Line
	6850 7700 7200 7700
Connection ~ 7200 7700
$Comp
L Connector:Conn_01x04_Male CB8
U 1 1 6033F01B
P 11150 5700
F 0 "CB8" H 11122 5628 50  0000 R CNN
F 1 "Conn_01x04_Male" H 11258 5890 50  0001 C CNN
F 2 "" H 11150 5700 50  0001 C CNN
F 3 "~" H 11150 5700 50  0001 C CNN
	1    11150 5700
	-1   0    0    -1  
$EndComp
$Comp
L Device:R R49
U 1 1 6041D0B8
P 9800 8100
F 0 "R49" H 9730 8054 50  0000 R CNN
F 1 "1" H 9730 8145 50  0000 R CNN
F 2 "" V 9730 8100 50  0001 C CNN
F 3 "~" H 9800 8100 50  0001 C CNN
	1    9800 8100
	-1   0    0    1   
$EndComp
$Comp
L Device:C C41
U 1 1 604655BC
P 9800 7800
F 0 "C41" H 9915 7846 50  0000 L CNN
F 1 "100n" H 9915 7755 50  0000 L CNN
F 2 "" H 9838 7650 50  0001 C CNN
F 3 "~" H 9800 7800 50  0001 C CNN
	1    9800 7800
	1    0    0    -1  
$EndComp
Wire Wire Line
	9800 7650 9800 7400
$Comp
L Device:R R47
U 1 1 604D81B9
P 9800 6700
F 0 "R47" H 9730 6654 50  0000 R CNN
F 1 "1" H 9730 6745 50  0000 R CNN
F 2 "" V 9730 6700 50  0001 C CNN
F 3 "~" H 9800 6700 50  0001 C CNN
	1    9800 6700
	-1   0    0    1   
$EndComp
$Comp
L Device:C C39
U 1 1 604D81BF
P 9800 7000
F 0 "C39" H 9915 7046 50  0000 L CNN
F 1 "100n" H 9915 6955 50  0000 L CNN
F 2 "" H 9838 6850 50  0001 C CNN
F 3 "~" H 9800 7000 50  0001 C CNN
	1    9800 7000
	1    0    0    -1  
$EndComp
Wire Wire Line
	9800 6550 9800 6300
Wire Wire Line
	9800 7150 9800 7400
$Comp
L Device:R_Small R27
U 1 1 6068A9B8
P 5800 9350
F 0 "R27" V 5604 9350 50  0000 C CNN
F 1 "2.2k" V 5695 9350 50  0000 C CNN
F 2 "" H 5800 9350 50  0001 C CNN
F 3 "~" H 5800 9350 50  0001 C CNN
	1    5800 9350
	0    1    1    0   
$EndComp
$Comp
L Device:C_Small C47
U 1 1 6068A9BE
P 6000 9850
F 0 "C47" H 6092 9896 50  0000 L CNN
F 1 "220n" H 6092 9805 50  0000 L CNN
F 2 "" H 6000 9850 50  0001 C CNN
F 3 "~" H 6000 9850 50  0001 C CNN
	1    6000 9850
	1    0    0    -1  
$EndComp
$Comp
L power:GND #PWR0108
U 1 1 6068A9C4
P 6350 10000
F 0 "#PWR0108" H 6350 9750 50  0001 C CNN
F 1 "GND" H 6355 9827 50  0000 C CNN
F 2 "" H 6350 10000 50  0001 C CNN
F 3 "" H 6350 10000 50  0001 C CNN
	1    6350 10000
	1    0    0    -1  
$EndComp
$Comp
L Device:R_Small R69
U 1 1 6068A9CC
P 6200 9650
F 0 "R69" V 6004 9650 50  0000 C CNN
F 1 "6.8k" V 6095 9650 50  0000 C CNN
F 2 "" H 6200 9650 50  0001 C CNN
F 3 "~" H 6200 9650 50  0001 C CNN
	1    6200 9650
	0    1    1    0   
$EndComp
$Comp
L Device:C_Small C49
U 1 1 6068A9D2
P 6200 9350
F 0 "C49" V 5971 9350 50  0000 C CNN
F 1 "68n" V 6062 9350 50  0000 C CNN
F 2 "" H 6200 9350 50  0001 C CNN
F 3 "~" H 6200 9350 50  0001 C CNN
	1    6200 9350
	0    1    1    0   
$EndComp
$Comp
L Device:R_Small R67
U 1 1 6068A9D8
P 6500 9350
F 0 "R67" V 6304 9350 50  0000 C CNN
F 1 "6.8k" V 6395 9350 50  0000 C CNN
F 2 "" H 6500 9350 50  0001 C CNN
F 3 "~" H 6500 9350 50  0001 C CNN
	1    6500 9350
	0    1    1    0   
$EndComp
Wire Wire Line
	6400 9350 6300 9350
Wire Wire Line
	6100 9350 6000 9350
Wire Wire Line
	6000 9350 6000 9650
Wire Wire Line
	6000 9650 6100 9650
$Comp
L Device:R_Small R65
U 1 1 6068A9E3
P 6500 9650
F 0 "R65" V 6304 9650 50  0000 C CNN
F 1 "6.8k" V 6395 9650 50  0000 C CNN
F 2 "" H 6500 9650 50  0001 C CNN
F 3 "~" H 6500 9650 50  0001 C CNN
	1    6500 9650
	0    1    1    0   
$EndComp
$Comp
L Device:R_Small R63
U 1 1 6068A9EA
P 7200 9650
F 0 "R63" V 7004 9650 50  0000 C CNN
F 1 "4.7k" V 7095 9650 50  0000 C CNN
F 2 "" H 7200 9650 50  0001 C CNN
F 3 "~" H 7200 9650 50  0001 C CNN
	1    7200 9650
	0    -1   -1   0   
$EndComp
Wire Wire Line
	7300 9650 7500 9650
$Comp
L Device:R_Small R57
U 1 1 6068A9F2
P 7200 8850
F 0 "R57" V 7004 8850 50  0000 C CNN
F 1 "4.7k" V 7095 8850 50  0000 C CNN
F 2 "" H 7200 8850 50  0001 C CNN
F 3 "~" H 7200 8850 50  0001 C CNN
	1    7200 8850
	0    -1   1    0   
$EndComp
Wire Wire Line
	7500 9650 7500 9450
$Comp
L CPS2-Custom:C4570HA IC3
U 2 1 6068A9FA
P 7250 9350
F 0 "IC3" H 7300 9717 50  0000 C CNN
F 1 "C4570HA" H 7300 9626 50  0000 C CNN
F 2 "" V 7250 9400 50  0001 C CNN
F 3 "" V 7250 9400 50  0001 C CNN
	2    7250 9350
	-1   0    0    -1  
$EndComp
Wire Wire Line
	6900 9350 6750 9350
Wire Wire Line
	7100 9650 6750 9650
Wire Wire Line
	6750 9350 6750 9650
Connection ~ 6750 9350
Wire Wire Line
	6750 9350 6600 9350
Connection ~ 6750 9650
Wire Wire Line
	6750 9650 6600 9650
$Comp
L Device:C_Small C45
U 1 1 6070A5B5
P 6350 9850
F 0 "C45" H 6442 9896 50  0000 L CNN
F 1 "220n" H 6442 9805 50  0000 L CNN
F 2 "" H 6350 9850 50  0001 C CNN
F 3 "~" H 6350 9850 50  0001 C CNN
	1    6350 9850
	1    0    0    -1  
$EndComp
Wire Wire Line
	6350 10000 6000 10000
$Comp
L Device:R_Small R53
U 1 1 6076963A
P 7750 9250
F 0 "R53" V 7554 9250 50  0000 C CNN
F 1 "4.7k" V 7645 9250 50  0000 C CNN
F 2 "" H 7750 9250 50  0001 C CNN
F 3 "~" H 7750 9250 50  0001 C CNN
	1    7750 9250
	0    -1   1    0   
$EndComp
$Comp
L Device:R_Small R55
U 1 1 607B9250
P 7750 9650
F 0 "R55" V 7554 9650 50  0000 C CNN
F 1 "4.7k" V 7645 9650 50  0000 C CNN
F 2 "" H 7750 9650 50  0001 C CNN
F 3 "~" H 7750 9650 50  0001 C CNN
	1    7750 9650
	0    -1   1    0   
$EndComp
Wire Wire Line
	7650 9650 7500 9650
Connection ~ 7500 9650
$Comp
L Device:R_Small R37
U 1 1 5FE200CE
P 7200 7550
F 0 "R37" H 7141 7504 50  0000 R CNN
F 1 "100k" H 7141 7595 50  0000 R CNN
F 2 "" H 7200 7550 50  0001 C CNN
F 3 "~" H 7200 7550 50  0001 C CNN
	1    7200 7550
	-1   0    0    1   
$EndComp
$Comp
L Device:C_Small C25
U 1 1 5FE200C5
P 6850 7550
F 0 "C25" H 6942 7596 50  0000 L CNN
F 1 "100p" H 6942 7505 50  0000 L CNN
F 2 "" H 6850 7550 50  0001 C CNN
F 3 "~" H 6850 7550 50  0001 C CNN
	1    6850 7550
	1    0    0    -1  
$EndComp
Wire Wire Line
	6550 7400 6450 7400
$Comp
L Device:CP C23
U 1 1 5FE200BE
P 6700 7400
F 0 "C23" V 6955 7400 50  0000 C CNN
F 1 "10u" V 6864 7400 50  0000 C CNN
F 2 "" H 6738 7250 50  0001 C CNN
F 3 "~" H 6700 7400 50  0001 C CNN
	1    6700 7400
	0    -1   -1   0   
$EndComp
Wire Wire Line
	5250 9350 5150 9350
$Comp
L Device:CP C19
U 1 1 5FE200B5
P 5000 9350
F 0 "C19" V 5255 9350 50  0000 C CNN
F 1 "2.2u" V 5164 9350 50  0000 C CNN
F 2 "" H 5038 9200 50  0001 C CNN
F 3 "~" H 5000 9350 50  0001 C CNN
	1    5000 9350
	0    -1   -1   0   
$EndComp
Wire Wire Line
	6250 7400 6150 7400
$Comp
L Device:R_Small R35
U 1 1 5FE200AD
P 6350 7400
F 0 "R35" V 6154 7400 50  0000 C CNN
F 1 "220" V 6245 7400 50  0000 C CNN
F 2 "" H 6350 7400 50  0001 C CNN
F 3 "~" H 6350 7400 50  0001 C CNN
	1    6350 7400
	0    1    1    0   
$EndComp
Wire Wire Line
	5550 7700 5550 7500
Wire Wire Line
	5750 7700 5550 7700
Wire Wire Line
	5950 7700 6150 7700
$Comp
L Device:R_Small R33
U 1 1 5FE2009B
P 5850 7700
F 0 "R33" V 5654 7700 50  0000 C CNN
F 1 "3.9k" V 5745 7700 50  0000 C CNN
F 2 "" H 5850 7700 50  0001 C CNN
F 3 "~" H 5850 7700 50  0001 C CNN
	1    5850 7700
	0    1    -1   0   
$EndComp
$Comp
L CPS2-Custom:C4570HA IC3
U 1 1 5FE20095
P 5800 7400
F 0 "IC3" H 5850 7750 50  0000 C CNN
F 1 "C4570HA" H 5850 7650 50  0000 C CNN
F 2 "" V 5800 7450 50  0001 C CNN
F 3 "" V 5800 7450 50  0001 C CNN
	1    5800 7400
	1    0    0    -1  
$EndComp
Wire Wire Line
	4800 9350 4750 9350
Wire Wire Line
	4800 10100 4750 10100
$Comp
L Device:R_Small R25
U 1 1 5FE20088
P 5350 9350
F 0 "R25" V 5154 9350 50  0000 C CNN
F 1 "1.1k" V 5245 9350 50  0000 C CNN
F 2 "" H 5350 9350 50  0001 C CNN
F 3 "~" H 5350 9350 50  0001 C CNN
	1    5350 9350
	0    1    1    0   
$EndComp
Wire Wire Line
	4450 10100 4400 10100
Connection ~ 4450 10100
Wire Wire Line
	4450 10200 4450 10100
$Comp
L Device:C_Small C17
U 1 1 5FE2007B
P 4450 10300
F 0 "C17" H 4542 10346 50  0000 L CNN
F 1 "560n" H 4542 10255 50  0000 L CNN
F 2 "" H 4450 10300 50  0001 C CNN
F 3 "~" H 4450 10300 50  0001 C CNN
	1    4450 10300
	1    0    0    -1  
$EndComp
Wire Wire Line
	4550 10100 4450 10100
$Comp
L Device:R_Small R23
U 1 1 5FE20074
P 4650 10100
F 0 "R23" V 4454 10100 50  0000 C CNN
F 1 "2.2k" V 4545 10100 50  0000 C CNN
F 2 "" H 4650 10100 50  0001 C CNN
F 3 "~" H 4650 10100 50  0001 C CNN
	1    4650 10100
	0    1    1    0   
$EndComp
Wire Wire Line
	4550 9350 4400 9350
$Comp
L Device:C_Small C15
U 1 1 5FE2006D
P 4650 9350
F 0 "C15" V 4421 9350 50  0000 C CNN
F 1 "68n" V 4512 9350 50  0000 C CNN
F 2 "" H 4650 9350 50  0001 C CNN
F 3 "~" H 4650 9350 50  0001 C CNN
	1    4650 9350
	0    1    1    0   
$EndComp
$Comp
L Device:R_Small R19
U 1 1 5FE20067
P 4300 10100
F 0 "R19" V 4104 10100 50  0000 C CNN
F 1 "2.2k" V 4195 10100 50  0000 C CNN
F 2 "" H 4300 10100 50  0001 C CNN
F 3 "~" H 4300 10100 50  0001 C CNN
	1    4300 10100
	0    1    1    0   
$EndComp
$Comp
L Device:R_Small R21
U 1 1 5FE20061
P 4300 9350
F 0 "R21" V 4104 9350 50  0000 C CNN
F 1 "2.7k" V 4195 9350 50  0000 C CNN
F 2 "" H 4300 9350 50  0001 C CNN
F 3 "~" H 4300 9350 50  0001 C CNN
	1    4300 9350
	0    1    1    0   
$EndComp
$Comp
L Device:R_Small R9
U 1 1 5FD6302C
P 2550 9050
F 0 "R9" H 2491 9096 50  0000 R CNN
F 1 "56k" H 2491 9005 50  0000 R CNN
F 2 "" H 2550 9050 50  0001 C CNN
F 3 "~" H 2550 9050 50  0001 C CNN
	1    2550 9050
	-1   0    0    -1  
$EndComp
$Comp
L Device:R_Small R11
U 1 1 5FD5D306
P 2900 9250
F 0 "R11" V 3096 9250 50  0000 C CNN
F 1 "1k" V 3005 9250 50  0000 C CNN
F 2 "" H 2900 9250 50  0001 C CNN
F 3 "~" H 2900 9250 50  0001 C CNN
	1    2900 9250
	0    1    -1   0   
$EndComp
$Comp
L Device:R_Small R4
U 1 1 5FD3239E
P 2050 9450
F 0 "R4" H 1991 9404 50  0000 R CNN
F 1 "12k" H 1991 9495 50  0000 R CNN
F 2 "" H 2050 9450 50  0001 C CNN
F 3 "~" H 2050 9450 50  0001 C CNN
	1    2050 9450
	-1   0    0    -1  
$EndComp
$Comp
L Device:CP C2
U 1 1 5FD2F312
P 2300 9250
F 0 "C2" V 2555 9250 50  0000 C CNN
F 1 "10u" V 2464 9250 50  0000 C CNN
F 2 "" H 2338 9100 50  0001 C CNN
F 3 "~" H 2300 9250 50  0001 C CNN
	1    2300 9250
	0    -1   -1   0   
$EndComp
Connection ~ 6850 7700
Wire Wire Line
	1600 9250 2050 9250
Wire Wire Line
	2050 9350 2050 9250
Connection ~ 2050 9250
Wire Wire Line
	2050 9250 2150 9250
$Comp
L power:GND #PWR0109
U 1 1 60BAE488
P 2050 9550
F 0 "#PWR0109" H 2050 9300 50  0001 C CNN
F 1 "GND" H 2055 9377 50  0000 C CNN
F 2 "" H 2050 9550 50  0001 C CNN
F 3 "" H 2050 9550 50  0001 C CNN
	1    2050 9550
	1    0    0    -1  
$EndComp
$Comp
L power:GND #PWR0110
U 1 1 60BD541B
P 3050 9550
F 0 "#PWR0110" H 3050 9300 50  0001 C CNN
F 1 "GND" H 3055 9377 50  0000 C CNN
F 2 "" H 3050 9550 50  0001 C CNN
F 3 "" H 3050 9550 50  0001 C CNN
	1    3050 9550
	1    0    0    -1  
$EndComp
Wire Wire Line
	3000 9250 3050 9250
$Comp
L Device:C_Small C9
U 1 1 5FDA585D
P 3050 9450
F 0 "C9" H 3142 9496 50  0000 L CNN
F 1 "47p" H 3142 9405 50  0000 L CNN
F 2 "" H 3050 9450 50  0001 C CNN
F 3 "~" H 3050 9450 50  0001 C CNN
	1    3050 9450
	1    0    0    -1  
$EndComp
Wire Wire Line
	3050 9350 3050 9250
$Comp
L power:GND #PWR0111
U 1 1 60C35DD1
P 4450 10400
F 0 "#PWR0111" H 4450 10150 50  0001 C CNN
F 1 "GND" H 4455 10227 50  0000 C CNN
F 2 "" H 4450 10400 50  0001 C CNN
F 3 "" H 4450 10400 50  0001 C CNN
	1    4450 10400
	1    0    0    -1  
$EndComp
Wire Wire Line
	4850 9350 4800 9350
$Comp
L Device:R_Small R29
U 1 1 60EFCFE2
P 5350 7300
F 0 "R29" V 5154 7300 50  0000 C CNN
F 1 "3.3k" V 5245 7300 50  0000 C CNN
F 2 "" H 5350 7300 50  0001 C CNN
F 3 "~" H 5350 7300 50  0001 C CNN
	1    5350 7300
	0    1    1    0   
$EndComp
Wire Wire Line
	5550 7300 5450 7300
Connection ~ 6150 7400
Wire Wire Line
	6150 7400 6150 7700
$Comp
L CPS2-Custom:C4570HA IC1
U 2 1 5FD4FF5A
P 3700 9350
F 0 "IC1" H 3750 9717 50  0000 C CNN
F 1 "C4570HA" H 3750 9626 50  0000 C CNN
F 2 "" V 3700 9400 50  0001 C CNN
F 3 "" V 3700 9400 50  0001 C CNN
	2    3700 9350
	1    0    0    -1  
$EndComp
Wire Wire Line
	3350 9450 3450 9450
$Comp
L Device:C_Small C11
U 1 1 5FE0E7E0
P 3800 9800
F 0 "C11" V 3571 9800 50  0000 C CNN
F 1 "150n" V 3662 9800 50  0000 C CNN
F 2 "" H 3800 9800 50  0001 C CNN
F 3 "~" H 3800 9800 50  0001 C CNN
	1    3800 9800
	0    1    1    0   
$EndComp
$Comp
L Device:R_Small R17
U 1 1 5FE0E7E6
P 3950 10100
F 0 "R17" V 3754 10100 50  0000 C CNN
F 1 "15k" V 3845 10100 50  0000 C CNN
F 2 "" H 3950 10100 50  0001 C CNN
F 3 "~" H 3950 10100 50  0001 C CNN
	1    3950 10100
	0    1    1    0   
$EndComp
$Comp
L Device:R_Small R15
U 1 1 5FE0E7EC
P 3700 10100
F 0 "R15" V 3504 10100 50  0000 C CNN
F 1 "15k" V 3595 10100 50  0000 C CNN
F 2 "" H 3700 10100 50  0001 C CNN
F 3 "~" H 3700 10100 50  0001 C CNN
	1    3700 10100
	0    1    1    0   
$EndComp
Wire Wire Line
	4050 9800 3900 9800
Wire Wire Line
	3700 9800 3600 9800
Wire Wire Line
	3800 10100 3850 10100
Connection ~ 4050 9800
Wire Wire Line
	3600 9800 3600 10100
$Comp
L Device:C_Small C13
U 1 1 5FE0E802
P 3850 10300
F 0 "C13" H 3942 10346 50  0000 L CNN
F 1 "150n" H 3942 10255 50  0000 L CNN
F 2 "" H 3850 10300 50  0001 C CNN
F 3 "~" H 3850 10300 50  0001 C CNN
	1    3850 10300
	1    0    0    -1  
$EndComp
Wire Wire Line
	3850 10200 3850 10100
Connection ~ 3850 10100
$Comp
L power:GND #PWR0112
U 1 1 5FE0E80A
P 3850 10400
F 0 "#PWR0112" H 3850 10150 50  0001 C CNN
F 1 "GND" H 3855 10227 50  0000 C CNN
F 2 "" H 3850 10400 50  0001 C CNN
F 3 "" H 3850 10400 50  0001 C CNN
	1    3850 10400
	1    0    0    -1  
$EndComp
Connection ~ 3600 10100
Wire Wire Line
	3600 10100 3550 10100
Wire Wire Line
	3350 9450 3350 10100
$Comp
L Device:R_Small R13
U 1 1 5FE0E7F2
P 3450 10100
F 0 "R13" V 3254 10100 50  0000 C CNN
F 1 "2.7k" V 3345 10100 50  0000 C CNN
F 2 "" H 3450 10100 50  0001 C CNN
F 3 "~" H 3450 10100 50  0001 C CNN
	1    3450 10100
	0    1    1    0   
$EndComp
Connection ~ 4800 9350
Connection ~ 4050 9350
Wire Wire Line
	4050 9350 4200 9350
Wire Wire Line
	4050 10100 4200 10100
Wire Wire Line
	4050 9350 4050 9800
Connection ~ 4050 10100
Wire Wire Line
	4050 9800 4050 10100
Wire Wire Line
	4800 9350 4800 10100
Wire Wire Line
	3050 9250 3450 9250
Connection ~ 3050 9250
Wire Wire Line
	6000 9350 5900 9350
Connection ~ 6000 9350
Connection ~ 7500 9250
Wire Wire Line
	7500 9250 7650 9250
Wire Wire Line
	7300 8850 7500 8850
Wire Wire Line
	7500 8850 7500 9250
Wire Wire Line
	2450 9250 2550 9250
Wire Wire Line
	2550 9150 2550 9250
Connection ~ 2550 9250
Wire Wire Line
	2550 9250 2800 9250
Wire Wire Line
	2550 8950 2550 8850
Wire Wire Line
	7200 7650 7200 7700
Wire Wire Line
	6850 7700 6850 7650
Wire Wire Line
	6850 7450 6850 7400
Wire Wire Line
	7200 7450 7200 7400
Wire Wire Line
	6850 7400 7200 7400
Connection ~ 7200 7400
Wire Wire Line
	7200 7400 7400 7400
Connection ~ 7400 7700
Connection ~ 6850 7400
Wire Wire Line
	7800 8550 7800 8450
Wire Wire Line
	7200 8500 7200 8550
Wire Wire Line
	6850 8250 7200 8250
Wire Wire Line
	7200 8300 7200 8250
Connection ~ 7200 8250
Wire Wire Line
	7200 8250 7200 8200
Wire Wire Line
	7200 8000 7200 7700
$Comp
L Device:CP C31
U 1 1 61766B95
P 7500 6450
F 0 "C31" H 7618 6496 50  0000 L CNN
F 1 "47u" H 7618 6405 50  0000 L CNN
F 2 "" H 7538 6300 50  0001 C CNN
F 3 "~" H 7500 6450 50  0001 C CNN
	1    7500 6450
	-1   0    0    -1  
$EndComp
$Comp
L power:GND #PWR0113
U 1 1 6178BDF1
P 7500 6600
F 0 "#PWR0113" H 7500 6350 50  0001 C CNN
F 1 "GND" H 7505 6427 50  0001 C CNN
F 2 "" H 7500 6600 50  0001 C CNN
F 3 "" H 7500 6600 50  0001 C CNN
	1    7500 6600
	1    0    0    -1  
$EndComp
Wire Wire Line
	7800 6300 7800 6750
Wire Wire Line
	7500 6300 7800 6300
Wire Wire Line
	5450 9350 5550 9350
Wire Wire Line
	2550 8850 5150 8850
Wire Wire Line
	5550 7700 5550 9350
Connection ~ 5550 7700
Connection ~ 5550 9350
Wire Wire Line
	5550 9350 5700 9350
Wire Wire Line
	5150 7300 5150 8850
Connection ~ 5150 7300
Wire Wire Line
	5150 7300 5250 7300
Connection ~ 5150 8850
Wire Wire Line
	5150 8850 7100 8850
$Comp
L Device:CP_Small C37
U 1 1 61896899
P 9250 7100
F 0 "C37" H 9338 7146 50  0000 L CNN
F 1 "220u" H 9338 7055 50  0000 L CNN
F 2 "" H 9250 7100 50  0001 C CNN
F 3 "~" H 9250 7100 50  0001 C CNN
	1    9250 7100
	1    0    0    -1  
$EndComp
Wire Wire Line
	9000 7200 9250 7200
$Comp
L Device:CP_Small C35
U 1 1 61898978
P 9250 7700
F 0 "C35" H 9162 7654 50  0000 R CNN
F 1 "220u" H 9162 7745 50  0000 R CNN
F 2 "" H 9250 7700 50  0001 C CNN
F 3 "~" H 9250 7700 50  0001 C CNN
	1    9250 7700
	-1   0    0    1   
$EndComp
Wire Wire Line
	9000 7600 9250 7600
Connection ~ 9250 7200
Wire Wire Line
	9250 7200 9600 7200
Wire Wire Line
	9250 7000 9000 7000
Connection ~ 9250 7400
Wire Wire Line
	9250 7400 9800 7400
Wire Wire Line
	9000 7400 9250 7400
Connection ~ 9250 7600
Wire Wire Line
	9250 7600 9600 7600
Wire Wire Line
	9250 7800 9000 7800
Wire Wire Line
	9800 9250 9800 8500
Connection ~ 9600 6300
Wire Wire Line
	9600 6300 9350 6300
Wire Wire Line
	9600 6300 9800 6300
Connection ~ 9600 8500
Wire Wire Line
	9600 8500 9350 8500
Wire Wire Line
	9600 8500 9800 8500
Connection ~ 9800 6300
Connection ~ 9800 7400
Connection ~ 9800 8500
Wire Wire Line
	7850 9250 9800 9250
$Comp
L CPS2-Custom:uPC2500AH IC4
U 1 1 61B5E3E2
P 8200 2950
F 0 "IC4" H 8900 3550 50  0000 R CNN
F 1 "uPC2500AH" H 8900 2350 50  0000 R CNN
F 2 "" H 8450 2950 50  0001 C CNN
F 3 "" H 8450 2950 50  0001 C CNN
	1    8200 2950
	1    0    0    -1  
$EndComp
$Comp
L power:GND #PWR0114
U 1 1 61B5E3EE
P 7400 3250
F 0 "#PWR0114" H 7400 3000 50  0001 C CNN
F 1 "GND" H 7405 3077 50  0000 C CNN
F 2 "" H 7400 3250 50  0001 C CNN
F 3 "" H 7400 3250 50  0001 C CNN
	1    7400 3250
	1    0    0    -1  
$EndComp
$Comp
L power:GND #PWR0115
U 1 1 61B5E3F4
P 9250 2950
F 0 "#PWR0115" H 9250 2700 50  0001 C CNN
F 1 "GND" H 9255 2777 50  0001 C CNN
F 2 "" H 9250 2950 50  0001 C CNN
F 3 "" H 9250 2950 50  0001 C CNN
	1    9250 2950
	1    0    0    -1  
$EndComp
$Comp
L Device:R R44
U 1 1 61B5E3FA
P 9200 1850
F 0 "R44" V 8993 1850 50  0000 C CNN
F 1 "1k" V 9084 1850 50  0000 C CNN
F 2 "" V 9130 1850 50  0001 C CNN
F 3 "~" H 9200 1850 50  0001 C CNN
	1    9200 1850
	0    1    1    0   
$EndComp
$Comp
L Device:CP C26
U 1 1 61B5E400
P 8500 1850
F 0 "C26" V 8245 1850 50  0000 C CNN
F 1 "47u" V 8336 1850 50  0000 C CNN
F 2 "" H 8538 1700 50  0001 C CNN
F 3 "~" H 8500 1850 50  0001 C CNN
	1    8500 1850
	0    -1   1    0   
$EndComp
Wire Wire Line
	8250 1850 8250 2300
$Comp
L Device:R R38
U 1 1 61B5E407
P 8750 2000
F 0 "R38" H 8680 1954 50  0000 R CNN
F 1 "22" H 8680 2045 50  0000 R CNN
F 2 "" V 8680 2000 50  0001 C CNN
F 3 "~" H 8750 2000 50  0001 C CNN
	1    8750 2000
	-1   0    0    1   
$EndComp
Wire Wire Line
	8750 1850 8650 1850
Wire Wire Line
	8350 1850 8250 1850
$Comp
L power:GND #PWR0116
U 1 1 61B5E40F
P 8750 2150
F 0 "#PWR0116" H 8750 1900 50  0001 C CNN
F 1 "GND" H 8755 1977 50  0001 C CNN
F 2 "" H 8750 2150 50  0001 C CNN
F 3 "" H 8750 2150 50  0001 C CNN
	1    8750 2150
	1    0    0    -1  
$EndComp
Wire Wire Line
	9050 1850 8750 1850
Connection ~ 8750 1850
Wire Wire Line
	9600 2750 9600 1850
$Comp
L Device:R R42
U 1 1 61B5E418
P 9200 4050
F 0 "R42" V 9407 4050 50  0000 C CNN
F 1 "1k" V 9316 4050 50  0000 C CNN
F 2 "" V 9130 4050 50  0001 C CNN
F 3 "~" H 9200 4050 50  0001 C CNN
	1    9200 4050
	0    1    -1   0   
$EndComp
$Comp
L Device:CP C28
U 1 1 61B5E41E
P 8500 4050
F 0 "C28" V 8755 4050 50  0000 C CNN
F 1 "47u" V 8664 4050 50  0000 C CNN
F 2 "" H 8538 3900 50  0001 C CNN
F 3 "~" H 8500 4050 50  0001 C CNN
	1    8500 4050
	0    -1   -1   0   
$EndComp
Wire Wire Line
	8250 4050 8250 3600
$Comp
L Device:R R40
U 1 1 61B5E425
P 8750 4200
F 0 "R40" H 8680 4154 50  0000 R CNN
F 1 "22" H 8680 4245 50  0000 R CNN
F 2 "" V 8680 4200 50  0001 C CNN
F 3 "~" H 8750 4200 50  0001 C CNN
	1    8750 4200
	-1   0    0    1   
$EndComp
Wire Wire Line
	8750 4050 8650 4050
Wire Wire Line
	8350 4050 8250 4050
$Comp
L power:GND #PWR0117
U 1 1 61B5E42D
P 8750 4350
F 0 "#PWR0117" H 8750 4100 50  0001 C CNN
F 1 "GND" H 8755 4177 50  0001 C CNN
F 2 "" H 8750 4350 50  0001 C CNN
F 3 "" H 8750 4350 50  0001 C CNN
	1    8750 4350
	1    0    0    -1  
$EndComp
Wire Wire Line
	9050 4050 8750 4050
Connection ~ 8750 4050
Wire Wire Line
	9600 3150 9600 4050
$Comp
L Device:R_Small R60
U 1 1 61B5E442
P 7200 3950
F 0 "R60" H 7142 3904 50  0000 R CNN
F 1 "100k" H 7142 3995 50  0000 R CNN
F 2 "" H 7200 3950 50  0001 C CNN
F 3 "~" H 7200 3950 50  0001 C CNN
	1    7200 3950
	-1   0    0    1   
$EndComp
$Comp
L Device:R_Small R58
U 1 1 61B5E448
P 7200 3650
F 0 "R58" H 7142 3604 50  0000 R CNN
F 1 "100k" H 7142 3695 50  0000 R CNN
F 2 "" H 7200 3650 50  0001 C CNN
F 3 "~" H 7200 3650 50  0001 C CNN
	1    7200 3650
	-1   0    0    1   
$EndComp
Wire Wire Line
	7200 3250 7400 3250
$Comp
L Device:CP C42
U 1 1 61B5E44F
P 6850 3650
F 0 "C42" H 6732 3604 50  0000 R CNN
F 1 "47u" H 6732 3695 50  0000 R CNN
F 2 "" H 6888 3500 50  0001 C CNN
F 3 "~" H 6850 3650 50  0001 C CNN
	1    6850 3650
	-1   0    0    1   
$EndComp
Wire Wire Line
	6850 3500 6850 3250
Wire Wire Line
	6850 3250 7200 3250
Connection ~ 7200 3250
$Comp
L Device:R R48
U 1 1 61B5E458
P 9800 3650
F 0 "R48" H 9730 3604 50  0000 R CNN
F 1 "1" H 9730 3695 50  0000 R CNN
F 2 "" V 9730 3650 50  0001 C CNN
F 3 "~" H 9800 3650 50  0001 C CNN
	1    9800 3650
	-1   0    0    1   
$EndComp
$Comp
L Device:C C40
U 1 1 61B5E45E
P 9800 3350
F 0 "C40" H 9915 3396 50  0000 L CNN
F 1 "100n" H 9915 3305 50  0000 L CNN
F 2 "" H 9838 3200 50  0001 C CNN
F 3 "~" H 9800 3350 50  0001 C CNN
	1    9800 3350
	1    0    0    -1  
$EndComp
Wire Wire Line
	9800 3200 9800 2950
Wire Wire Line
	9800 3800 9800 4050
$Comp
L Device:R R46
U 1 1 61B5E466
P 9800 2250
F 0 "R46" H 9730 2204 50  0000 R CNN
F 1 "1" H 9730 2295 50  0000 R CNN
F 2 "" V 9730 2250 50  0001 C CNN
F 3 "~" H 9800 2250 50  0001 C CNN
	1    9800 2250
	-1   0    0    1   
$EndComp
$Comp
L Device:C C38
U 1 1 61B5E46C
P 9800 2550
F 0 "C38" H 9915 2596 50  0000 L CNN
F 1 "100n" H 9915 2505 50  0000 L CNN
F 2 "" H 9838 2400 50  0001 C CNN
F 3 "~" H 9800 2550 50  0001 C CNN
	1    9800 2550
	1    0    0    -1  
$EndComp
Wire Wire Line
	9800 2100 9800 1850
Wire Wire Line
	9800 2700 9800 2950
$Comp
L Device:C_Small C46
U 1 1 61B5E47A
P 6000 5400
F 0 "C46" H 6092 5446 50  0000 L CNN
F 1 "220n" H 6092 5355 50  0000 L CNN
F 2 "" H 6000 5400 50  0001 C CNN
F 3 "~" H 6000 5400 50  0001 C CNN
	1    6000 5400
	1    0    0    -1  
$EndComp
$Comp
L power:GND #PWR0118
U 1 1 61B5E480
P 6350 5550
F 0 "#PWR0118" H 6350 5300 50  0001 C CNN
F 1 "GND" H 6355 5377 50  0000 C CNN
F 2 "" H 6350 5550 50  0001 C CNN
F 3 "" H 6350 5550 50  0001 C CNN
	1    6350 5550
	1    0    0    -1  
$EndComp
$Comp
L Device:R_Small R68
U 1 1 61B5E487
P 6200 5200
F 0 "R68" V 6004 5200 50  0000 C CNN
F 1 "6.8k" V 6095 5200 50  0000 C CNN
F 2 "" H 6200 5200 50  0001 C CNN
F 3 "~" H 6200 5200 50  0001 C CNN
	1    6200 5200
	0    1    1    0   
$EndComp
$Comp
L Device:C_Small C48
U 1 1 61B5E48D
P 6200 4900
F 0 "C48" V 5971 4900 50  0000 C CNN
F 1 "68n" V 6062 4900 50  0000 C CNN
F 2 "" H 6200 4900 50  0001 C CNN
F 3 "~" H 6200 4900 50  0001 C CNN
	1    6200 4900
	0    1    1    0   
$EndComp
$Comp
L Device:R_Small R66
U 1 1 61B5E493
P 6500 4900
F 0 "R66" V 6304 4900 50  0000 C CNN
F 1 "6.8k" V 6395 4900 50  0000 C CNN
F 2 "" H 6500 4900 50  0001 C CNN
F 3 "~" H 6500 4900 50  0001 C CNN
	1    6500 4900
	0    1    1    0   
$EndComp
Wire Wire Line
	6400 4900 6300 4900
Wire Wire Line
	6100 4900 6000 4900
Wire Wire Line
	6000 4900 6000 5200
Wire Wire Line
	6000 5200 6100 5200
$Comp
L Device:R_Small R64
U 1 1 61B5E49E
P 6500 5200
F 0 "R64" V 6304 5200 50  0000 C CNN
F 1 "6.8k" V 6395 5200 50  0000 C CNN
F 2 "" H 6500 5200 50  0001 C CNN
F 3 "~" H 6500 5200 50  0001 C CNN
	1    6500 5200
	0    1    1    0   
$EndComp
$Comp
L Device:R_Small R62
U 1 1 61B5E4A5
P 7200 5200
F 0 "R62" V 7004 5200 50  0000 C CNN
F 1 "4.7k" V 7095 5200 50  0000 C CNN
F 2 "" H 7200 5200 50  0001 C CNN
F 3 "~" H 7200 5200 50  0001 C CNN
	1    7200 5200
	0    -1   -1   0   
$EndComp
Wire Wire Line
	7300 5200 7500 5200
$Comp
L Device:R_Small R56
U 1 1 61B5E4AC
P 7200 4400
F 0 "R56" V 7004 4400 50  0000 C CNN
F 1 "4.7k" V 7095 4400 50  0000 C CNN
F 2 "" H 7200 4400 50  0001 C CNN
F 3 "~" H 7200 4400 50  0001 C CNN
	1    7200 4400
	0    -1   1    0   
$EndComp
Wire Wire Line
	7500 5200 7500 5000
$Comp
L CPS2-Custom:C4570HA IC2
U 2 1 61B5E4B3
P 7250 4900
F 0 "IC2" H 7300 5267 50  0000 C CNN
F 1 "C4570HA" H 7300 5176 50  0000 C CNN
F 2 "" V 7250 4950 50  0001 C CNN
F 3 "" V 7250 4950 50  0001 C CNN
	2    7250 4900
	-1   0    0    -1  
$EndComp
Wire Wire Line
	6900 4900 6750 4900
Wire Wire Line
	7100 5200 6750 5200
Wire Wire Line
	6750 4900 6750 5200
Connection ~ 6750 4900
Wire Wire Line
	6750 4900 6600 4900
Connection ~ 6750 5200
Wire Wire Line
	6750 5200 6600 5200
$Comp
L Device:C_Small C44
U 1 1 61B5E4C0
P 6350 5400
F 0 "C44" H 6442 5446 50  0000 L CNN
F 1 "220n" H 6442 5355 50  0000 L CNN
F 2 "" H 6350 5400 50  0001 C CNN
F 3 "~" H 6350 5400 50  0001 C CNN
	1    6350 5400
	1    0    0    -1  
$EndComp
Wire Wire Line
	6350 5550 6000 5550
$Comp
L Device:R_Small R52
U 1 1 61B5E4CB
P 7750 4800
F 0 "R52" V 7554 4800 50  0000 C CNN
F 1 "4.7k" V 7645 4800 50  0000 C CNN
F 2 "" H 7750 4800 50  0001 C CNN
F 3 "~" H 7750 4800 50  0001 C CNN
	1    7750 4800
	0    -1   1    0   
$EndComp
$Comp
L Device:R_Small R54
U 1 1 61B5E4D1
P 7750 5200
F 0 "R54" V 7554 5200 50  0000 C CNN
F 1 "4.7k" V 7645 5200 50  0000 C CNN
F 2 "" H 7750 5200 50  0001 C CNN
F 3 "~" H 7750 5200 50  0001 C CNN
	1    7750 5200
	0    -1   1    0   
$EndComp
Wire Wire Line
	7650 5200 7500 5200
Connection ~ 7500 5200
$Comp
L Device:R_Small R36
U 1 1 61B5E4DA
P 7200 3100
F 0 "R36" H 7141 3054 50  0000 R CNN
F 1 "100k" H 7141 3145 50  0000 R CNN
F 2 "" H 7200 3100 50  0001 C CNN
F 3 "~" H 7200 3100 50  0001 C CNN
	1    7200 3100
	-1   0    0    1   
$EndComp
$Comp
L Device:C_Small C24
U 1 1 61B5E4E0
P 6850 3100
F 0 "C24" H 6942 3146 50  0000 L CNN
F 1 "100p" H 6942 3055 50  0000 L CNN
F 2 "" H 6850 3100 50  0001 C CNN
F 3 "~" H 6850 3100 50  0001 C CNN
	1    6850 3100
	1    0    0    -1  
$EndComp
Wire Wire Line
	6550 2950 6450 2950
$Comp
L Device:CP C22
U 1 1 61B5E4E7
P 6700 2950
F 0 "C22" V 6955 2950 50  0000 C CNN
F 1 "10u" V 6864 2950 50  0000 C CNN
F 2 "" H 6738 2800 50  0001 C CNN
F 3 "~" H 6700 2950 50  0001 C CNN
	1    6700 2950
	0    -1   -1   0   
$EndComp
Wire Wire Line
	6250 2950 6150 2950
$Comp
L Device:R_Small R34
U 1 1 61B5E4F5
P 6350 2950
F 0 "R34" V 6154 2950 50  0000 C CNN
F 1 "220" V 6245 2950 50  0000 C CNN
F 2 "" H 6350 2950 50  0001 C CNN
F 3 "~" H 6350 2950 50  0001 C CNN
	1    6350 2950
	0    1    1    0   
$EndComp
Wire Wire Line
	5550 3250 5550 3050
Wire Wire Line
	5750 3250 5550 3250
Wire Wire Line
	5950 3250 6150 3250
$Comp
L Device:R_Small R32
U 1 1 61B5E4FE
P 5850 3250
F 0 "R32" V 5654 3250 50  0000 C CNN
F 1 "3.9k" V 5745 3250 50  0000 C CNN
F 2 "" H 5850 3250 50  0001 C CNN
F 3 "~" H 5850 3250 50  0001 C CNN
	1    5850 3250
	0    1    -1   0   
$EndComp
$Comp
L CPS2-Custom:C4570HA IC2
U 1 1 61B5E504
P 5800 2950
F 0 "IC2" H 5850 3300 50  0000 C CNN
F 1 "C4570HA" H 5850 3200 50  0000 C CNN
F 2 "" V 5800 3000 50  0001 C CNN
F 3 "" V 5800 3000 50  0001 C CNN
	1    5800 2950
	1    0    0    -1  
$EndComp
Wire Wire Line
	4800 4900 4750 4900
Wire Wire Line
	4800 5650 4750 5650
Wire Wire Line
	4450 5650 4400 5650
Connection ~ 4450 5650
Wire Wire Line
	4450 5750 4450 5650
$Comp
L Device:C_Small C16
U 1 1 61B5E515
P 4450 5850
F 0 "C16" H 4542 5896 50  0000 L CNN
F 1 "560n" H 4542 5805 50  0000 L CNN
F 2 "" H 4450 5850 50  0001 C CNN
F 3 "~" H 4450 5850 50  0001 C CNN
	1    4450 5850
	1    0    0    -1  
$EndComp
Wire Wire Line
	4550 5650 4450 5650
$Comp
L Device:R_Small R22
U 1 1 61B5E51C
P 4650 5650
F 0 "R22" V 4454 5650 50  0000 C CNN
F 1 "2.2k" V 4545 5650 50  0000 C CNN
F 2 "" H 4650 5650 50  0001 C CNN
F 3 "~" H 4650 5650 50  0001 C CNN
	1    4650 5650
	0    1    1    0   
$EndComp
Wire Wire Line
	4550 4900 4400 4900
$Comp
L Device:C_Small C14
U 1 1 61B5E523
P 4650 4900
F 0 "C14" V 4421 4900 50  0000 C CNN
F 1 "68n" V 4512 4900 50  0000 C CNN
F 2 "" H 4650 4900 50  0001 C CNN
F 3 "~" H 4650 4900 50  0001 C CNN
	1    4650 4900
	0    1    1    0   
$EndComp
$Comp
L Device:R_Small R18
U 1 1 61B5E529
P 4300 5650
F 0 "R18" V 4104 5650 50  0000 C CNN
F 1 "2.2k" V 4195 5650 50  0000 C CNN
F 2 "" H 4300 5650 50  0001 C CNN
F 3 "~" H 4300 5650 50  0001 C CNN
	1    4300 5650
	0    1    1    0   
$EndComp
$Comp
L Device:R_Small R20
U 1 1 61B5E52F
P 4300 4900
F 0 "R20" V 4104 4900 50  0000 C CNN
F 1 "2.7k" V 4195 4900 50  0000 C CNN
F 2 "" H 4300 4900 50  0001 C CNN
F 3 "~" H 4300 4900 50  0001 C CNN
	1    4300 4900
	0    1    1    0   
$EndComp
$Comp
L Device:R_Small R8
U 1 1 61B5E535
P 2550 4600
F 0 "R8" H 2491 4646 50  0000 R CNN
F 1 "56k" H 2491 4555 50  0000 R CNN
F 2 "" H 2550 4600 50  0001 C CNN
F 3 "~" H 2550 4600 50  0001 C CNN
	1    2550 4600
	-1   0    0    -1  
$EndComp
$Comp
L Device:R_Small R10
U 1 1 61B5E53B
P 2900 4800
F 0 "R10" V 3096 4800 50  0000 C CNN
F 1 "1k" V 3005 4800 50  0000 C CNN
F 2 "" H 2900 4800 50  0001 C CNN
F 3 "~" H 2900 4800 50  0001 C CNN
	1    2900 4800
	0    1    -1   0   
$EndComp
$Comp
L Device:R_Small R3
U 1 1 61B5E541
P 2050 5000
F 0 "R3" H 1991 4954 50  0000 R CNN
F 1 "12k" H 1991 5045 50  0000 R CNN
F 2 "" H 2050 5000 50  0001 C CNN
F 3 "~" H 2050 5000 50  0001 C CNN
	1    2050 5000
	-1   0    0    1   
$EndComp
$Comp
L Device:CP C1
U 1 1 61B5E547
P 2300 4800
F 0 "C1" V 2555 4800 50  0000 C CNN
F 1 "10u" V 2464 4800 50  0000 C CNN
F 2 "" H 2338 4650 50  0001 C CNN
F 3 "~" H 2300 4800 50  0001 C CNN
	1    2300 4800
	0    -1   -1   0   
$EndComp
Connection ~ 6850 3250
Wire Wire Line
	1600 4800 2050 4800
Wire Wire Line
	2050 4900 2050 4800
Connection ~ 2050 4800
Wire Wire Line
	2050 4800 2150 4800
$Comp
L power:GND #PWR0119
U 1 1 61B5E552
P 2050 5100
F 0 "#PWR0119" H 2050 4850 50  0001 C CNN
F 1 "GND" H 2055 4927 50  0000 C CNN
F 2 "" H 2050 5100 50  0001 C CNN
F 3 "" H 2050 5100 50  0001 C CNN
	1    2050 5100
	1    0    0    -1  
$EndComp
$Comp
L power:GND #PWR0120
U 1 1 61B5E558
P 3050 5100
F 0 "#PWR0120" H 3050 4850 50  0001 C CNN
F 1 "GND" H 3055 4927 50  0000 C CNN
F 2 "" H 3050 5100 50  0001 C CNN
F 3 "" H 3050 5100 50  0001 C CNN
	1    3050 5100
	1    0    0    -1  
$EndComp
Wire Wire Line
	3000 4800 3050 4800
$Comp
L Device:C_Small C8
U 1 1 61B5E55F
P 3050 5000
F 0 "C8" H 3142 5046 50  0000 L CNN
F 1 "47p" H 3142 4955 50  0000 L CNN
F 2 "" H 3050 5000 50  0001 C CNN
F 3 "~" H 3050 5000 50  0001 C CNN
	1    3050 5000
	1    0    0    -1  
$EndComp
Wire Wire Line
	3050 4900 3050 4800
$Comp
L power:GND #PWR0121
U 1 1 61B5E566
P 4450 5950
F 0 "#PWR0121" H 4450 5700 50  0001 C CNN
F 1 "GND" H 4455 5777 50  0000 C CNN
F 2 "" H 4450 5950 50  0001 C CNN
F 3 "" H 4450 5950 50  0001 C CNN
	1    4450 5950
	1    0    0    -1  
$EndComp
$Comp
L Device:R_Small R28
U 1 1 61B5E56D
P 5350 2850
F 0 "R28" V 5154 2850 50  0000 C CNN
F 1 "3.3k" V 5245 2850 50  0000 C CNN
F 2 "" H 5350 2850 50  0001 C CNN
F 3 "~" H 5350 2850 50  0001 C CNN
	1    5350 2850
	0    1    1    0   
$EndComp
Wire Wire Line
	5550 2850 5450 2850
Connection ~ 6150 2950
Wire Wire Line
	6150 2950 6150 3250
Wire Wire Line
	3350 5000 3450 5000
$Comp
L Device:C_Small C10
U 1 1 61B5E57D
P 3800 5350
F 0 "C10" V 3571 5350 50  0000 C CNN
F 1 "150n" V 3662 5350 50  0000 C CNN
F 2 "" H 3800 5350 50  0001 C CNN
F 3 "~" H 3800 5350 50  0001 C CNN
	1    3800 5350
	0    1    1    0   
$EndComp
$Comp
L Device:R_Small R16
U 1 1 61B5E583
P 3950 5650
F 0 "R16" V 3754 5650 50  0000 C CNN
F 1 "15k" V 3845 5650 50  0000 C CNN
F 2 "" H 3950 5650 50  0001 C CNN
F 3 "~" H 3950 5650 50  0001 C CNN
	1    3950 5650
	0    1    1    0   
$EndComp
$Comp
L Device:R_Small R14
U 1 1 61B5E589
P 3700 5650
F 0 "R14" V 3504 5650 50  0000 C CNN
F 1 "15k" V 3595 5650 50  0000 C CNN
F 2 "" H 3700 5650 50  0001 C CNN
F 3 "~" H 3700 5650 50  0001 C CNN
	1    3700 5650
	0    1    1    0   
$EndComp
Wire Wire Line
	4050 5350 3900 5350
Wire Wire Line
	3700 5350 3600 5350
Wire Wire Line
	3800 5650 3850 5650
Connection ~ 4050 5350
Wire Wire Line
	3600 5350 3600 5650
$Comp
L Device:C_Small C12
U 1 1 61B5E594
P 3850 5850
F 0 "C12" H 3942 5896 50  0000 L CNN
F 1 "150n" H 3942 5805 50  0000 L CNN
F 2 "" H 3850 5850 50  0001 C CNN
F 3 "~" H 3850 5850 50  0001 C CNN
	1    3850 5850
	1    0    0    -1  
$EndComp
Wire Wire Line
	3850 5750 3850 5650
Connection ~ 3850 5650
$Comp
L power:GND #PWR0122
U 1 1 61B5E59C
P 3850 5950
F 0 "#PWR0122" H 3850 5700 50  0001 C CNN
F 1 "GND" H 3855 5777 50  0000 C CNN
F 2 "" H 3850 5950 50  0001 C CNN
F 3 "" H 3850 5950 50  0001 C CNN
	1    3850 5950
	1    0    0    -1  
$EndComp
Connection ~ 3600 5650
Wire Wire Line
	3600 5650 3550 5650
Wire Wire Line
	3350 5000 3350 5650
$Comp
L Device:R_Small R12
U 1 1 61B5E5A5
P 3450 5650
F 0 "R12" V 3254 5650 50  0000 C CNN
F 1 "2.7k" V 3345 5650 50  0000 C CNN
F 2 "" H 3450 5650 50  0001 C CNN
F 3 "~" H 3450 5650 50  0001 C CNN
	1    3450 5650
	0    1    1    0   
$EndComp
Connection ~ 4800 4900
Wire Wire Line
	4050 4900 4200 4900
Wire Wire Line
	4050 5650 4200 5650
Wire Wire Line
	4050 4900 4050 5350
Connection ~ 4050 5650
Wire Wire Line
	4050 5350 4050 5650
Wire Wire Line
	4800 4900 4800 5650
Wire Wire Line
	3050 4800 3450 4800
Connection ~ 3050 4800
Wire Wire Line
	6000 4900 5900 4900
Connection ~ 6000 4900
Connection ~ 7500 4800
Wire Wire Line
	7500 4800 7650 4800
Wire Wire Line
	7300 4400 7500 4400
Wire Wire Line
	7500 4400 7500 4800
Wire Wire Line
	2450 4800 2550 4800
Wire Wire Line
	2550 4700 2550 4800
Connection ~ 2550 4800
Wire Wire Line
	2550 4800 2800 4800
Wire Wire Line
	2550 4500 2550 4400
Wire Wire Line
	7200 3200 7200 3250
Wire Wire Line
	6850 3250 6850 3200
Wire Wire Line
	6850 3000 6850 2950
Wire Wire Line
	7200 3000 7200 2950
Wire Wire Line
	6850 2950 7200 2950
Connection ~ 7200 2950
Wire Wire Line
	7200 2950 7400 2950
Connection ~ 7400 3250
Connection ~ 6850 2950
Wire Wire Line
	7800 4100 7800 4000
Wire Wire Line
	7200 4050 7200 4100
Wire Wire Line
	6850 3800 7200 3800
Wire Wire Line
	7200 3850 7200 3800
Connection ~ 7200 3800
Wire Wire Line
	7200 3800 7200 3750
Wire Wire Line
	7200 3550 7200 3250
Wire Wire Line
	6850 4100 7200 4100
$Comp
L Device:CP C30
U 1 1 61B5E5D4
P 7500 2000
F 0 "C30" H 7382 2046 50  0000 R CNN
F 1 "47u" H 7382 1955 50  0000 R CNN
F 2 "" H 7538 1850 50  0001 C CNN
F 3 "~" H 7500 2000 50  0001 C CNN
	1    7500 2000
	1    0    0    -1  
$EndComp
$Comp
L power:GND #PWR0123
U 1 1 61B5E5DA
P 7500 2150
F 0 "#PWR0123" H 7500 1900 50  0001 C CNN
F 1 "GND" H 7505 1977 50  0001 C CNN
F 2 "" H 7500 2150 50  0001 C CNN
F 3 "" H 7500 2150 50  0001 C CNN
	1    7500 2150
	1    0    0    -1  
$EndComp
Wire Wire Line
	7800 1850 7800 2300
Wire Wire Line
	7500 1850 7800 1850
Wire Wire Line
	2550 4400 5150 4400
Wire Wire Line
	5550 3250 5550 4900
Connection ~ 5550 3250
Wire Wire Line
	5150 2850 5150 4400
Wire Wire Line
	5150 2850 5250 2850
Connection ~ 5150 4400
Wire Wire Line
	5150 4400 7100 4400
$Comp
L Device:CP_Small C36
U 1 1 61B5E5EE
P 9250 2650
F 0 "C36" H 9338 2696 50  0000 L CNN
F 1 "220u" H 9338 2605 50  0000 L CNN
F 2 "" H 9250 2650 50  0001 C CNN
F 3 "~" H 9250 2650 50  0001 C CNN
	1    9250 2650
	1    0    0    -1  
$EndComp
Wire Wire Line
	9000 2750 9250 2750
$Comp
L Device:CP_Small C34
U 1 1 61B5E5F5
P 9250 3250
F 0 "C34" H 9162 3204 50  0000 R CNN
F 1 "220u" H 9162 3295 50  0000 R CNN
F 2 "" H 9250 3250 50  0001 C CNN
F 3 "~" H 9250 3250 50  0001 C CNN
	1    9250 3250
	-1   0    0    1   
$EndComp
Wire Wire Line
	9000 3150 9250 3150
Connection ~ 9250 2750
Wire Wire Line
	9250 2750 9600 2750
Wire Wire Line
	9250 2550 9000 2550
Connection ~ 9250 2950
Wire Wire Line
	9250 2950 9800 2950
Wire Wire Line
	9000 2950 9250 2950
Connection ~ 9250 3150
Wire Wire Line
	9250 3150 9600 3150
Wire Wire Line
	9250 3350 9000 3350
Wire Wire Line
	9800 4800 9800 4050
Connection ~ 9600 1850
Wire Wire Line
	9600 1850 9350 1850
Wire Wire Line
	9600 1850 9800 1850
Connection ~ 9600 4050
Wire Wire Line
	9600 4050 9350 4050
Wire Wire Line
	9600 4050 9800 4050
Connection ~ 9800 1850
Connection ~ 9800 2950
Connection ~ 9800 4050
Connection ~ 9800 4800
Wire Wire Line
	7850 4800 9800 4800
Connection ~ 4050 4900
$Comp
L Connector:Conn_Coaxial_x2 PJ1
U 1 1 5FD21904
P 1150 5750
F 0 "PJ1" H 1078 5997 50  0000 C CNN
F 1 "Conn_Coaxial_x2" H 1078 5997 50  0001 C CNN
F 2 "" H 1150 5650 50  0001 C CNN
F 3 " ~" H 1150 5650 50  0001 C CNN
	1    1150 5750
	-1   0    0    -1  
$EndComp
Wire Wire Line
	1350 5850 1600 5850
Wire Wire Line
	1350 5650 1600 5650
Wire Wire Line
	4350 7300 5150 7300
$Comp
L Device:R_Small R7
U 1 1 61DBE60C
P 3250 7300
F 0 "R7" V 3054 7300 50  0000 C CNN
F 1 "1.5k" V 3145 7300 50  0000 C CNN
F 2 "" H 3250 7300 50  0001 C CNN
F 3 "~" H 3250 7300 50  0001 C CNN
	1    3250 7300
	0    1    1    0   
$EndComp
Wire Wire Line
	3350 7300 3450 7300
Connection ~ 3450 7300
$Comp
L power:GND #PWR0125
U 1 1 61E597B5
P 3850 7600
F 0 "#PWR0125" H 3850 7350 50  0001 C CNN
F 1 "GND" H 3855 7427 50  0000 C CNN
F 2 "" H 3850 7600 50  0001 C CNN
F 3 "" H 3850 7600 50  0001 C CNN
	1    3850 7600
	1    0    0    -1  
$EndComp
$Comp
L power:GND #PWR0126
U 1 1 61E5AEDA
P 4350 7600
F 0 "#PWR0126" H 4350 7350 50  0001 C CNN
F 1 "GND" H 4355 7427 50  0000 C CNN
F 2 "" H 4350 7600 50  0001 C CNN
F 3 "" H 4350 7600 50  0001 C CNN
	1    4350 7600
	1    0    0    -1  
$EndComp
Wire Wire Line
	3050 7300 3150 7300
Connection ~ 5550 4900
Wire Wire Line
	4800 4900 4900 4900
Wire Wire Line
	5550 4900 5700 4900
Wire Wire Line
	3450 2900 3450 2850
$Comp
L Device:R_Small R6
U 1 1 61FB374D
P 3250 2850
F 0 "R6" V 3054 2850 50  0000 C CNN
F 1 "1.5k" V 3145 2850 50  0000 C CNN
F 2 "" H 3250 2850 50  0001 C CNN
F 3 "~" H 3250 2850 50  0001 C CNN
	1    3250 2850
	0    1    1    0   
$EndComp
Wire Wire Line
	3350 2850 3450 2850
Connection ~ 3450 2850
$Comp
L power:GND #PWR0127
U 1 1 61FB3755
P 3450 3150
F 0 "#PWR0127" H 3450 2900 50  0001 C CNN
F 1 "GND" H 3455 2977 50  0000 C CNN
F 2 "" H 3450 3150 50  0001 C CNN
F 3 "" H 3450 3150 50  0001 C CNN
	1    3450 3150
	1    0    0    -1  
$EndComp
$Comp
L power:GND #PWR0128
U 1 1 61FB375B
P 3850 3150
F 0 "#PWR0128" H 3850 2900 50  0001 C CNN
F 1 "GND" H 3855 2977 50  0000 C CNN
F 2 "" H 3850 3150 50  0001 C CNN
F 3 "" H 3850 3150 50  0001 C CNN
	1    3850 3150
	1    0    0    -1  
$EndComp
$Comp
L power:GND #PWR0129
U 1 1 61FB3761
P 4350 3150
F 0 "#PWR0129" H 4350 2900 50  0001 C CNN
F 1 "GND" H 4355 2977 50  0000 C CNN
F 2 "" H 4350 3150 50  0001 C CNN
F 3 "" H 4350 3150 50  0001 C CNN
	1    4350 3150
	1    0    0    -1  
$EndComp
Wire Wire Line
	3050 2850 3150 2850
Connection ~ 5150 2850
Wire Wire Line
	4250 2850 4350 2850
Connection ~ 4350 2850
Wire Wire Line
	4350 2850 5150 2850
Wire Wire Line
	10850 6300 10850 5800
Wire Wire Line
	10850 5800 10950 5800
Wire Wire Line
	9800 6300 10850 6300
Wire Wire Line
	10950 5700 10850 5700
Wire Wire Line
	10850 5700 10850 1850
Wire Wire Line
	9800 1850 10850 1850
Wire Wire Line
	1600 5650 1600 4800
Wire Wire Line
	1600 5850 1600 9250
Wire Wire Line
	9800 8250 9800 8500
Wire Wire Line
	9800 4850 9800 4800
$Comp
L Device:R R50
U 1 1 61B5E615
P 9800 5000
F 0 "R50" H 9730 5046 50  0000 R CNN
F 1 "0.1" H 9730 4955 50  0000 R CNN
F 2 "" V 9730 5000 50  0001 C CNN
F 3 "~" H 9800 5000 50  0001 C CNN
	1    9800 5000
	-1   0    0    -1  
$EndComp
Wire Wire Line
	7850 5200 9800 5200
Wire Wire Line
	9800 5150 9800 5200
Wire Wire Line
	10950 5600 10950 5200
Connection ~ 9800 5200
Wire Wire Line
	9800 5200 10950 5200
Wire Wire Line
	10950 5900 10950 9650
Connection ~ 9800 9650
Wire Wire Line
	9800 9650 10950 9650
Wire Wire Line
	7850 9650 9800 9650
Connection ~ 9800 9250
$Comp
L Device:R R51
U 1 1 607A444E
P 9800 9450
F 0 "R51" H 9730 9496 50  0000 R CNN
F 1 "0.1" H 9730 9405 50  0000 R CNN
F 2 "" V 9730 9450 50  0001 C CNN
F 3 "~" H 9800 9450 50  0001 C CNN
	1    9800 9450
	-1   0    0    -1  
$EndComp
Wire Wire Line
	9800 9600 9800 9650
Wire Wire Line
	9800 9300 9800 9250
$Comp
L Device:R_Small R26
U 1 1 61B5E474
P 5800 4900
F 0 "R26" V 5604 4900 50  0000 C CNN
F 1 "2.2k" V 5695 4900 50  0000 C CNN
F 2 "" H 5800 4900 50  0001 C CNN
F 3 "~" H 5800 4900 50  0001 C CNN
	1    5800 4900
	0    1    1    0   
$EndComp
Wire Wire Line
	6300 5200 6350 5200
Wire Wire Line
	6350 5500 6350 5550
Connection ~ 6350 5550
Wire Wire Line
	6000 5550 6000 5500
Wire Wire Line
	6000 5300 6000 5200
Connection ~ 6000 5200
Wire Wire Line
	6350 5200 6350 5300
Connection ~ 6350 5200
Wire Wire Line
	6350 5200 6400 5200
Wire Wire Line
	6300 9650 6350 9650
Wire Wire Line
	6350 9950 6350 10000
Connection ~ 6350 10000
Wire Wire Line
	6000 10000 6000 9950
Wire Wire Line
	6000 9750 6000 9650
Connection ~ 6000 9650
Wire Wire Line
	6350 9650 6350 9750
Connection ~ 6350 9650
Wire Wire Line
	6350 9650 6400 9650
Text Notes 1350 5550 0    50   ~ 0
L-ch
Text Notes 1350 6000 0    50   ~ 0
R-ch
Text Notes 11000 6000 0    50   ~ 0
+
Text Notes 11000 5500 0    50   ~ 0
+
Text Notes 11000 5400 0    50   ~ 0
L-ch
Text Notes 11000 6100 0    50   ~ 0
R-ch
$Comp
L power:VCC #PWR0133
U 1 1 629CE43C
P 3050 2850
F 0 "#PWR0133" H 3050 2700 50  0001 C CNN
F 1 "VCC" H 3065 3023 50  0000 C CNN
F 2 "" H 3050 2850 50  0001 C CNN
F 3 "" H 3050 2850 50  0001 C CNN
	1    3050 2850
	1    0    0    -1  
$EndComp
$Comp
L power:VCC #PWR0134
U 1 1 62A014E0
P 3050 7300
F 0 "#PWR0134" H 3050 7150 50  0001 C CNN
F 1 "VCC" H 3065 7473 50  0000 C CNN
F 2 "" H 3050 7300 50  0001 C CNN
F 3 "" H 3050 7300 50  0001 C CNN
	1    3050 7300
	1    0    0    -1  
$EndComp
$Comp
L power:+12V #PWR0135
U 1 1 62A4EA3C
P 7300 7100
F 0 "#PWR0135" H 7300 6950 50  0001 C CNN
F 1 "+12V" H 7315 7273 50  0000 C CNN
F 2 "" H 7300 7100 50  0001 C CNN
F 3 "" H 7300 7100 50  0001 C CNN
	1    7300 7100
	1    0    0    -1  
$EndComp
Wire Wire Line
	7400 7100 7300 7100
Wire Wire Line
	6850 8550 7200 8550
$Comp
L power:+12V #PWR0136
U 1 1 62AD2ED2
P 6850 8550
F 0 "#PWR0136" H 6850 8400 50  0001 C CNN
F 1 "+12V" H 6865 8723 50  0000 C CNN
F 2 "" H 6850 8550 50  0001 C CNN
F 3 "" H 6850 8550 50  0001 C CNN
	1    6850 8550
	1    0    0    -1  
$EndComp
$Comp
L power:+12V #PWR0137
U 1 1 62AEC3F1
P 7300 2650
F 0 "#PWR0137" H 7300 2500 50  0001 C CNN
F 1 "+12V" H 7315 2823 50  0000 C CNN
F 2 "" H 7300 2650 50  0001 C CNN
F 3 "" H 7300 2650 50  0001 C CNN
	1    7300 2650
	1    0    0    -1  
$EndComp
Wire Wire Line
	7400 2650 7300 2650
$Comp
L power:+12V #PWR0138
U 1 1 62B05B20
P 6850 4100
F 0 "#PWR0138" H 6850 3950 50  0001 C CNN
F 1 "+12V" H 6865 4273 50  0000 C CNN
F 2 "" H 6850 4100 50  0001 C CNN
F 3 "" H 6850 4100 50  0001 C CNN
	1    6850 4100
	1    0    0    -1  
$EndComp
Text Notes 11450 5850 0    50   ~ 0
SPEAKER\nOUTPUT
Text Notes 900  5850 2    50   ~ 0
LINE\nINPUT
$Comp
L Device:D_Zener_Small D2
U 1 1 5FCEF871
P 3450 3000
F 0 "D2" V 3404 3070 50  0000 L CNN
F 1 "7.5V" V 3495 3070 50  0000 L CNN
F 2 "" V 3450 3000 50  0001 C CNN
F 3 "~" V 3450 3000 50  0001 C CNN
	1    3450 3000
	0    1    1    0   
$EndComp
Wire Wire Line
	3450 3100 3450 3150
Connection ~ 3850 2850
Wire Wire Line
	3850 2850 4050 2850
Wire Wire Line
	3450 2850 3850 2850
$Comp
L power:GND #PWR?
U 1 1 5FDA85BB
P 3450 7600
F 0 "#PWR?" H 3450 7350 50  0001 C CNN
F 1 "GND" H 3455 7427 50  0000 C CNN
F 2 "" H 3450 7600 50  0001 C CNN
F 3 "" H 3450 7600 50  0001 C CNN
	1    3450 7600
	1    0    0    -1  
$EndComp
Wire Wire Line
	3450 7550 3450 7600
$Comp
L Device:D_Zener_Small D3
U 1 1 5FDA85C1
P 3450 7450
F 0 "D3" V 3404 7520 50  0000 L CNN
F 1 "7.5V" V 3495 7520 50  0000 L CNN
F 2 "" V 3450 7450 50  0001 C CNN
F 3 "~" V 3450 7450 50  0001 C CNN
	1    3450 7450
	0    1    1    0   
$EndComp
Connection ~ 3850 7300
Wire Wire Line
	3450 7300 3850 7300
$Comp
L Transistor_BJT:2SC1941 Q2
U 1 1 5FDE3E57
P 7700 8250
F 0 "Q2" H 7890 8204 50  0000 L CNN
F 1 "2SC2440" H 7890 8295 50  0000 L CNN
F 2 "Package_TO_SOT_THT:TO-92_Inline" H 7900 8175 50  0001 L CIN
F 3 "http://rtellason.com/transdata/2sc1941.pdf" H 7700 8250 50  0001 L CNN
	1    7700 8250
	1    0    0    1   
$EndComp
Wire Wire Line
	7800 8550 7200 8550
Connection ~ 7200 8550
Wire Wire Line
	7200 8250 7500 8250
$Comp
L Transistor_BJT:2SC1941 Q1
U 1 1 5FED3DC2
P 7700 3800
F 0 "Q1" H 7890 3754 50  0000 L CNN
F 1 "2SC2440" H 7890 3845 50  0000 L CNN
F 2 "Package_TO_SOT_THT:TO-92_Inline" H 7900 3725 50  0001 L CIN
F 3 "http://rtellason.com/transdata/2sc1941.pdf" H 7700 3800 50  0001 L CNN
	1    7700 3800
	1    0    0    1   
$EndComp
Wire Wire Line
	7800 4100 7200 4100
Connection ~ 7200 4100
Wire Wire Line
	7200 3800 7500 3800
Wire Wire Line
	12000 2050 13000 2050
$Comp
L power:PWR_FLAG #FLG0105
U 1 1 62B8F021
P 13950 3150
F 0 "#FLG0105" H 13950 3225 50  0001 C CNN
F 1 "PWR_FLAG" H 13950 3323 50  0001 C CNN
F 2 "" H 13950 3150 50  0001 C CNN
F 3 "~" H 13950 3150 50  0001 C CNN
	1    13950 3150
	1    0    0    -1  
$EndComp
$Comp
L power:+12V #PWR0130
U 1 1 62B8DD8D
P 13450 2850
F 0 "#PWR0130" H 13450 2700 50  0001 C CNN
F 1 "+12V" H 13465 3023 50  0000 C CNN
F 2 "" H 13450 2850 50  0001 C CNN
F 3 "" H 13450 2850 50  0001 C CNN
	1    13450 2850
	1    0    0    -1  
$EndComp
$Comp
L power:PWR_FLAG #FLG0104
U 1 1 62B59129
P 13650 1750
F 0 "#FLG0104" H 13650 1825 50  0001 C CNN
F 1 "PWR_FLAG" H 13650 1923 50  0001 C CNN
F 2 "" H 13650 1750 50  0001 C CNN
F 3 "~" H 13650 1750 50  0001 C CNN
	1    13650 1750
	1    0    0    -1  
$EndComp
Connection ~ 12700 2300
Wire Wire Line
	12700 2300 12600 2300
$Comp
L power:PWR_FLAG #FLG0103
U 1 1 62B3D5FD
P 12600 2300
F 0 "#FLG0103" H 12600 2375 50  0001 C CNN
F 1 "PWR_FLAG" H 12600 2473 50  0001 C CNN
F 2 "" H 12600 2300 50  0001 C CNN
F 3 "~" H 12600 2300 50  0001 C CNN
	1    12600 2300
	1    0    0    -1  
$EndComp
Connection ~ 15250 1750
$Comp
L CPS2-Custom:C4570HA IC3
U 3 1 5FCD4CD4
P 15300 3550
F 0 "IC3" H 15428 3621 50  0000 L CNN
F 1 "C4570HA" H 15428 3530 50  0000 L CNN
F 2 "" V 15300 3600 50  0001 C CNN
F 3 "" V 15300 3600 50  0001 C CNN
	3    15300 3550
	1    0    0    -1  
$EndComp
$Comp
L power:+12V #PWR0132
U 1 1 6298039F
P 15250 1750
F 0 "#PWR0132" H 15250 1600 50  0001 C CNN
F 1 "+12V" H 15265 1923 50  0000 C CNN
F 2 "" H 15250 1750 50  0001 C CNN
F 3 "" H 15250 1750 50  0001 C CNN
	1    15250 1750
	1    0    0    -1  
$EndComp
Text Notes 11550 1150 0    50   ~ 0
~~13.5 VAC Power Supply usage
Text Notes 13750 1650 0    50   ~ 0
12 VDC needed after rectifier
NoConn ~ 15350 3250
NoConn ~ 14700 3250
NoConn ~ 14050 3250
Connection ~ 15250 3150
Wire Wire Line
	15250 3250 15250 3150
Wire Wire Line
	14600 3150 15250 3150
Connection ~ 14600 3150
Wire Wire Line
	14600 3250 14600 3150
Wire Wire Line
	13950 3150 14600 3150
Connection ~ 13950 3150
Wire Wire Line
	13950 3150 13950 3250
Wire Wire Line
	13450 3650 13450 3800
Connection ~ 13450 3150
$Comp
L Device:R R5
U 1 1 621DBB18
P 13450 3000
F 0 "R5" H 13380 2954 50  0000 R CNN
F 1 "22" H 13380 3045 50  0000 R CNN
F 2 "" V 13380 3000 50  0001 C CNN
F 3 "~" H 13450 3000 50  0001 C CNN
	1    13450 3000
	-1   0    0    1   
$EndComp
Connection ~ 13450 3800
$Comp
L power:GND #PWR0131
U 1 1 6219250D
P 13450 3800
F 0 "#PWR0131" H 13450 3550 50  0001 C CNN
F 1 "GND" H 13455 3627 50  0000 C CNN
F 2 "" H 13450 3800 50  0001 C CNN
F 3 "" H 13450 3800 50  0001 C CNN
	1    13450 3800
	1    0    0    -1  
$EndComp
Wire Wire Line
	14650 3800 15300 3800
Wire Wire Line
	14000 3800 14650 3800
Connection ~ 14650 3800
Wire Wire Line
	12000 1450 12200 1450
Connection ~ 12000 1450
Wire Wire Line
	12000 1650 12000 1450
Connection ~ 12000 2050
Wire Wire Line
	12000 1850 12000 2050
Wire Wire Line
	11750 2050 12000 2050
Wire Wire Line
	11750 1450 12000 1450
Wire Wire Line
	11750 1650 11750 1450
Wire Wire Line
	11750 1850 11750 2050
$Comp
L Connector:Conn_01x03_Male CB6
U 1 1 5FCB1D80
P 11550 1750
F 0 "CB6" H 11650 1550 50  0000 C CNN
F 1 "Conn_01x03_Male" H 11658 1940 50  0001 C CNN
F 2 "" H 11550 1750 50  0001 C CNN
F 3 "~" H 11550 1750 50  0001 C CNN
	1    11550 1750
	1    0    0    -1  
$EndComp
Wire Wire Line
	12500 1450 13000 1450
Wire Wire Line
	12700 1750 12700 2300
Wire Wire Line
	13650 1750 14200 1750
Connection ~ 13650 1750
Wire Wire Line
	13300 1750 13650 1750
Wire Wire Line
	13650 1750 13650 1950
Wire Wire Line
	14200 1750 14750 1750
Connection ~ 14200 1750
Wire Wire Line
	14200 1750 14200 1950
Connection ~ 14750 1750
Wire Wire Line
	14750 1750 14750 1950
Wire Wire Line
	13450 3350 13450 3150
$Comp
L Device:CP C5
U 1 1 5FCDBBE3
P 13450 3500
F 0 "C5" H 13568 3546 50  0000 L CNN
F 1 "1000u" H 13568 3455 50  0000 L CNN
F 2 "" H 13488 3350 50  0001 C CNN
F 3 "~" H 13450 3500 50  0001 C CNN
	1    13450 3500
	1    0    0    -1  
$EndComp
$Comp
L CPS2-Custom:C4570HA IC2
U 3 1 5FCD3F2E
P 14650 3550
F 0 "IC2" H 14778 3621 50  0000 L CNN
F 1 "C4570HA" H 14778 3530 50  0000 L CNN
F 2 "" V 14650 3600 50  0001 C CNN
F 3 "" V 14650 3600 50  0001 C CNN
	3    14650 3550
	1    0    0    -1  
$EndComp
$Comp
L CPS2-Custom:C4570HA IC1
U 3 1 5FCD198A
P 14000 3550
F 0 "IC1" H 14128 3621 50  0000 L CNN
F 1 "C4570HA" H 14128 3530 50  0000 L CNN
F 2 "" V 14000 3600 50  0001 C CNN
F 3 "" V 14000 3600 50  0001 C CNN
	3    14000 3550
	1    0    0    -1  
$EndComp
$Comp
L power:VCC #PWR0102
U 1 1 5FCC8E66
P 15250 3150
F 0 "#PWR0102" H 15250 3000 50  0001 C CNN
F 1 "VCC" H 15265 3323 50  0000 C CNN
F 2 "" H 15250 3150 50  0001 C CNN
F 3 "" H 15250 3150 50  0001 C CNN
	1    15250 3150
	1    0    0    -1  
$EndComp
Connection ~ 15250 2300
$Comp
L power:GND #PWR0101
U 1 1 5FCC83B1
P 15250 2300
F 0 "#PWR0101" H 15250 2050 50  0001 C CNN
F 1 "GND" H 15255 2127 50  0000 C CNN
F 2 "" H 15250 2300 50  0001 C CNN
F 3 "" H 15250 2300 50  0001 C CNN
	1    15250 2300
	1    0    0    -1  
$EndComp
Wire Wire Line
	15250 1750 14750 1750
Connection ~ 14750 2300
Wire Wire Line
	15250 2300 14750 2300
Wire Wire Line
	15250 2050 15250 2100
$Comp
L Device:R_Small R70
U 1 1 5FCBDBFE
P 15250 2200
F 0 "R70" H 15309 2246 50  0000 L CNN
F 1 "3.3k" H 15309 2155 50  0000 L CNN
F 2 "" H 15250 2200 50  0001 C CNN
F 3 "~" H 15250 2200 50  0001 C CNN
	1    15250 2200
	1    0    0    -1  
$EndComp
$Comp
L Device:LED D4
U 1 1 5FCBC1E8
P 15250 1900
F 0 "D4" V 15289 1782 50  0000 R CNN
F 1 "LED" V 15198 1782 50  0000 R CNN
F 2 "" H 15250 1900 50  0001 C CNN
F 3 "~" H 15250 1900 50  0001 C CNN
	1    15250 1900
	0    -1   -1   0   
$EndComp
Connection ~ 14200 2300
Wire Wire Line
	14750 2300 14750 2250
Wire Wire Line
	14200 2300 14750 2300
$Comp
L Device:CP C33
U 1 1 5FCBA2AE
P 14750 2100
F 0 "C33" H 14868 2146 50  0000 L CNN
F 1 "470u" H 14868 2055 50  0000 L CNN
F 2 "" H 14788 1950 50  0001 C CNN
F 3 "~" H 14750 2100 50  0001 C CNN
	1    14750 2100
	1    0    0    -1  
$EndComp
Connection ~ 13650 2300
Wire Wire Line
	14200 2300 13650 2300
Wire Wire Line
	14200 2250 14200 2300
$Comp
L Device:CP C32
U 1 1 5FCB9687
P 14200 2100
F 0 "C32" H 14318 2146 50  0000 L CNN
F 1 "470u" H 14318 2055 50  0000 L CNN
F 2 "" H 14238 1950 50  0001 C CNN
F 3 "~" H 14200 2100 50  0001 C CNN
	1    14200 2100
	1    0    0    -1  
$EndComp
Wire Wire Line
	13650 2300 13650 2250
$Comp
L Device:CP C4
U 1 1 5FCB8B7A
P 13650 2100
F 0 "C4" H 13768 2146 50  0000 L CNN
F 1 "4700u" H 13768 2055 50  0000 L CNN
F 2 "" H 13688 1950 50  0001 C CNN
F 3 "~" H 13650 2100 50  0001 C CNN
	1    13650 2100
	1    0    0    -1  
$EndComp
Wire Wire Line
	12700 2300 13650 2300
$Comp
L Device:C_Small C3
U 1 1 5FCB7921
P 12000 1750
F 0 "C3" H 12092 1796 50  0000 L CNN
F 1 "10n" H 12092 1705 50  0000 L CNN
F 2 "" H 12000 1750 50  0001 C CNN
F 3 "~" H 12000 1750 50  0001 C CNN
	1    12000 1750
	1    0    0    -1  
$EndComp
$Comp
L Device:Fuse F1
U 1 1 5FCB2F6B
P 12350 1450
F 0 "F1" V 12153 1450 50  0000 C CNN
F 1 "6A 125V" V 12244 1450 50  0000 C CNN
F 2 "" V 12280 1450 50  0001 C CNN
F 3 "~" H 12350 1450 50  0001 C CNN
	1    12350 1450
	0    1    1    0   
$EndComp
NoConn ~ 11750 1750
$Comp
L Device:D_Bridge_+AA- D1
U 1 1 5FCB0C5A
P 13000 1750
F 0 "D1" H 13150 1550 50  0000 L CNN
F 1 "D3SBA20" H 13150 1450 50  0000 L CNN
F 2 "" H 13000 1750 50  0001 C CNN
F 3 "~" H 13000 1750 50  0001 C CNN
	1    13000 1750
	1    0    0    -1  
$EndComp
Text Notes 11550 3150 0    50   ~ 0
Note: on CAPCOM Impress cabinets,\nThis part is slightly moded to use\nthe +12VDC coming from JAMMA.\n\nD1 is removed and a coil is put\nbetween the pins 1 and 2 of D1\n\n+12VDC then comes from pin 1 of CB6\nGND comes from the speaker inputs
Wire Notes Line
	11350 600  11350 4200
Wire Notes Line
	11350 4200 15950 4200
Wire Notes Line
	15950 4200 15950 600 
Wire Notes Line
	15950 600  11350 600 
Text Notes 15900 800  2    100  ~ 0
POWER SUPPLY
Wire Wire Line
	13450 3150 13950 3150
Wire Wire Line
	13450 3800 14000 3800
Connection ~ 14000 3800
$EndSCHEMATC
