EESchema Schematic File Version 4
EELAYER 30 0
EELAYER END
$Descr A3 16535 11693
encoding utf-8
Sheet 57 83
Title "CPS Reverse Engineering: DL-0311"
Date "2021-09-12"
Rev ""
Comp ""
Comment1 ""
Comment2 ""
Comment3 "Licence: CC-BY"
Comment4 "Author: Loïc *WydD* Petit"
$EndDescr
Connection ~ 7250 8600
Connection ~ 7350 9150
Connection ~ 7350 8500
Connection ~ 8050 8550
Connection ~ 6850 9150
Connection ~ 8250 8750
Connection ~ 8150 8650
Connection ~ 8350 7350
Connection ~ 8250 7250
Connection ~ 8350 8100
Connection ~ 8250 8000
Connection ~ 7750 6450
Connection ~ 7750 6550
Connection ~ 7350 4250
Connection ~ 8350 6800
Connection ~ 5000 7700
Connection ~ 6150 7950
Connection ~ 5000 8350
Connection ~ 5100 7900
Connection ~ 5000 9000
Connection ~ 5100 8550
Connection ~ 5100 9200
Connection ~ 7250 7300
Connection ~ 7050 7850
Connection ~ 6150 8600
Connection ~ 6150 9250
Connection ~ 7350 7200
Connection ~ 7150 7200
Connection ~ 6950 8500
Connection ~ 8150 7900
Connection ~ 7250 7950
Connection ~ 7350 7850
Connection ~ 3900 9200
Connection ~ 8150 3000
Connection ~ 8250 3100
Connection ~ 8250 2350
Connection ~ 8350 2450
Connection ~ 7350 2950
Connection ~ 7350 2300
Connection ~ 5000 4100
Connection ~ 5100 3650
Connection ~ 5000 3450
Connection ~ 6150 3050
Connection ~ 5000 2800
Connection ~ 5100 3000
Connection ~ 3900 4300
Connection ~ 5100 4300
Connection ~ 7250 2400
Connection ~ 7250 3050
Connection ~ 7050 2950
Connection ~ 7150 2300
Connection ~ 8350 1900
Connection ~ 7750 1650
Connection ~ 6150 4350
Connection ~ 6150 3700
Connection ~ 6950 3600
Connection ~ 7250 3700
Connection ~ 7350 3600
Connection ~ 6850 4250
Connection ~ 8150 3750
Connection ~ 8250 3850
Connection ~ 8050 3650
Connection ~ 8350 3200
Connection ~ 7750 1550
Connection ~ 12750 3900
Connection ~ 10300 5600
NoConn ~ 6750 9050
NoConn ~ 6750 7100
NoConn ~ 6750 8400
NoConn ~ 6750 7750
NoConn ~ 9600 9450
NoConn ~ 2900 9250
NoConn ~ 6750 2850
NoConn ~ 6750 2200
NoConn ~ 6750 3500
NoConn ~ 6750 4150
NoConn ~ 9600 4550
NoConn ~ 1950 9250
Entry Wire Line
	4000 2050 3900 1950
Entry Wire Line
	4000 2700 3900 2600
Entry Wire Line
	4000 3350 3900 3250
Entry Wire Line
	4000 3650 3900 3550
Entry Wire Line
	4000 6950 3900 6850
Entry Wire Line
	4000 7600 3900 7500
Entry Wire Line
	4000 8250 3900 8150
Entry Wire Line
	4000 8550 3900 8450
Entry Wire Line
	8800 5050 8900 5150
Entry Wire Line
	8800 5150 8900 5250
Entry Wire Line
	8800 5250 8900 5350
Entry Wire Line
	8800 5350 8900 5450
Entry Wire Line
	8800 9950 8900 9850
Entry Wire Line
	8800 10050 8900 9950
Entry Wire Line
	8800 10150 8900 10050
Entry Wire Line
	8800 10250 8900 10150
Entry Wire Line
	11150 2700 11250 2800
Entry Wire Line
	11150 2800 11250 2900
Entry Wire Line
	11150 2900 11250 3000
Entry Wire Line
	11150 3000 11250 3100
Entry Wire Line
	11150 3700 11250 3800
Entry Wire Line
	13350 2800 13450 2900
Entry Wire Line
	13350 2900 13450 3000
Entry Wire Line
	13350 3000 13450 3100
Entry Wire Line
	13350 3100 13450 3200
Entry Wire Line
	13350 3800 13450 3900
Wire Wire Line
	1950 9150 2400 9150
Wire Wire Line
	2900 9150 3100 9150
Wire Wire Line
	3100 9600 3000 9600
Wire Wire Line
	3100 9600 3100 9250
Wire Wire Line
	3900 4100 3900 4300
Wire Wire Line
	3900 4300 3650 4300
Wire Wire Line
	3900 9000 3900 9200
Wire Wire Line
	3900 9200 3650 9200
Wire Wire Line
	4000 2050 5200 2050
Wire Wire Line
	4000 2700 5200 2700
Wire Wire Line
	4000 3350 5200 3350
Wire Wire Line
	4000 3650 4800 3650
Wire Wire Line
	4000 6950 5200 6950
Wire Wire Line
	4000 7600 5200 7600
Wire Wire Line
	4000 8250 5200 8250
Wire Wire Line
	4000 8550 4800 8550
Wire Wire Line
	4500 4100 5000 4100
Wire Wire Line
	4500 9000 5000 9000
Wire Wire Line
	4600 900  4600 4200
Wire Wire Line
	4600 900  10100 900 
Wire Wire Line
	4600 4200 5200 4200
Wire Wire Line
	4600 5800 4600 9100
Wire Wire Line
	4600 5800 10100 5800
Wire Wire Line
	4600 9100 5200 9100
Wire Wire Line
	4700 1000 4700 3550
Wire Wire Line
	4700 1000 10000 1000
Wire Wire Line
	4700 3550 5200 3550
Wire Wire Line
	4700 5900 4700 8450
Wire Wire Line
	4700 5900 10000 5900
Wire Wire Line
	4700 8450 5200 8450
Wire Wire Line
	4800 1100 4800 2900
Wire Wire Line
	4800 1100 9900 1100
Wire Wire Line
	4800 2900 5200 2900
Wire Wire Line
	4800 3650 4800 4000
Wire Wire Line
	4800 4000 5200 4000
Wire Wire Line
	4800 6000 4800 7800
Wire Wire Line
	4800 6000 9900 6000
Wire Wire Line
	4800 7800 5200 7800
Wire Wire Line
	4800 8900 4800 8550
Wire Wire Line
	4900 1200 4900 2250
Wire Wire Line
	4900 1200 9800 1200
Wire Wire Line
	4900 2250 5200 2250
Wire Wire Line
	4900 6100 4900 7150
Wire Wire Line
	4900 6100 9800 6100
Wire Wire Line
	4900 7150 5200 7150
Wire Wire Line
	5000 2150 5000 2800
Wire Wire Line
	5000 2800 5000 3450
Wire Wire Line
	5000 3450 5000 4100
Wire Wire Line
	5000 4100 5200 4100
Wire Wire Line
	5000 7050 5000 7700
Wire Wire Line
	5000 7700 5000 8350
Wire Wire Line
	5000 8350 5000 9000
Wire Wire Line
	5000 9000 5200 9000
Wire Wire Line
	5100 2350 5200 2350
Wire Wire Line
	5100 3000 5100 2350
Wire Wire Line
	5100 3650 5100 3000
Wire Wire Line
	5100 4300 3900 4300
Wire Wire Line
	5100 4300 5100 3650
Wire Wire Line
	5100 7250 5200 7250
Wire Wire Line
	5100 7900 5100 7250
Wire Wire Line
	5100 8550 5100 7900
Wire Wire Line
	5100 9200 3900 9200
Wire Wire Line
	5100 9200 5100 8550
Wire Wire Line
	5200 2150 5000 2150
Wire Wire Line
	5200 2800 5000 2800
Wire Wire Line
	5200 3000 5100 3000
Wire Wire Line
	5200 3450 5000 3450
Wire Wire Line
	5200 3650 5100 3650
Wire Wire Line
	5200 4300 5100 4300
Wire Wire Line
	5200 7050 5000 7050
Wire Wire Line
	5200 7700 5000 7700
Wire Wire Line
	5200 7900 5100 7900
Wire Wire Line
	5200 8350 5000 8350
Wire Wire Line
	5200 8550 5100 8550
Wire Wire Line
	5200 8900 4800 8900
Wire Wire Line
	5200 9200 5100 9200
Wire Wire Line
	6050 4450 6150 4450
Wire Wire Line
	6050 9350 6150 9350
Wire Wire Line
	6150 2400 6150 3050
Wire Wire Line
	6150 3050 6150 3700
Wire Wire Line
	6150 3700 6150 4350
Wire Wire Line
	6150 4350 6150 4450
Wire Wire Line
	6150 4350 6250 4350
Wire Wire Line
	6150 7300 6150 7950
Wire Wire Line
	6150 7950 6150 8600
Wire Wire Line
	6150 8600 6150 9250
Wire Wire Line
	6150 9250 6150 9350
Wire Wire Line
	6150 9250 6250 9250
Wire Wire Line
	6250 2200 6050 2200
Wire Wire Line
	6250 2400 6150 2400
Wire Wire Line
	6250 2850 6050 2850
Wire Wire Line
	6250 3050 6150 3050
Wire Wire Line
	6250 3500 6050 3500
Wire Wire Line
	6250 3700 6150 3700
Wire Wire Line
	6250 4150 6050 4150
Wire Wire Line
	6250 7100 6050 7100
Wire Wire Line
	6250 7300 6150 7300
Wire Wire Line
	6250 7750 6050 7750
Wire Wire Line
	6250 7950 6150 7950
Wire Wire Line
	6250 8400 6050 8400
Wire Wire Line
	6250 8600 6150 8600
Wire Wire Line
	6250 9050 6050 9050
Wire Wire Line
	6750 2300 7150 2300
Wire Wire Line
	6750 2950 7050 2950
Wire Wire Line
	6750 4250 6850 4250
Wire Wire Line
	6750 5500 7350 5500
Wire Wire Line
	6750 7200 7150 7200
Wire Wire Line
	6750 7850 7050 7850
Wire Wire Line
	6750 9150 6850 9150
Wire Wire Line
	6750 10400 7350 10400
Wire Wire Line
	6850 4250 6850 5350
Wire Wire Line
	6850 9150 6850 10250
Wire Wire Line
	6950 3600 6750 3600
Wire Wire Line
	6950 3600 6950 5250
Wire Wire Line
	6950 5250 7350 5250
Wire Wire Line
	6950 8500 6750 8500
Wire Wire Line
	6950 8500 6950 10150
Wire Wire Line
	6950 10150 7350 10150
Wire Wire Line
	7050 2950 7050 5150
Wire Wire Line
	7050 7850 7050 10050
Wire Wire Line
	7150 2300 7150 5050
Wire Wire Line
	7150 2300 7350 2300
Wire Wire Line
	7150 7200 7150 9950
Wire Wire Line
	7150 7200 7350 7200
Wire Wire Line
	7250 1800 7100 1800
Wire Wire Line
	7250 1800 7250 2400
Wire Wire Line
	7250 2400 7350 2400
Wire Wire Line
	7250 3050 7250 2400
Wire Wire Line
	7250 3700 7250 3050
Wire Wire Line
	7250 4350 7250 3700
Wire Wire Line
	7250 6700 7100 6700
Wire Wire Line
	7250 6700 7250 7300
Wire Wire Line
	7250 7300 7350 7300
Wire Wire Line
	7250 7950 7250 7300
Wire Wire Line
	7250 8600 7250 7950
Wire Wire Line
	7250 9250 7250 8600
Wire Wire Line
	7350 2000 7350 2300
Wire Wire Line
	7350 2000 9250 2000
Wire Wire Line
	7350 2550 7350 2950
Wire Wire Line
	7350 2550 9100 2550
Wire Wire Line
	7350 2950 7050 2950
Wire Wire Line
	7350 3050 7250 3050
Wire Wire Line
	7350 3300 7350 3600
Wire Wire Line
	7350 3600 6950 3600
Wire Wire Line
	7350 3700 7250 3700
Wire Wire Line
	7350 4000 7350 4250
Wire Wire Line
	7350 4250 6850 4250
Wire Wire Line
	7350 4350 7250 4350
Wire Wire Line
	7350 5050 7150 5050
Wire Wire Line
	7350 5150 7050 5150
Wire Wire Line
	7350 5350 6850 5350
Wire Wire Line
	7350 6900 7350 7200
Wire Wire Line
	7350 6900 9250 6900
Wire Wire Line
	7350 7450 7350 7850
Wire Wire Line
	7350 7450 9100 7450
Wire Wire Line
	7350 7850 7050 7850
Wire Wire Line
	7350 7950 7250 7950
Wire Wire Line
	7350 8200 7350 8500
Wire Wire Line
	7350 8500 6950 8500
Wire Wire Line
	7350 8600 7250 8600
Wire Wire Line
	7350 8900 7350 9150
Wire Wire Line
	7350 9150 6850 9150
Wire Wire Line
	7350 9250 7250 9250
Wire Wire Line
	7350 9950 7150 9950
Wire Wire Line
	7350 10050 7050 10050
Wire Wire Line
	7350 10250 6850 10250
Wire Wire Line
	7650 1550 7750 1550
Wire Wire Line
	7750 1550 7750 1650
Wire Wire Line
	7750 1650 7750 1900
Wire Wire Line
	7750 1900 7950 1900
Wire Wire Line
	7750 6450 7750 6550
Wire Wire Line
	7750 6550 7750 6800
Wire Wire Line
	7750 6800 7950 6800
Wire Wire Line
	7900 2350 8250 2350
Wire Wire Line
	7900 3000 8150 3000
Wire Wire Line
	7900 7250 8250 7250
Wire Wire Line
	7900 7900 8150 7900
Wire Wire Line
	7950 1900 7950 4400
Wire Wire Line
	7950 4400 8450 4400
Wire Wire Line
	7950 6800 7950 9300
Wire Wire Line
	7950 9300 8450 9300
Wire Wire Line
	8050 3650 7900 3650
Wire Wire Line
	8050 3650 8050 4500
Wire Wire Line
	8050 4500 9000 4500
Wire Wire Line
	8050 8550 7900 8550
Wire Wire Line
	8050 9400 8050 8550
Wire Wire Line
	8050 9400 9000 9400
Wire Wire Line
	8150 3000 8450 3000
Wire Wire Line
	8150 3750 8150 3000
Wire Wire Line
	8150 4600 8150 3750
Wire Wire Line
	8150 4600 9000 4600
Wire Wire Line
	8150 7900 8450 7900
Wire Wire Line
	8150 8650 8150 7900
Wire Wire Line
	8150 8650 8150 9500
Wire Wire Line
	8150 9500 9000 9500
Wire Wire Line
	8250 2350 8450 2350
Wire Wire Line
	8250 3100 8250 2350
Wire Wire Line
	8250 3850 8250 3100
Wire Wire Line
	8250 3850 8250 4700
Wire Wire Line
	8250 7250 8450 7250
Wire Wire Line
	8250 8000 8250 7250
Wire Wire Line
	8250 8750 8250 8000
Wire Wire Line
	8250 9600 8250 8750
Wire Wire Line
	8350 1600 8300 1600
Wire Wire Line
	8350 1600 8350 1900
Wire Wire Line
	8350 1900 8350 2450
Wire Wire Line
	8350 2450 8350 3200
Wire Wire Line
	8350 3200 8350 3950
Wire Wire Line
	8350 3200 8450 3200
Wire Wire Line
	8350 3950 8450 3950
Wire Wire Line
	8350 6500 8300 6500
Wire Wire Line
	8350 6500 8350 6800
Wire Wire Line
	8350 6800 8350 7350
Wire Wire Line
	8350 7350 8350 8100
Wire Wire Line
	8350 8100 8350 8850
Wire Wire Line
	8350 8100 8450 8100
Wire Wire Line
	8350 8850 8450 8850
Wire Wire Line
	8450 2450 8350 2450
Wire Wire Line
	8450 3100 8250 3100
Wire Wire Line
	8450 3650 8050 3650
Wire Wire Line
	8450 3750 8150 3750
Wire Wire Line
	8450 3850 8250 3850
Wire Wire Line
	8450 4300 7900 4300
Wire Wire Line
	8450 7350 8350 7350
Wire Wire Line
	8450 8000 8250 8000
Wire Wire Line
	8450 8550 8050 8550
Wire Wire Line
	8450 8650 8150 8650
Wire Wire Line
	8450 8750 8250 8750
Wire Wire Line
	8450 9200 7900 9200
Wire Wire Line
	8800 5050 8350 5050
Wire Wire Line
	8800 5150 8350 5150
Wire Wire Line
	8800 5250 8350 5250
Wire Wire Line
	8800 5350 8350 5350
Wire Wire Line
	8800 9950 8350 9950
Wire Wire Line
	8800 10050 8350 10050
Wire Wire Line
	8800 10150 8350 10150
Wire Wire Line
	8800 10250 8350 10250
Wire Wire Line
	9000 4350 9000 4400
Wire Wire Line
	9000 4700 8250 4700
Wire Wire Line
	9000 9300 9000 9250
Wire Wire Line
	9000 9600 8250 9600
Wire Wire Line
	9100 2500 9100 2550
Wire Wire Line
	9100 7400 9100 7450
Wire Wire Line
	9150 3200 9150 3300
Wire Wire Line
	9150 3300 7350 3300
Wire Wire Line
	9150 3900 9150 4000
Wire Wire Line
	9150 4000 7350 4000
Wire Wire Line
	9150 8100 9150 8200
Wire Wire Line
	9150 8200 7350 8200
Wire Wire Line
	9150 8800 9150 8900
Wire Wire Line
	9150 8900 7350 8900
Wire Wire Line
	9250 1900 8350 1900
Wire Wire Line
	9250 2400 9000 2400
Wire Wire Line
	9250 2500 9100 2500
Wire Wire Line
	9250 3100 9000 3100
Wire Wire Line
	9250 3200 9150 3200
Wire Wire Line
	9250 3800 9050 3800
Wire Wire Line
	9250 3900 9150 3900
Wire Wire Line
	9250 6800 8350 6800
Wire Wire Line
	9250 7300 9000 7300
Wire Wire Line
	9250 7400 9100 7400
Wire Wire Line
	9250 8000 9000 8000
Wire Wire Line
	9250 8100 9150 8100
Wire Wire Line
	9250 8700 9050 8700
Wire Wire Line
	9250 8800 9150 8800
Wire Wire Line
	9800 1950 9800 1200
Wire Wire Line
	9800 2450 9900 2450
Wire Wire Line
	9800 3150 10000 3150
Wire Wire Line
	9800 3850 10100 3850
Wire Wire Line
	9800 6850 9800 6100
Wire Wire Line
	9800 7350 9900 7350
Wire Wire Line
	9800 8050 10000 8050
Wire Wire Line
	9800 8750 10100 8750
Wire Wire Line
	9900 1100 9900 2450
Wire Wire Line
	9900 6000 9900 7350
Wire Wire Line
	10000 1000 10000 3150
Wire Wire Line
	10000 5900 10000 8050
Wire Wire Line
	10100 900  10100 3850
Wire Wire Line
	10100 5800 10100 8750
Wire Wire Line
	11900 3450 11900 3250
Wire Wire Line
	11900 3450 12750 3450
Wire Wire Line
	12550 3900 12750 3900
Wire Wire Line
	12650 3800 13350 3800
Wire Wire Line
	12650 4100 12750 4100
Wire Wire Line
	12750 3900 12750 3450
Wire Wire Line
	12750 4100 12750 3900
Wire Wire Line
	13350 2800 12900 2800
Wire Wire Line
	13350 2900 12900 2900
Wire Wire Line
	13350 3000 12900 3000
Wire Wire Line
	13350 3100 12900 3100
Wire Bus Line
	3900 1850 3800 1850
Wire Bus Line
	3900 6750 3800 6750
Wire Bus Line
	8900 9750 10300 9750
Wire Bus Line
	10300 5600 8900 5600
Wire Bus Line
	10300 9750 10300 5600
Text Notes 3750 2850 1    50   ~ 0
SPRITE-HI
Text Notes 3800 7950 1    50   ~ 0
SPRITE-LO
Text Notes 4500 1100 2    50   ~ 0
INC when\nSPRITE-X-READY & LI
Text Notes 4500 1400 2    50   ~ 0
LOAD WHEN\nSPRITE BLOCK READY & Synced [BUS-SPRITE-TILE]
Text Notes 4500 6050 2    50   ~ 0
INC when\nTOGGLE & LI
Text Notes 4500 6350 2    50   ~ 0
LOAD WHEN\nNOT TOGGLE OR Synced [X-READY & BUS-SPRITE-END]
Text Notes 6450 6500 2    50   ~ 0
- X FLIP\n+ ~X FLIP
Text Notes 6550 1650 2    50   ~ 0
- Y FLIP\n+ ~Y FLIP
Text Notes 8700 6500 0    50   ~ 0
INC when\nTOGGLE & LI
Text Label 4050 2050 0    50   ~ 0
TILE-YOFF3
Text Label 4050 2700 0    50   ~ 0
TILE-YOFF2
Text Label 4050 3350 0    50   ~ 0
TILE-YOFF1
Text Label 4050 3650 0    50   ~ 0
TILE-YOFF0
Text Label 4050 6950 0    50   ~ 0
TILE-XOFF3
Text Label 4050 7600 0    50   ~ 0
TILE-XOFF2
Text Label 4050 8250 0    50   ~ 0
TILE-XOFF1
Text Label 4050 8550 0    50   ~ 0
TILE-XOFF0
Text Label 8700 5050 2    50   ~ 0
ADDR5
Text Label 8700 5150 2    50   ~ 0
ADDR6
Text Label 8700 5250 2    50   ~ 0
ADDR7
Text Label 8700 5350 2    50   ~ 0
ADDR8
Text Label 8700 9950 2    50   ~ 0
ADDR1
Text Label 8700 10050 2    50   ~ 0
ADDR2
Text Label 8700 10150 2    50   ~ 0
ADDR3
Text Label 8700 10250 2    50   ~ 0
ADDR4
Text Label 12950 3800 0    50   ~ 0
ADDR9
Text Label 13250 2800 2    50   ~ 0
ADDR13
Text Label 13250 2900 2    50   ~ 0
ADDR12
Text Label 13250 3000 2    50   ~ 0
ADDR11
Text Label 13250 3100 2    50   ~ 0
ADDR10
Text HLabel 1450 9150 0    50   Input ~ 0
ATTR-LOOKUP
Text HLabel 1450 9350 0    50   Input ~ 0
~CLK4M
Text HLabel 2400 9350 0    50   Input ~ 0
~CLK4M
Text HLabel 3000 9600 0    50   Input ~ 0
~SPRITE-X-READY-SYNC
Text HLabel 3100 4250 0    50   Input ~ 0
BUS-SPRITE-TILE-SYNC
Text HLabel 3100 4350 0    50   Input ~ 0
SPRITE-BLOCK-READY
Text HLabel 3800 1850 0    50   Input ~ 0
TILE-YOFF[0..3]
Text HLabel 3800 6750 0    50   Input ~ 0
TILE-XOFF[0..3]
Text HLabel 6050 4450 0    50   Input ~ 0
~CLK4M
Text HLabel 6050 9350 0    50   Input ~ 0
~CLK4M
Text HLabel 6750 5500 0    50   Input ~ 0
~BUS-SPRITE-LOOKUP
Text HLabel 6750 10400 0    50   Input ~ 0
~BUS-SPRITE-LOOKUP
Text HLabel 7100 1800 0    50   Input ~ 0
~ATTR-YFLIP
Text HLabel 7100 6700 0    50   Input ~ 0
~ATTR-XFLIP
Text HLabel 7200 6400 0    50   Input ~ 0
ATTR-LOOKUP
Text HLabel 7200 6500 0    50   Input ~ 0
LI
Text HLabel 7650 1550 0    50   Input ~ 0
~SPRITE-X-READY-SYNC
Text HLabel 12650 4100 0    50   Input ~ 0
~BUS-SPRITE-LOOKUP
Text HLabel 13900 5600 2    50   3State ~ 0
ADDR[1..13]
$Comp
L A5C:TINVBF UCB?
U 1 1 61B30BDC
P 12450 3800
AR Path="/611554F0/61B30BDC" Ref="UCB?"  Part="1" 
AR Path="/61B30BDC" Ref="UCB?"  Part="1" 
AR Path="/6123A74D/61B30BDC" Ref="UCB171"  Part="1" 
AR Path="/612CA5FA/612CAE0A/61B30BDC" Ref="UCB171"  Part="1" 
F 0 "UCB171" H 12450 4065 50  0000 C CNN
F 1 "TINVBF" H 12450 3974 50  0000 C CNN
F 2 "" H 11950 3750 50  0001 C CNN
F 3 "" H 11950 3750 50  0001 C CNN
	1    12450 3800
	1    0    0    -1  
$EndComp
$Comp
L A5C:NAND02 UAD211
U 1 1 61118D1D
P 3350 4300
F 0 "UAD211" H 3375 4567 50  0000 C CNN
F 1 "NAND02" H 3375 4476 50  0000 C CNN
F 2 "" H 3350 4300 50  0001 C CNN
F 3 "" H 3350 4300 50  0001 C CNN
	1    3350 4300
	1    0    0    -1  
$EndComp
$Comp
L A5C:AND02 UAB348
U 1 1 61118CD3
P 3350 9200
F 0 "UAB348" H 3375 9467 50  0000 C CNN
F 1 "AND02" H 3375 9376 50  0000 C CNN
F 2 "" H 3350 9200 50  0001 C CNN
F 3 "" H 3350 9200 50  0001 C CNN
	1    3350 9200
	1    0    0    -1  
$EndComp
$Comp
L A5C:NAND02 UAC374
U 1 1 61118D1E
P 7450 6450
F 0 "UAC374" H 7475 6717 50  0000 C CNN
F 1 "NAND02" H 7475 6626 50  0000 C CNN
F 2 "" H 7450 6450 50  0001 C CNN
F 3 "" H 7450 6450 50  0001 C CNN
	1    7450 6450
	1    0    0    -1  
$EndComp
$Comp
L A5C:XNOR02 UBD89
U 1 1 61118D14
P 7600 2350
F 0 "UBD89" H 7625 2617 50  0000 C CNN
F 1 "XNOR02" H 7625 2526 50  0000 C CNN
F 2 "" H 7625 2350 50  0001 C CNN
F 3 "" H 7625 2350 50  0001 C CNN
	1    7600 2350
	1    0    0    -1  
$EndComp
$Comp
L A5C:XNOR02 UBD68
U 1 1 61118D15
P 7600 3000
F 0 "UBD68" H 7625 3267 50  0000 C CNN
F 1 "XNOR02" H 7625 3176 50  0000 C CNN
F 2 "" H 7625 3000 50  0001 C CNN
F 3 "" H 7625 3000 50  0001 C CNN
	1    7600 3000
	1    0    0    -1  
$EndComp
$Comp
L A5C:XNOR02 UBD86
U 1 1 61118D23
P 7600 3650
F 0 "UBD86" H 7625 3917 50  0000 C CNN
F 1 "XNOR02" H 7625 3826 50  0000 C CNN
F 2 "" H 7625 3650 50  0001 C CNN
F 3 "" H 7625 3650 50  0001 C CNN
	1    7600 3650
	1    0    0    -1  
$EndComp
$Comp
L A5C:XOR02 UBC60
U 1 1 61118D24
P 7600 4300
F 0 "UBC60" H 7625 4567 50  0000 C CNN
F 1 "XOR02" H 7625 4476 50  0000 C CNN
F 2 "" H 7600 4300 50  0001 C CNN
F 3 "" H 7600 4300 50  0001 C CNN
	1    7600 4300
	1    0    0    -1  
$EndComp
$Comp
L A5C:XNOR02 UBB71
U 1 1 6766B7EC
P 7600 7250
F 0 "UBB71" H 7625 7517 50  0000 C CNN
F 1 "XNOR02" H 7625 7426 50  0000 C CNN
F 2 "" H 7625 7250 50  0001 C CNN
F 3 "" H 7625 7250 50  0001 C CNN
	1    7600 7250
	1    0    0    -1  
$EndComp
$Comp
L A5C:XNOR02 UAD385
U 1 1 6DDFEEF5
P 7600 7900
F 0 "UAD385" H 7625 8167 50  0000 C CNN
F 1 "XNOR02" H 7625 8076 50  0000 C CNN
F 2 "" H 7625 7900 50  0001 C CNN
F 3 "" H 7625 7900 50  0001 C CNN
	1    7600 7900
	1    0    0    -1  
$EndComp
$Comp
L A5C:XNOR02 UAD424
U 1 1 7EA9E87D
P 7600 8550
F 0 "UAD424" H 7625 8817 50  0000 C CNN
F 1 "XNOR02" H 7625 8726 50  0000 C CNN
F 2 "" H 7625 8550 50  0001 C CNN
F 3 "" H 7625 8550 50  0001 C CNN
	1    7600 8550
	1    0    0    -1  
$EndComp
$Comp
L A5C:XOR02 UAD435
U 1 1 61118CD8
P 7600 9200
F 0 "UAD435" H 7625 9467 50  0000 C CNN
F 1 "XOR02" H 7625 9376 50  0000 C CNN
F 2 "" H 7600 9200 50  0001 C CNN
F 3 "" H 7600 9200 50  0001 C CNN
	1    7600 9200
	1    0    0    -1  
$EndComp
$Comp
L A5C:NOR02 UBB62
U 1 1 61118D13
P 8000 1600
F 0 "UBB62" H 8025 1867 50  0000 C CNN
F 1 "NOR02" H 8025 1776 50  0000 C CNN
F 2 "" H 8000 1600 50  0001 C CNN
F 3 "" H 8000 1600 50  0001 C CNN
	1    8000 1600
	1    0    0    -1  
$EndComp
$Comp
L A5C:NOR02 UAC427
U 1 1 61118D1F
P 8000 6500
F 0 "UAC427" H 8025 6767 50  0000 C CNN
F 1 "NOR02" H 8025 6676 50  0000 C CNN
F 2 "" H 8000 6500 50  0001 C CNN
F 3 "" H 8000 6500 50  0001 C CNN
	1    8000 6500
	1    0    0    -1  
$EndComp
$Comp
L A5C:NAND02 UBD81
U 1 1 61118D20
P 8700 2400
F 0 "UBD81" H 8725 2667 50  0000 C CNN
F 1 "NAND02" H 8725 2576 50  0000 C CNN
F 2 "" H 8700 2400 50  0001 C CNN
F 3 "" H 8700 2400 50  0001 C CNN
	1    8700 2400
	1    0    0    -1  
$EndComp
$Comp
L A5C:NOR02 UBA56
U 1 1 61118D22
P 8700 4350
F 0 "UBA56" H 8725 4617 50  0000 C CNN
F 1 "NOR02" H 8725 4526 50  0000 C CNN
F 2 "" H 8700 4350 50  0001 C CNN
F 3 "" H 8700 4350 50  0001 C CNN
	1    8700 4350
	1    0    0    -1  
$EndComp
$Comp
L A5C:NAND02 UBB60
U 1 1 67CE8245
P 8700 7300
F 0 "UBB60" H 8725 7567 50  0000 C CNN
F 1 "NAND02" H 8725 7476 50  0000 C CNN
F 2 "" H 8700 7300 50  0001 C CNN
F 3 "" H 8700 7300 50  0001 C CNN
	1    8700 7300
	1    0    0    -1  
$EndComp
$Comp
L A5C:NOR02 UAC434
U 1 1 61118CDA
P 8700 9250
F 0 "UAC434" H 8725 9517 50  0000 C CNN
F 1 "NOR02" H 8725 9426 50  0000 C CNN
F 2 "" H 8700 9250 50  0001 C CNN
F 3 "" H 8700 9250 50  0001 C CNN
	1    8700 9250
	1    0    0    -1  
$EndComp
$Comp
L A5C:XOR02 UBC89
U 1 1 61118CFE
P 9500 1950
F 0 "UBC89" H 9525 2217 50  0000 C CNN
F 1 "XOR02" H 9525 2126 50  0000 C CNN
F 2 "" H 9500 1950 50  0001 C CNN
F 3 "" H 9500 1950 50  0001 C CNN
	1    9500 1950
	1    0    0    -1  
$EndComp
$Comp
L A5C:XNOR02 UBD82
U 1 1 61118CFD
P 9500 2450
F 0 "UBD82" H 9525 2717 50  0000 C CNN
F 1 "XNOR02" H 9525 2626 50  0000 C CNN
F 2 "" H 9525 2450 50  0001 C CNN
F 3 "" H 9525 2450 50  0001 C CNN
	1    9500 2450
	1    0    0    -1  
$EndComp
$Comp
L A5C:XNOR02 UBC78
U 1 1 61118D03
P 9500 3150
F 0 "UBC78" H 9525 3417 50  0000 C CNN
F 1 "XNOR02" H 9525 3326 50  0000 C CNN
F 2 "" H 9525 3150 50  0001 C CNN
F 3 "" H 9525 3150 50  0001 C CNN
	1    9500 3150
	1    0    0    -1  
$EndComp
$Comp
L A5C:XNOR02 UBD71
U 1 1 61118D04
P 9500 3850
F 0 "UBD71" H 9525 4117 50  0000 C CNN
F 1 "XNOR02" H 9525 4026 50  0000 C CNN
F 2 "" H 9525 3850 50  0001 C CNN
F 3 "" H 9525 3850 50  0001 C CNN
	1    9500 3850
	1    0    0    -1  
$EndComp
$Comp
L A5C:XOR02 UAD370
U 1 1 61118D00
P 9500 6850
F 0 "UAD370" H 9525 7117 50  0000 C CNN
F 1 "XOR02" H 9525 7026 50  0000 C CNN
F 2 "" H 9500 6850 50  0001 C CNN
F 3 "" H 9500 6850 50  0001 C CNN
	1    9500 6850
	1    0    0    -1  
$EndComp
$Comp
L A5C:XNOR02 UBB52
U 1 1 69D31615
P 9500 7350
F 0 "UBB52" H 9525 7617 50  0000 C CNN
F 1 "XNOR02" H 9525 7526 50  0000 C CNN
F 2 "" H 9525 7350 50  0001 C CNN
F 3 "" H 9525 7350 50  0001 C CNN
	1    9500 7350
	1    0    0    -1  
$EndComp
$Comp
L A5C:XNOR02 UAD388
U 1 1 7C971797
P 9500 8050
F 0 "UAD388" H 9525 8317 50  0000 C CNN
F 1 "XNOR02" H 9525 8226 50  0000 C CNN
F 2 "" H 9525 8050 50  0001 C CNN
F 3 "" H 9525 8050 50  0001 C CNN
	1    9500 8050
	1    0    0    -1  
$EndComp
$Comp
L A5C:XNOR02 UAD420
U 1 1 61118CDB
P 9500 8750
F 0 "UAD420" H 9525 9017 50  0000 C CNN
F 1 "XNOR02" H 9525 8926 50  0000 C CNN
F 2 "" H 9525 8750 50  0001 C CNN
F 3 "" H 9525 8750 50  0001 C CNN
	1    9500 8750
	1    0    0    -1  
$EndComp
$Comp
L A5C:NAND03 UBC75
U 1 1 61118D21
P 8700 3100
F 0 "UBC75" H 8725 3392 50  0000 C CNN
F 1 "NAND03" H 8725 3301 50  0000 C CNN
F 2 "" H 8700 3100 50  0001 C CNN
F 3 "" H 8700 3100 50  0001 C CNN
	1    8700 3100
	1    0    0    -1  
$EndComp
$Comp
L A5C:NAND03 UAD397
U 1 1 7258B76A
P 8700 8000
F 0 "UAD397" H 8725 8292 50  0000 C CNN
F 1 "NAND03" H 8725 8201 50  0000 C CNN
F 2 "" H 8700 8000 50  0001 C CNN
F 3 "" H 8700 8000 50  0001 C CNN
	1    8700 8000
	1    0    0    -1  
$EndComp
$Comp
L A5C:INV01 UBC65
U 1 1 61118D1C
P 4200 4100
F 0 "UBC65" H 4200 4417 50  0000 C CNN
F 1 "INV01" H 4200 4326 50  0000 C CNN
F 2 "" H 4200 3900 50  0001 C CNN
F 3 "" H 4200 3900 50  0001 C CNN
	1    4200 4100
	1    0    0    -1  
$EndComp
$Comp
L A5C:INV01 UAD361
U 1 1 61118CD6
P 4200 9000
F 0 "UAD361" H 4200 9317 50  0000 C CNN
F 1 "INV01" H 4200 9226 50  0000 C CNN
F 2 "" H 4200 8800 50  0001 C CNN
F 3 "" H 4200 8800 50  0001 C CNN
	1    4200 9000
	1    0    0    -1  
$EndComp
$Comp
L A5C:DFFCOO UAC280
U 1 1 61118CD4
P 1700 9250
F 0 "UAC280" H 1700 9615 50  0000 C CNN
F 1 "DFFCOO" H 1700 9524 50  0000 C CNN
F 2 "" H 1700 9250 50  0001 C CNN
F 3 "" H 1700 9250 50  0001 C CNN
	1    1700 9250
	1    0    0    -1  
$EndComp
$Comp
L A5C:DFFCOO UAA335
U 1 1 61118CD5
P 2650 9250
F 0 "UAA335" H 2650 9615 50  0000 C CNN
F 1 "DFFCOO" H 2650 9524 50  0000 C CNN
F 2 "" H 2650 9250 50  0001 C CNN
F 3 "" H 2650 9250 50  0001 C CNN
	1    2650 9250
	1    0    0    -1  
$EndComp
$Comp
L A5C:DFFCOO UBC100
U 1 1 61118D11
P 6500 2300
F 0 "UBC100" H 6500 2665 50  0000 C CNN
F 1 "DFFCOO" H 6500 2574 50  0000 C CNN
F 2 "" H 6500 2300 50  0001 C CNN
F 3 "" H 6500 2300 50  0001 C CNN
	1    6500 2300
	1    0    0    -1  
$EndComp
$Comp
L A5C:DFFCOO UBC66
U 1 1 61118D12
P 6500 2950
F 0 "UBC66" H 6500 3315 50  0000 C CNN
F 1 "DFFCOO" H 6500 3224 50  0000 C CNN
F 2 "" H 6500 2950 50  0001 C CNN
F 3 "" H 6500 2950 50  0001 C CNN
	1    6500 2950
	1    0    0    -1  
$EndComp
$Comp
L A5C:DFFCOO UBB100
U 1 1 61118D1B
P 6500 3600
F 0 "UBB100" H 6500 3965 50  0000 C CNN
F 1 "DFFCOO" H 6500 3874 50  0000 C CNN
F 2 "" H 6500 3600 50  0001 C CNN
F 3 "" H 6500 3600 50  0001 C CNN
	1    6500 3600
	1    0    0    -1  
$EndComp
$Comp
L A5C:DFFCOO UBA69
U 1 1 61118D1A
P 6500 4250
F 0 "UBA69" H 6500 4615 50  0000 C CNN
F 1 "DFFCOO" H 6500 4524 50  0000 C CNN
F 2 "" H 6500 4250 50  0001 C CNN
F 3 "" H 6500 4250 50  0001 C CNN
	1    6500 4250
	1    0    0    -1  
$EndComp
$Comp
L A5C:DFFCOO UAD412
U 1 1 67666999
P 6500 7200
F 0 "UAD412" H 6500 7565 50  0000 C CNN
F 1 "DFFCOO" H 6500 7474 50  0000 C CNN
F 2 "" H 6500 7200 50  0001 C CNN
F 3 "" H 6500 7200 50  0001 C CNN
	1    6500 7200
	1    0    0    -1  
$EndComp
$Comp
L A5C:DFFCOO UBA24
U 1 1 6A3C1E3D
P 6500 7850
F 0 "UBA24" H 6500 8215 50  0000 C CNN
F 1 "DFFCOO" H 6500 8124 50  0000 C CNN
F 2 "" H 6500 7850 50  0001 C CNN
F 3 "" H 6500 7850 50  0001 C CNN
	1    6500 7850
	1    0    0    -1  
$EndComp
$Comp
L A5C:DFFCOO UAD393
U 1 1 7D6B3A17
P 6500 8500
F 0 "UAD393" H 6500 8865 50  0000 C CNN
F 1 "DFFCOO" H 6500 8774 50  0000 C CNN
F 2 "" H 6500 8500 50  0001 C CNN
F 3 "" H 6500 8500 50  0001 C CNN
	1    6500 8500
	1    0    0    -1  
$EndComp
$Comp
L A5C:DFFCOO UAD427
U 1 1 61118CD7
P 6500 9150
F 0 "UAD427" H 6500 9515 50  0000 C CNN
F 1 "DFFCOO" H 6500 9424 50  0000 C CNN
F 2 "" H 6500 9150 50  0001 C CNN
F 3 "" H 6500 9150 50  0001 C CNN
	1    6500 9150
	1    0    0    -1  
$EndComp
$Comp
L A5C:NAND04 UBD78
U 1 1 61118D02
P 8750 3800
F 0 "UBD78" H 8750 4142 50  0000 C CNN
F 1 "NAND04" H 8750 4051 50  0000 C CNN
F 2 "" H 8750 3550 50  0001 C CNN
F 3 "" H 8750 3550 50  0001 C CNN
	1    8750 3800
	1    0    0    -1  
$EndComp
$Comp
L A5C:NAND04 UAD416
U 1 1 61118CD9
P 8750 8700
F 0 "UAD416" H 8750 9042 50  0000 C CNN
F 1 "NAND04" H 8750 8951 50  0000 C CNN
F 2 "" H 8750 8450 50  0001 C CNN
F 3 "" H 8750 8450 50  0001 C CNN
	1    8750 8700
	1    0    0    -1  
$EndComp
$Comp
L A5C:NAND04 UBD75
U 1 1 61118D01
P 9300 4550
F 0 "UBD75" H 9300 4892 50  0000 C CNN
F 1 "NAND04" H 9300 4801 50  0000 C CNN
F 2 "" H 9300 4300 50  0001 C CNN
F 3 "" H 9300 4300 50  0001 C CNN
	1    9300 4550
	1    0    0    -1  
$EndComp
$Comp
L A5C:NAND04 UAD432
U 1 1 61118CDC
P 9300 9450
F 0 "UAD432" H 9300 9792 50  0000 C CNN
F 1 "NAND04" H 9300 9701 50  0000 C CNN
F 2 "" H 9300 9200 50  0001 C CNN
F 3 "" H 9300 9200 50  0001 C CNN
	1    9300 9450
	1    0    0    -1  
$EndComp
$Comp
L A5C:AOI22 UBC95
U 1 1 61118D10
P 5600 2150
F 0 "UBC95" H 5625 2467 50  0000 C CNN
F 1 "AOI22" H 5625 2376 50  0000 C CNN
F 2 "" H 5750 2150 50  0001 C CNN
F 3 "" H 5750 2150 50  0001 C CNN
	1    5600 2150
	1    0    0    -1  
$EndComp
$Comp
L A5C:AOI22 UBC84
U 1 1 61118D18
P 5600 2800
F 0 "UBC84" H 5625 3117 50  0000 C CNN
F 1 "AOI22" H 5625 3026 50  0000 C CNN
F 2 "" H 5750 2800 50  0001 C CNN
F 3 "" H 5750 2800 50  0001 C CNN
	1    5600 2800
	1    0    0    -1  
$EndComp
$Comp
L A5C:AOI22 UBC81
U 1 1 61118D17
P 5600 3450
F 0 "UBC81" H 5625 3767 50  0000 C CNN
F 1 "AOI22" H 5625 3676 50  0000 C CNN
F 2 "" H 5750 3450 50  0001 C CNN
F 3 "" H 5750 3450 50  0001 C CNN
	1    5600 3450
	1    0    0    -1  
$EndComp
$Comp
L A5C:AOI22 UBC71
U 1 1 61118D19
P 5600 4100
F 0 "UBC71" H 5625 4417 50  0000 C CNN
F 1 "AOI22" H 5625 4326 50  0000 C CNN
F 2 "" H 5750 4100 50  0001 C CNN
F 3 "" H 5750 4100 50  0001 C CNN
	1    5600 4100
	1    0    0    -1  
$EndComp
$Comp
L A5C:AOI22 UAD374
U 1 1 61118D16
P 5600 7050
F 0 "UAD374" H 5625 7367 50  0000 C CNN
F 1 "AOI22" H 5625 7276 50  0000 C CNN
F 2 "" H 5750 7050 50  0001 C CNN
F 3 "" H 5750 7050 50  0001 C CNN
	1    5600 7050
	1    0    0    -1  
$EndComp
$Comp
L A5C:AOI22 UBA32
U 1 1 6A3B856D
P 5600 7700
F 0 "UBA32" H 5625 8017 50  0000 C CNN
F 1 "AOI22" H 5625 7926 50  0000 C CNN
F 2 "" H 5750 7700 50  0001 C CNN
F 3 "" H 5750 7700 50  0001 C CNN
	1    5600 7700
	1    0    0    -1  
$EndComp
$Comp
L A5C:AOI22 UAD353
U 1 1 7D6AE82E
P 5600 8350
F 0 "UAD353" H 5625 8667 50  0000 C CNN
F 1 "AOI22" H 5625 8576 50  0000 C CNN
F 2 "" H 5750 8350 50  0001 C CNN
F 3 "" H 5750 8350 50  0001 C CNN
	1    5600 8350
	1    0    0    -1  
$EndComp
$Comp
L A5C:AOI22 UAD367
U 1 1 61118CD2
P 5600 9000
F 0 "UAD367" H 5625 9317 50  0000 C CNN
F 1 "AOI22" H 5625 9226 50  0000 C CNN
F 2 "" H 5750 9000 50  0001 C CNN
F 3 "" H 5750 9000 50  0001 C CNN
	1    5600 9000
	1    0    0    -1  
$EndComp
$Comp
L A5C:M367C UBF107
U 1 1 615C4B34
P 7850 5300
F 0 "UBF107" H 7850 5815 50  0000 C CNN
F 1 "M367C" H 7850 5724 50  0000 C CNN
F 2 "" H 8150 5100 50  0001 C CNN
F 3 "" H 8150 5100 50  0001 C CNN
	1    7850 5300
	1    0    0    -1  
$EndComp
$Comp
L A5C:M367C UBB74
U 1 1 63C5700C
P 7850 10200
F 0 "UBB74" H 7850 10715 50  0000 C CNN
F 1 "M367C" H 7850 10624 50  0000 C CNN
F 2 "" H 8150 10000 50  0001 C CNN
F 3 "" H 8150 10000 50  0001 C CNN
	1    7850 10200
	1    0    0    -1  
$EndComp
$Comp
L A5C:M368C UCB?
U 1 1 61B30BE2
P 12400 3050
AR Path="/604B5523/61B30BE2" Ref="UCB?"  Part="1" 
AR Path="/61B30BE2" Ref="UCB?"  Part="1" 
AR Path="/60E86855/61B30BE2" Ref="UCB?"  Part="1" 
AR Path="/611554F0/61B30BE2" Ref="UCB?"  Part="1" 
AR Path="/6123A74D/61B30BE2" Ref="UCB174"  Part="1" 
AR Path="/612CA5FA/612CAE0A/61B30BE2" Ref="UCB174"  Part="1" 
F 0 "UCB174" H 12400 3560 50  0000 C CNN
F 1 "M368C" H 12400 3470 50  0000 C CNN
F 2 "" H 12700 2850 50  0001 C CNN
F 3 "" H 12700 2850 50  0001 C CNN
	1    12400 3050
	1    0    0    -1  
$EndComp
Wire Bus Line
	11150 2600 11050 2600
Text HLabel 11050 2600 0    50   Input ~ 0
~LOOKUP-IDX[0..4]
Text Label 11300 3800 0    50   ~ 0
~LOOKUP-IDX0
Text Label 11300 3100 0    50   ~ 0
~LOOKUP-IDX1
Text Label 11300 3000 0    50   ~ 0
~LOOKUP-IDX2
Text Label 11300 2900 0    50   ~ 0
~LOOKUP-IDX3
Text Label 11300 2800 0    50   ~ 0
~LOOKUP-IDX4
Wire Wire Line
	11250 3800 12250 3800
Wire Wire Line
	11250 2800 11900 2800
Wire Wire Line
	11250 2900 11900 2900
Wire Wire Line
	11250 3000 11900 3000
Wire Wire Line
	11250 3100 11900 3100
Connection ~ 13450 5600
Wire Bus Line
	13450 5600 13900 5600
Wire Bus Line
	10300 5600 13450 5600
Wire Bus Line
	3900 1850 3900 3550
Wire Bus Line
	3900 6750 3900 8450
Wire Bus Line
	8900 5150 8900 5600
Wire Bus Line
	8900 9750 8900 10150
Wire Bus Line
	11150 2600 11150 3700
Wire Bus Line
	13450 2900 13450 5600
$EndSCHEMATC
