EESchema Schematic File Version 4
EELAYER 30 0
EELAYER END
$Descr A4 11693 8268
encoding utf-8
Sheet 24 69
Title ""
Date "2020-11-26"
Rev ""
Comp ""
Comment1 "Licence: CC-BY"
Comment2 "Author: Loïc *WydD* Petit"
Comment3 ""
Comment4 ""
$EndDescr
Connection ~ 3200 4250
Connection ~ 3200 2300
Connection ~ 3200 2950
Connection ~ 3200 3600
Connection ~ 8350 2450
Connection ~ 8350 2100
Connection ~ 8350 1800
Connection ~ 8350 3100
Connection ~ 7350 4350
Connection ~ 5950 4850
Connection ~ 8050 4050
Connection ~ 7950 3950
Connection ~ 8150 4150
Connection ~ 8250 4250
Connection ~ 3200 4850
Connection ~ 9600 4950
NoConn ~ 3800 1550
NoConn ~ 3800 2850
NoConn ~ 3800 2200
NoConn ~ 3800 3500
NoConn ~ 6850 2000
Entry Wire Line
	2750 1450 2650 1350
Entry Wire Line
	2750 2100 2650 2000
Entry Wire Line
	2750 2750 2650 2650
Entry Wire Line
	2750 3400 2650 3300
Entry Wire Line
	2750 4050 2650 3950
Entry Wire Line
	4350 1450 4450 1350
Entry Wire Line
	4350 2100 4450 2000
Entry Wire Line
	4350 2750 4450 2650
Entry Wire Line
	4350 3400 4450 3300
Entry Wire Line
	4350 4050 4450 3950
Entry Wire Line
	5200 3850 5300 3950
Entry Wire Line
	5200 3950 5300 4050
Entry Wire Line
	5200 4050 5300 4150
Entry Wire Line
	5200 4150 5300 4250
Entry Wire Line
	5200 4250 5300 4350
Entry Wire Line
	5200 4350 5300 4450
Entry Wire Line
	5200 4450 5300 4550
Entry Wire Line
	5200 4550 5300 4650
Entry Wire Line
	9500 1200 9600 1300
Entry Wire Line
	9500 1850 9600 1950
Entry Wire Line
	9500 2500 9600 2600
Entry Wire Line
	9500 3150 9600 3250
Entry Wire Line
	9500 3800 9600 3900
Entry Wire Line
	9500 4450 9600 4550
Entry Wire Line
	9500 4550 9600 4650
Entry Wire Line
	9500 4650 9600 4750
Entry Wire Line
	9500 5250 9600 5150
Wire Wire Line
	2250 4800 2350 4800
Wire Wire Line
	2250 4900 2350 4900
Wire Wire Line
	2750 1450 3300 1450
Wire Wire Line
	2750 2100 3300 2100
Wire Wire Line
	2750 2750 3300 2750
Wire Wire Line
	2750 3400 3300 3400
Wire Wire Line
	2900 4850 3200 4850
Wire Wire Line
	3200 1650 3200 2300
Wire Wire Line
	3200 2300 3200 2950
Wire Wire Line
	3200 2300 3300 2300
Wire Wire Line
	3200 2950 3200 3600
Wire Wire Line
	3200 2950 3300 2950
Wire Wire Line
	3200 3600 3200 4250
Wire Wire Line
	3200 4250 3300 4250
Wire Wire Line
	3200 4850 3200 4250
Wire Wire Line
	3200 4850 5950 4850
Wire Wire Line
	3300 1650 3200 1650
Wire Wire Line
	3300 3600 3200 3600
Wire Wire Line
	3300 4050 2750 4050
Wire Wire Line
	3800 4050 4350 4050
Wire Wire Line
	4350 1450 3800 1450
Wire Wire Line
	4350 2100 3800 2100
Wire Wire Line
	4350 2750 3800 2750
Wire Wire Line
	4350 3400 3800 3400
Wire Wire Line
	5300 3950 6050 3950
Wire Wire Line
	5300 4050 6050 4050
Wire Wire Line
	5300 4150 6050 4150
Wire Wire Line
	5300 4250 6050 4250
Wire Wire Line
	5300 4350 6050 4350
Wire Wire Line
	5300 4450 6050 4450
Wire Wire Line
	5300 4550 6050 4550
Wire Wire Line
	5300 4650 6050 4650
Wire Wire Line
	5850 5100 6050 5100
Wire Wire Line
	5950 4850 5950 2200
Wire Wire Line
	5950 4850 6050 4850
Wire Wire Line
	6050 2000 6350 2000
Wire Wire Line
	6050 5100 6050 4950
Wire Wire Line
	6350 2200 5950 2200
Wire Wire Line
	6850 2100 8350 2100
Wire Wire Line
	7050 3950 7950 3950
Wire Wire Line
	7050 4050 8050 4050
Wire Wire Line
	7050 4150 8150 4150
Wire Wire Line
	7050 4250 8250 4250
Wire Wire Line
	7050 4350 7350 4350
Wire Wire Line
	7050 4450 9500 4450
Wire Wire Line
	7050 4550 9500 4550
Wire Wire Line
	7050 4650 9500 4650
Wire Wire Line
	7350 5450 7350 4350
Wire Wire Line
	7350 5450 7450 5450
Wire Wire Line
	7950 1250 7950 3950
Wire Wire Line
	7950 3950 7950 5350
Wire Wire Line
	8050 1900 8050 4050
Wire Wire Line
	8050 1900 8450 1900
Wire Wire Line
	8050 4050 8050 5250
Wire Wire Line
	8050 5250 8600 5250
Wire Wire Line
	8050 5450 8600 5450
Wire Wire Line
	8150 2550 8150 4150
Wire Wire Line
	8150 4150 8150 5150
Wire Wire Line
	8250 3200 8250 4250
Wire Wire Line
	8250 3200 8450 3200
Wire Wire Line
	8250 4250 8250 5050
Wire Wire Line
	8250 5050 8600 5050
Wire Wire Line
	8350 1150 8350 1800
Wire Wire Line
	8350 1150 8450 1150
Wire Wire Line
	8350 1800 8350 2100
Wire Wire Line
	8350 2100 8350 2450
Wire Wire Line
	8350 2450 8350 3100
Wire Wire Line
	8350 3100 8350 3750
Wire Wire Line
	8350 3850 8350 4350
Wire Wire Line
	8350 4350 7350 4350
Wire Wire Line
	8450 1250 7950 1250
Wire Wire Line
	8450 1800 8350 1800
Wire Wire Line
	8450 2450 8350 2450
Wire Wire Line
	8450 2550 8150 2550
Wire Wire Line
	8450 3100 8350 3100
Wire Wire Line
	8450 3750 8350 3750
Wire Wire Line
	8450 3850 8350 3850
Wire Wire Line
	8600 5150 8150 5150
Wire Wire Line
	8600 5350 7950 5350
Wire Wire Line
	9000 1200 9500 1200
Wire Wire Line
	9000 1850 9500 1850
Wire Wire Line
	9000 2500 9500 2500
Wire Wire Line
	9250 5250 9500 5250
Wire Wire Line
	9500 3150 9000 3150
Wire Wire Line
	9500 3800 9000 3800
Wire Bus Line
	2450 1050 2650 1050
Wire Bus Line
	4650 1050 4450 1050
Wire Bus Line
	5200 3700 5050 3700
Wire Bus Line
	9600 4950 9600 5150
Wire Bus Line
	9600 4950 9800 4950
Text Label 2800 1450 0    50   ~ 0
XS0
Text Label 2800 2100 0    50   ~ 0
XS1
Text Label 2800 2750 0    50   ~ 0
XS2
Text Label 2800 3400 0    50   ~ 0
XS3
Text Label 2800 4050 0    50   ~ 0
XS4
Text Label 4300 1450 2    50   ~ 0
XS-OUT0
Text Label 4300 2100 2    50   ~ 0
XS-OUT1
Text Label 4300 2750 2    50   ~ 0
XS-OUT2
Text Label 4300 3400 2    50   ~ 0
XS-OUT3
Text Label 4300 4050 2    50   ~ 0
XS-OUT4
Text Label 5650 3950 2    50   ~ 0
APD0
Text Label 5650 4050 2    50   ~ 0
APD1
Text Label 5650 4150 2    50   ~ 0
APD2
Text Label 5650 4250 2    50   ~ 0
APD3
Text Label 5650 4350 2    50   ~ 0
APD4
Text Label 5650 4450 2    50   ~ 0
APD5
Text Label 5650 4550 2    50   ~ 0
APD6
Text Label 5650 4650 2    50   ~ 0
APD7
Text Label 9300 1200 0    50   ~ 0
PD0
Text Label 9300 1850 0    50   ~ 0
PD1
Text Label 9300 2500 0    50   ~ 0
PD2
Text Label 9300 3150 0    50   ~ 0
PD3
Text Label 9300 3800 0    50   ~ 0
PD4
Text Label 9300 4450 0    50   ~ 0
PD5
Text Label 9300 4550 0    50   ~ 0
PD6
Text Label 9300 4650 0    50   ~ 0
PD7
Text Label 9300 5250 0    50   ~ 0
PD8
Text HLabel 2250 4800 0    50   Input ~ 0
LOAD
Text HLabel 2250 4900 0    50   Input ~ 0
CLK8M
Text HLabel 2450 1050 0    50   Input ~ 0
XS[0..4]
Text HLabel 4650 1050 2    50   Output ~ 0
XS-OUT[0..4]
Text HLabel 5050 3700 0    50   Input ~ 0
APD[0..7]
Text HLabel 6050 2000 0    50   Input ~ 0
FLIP
Text HLabel 9800 4950 2    50   Output ~ 0
PD[0..8]
$Comp
L power:VCC #PWR?
U 1 1 67360A0E
P 5850 5100
AR Path="/62B9D68C/67360A0E" Ref="#PWR?"  Part="1" 
AR Path="/5FBCE4A9/5FBD0ADE/67360A0E" Ref="#PWR0113"  Part="1" 
F 0 "#PWR0113" H 5850 4950 50  0001 C CNN
F 1 "VCC" H 5865 5273 50  0000 C CNN
F 2 "" H 5850 5100 50  0001 C CNN
F 3 "" H 5850 5100 50  0001 C CNN
	1    5850 5100
	1    0    0    -1  
$EndComp
$Comp
L A5C:NAND02 UBH474
U 1 1 5FC0AF11
P 2600 4850
AR Path="/62B9D68C/5FC0AF11" Ref="UBH474"  Part="1" 
AR Path="/5FBCE4A9/5FBD0ADE/5FC0AF11" Ref="UBH474"  Part="1" 
F 0 "UBH474" H 2625 5116 50  0000 C CNN
F 1 "NAND02" H 2625 5025 50  0000 C CNN
F 2 "" H 2600 4850 50  0001 C CNN
F 3 "" H 2600 4850 50  0001 C CNN
	1    2600 4850
	1    0    0    -1  
$EndComp
$Comp
L A5C:XOR02 UBR218
U 1 1 67360A11
P 8700 1200
AR Path="/62B9D68C/67360A11" Ref="UBR218"  Part="1" 
AR Path="/5FBCE4A9/5FBD0ADE/67360A11" Ref="UBR218"  Part="1" 
F 0 "UBR218" H 8725 1467 50  0000 C CNN
F 1 "XOR02" H 8725 1376 50  0000 C CNN
F 2 "" H 8700 1200 50  0001 C CNN
F 3 "" H 8700 1200 50  0001 C CNN
	1    8700 1200
	1    0    0    -1  
$EndComp
$Comp
L A5C:XOR02 UBR221
U 1 1 67360A12
P 8700 1850
AR Path="/62B9D68C/67360A12" Ref="UBR221"  Part="1" 
AR Path="/5FBCE4A9/5FBD0ADE/67360A12" Ref="UBR221"  Part="1" 
F 0 "UBR221" H 8725 2117 50  0000 C CNN
F 1 "XOR02" H 8725 2026 50  0000 C CNN
F 2 "" H 8700 1850 50  0001 C CNN
F 3 "" H 8700 1850 50  0001 C CNN
	1    8700 1850
	1    0    0    -1  
$EndComp
$Comp
L A5C:XOR02 UBR224
U 1 1 67360A13
P 8700 2500
AR Path="/62B9D68C/67360A13" Ref="UBR224"  Part="1" 
AR Path="/5FBCE4A9/5FBD0ADE/67360A13" Ref="UBR224"  Part="1" 
F 0 "UBR224" H 8725 2767 50  0000 C CNN
F 1 "XOR02" H 8725 2676 50  0000 C CNN
F 2 "" H 8700 2500 50  0001 C CNN
F 3 "" H 8700 2500 50  0001 C CNN
	1    8700 2500
	1    0    0    -1  
$EndComp
$Comp
L A5C:XOR02 UBR226
U 1 1 67360A14
P 8700 3150
AR Path="/62B9D68C/67360A14" Ref="UBR226"  Part="1" 
AR Path="/5FBCE4A9/5FBD0ADE/67360A14" Ref="UBR226"  Part="1" 
F 0 "UBR226" H 8725 3417 50  0000 C CNN
F 1 "XOR02" H 8725 3326 50  0000 C CNN
F 2 "" H 8700 3150 50  0001 C CNN
F 3 "" H 8700 3150 50  0001 C CNN
	1    8700 3150
	1    0    0    -1  
$EndComp
$Comp
L A5C:XOR02 UBR229
U 1 1 67360A15
P 8700 3800
AR Path="/62B9D68C/67360A15" Ref="UBR229"  Part="1" 
AR Path="/5FBCE4A9/5FBD0ADE/67360A15" Ref="UBR229"  Part="1" 
F 0 "UBR229" H 8725 4067 50  0000 C CNN
F 1 "XOR02" H 8725 3976 50  0000 C CNN
F 2 "" H 8700 3800 50  0001 C CNN
F 3 "" H 8700 3800 50  0001 C CNN
	1    8700 3800
	1    0    0    -1  
$EndComp
$Comp
L A5C:INV01 UBH221
U 1 1 621C5AF8
P 7750 5450
AR Path="/62B9D68C/621C5AF8" Ref="UBH221"  Part="1" 
AR Path="/5FBCE4A9/5FBD0ADE/621C5AF8" Ref="UBH221"  Part="1" 
F 0 "UBH221" H 7750 5767 50  0000 C CNN
F 1 "INV01" H 7750 5676 50  0000 C CNN
F 2 "" H 7750 5250 50  0001 C CNN
F 3 "" H 7750 5250 50  0001 C CNN
	1    7750 5450
	1    0    0    1   
$EndComp
$Comp
L A5C:DFFCOO UBZ3
U 1 1 5FBECFEB
P 3550 1550
AR Path="/62B9D68C/5FBECFEB" Ref="UBZ3"  Part="1" 
AR Path="/5FBCE4A9/5FBD0ADE/5FBECFEB" Ref="UBZ3"  Part="1" 
F 0 "UBZ3" H 3550 1911 50  0000 C CNN
F 1 "DFFCOO" H 3550 1820 50  0000 C CNN
F 2 "" H 3550 1550 50  0001 C CNN
F 3 "" H 3550 1550 50  0001 C CNN
F 4 "UBZ0" H 3550 1550 50  0001 C CNN "MiscRef"
	1    3550 1550
	1    0    0    -1  
$EndComp
$Comp
L A5C:DFFCOO UBZ7
U 1 1 5FBED525
P 3550 2200
AR Path="/62B9D68C/5FBED525" Ref="UBZ7"  Part="1" 
AR Path="/5FBCE4A9/5FBD0ADE/5FBED525" Ref="UBZ7"  Part="1" 
F 0 "UBZ7" H 3550 2561 50  0000 C CNN
F 1 "DFFCOO" H 3550 2470 50  0000 C CNN
F 2 "" H 3550 2200 50  0001 C CNN
F 3 "" H 3550 2200 50  0001 C CNN
	1    3550 2200
	1    0    0    -1  
$EndComp
$Comp
L A5C:DFFCOO UBZ10
U 1 1 5FBEEEE8
P 3550 2850
AR Path="/62B9D68C/5FBEEEE8" Ref="UBZ10"  Part="1" 
AR Path="/5FBCE4A9/5FBD0ADE/5FBEEEE8" Ref="UBZ10"  Part="1" 
F 0 "UBZ10" H 3550 3211 50  0000 C CNN
F 1 "DFFCOO" H 3550 3120 50  0000 C CNN
F 2 "" H 3550 2850 50  0001 C CNN
F 3 "" H 3550 2850 50  0001 C CNN
	1    3550 2850
	1    0    0    -1  
$EndComp
$Comp
L A5C:DFFCOO UBZ14
U 1 1 5FBF0C1C
P 3550 3500
AR Path="/62B9D68C/5FBF0C1C" Ref="UBZ14"  Part="1" 
AR Path="/5FBCE4A9/5FBD0ADE/5FBF0C1C" Ref="UBZ14"  Part="1" 
F 0 "UBZ14" H 3550 3861 50  0000 C CNN
F 1 "DFFCOO" H 3550 3770 50  0000 C CNN
F 2 "" H 3550 3500 50  0001 C CNN
F 3 "" H 3550 3500 50  0001 C CNN
	1    3550 3500
	1    0    0    -1  
$EndComp
$Comp
L A5C:DFFCOO UBZ18
U 1 1 5FBF1DB3
P 3550 4150
AR Path="/62B9D68C/5FBF1DB3" Ref="UBZ18"  Part="1" 
AR Path="/5FBCE4A9/5FBD0ADE/5FBF1DB3" Ref="UBZ18"  Part="1" 
F 0 "UBZ18" H 3550 4511 50  0000 C CNN
F 1 "DFFCOO" H 3550 4420 50  0000 C CNN
F 2 "" H 3550 4150 50  0001 C CNN
F 3 "" H 3550 4150 50  0001 C CNN
	1    3550 4150
	1    0    0    -1  
$EndComp
$Comp
L A5C:DFFCOO UBU?
U 1 1 62444B30
P 6600 2100
AR Path="/62444B30" Ref="UBU?"  Part="1" 
AR Path="/621ABC04/62444B30" Ref="UBU258"  Part="1" 
AR Path="/62B9D68C/62444B30" Ref="UBU258"  Part="1" 
AR Path="/5FBCE4A9/5FBD0ADE/62444B30" Ref="UBU258"  Part="1" 
F 0 "UBU258" H 6600 2465 50  0000 C CNN
F 1 "DFFCOO" H 6600 2374 50  0000 C CNN
F 2 "" H 6600 2100 50  0001 C CNN
F 3 "" H 6600 2100 50  0001 C CNN
F 4 "UBU256" H 6600 2100 50  0001 C CNN "MiscRef"
	1    6600 2100
	1    0    0    -1  
$EndComp
$Comp
L A5C:NAND05 UBH222
U 1 1 621BFB48
P 8900 5250
AR Path="/62B9D68C/621BFB48" Ref="UBH222"  Part="1" 
AR Path="/5FBCE4A9/5FBD0ADE/621BFB48" Ref="UBH222"  Part="1" 
F 0 "UBH222" H 8925 5640 50  0000 C CNN
F 1 "NAND05" H 8925 5549 50  0000 C CNN
F 2 "" H 8900 4950 50  0001 C CNN
F 3 "" H 8900 4950 50  0001 C CNN
	1    8900 5250
	1    0    0    1   
$EndComp
$Comp
L A5C:M273C UBD222
U 1 1 621AD4A4
P 6550 4450
AR Path="/62B9D68C/621AD4A4" Ref="UBD222"  Part="1" 
AR Path="/5FBCE4A9/5FBD0ADE/621AD4A4" Ref="UBD222"  Part="1" 
F 0 "UBD222" H 6550 5217 50  0000 C CNN
F 1 "M273C" H 6550 5126 50  0000 C CNN
F 2 "" H 6550 4450 50  0001 C CNN
F 3 "" H 6550 4450 50  0001 C CNN
F 4 "UBD219;UBD226;UBD230;UBD234;UBD238;UBD242;UBD245;UBD249" H 6550 4450 50  0001 C CNN "MiscRef"
	1    6550 4450
	1    0    0    -1  
$EndComp
NoConn ~ 3800 4150
Wire Bus Line
	2650 1050 2650 3950
Wire Bus Line
	4450 1050 4450 3950
Wire Bus Line
	5200 3700 5200 4550
Wire Bus Line
	9600 1300 9600 4950
$EndSCHEMATC
