EESchema Schematic File Version 4
EELAYER 30 0
EELAYER END
$Descr A4 11693 8268
encoding utf-8
Sheet 20 22
Title ""
Date "2020-12-13"
Rev ""
Comp ""
Comment1 ""
Comment2 "Licence: CC-BY"
Comment3 "Author: Loïc *WydD* Petit"
Comment4 "Project: CPS2 Reverse Engineering: 93646A"
$EndDescr
Connection ~ 6350 6100
Connection ~ 3450 5650
Connection ~ 3750 6500
Connection ~ 4500 6500
Connection ~ 3750 7500
Connection ~ 4500 7500
Connection ~ 3650 1900
Connection ~ 7050 1900
Connection ~ 3350 4850
Connection ~ 3400 4950
Connection ~ 3450 5050
Connection ~ 6300 5550
Connection ~ 6350 5450
Connection ~ 6350 5650
Connection ~ 6950 1100
Connection ~ 7000 1200
Connection ~ 7050 1300
Connection ~ 5550 2200
Connection ~ 5550 1600
Connection ~ 8950 1600
Connection ~ 8950 2200
Connection ~ 10250 3850
Connection ~ 9750 3750
Connection ~ 9250 3650
Connection ~ 10750 3950
Connection ~ 8750 3950
Connection ~ 8250 3850
Connection ~ 7750 3750
Connection ~ 7250 3650
Connection ~ 6750 3950
Connection ~ 6250 3850
Connection ~ 5750 3750
Connection ~ 5250 3650
Connection ~ 8250 5700
Connection ~ 8950 5400
Connection ~ 3250 3650
Connection ~ 3750 3750
Connection ~ 4250 3850
Connection ~ 4750 3950
Connection ~ 3650 1300
Connection ~ 3600 1200
Connection ~ 3550 1100
Connection ~ 3950 5950
Connection ~ 4150 2200
Connection ~ 7550 2200
Connection ~ 6850 6400
Connection ~ 3000 6500
Connection ~ 5250 7500
NoConn ~ 5050 1000
NoConn ~ 5050 1500
NoConn ~ 5050 1600
NoConn ~ 5050 2100
NoConn ~ 5150 2700
NoConn ~ 5050 2700
NoConn ~ 4550 2700
NoConn ~ 4450 2700
NoConn ~ 8450 1000
NoConn ~ 8450 1500
NoConn ~ 8450 1600
NoConn ~ 8450 2100
NoConn ~ 9150 4900
NoConn ~ 9050 4900
NoConn ~ 8550 4900
NoConn ~ 8450 4900
NoConn ~ 7750 6300
NoConn ~ 7750 5800
NoConn ~ 7750 5700
NoConn ~ 7750 5200
NoConn ~ 8450 2700
NoConn ~ 8550 2700
NoConn ~ 9050 2700
NoConn ~ 9150 2700
Entry Wire Line
	1200 1100 1300 1200
Entry Wire Line
	1200 1200 1300 1300
Entry Wire Line
	1200 1300 1300 1400
Entry Wire Line
	1200 1400 1300 1500
Entry Wire Line
	1200 1700 1300 1600
Entry Wire Line
	1200 1800 1300 1700
Entry Wire Line
	1200 1900 1300 1800
Entry Wire Line
	1200 2000 1300 1900
Entry Wire Line
	1200 3150 1300 3250
Entry Wire Line
	1200 3250 1300 3350
Entry Wire Line
	1200 3350 1300 3450
Entry Wire Line
	1200 3450 1300 3550
Entry Wire Line
	1200 3750 1300 3650
Entry Wire Line
	1200 3850 1300 3750
Entry Wire Line
	1200 3950 1300 3850
Entry Wire Line
	1200 4050 1300 3950
Wire Wire Line
	1300 1200 1550 1200
Wire Wire Line
	1300 1300 1550 1300
Wire Wire Line
	1300 1400 1550 1400
Wire Wire Line
	1300 1500 1550 1500
Wire Wire Line
	1300 1600 1550 1600
Wire Wire Line
	1300 1700 1550 1700
Wire Wire Line
	1300 1800 1550 1800
Wire Wire Line
	1300 1900 1550 1900
Wire Wire Line
	1300 3250 1550 3250
Wire Wire Line
	1300 3350 1550 3350
Wire Wire Line
	1300 3450 1550 3450
Wire Wire Line
	1300 3550 1550 3550
Wire Wire Line
	1300 3650 1550 3650
Wire Wire Line
	1300 3750 1550 3750
Wire Wire Line
	1300 3850 1550 3850
Wire Wire Line
	1300 3950 1550 3950
Wire Wire Line
	2550 1200 2800 1200
Wire Wire Line
	2550 1300 2800 1300
Wire Wire Line
	2550 1400 2800 1400
Wire Wire Line
	2550 1500 2800 1500
Wire Wire Line
	2550 1600 2800 1600
Wire Wire Line
	2550 1700 2800 1700
Wire Wire Line
	2550 1800 2800 1800
Wire Wire Line
	2550 1900 2800 1900
Wire Wire Line
	2550 3250 2800 3250
Wire Wire Line
	2550 3350 2800 3350
Wire Wire Line
	2550 3450 2800 3450
Wire Wire Line
	2550 3550 2800 3550
Wire Wire Line
	2550 3750 3750 3750
Wire Wire Line
	2550 3950 4750 3950
Wire Wire Line
	3000 7500 3750 7500
Wire Wire Line
	3050 4850 3350 4850
Wire Wire Line
	3050 4950 3400 4950
Wire Wire Line
	3050 5050 3450 5050
Wire Wire Line
	3250 1100 3550 1100
Wire Wire Line
	3250 1200 3600 1200
Wire Wire Line
	3250 1300 3650 1300
Wire Wire Line
	3250 2750 3250 2900
Wire Wire Line
	3250 3500 3250 3650
Wire Wire Line
	3250 3650 2550 3650
Wire Wire Line
	3250 3650 5250 3650
Wire Wire Line
	3350 4850 3350 5350
Wire Wire Line
	3350 5350 3450 5350
Wire Wire Line
	3400 4950 3400 5250
Wire Wire Line
	3400 5250 3450 5250
Wire Wire Line
	3450 4850 3350 4850
Wire Wire Line
	3450 4950 3400 4950
Wire Wire Line
	3450 5050 3450 5150
Wire Wire Line
	3450 5550 3450 5650
Wire Wire Line
	3450 5650 3450 5950
Wire Wire Line
	3450 5950 3950 5950
Wire Wire Line
	3550 1100 3550 1600
Wire Wire Line
	3550 1600 3650 1600
Wire Wire Line
	3600 1200 3600 1500
Wire Wire Line
	3600 1500 3650 1500
Wire Wire Line
	3650 1100 3550 1100
Wire Wire Line
	3650 1200 3600 1200
Wire Wire Line
	3650 1300 3650 1400
Wire Wire Line
	3650 1800 3650 1900
Wire Wire Line
	3650 1900 3650 2200
Wire Wire Line
	3650 2200 4150 2200
Wire Wire Line
	3750 2800 4750 2800
Wire Wire Line
	3750 2900 3750 2800
Wire Wire Line
	3750 3500 3750 3750
Wire Wire Line
	3750 6500 3000 6500
Wire Wire Line
	3750 7500 4500 7500
Wire Wire Line
	4250 2900 4250 2850
Wire Wire Line
	4250 3850 2550 3850
Wire Wire Line
	4250 3850 4250 3500
Wire Wire Line
	4250 3850 6250 3850
Wire Wire Line
	4450 4850 4750 4850
Wire Wire Line
	4450 4950 4750 4950
Wire Wire Line
	4450 5050 4750 5050
Wire Wire Line
	4450 5150 4750 5150
Wire Wire Line
	4450 5250 4750 5250
Wire Wire Line
	4450 5350 4750 5350
Wire Wire Line
	4500 6500 3750 6500
Wire Wire Line
	4500 7500 5250 7500
Wire Wire Line
	4650 1000 4950 1000
Wire Wire Line
	4650 1100 5050 1100
Wire Wire Line
	4650 1200 5050 1200
Wire Wire Line
	4650 1300 5050 1300
Wire Wire Line
	4650 1400 4850 1400
Wire Wire Line
	4650 1500 4750 1500
Wire Wire Line
	4650 1600 4650 1700
Wire Wire Line
	4650 2000 5050 2000
Wire Wire Line
	4650 2700 4650 2750
Wire Wire Line
	4650 2750 3250 2750
Wire Wire Line
	4750 1500 4750 1800
Wire Wire Line
	4750 1800 5050 1800
Wire Wire Line
	4750 2800 4750 2700
Wire Wire Line
	4750 3500 4750 3950
Wire Wire Line
	4750 3950 6750 3950
Wire Wire Line
	4850 2850 4250 2850
Wire Wire Line
	4850 2850 4850 2700
Wire Wire Line
	4950 1400 4950 1000
Wire Wire Line
	4950 2200 5550 2200
Wire Wire Line
	4950 2300 4950 2200
Wire Wire Line
	4950 2900 4750 2900
Wire Wire Line
	4950 2900 4950 2700
Wire Wire Line
	5050 1400 4950 1400
Wire Wire Line
	5250 2900 5250 2700
Wire Wire Line
	5250 3650 5250 3500
Wire Wire Line
	5250 3650 7250 3650
Wire Wire Line
	5250 6500 4500 6500
Wire Wire Line
	5350 2900 5350 2700
Wire Wire Line
	5450 1000 5550 1000
Wire Wire Line
	5450 2850 5450 2700
Wire Wire Line
	5450 2850 6250 2850
Wire Wire Line
	5550 1000 5550 1600
Wire Wire Line
	5550 1600 5450 1600
Wire Wire Line
	5550 2200 5550 1600
Wire Wire Line
	5550 2200 5550 2300
Wire Wire Line
	5550 2800 5550 2700
Wire Wire Line
	5700 1600 5550 1600
Wire Wire Line
	5750 2900 5350 2900
Wire Wire Line
	5750 3500 5750 3750
Wire Wire Line
	5750 3750 3750 3750
Wire Wire Line
	5950 5550 6300 5550
Wire Wire Line
	5950 5650 6350 5650
Wire Wire Line
	6250 2850 6250 2900
Wire Wire Line
	6250 3850 6250 3500
Wire Wire Line
	6250 3850 8250 3850
Wire Wire Line
	6300 5300 6300 5550
Wire Wire Line
	6300 5300 6350 5300
Wire Wire Line
	6300 5550 6300 5800
Wire Wire Line
	6350 5400 6350 5450
Wire Wire Line
	6350 5450 5950 5450
Wire Wire Line
	6350 5450 6350 5500
Wire Wire Line
	6350 5650 6350 5600
Wire Wire Line
	6350 5700 6350 5650
Wire Wire Line
	6350 5800 6300 5800
Wire Wire Line
	6350 6000 6350 6100
Wire Wire Line
	6350 6100 6350 6400
Wire Wire Line
	6350 6400 6850 6400
Wire Wire Line
	6650 1100 6950 1100
Wire Wire Line
	6650 1200 7000 1200
Wire Wire Line
	6650 1300 7050 1300
Wire Wire Line
	6750 2800 5550 2800
Wire Wire Line
	6750 2900 6750 2800
Wire Wire Line
	6750 3500 6750 3950
Wire Wire Line
	6750 3950 8750 3950
Wire Wire Line
	6950 1100 6950 1600
Wire Wire Line
	6950 1600 7050 1600
Wire Wire Line
	7000 1200 7000 1500
Wire Wire Line
	7000 1500 7050 1500
Wire Wire Line
	7050 1100 6950 1100
Wire Wire Line
	7050 1200 7000 1200
Wire Wire Line
	7050 1400 7050 1300
Wire Wire Line
	7050 1800 7050 1900
Wire Wire Line
	7050 1900 7050 2200
Wire Wire Line
	7050 2200 7550 2200
Wire Wire Line
	7250 2750 8650 2750
Wire Wire Line
	7250 2900 7250 2750
Wire Wire Line
	7250 3500 7250 3650
Wire Wire Line
	7250 3650 7250 4100
Wire Wire Line
	7250 3650 9250 3650
Wire Wire Line
	7250 4700 7250 4850
Wire Wire Line
	7250 4850 8650 4850
Wire Wire Line
	7350 5400 7750 5400
Wire Wire Line
	7350 5500 7550 5500
Wire Wire Line
	7350 5600 7750 5600
Wire Wire Line
	7350 6300 7650 6300
Wire Wire Line
	7450 5700 7350 5700
Wire Wire Line
	7450 6200 7450 5700
Wire Wire Line
	7450 6200 7750 6200
Wire Wire Line
	7350 5800 7350 6100
Wire Wire Line
	7550 6000 7550 5500
Wire Wire Line
	7550 6000 7750 6000
Wire Wire Line
	7650 5500 7650 5300
Wire Wire Line
	7700 5300 7700 5200
Wire Wire Line
	7650 5900 7650 6300
Wire Wire Line
	7750 2800 7750 2900
Wire Wire Line
	7750 3750 5750 3750
Wire Wire Line
	7750 3750 7750 3500
Wire Wire Line
	7750 4100 7750 3750
Wire Wire Line
	7750 4700 7750 4800
Wire Wire Line
	7750 4800 8750 4800
Wire Wire Line
	7750 5300 7700 5300
Wire Wire Line
	7750 5500 7650 5500
Wire Wire Line
	7750 5900 7650 5900
Wire Wire Line
	8050 1000 8350 1000
Wire Wire Line
	8050 1100 8450 1100
Wire Wire Line
	8050 1200 8450 1200
Wire Wire Line
	8050 1300 8450 1300
Wire Wire Line
	8050 1400 8250 1400
Wire Wire Line
	8050 1500 8150 1500
Wire Wire Line
	8050 2000 8450 2000
Wire Wire Line
	8150 1500 8150 1800
Wire Wire Line
	8150 1800 8450 1800
Wire Wire Line
	8150 6300 8250 6300
Wire Wire Line
	8250 2850 8250 2900
Wire Wire Line
	8250 3500 8250 3850
Wire Wire Line
	8250 3850 8250 4100
Wire Wire Line
	8250 3850 10250 3850
Wire Wire Line
	8250 4700 8250 4750
Wire Wire Line
	8250 4750 8850 4750
Wire Wire Line
	8250 5700 8150 5700
Wire Wire Line
	8250 5700 8950 5700
Wire Wire Line
	8250 6300 8250 5700
Wire Wire Line
	8350 1400 8350 1000
Wire Wire Line
	8450 1400 8350 1400
Wire Wire Line
	8650 2750 8650 2700
Wire Wire Line
	8650 4850 8650 4900
Wire Wire Line
	8750 2700 8750 2800
Wire Wire Line
	8750 2800 7750 2800
Wire Wire Line
	8750 3950 8750 3500
Wire Wire Line
	8750 4100 8750 3950
Wire Wire Line
	8750 4700 8950 4700
Wire Wire Line
	8750 4900 8750 4800
Wire Wire Line
	8850 1000 8950 1000
Wire Wire Line
	8850 2850 8250 2850
Wire Wire Line
	8850 2850 8850 2700
Wire Wire Line
	8850 4750 8850 4900
Wire Wire Line
	8950 1000 8950 1600
Wire Wire Line
	8950 1600 8850 1600
Wire Wire Line
	8950 1600 8950 2200
Wire Wire Line
	8950 2200 8950 2300
Wire Wire Line
	8950 2200 9550 2200
Wire Wire Line
	8950 2700 8950 2900
Wire Wire Line
	8950 2900 8750 2900
Wire Wire Line
	8950 4900 8950 4700
Wire Wire Line
	8950 5300 8950 5400
Wire Wire Line
	8950 5400 9550 5400
Wire Wire Line
	8950 5700 8950 5400
Wire Wire Line
	9100 1600 8950 1600
Wire Wire Line
	9100 5700 8950 5700
Wire Wire Line
	9250 2900 9250 2700
Wire Wire Line
	9250 3500 9250 3650
Wire Wire Line
	9250 3650 9250 4100
Wire Wire Line
	9250 4700 9250 4900
Wire Wire Line
	9350 2700 9350 2900
Wire Wire Line
	9350 2900 9750 2900
Wire Wire Line
	9350 4700 9350 4900
Wire Wire Line
	9450 2850 9450 2700
Wire Wire Line
	9450 4750 9450 4900
Wire Wire Line
	9550 2200 9550 2300
Wire Wire Line
	9550 2700 9550 2800
Wire Wire Line
	9550 2800 10750 2800
Wire Wire Line
	9550 4800 9550 4900
Wire Wire Line
	9550 5400 9550 5300
Wire Wire Line
	9750 3500 9750 3750
Wire Wire Line
	9750 3750 7750 3750
Wire Wire Line
	9750 3750 9750 4100
Wire Wire Line
	9750 4700 9350 4700
Wire Wire Line
	10250 2850 9450 2850
Wire Wire Line
	10250 2900 10250 2850
Wire Wire Line
	10250 3500 10250 3850
Wire Wire Line
	10250 3850 10250 4100
Wire Wire Line
	10250 4700 10250 4750
Wire Wire Line
	10250 4750 9450 4750
Wire Wire Line
	10750 2900 10750 2800
Wire Wire Line
	10750 3500 10750 3950
Wire Wire Line
	10750 3950 8750 3950
Wire Wire Line
	10750 3950 10750 4100
Wire Wire Line
	10750 4700 10750 4800
Wire Wire Line
	10750 4800 9550 4800
Wire Bus Line
	1200 950  1000 950 
Wire Bus Line
	1200 2150 1000 2150
Wire Bus Line
	1200 3000 1000 3000
Wire Bus Line
	1200 4200 1000 4200
Text Label 1350 1200 0    50   ~ 0
G3
Text Label 1350 1300 0    50   ~ 0
G2
Text Label 1350 1400 0    50   ~ 0
G1
Text Label 1350 1500 0    50   ~ 0
G0
Text Label 1350 1600 0    50   ~ 0
B0
Text Label 1350 1700 0    50   ~ 0
B1
Text Label 1350 1800 0    50   ~ 0
B2
Text Label 1350 1900 0    50   ~ 0
B3
Text Label 1350 3250 0    50   ~ 0
R3
Text Label 1350 3350 0    50   ~ 0
R2
Text Label 1350 3450 0    50   ~ 0
R1
Text Label 1350 3550 0    50   ~ 0
R0
Text Label 1350 3650 0    50   ~ 0
F0
Text Label 1350 3750 0    50   ~ 0
F1
Text Label 1350 3850 0    50   ~ 0
F2
Text Label 1350 3950 0    50   ~ 0
F3
Text Label 2600 1200 0    50   ~ 0
QG3
Text Label 2600 1300 0    50   ~ 0
QG2
Text Label 2600 1400 0    50   ~ 0
QG1
Text Label 2600 1500 0    50   ~ 0
QG0
Text Label 2600 1600 0    50   ~ 0
QB0
Text Label 2600 1700 0    50   ~ 0
QB1
Text Label 2600 1800 0    50   ~ 0
QB2
Text Label 2600 1900 0    50   ~ 0
QB3
Text Label 2600 3250 0    50   ~ 0
QR3
Text Label 2600 3350 0    50   ~ 0
QR2
Text Label 2600 3450 0    50   ~ 0
QR1
Text Label 2600 3550 0    50   ~ 0
QR0
Text Label 3100 4850 0    50   ~ 0
QB0
Text Label 3100 4950 0    50   ~ 0
QG0
Text Label 3100 5050 0    50   ~ 0
QR0
Text Label 3300 1100 0    50   ~ 0
QB3
Text Label 3300 1200 0    50   ~ 0
QB2
Text Label 3300 1300 0    50   ~ 0
QB1
Text Label 4500 4850 0    50   ~ 0
OaB0
Text Label 4500 4950 0    50   ~ 0
OaG0
Text Label 4500 5050 0    50   ~ 0
OaR0
Text Label 4500 5150 0    50   ~ 0
ObR0
Text Label 4500 5250 0    50   ~ 0
ObG0
Text Label 4500 5350 0    50   ~ 0
ObB0
Text Label 4700 1000 0    50   ~ 0
OaB0
Text Label 4700 2000 0    50   ~ 0
ObB0
Text Label 4900 3650 0    50   ~ 0
QF0
Text Label 4900 3750 0    50   ~ 0
QF1
Text Label 4900 3850 0    50   ~ 0
QF2
Text Label 4900 3950 0    50   ~ 0
QF3
Text Label 6000 5450 0    50   ~ 0
QR1
Text Label 6000 5550 0    50   ~ 0
QR2
Text Label 6000 5650 0    50   ~ 0
QR3
Text Label 6700 1100 0    50   ~ 0
QG3
Text Label 6700 1200 0    50   ~ 0
QG2
Text Label 6700 1300 0    50   ~ 0
QG1
Text Label 7400 5200 0    50   ~ 0
OaR0
Text Label 7400 6300 0    50   ~ 0
ObR0
Text Label 8100 1000 0    50   ~ 0
OaG0
Text Label 8100 2000 0    50   ~ 0
ObG0
Text HLabel 1000 950  0    50   Input ~ 0
G[0..3]
Text HLabel 1000 2150 0    50   Input ~ 0
B[0..3]
Text HLabel 1000 3000 0    50   Input ~ 0
R[0..3]
Text HLabel 1000 4200 0    50   Input ~ 0
F[0..3]
Text HLabel 1550 2100 0    50   Input ~ 0
CLK
Text HLabel 1550 2200 0    50   Input ~ 0
~CLEAR
Text HLabel 1550 4150 0    50   Input ~ 0
CLK
Text HLabel 1550 4250 0    50   Input ~ 0
~CLEAR
Text HLabel 5700 1600 2    50   Output ~ 0
BLUE
Text HLabel 9100 1600 2    50   Output ~ 0
GREEN
Text HLabel 9100 5700 2    50   Output ~ 0
RED
$Comp
L power:VCC #PWR0360
U 1 1 5F89A71C
P 2050 900
F 0 "#PWR0360" H 2050 750 50  0001 C CNN
F 1 "VCC" H 2067 1073 50  0000 C CNN
F 2 "" H 2050 900 50  0001 C CNN
F 3 "" H 2050 900 50  0001 C CNN
	1    2050 900 
	1    0    0    -1  
$EndComp
$Comp
L power:VCC #PWR0355
U 1 1 5F884289
P 2050 2950
F 0 "#PWR0355" H 2050 2800 50  0001 C CNN
F 1 "VCC" H 2067 3123 50  0000 C CNN
F 2 "" H 2050 2950 50  0001 C CNN
F 3 "" H 2050 2950 50  0001 C CNN
	1    2050 2950
	1    0    0    -1  
$EndComp
$Comp
L power:VCC #PWR0366
U 1 1 5F8B00E7
P 3000 6500
F 0 "#PWR0366" H 3000 6350 50  0001 C CNN
F 1 "VCC" H 3017 6673 50  0000 C CNN
F 2 "" H 3000 6500 50  0001 C CNN
F 3 "" H 3000 6500 50  0001 C CNN
	1    3000 6500
	1    0    0    -1  
$EndComp
$Comp
L power:VCC #PWR0368
U 1 1 5F8B0E50
P 3950 4550
F 0 "#PWR0368" H 3950 4400 50  0001 C CNN
F 1 "VCC" H 3967 4723 50  0000 C CNN
F 2 "" H 3950 4550 50  0001 C CNN
F 3 "" H 3950 4550 50  0001 C CNN
	1    3950 4550
	1    0    0    -1  
$EndComp
$Comp
L power:VCC #PWR0361
U 1 1 5F89AC06
P 4150 800
F 0 "#PWR0361" H 4150 650 50  0001 C CNN
F 1 "VCC" H 4167 973 50  0000 C CNN
F 2 "" H 4150 800 50  0001 C CNN
F 3 "" H 4150 800 50  0001 C CNN
	1    4150 800 
	1    0    0    -1  
$EndComp
$Comp
L power:VCC #PWR0365
U 1 1 5F89C639
P 6850 5000
F 0 "#PWR0365" H 6850 4850 50  0001 C CNN
F 1 "VCC" H 6867 5173 50  0000 C CNN
F 2 "" H 6850 5000 50  0001 C CNN
F 3 "" H 6850 5000 50  0001 C CNN
	1    6850 5000
	1    0    0    -1  
$EndComp
$Comp
L power:VCC #PWR0362
U 1 1 5F89B353
P 7550 800
F 0 "#PWR0362" H 7550 650 50  0001 C CNN
F 1 "VCC" H 7567 973 50  0000 C CNN
F 2 "" H 7550 800 50  0001 C CNN
F 3 "" H 7550 800 50  0001 C CNN
	1    7550 800 
	1    0    0    -1  
$EndComp
$Comp
L power:GND #PWR0359
U 1 1 5F8995E1
P 2050 2500
F 0 "#PWR0359" H 2050 2250 50  0001 C CNN
F 1 "GND" H 2055 2327 50  0001 C CNN
F 2 "" H 2050 2500 50  0001 C CNN
F 3 "" H 2050 2500 50  0001 C CNN
	1    2050 2500
	1    0    0    -1  
$EndComp
$Comp
L power:GND #PWR0356
U 1 1 5F8848F6
P 2050 4550
F 0 "#PWR0356" H 2050 4300 50  0001 C CNN
F 1 "GND" H 2055 4377 50  0001 C CNN
F 2 "" H 2050 4550 50  0001 C CNN
F 3 "" H 2050 4550 50  0001 C CNN
	1    2050 4550
	1    0    0    -1  
$EndComp
$Comp
L power:GND #PWR0357
U 1 1 5F898D29
P 3950 5950
F 0 "#PWR0357" H 3950 5700 50  0001 C CNN
F 1 "GND" H 3955 5777 50  0001 C CNN
F 2 "" H 3950 5950 50  0001 C CNN
F 3 "" H 3950 5950 50  0001 C CNN
	1    3950 5950
	1    0    0    -1  
$EndComp
$Comp
L power:GND #PWR0358
U 1 1 5F8990CF
P 4150 2200
F 0 "#PWR0358" H 4150 1950 50  0001 C CNN
F 1 "GND" H 4155 2027 50  0001 C CNN
F 2 "" H 4150 2200 50  0001 C CNN
F 3 "" H 4150 2200 50  0001 C CNN
	1    4150 2200
	1    0    0    -1  
$EndComp
$Comp
L power:GND #PWR0367
U 1 1 5F8B07AB
P 5250 7500
F 0 "#PWR0367" H 5250 7250 50  0001 C CNN
F 1 "GND" H 5255 7327 50  0001 C CNN
F 2 "" H 5250 7500 50  0001 C CNN
F 3 "" H 5250 7500 50  0001 C CNN
	1    5250 7500
	1    0    0    -1  
$EndComp
$Comp
L power:GND #PWR0364
U 1 1 5F89BBF1
P 6850 6400
F 0 "#PWR0364" H 6850 6150 50  0001 C CNN
F 1 "GND" H 6855 6227 50  0001 C CNN
F 2 "" H 6850 6400 50  0001 C CNN
F 3 "" H 6850 6400 50  0001 C CNN
	1    6850 6400
	1    0    0    -1  
$EndComp
$Comp
L power:GND #PWR0363
U 1 1 5F89B778
P 7550 2200
F 0 "#PWR0363" H 7550 1950 50  0001 C CNN
F 1 "GND" H 7555 2027 50  0001 C CNN
F 2 "" H 7550 2200 50  0001 C CNN
F 3 "" H 7550 2200 50  0001 C CNN
	1    7550 2200
	1    0    0    -1  
$EndComp
$Comp
L 74xx:74LS07 UE2
U 6 1 5E61F588
P 3250 3200
F 0 "UE2" H 3250 3517 50  0000 C CNN
F 1 "74LS07" H 3250 3426 50  0000 C CNN
F 2 "" H 3250 3200 50  0001 C CNN
F 3 "www.ti.com/lit/ds/symlink/sn74ls07.pdf" H 3250 3200 50  0001 C CNN
	6    3250 3200
	0    1    -1   0   
$EndComp
$Comp
L 74xx:74LS07 UD1
U 6 1 5E639CF5
P 3750 3200
F 0 "UD1" H 3750 3517 50  0000 C CNN
F 1 "74LS07" H 3750 3426 50  0000 C CNN
F 2 "" H 3750 3200 50  0001 C CNN
F 3 "www.ti.com/lit/ds/symlink/sn74ls07.pdf" H 3750 3200 50  0001 C CNN
	6    3750 3200
	0    1    -1   0   
$EndComp
$Comp
L 74xx:74LS07 UE1
U 3 1 5E64A944
P 4250 3200
F 0 "UE1" H 4250 3517 50  0000 C CNN
F 1 "74LS07" H 4250 3426 50  0000 C CNN
F 2 "" H 4250 3200 50  0001 C CNN
F 3 "www.ti.com/lit/ds/symlink/sn74ls07.pdf" H 4250 3200 50  0001 C CNN
	3    4250 3200
	0    1    -1   0   
$EndComp
$Comp
L 74xx:74LS07 UF2
U 6 1 5E654DE8
P 4750 3200
F 0 "UF2" H 4750 3517 50  0000 C CNN
F 1 "74LS07" H 4750 3426 50  0000 C CNN
F 2 "" H 4750 3200 50  0001 C CNN
F 3 "www.ti.com/lit/ds/symlink/sn74ls07.pdf" H 4750 3200 50  0001 C CNN
	6    4750 3200
	0    1    -1   0   
$EndComp
$Comp
L 74xx:74LS07 UE2
U 3 1 5E61D0F9
P 5250 3200
F 0 "UE2" H 5250 3517 50  0000 C CNN
F 1 "74LS07" H 5250 3426 50  0000 C CNN
F 2 "" H 5250 3200 50  0001 C CNN
F 3 "www.ti.com/lit/ds/symlink/sn74ls07.pdf" H 5250 3200 50  0001 C CNN
	3    5250 3200
	0    1    -1   0   
$EndComp
$Comp
L 74xx:74LS07 UD1
U 1 1 5E639CD7
P 5750 3200
F 0 "UD1" H 5750 3517 50  0000 C CNN
F 1 "74LS07" H 5750 3426 50  0000 C CNN
F 2 "" H 5750 3200 50  0001 C CNN
F 3 "www.ti.com/lit/ds/symlink/sn74ls07.pdf" H 5750 3200 50  0001 C CNN
	1    5750 3200
	0    1    -1   0   
$EndComp
$Comp
L 74xx:74LS07 UE1
U 4 1 5E64A94A
P 6250 3200
F 0 "UE1" H 6250 3517 50  0000 C CNN
F 1 "74LS07" H 6250 3426 50  0000 C CNN
F 2 "" H 6250 3200 50  0001 C CNN
F 3 "www.ti.com/lit/ds/symlink/sn74ls07.pdf" H 6250 3200 50  0001 C CNN
	4    6250 3200
	0    1    -1   0   
$EndComp
$Comp
L 74xx:74LS07 UF2
U 3 1 5E654DD6
P 6750 3200
F 0 "UF2" H 6750 3517 50  0000 C CNN
F 1 "74LS07" H 6750 3426 50  0000 C CNN
F 2 "" H 6750 3200 50  0001 C CNN
F 3 "www.ti.com/lit/ds/symlink/sn74ls07.pdf" H 6750 3200 50  0001 C CNN
	3    6750 3200
	0    1    -1   0   
$EndComp
$Comp
L 74xx:74LS07 UE2
U 5 1 5E61E7D9
P 7250 3200
F 0 "UE2" H 7250 3517 50  0000 C CNN
F 1 "74LS07" H 7250 3426 50  0000 C CNN
F 2 "" H 7250 3200 50  0001 C CNN
F 3 "www.ti.com/lit/ds/symlink/sn74ls07.pdf" H 7250 3200 50  0001 C CNN
	5    7250 3200
	0    1    -1   0   
$EndComp
$Comp
L 74xx:74LS07 UE2
U 4 1 5E61DF72
P 7250 4400
F 0 "UE2" H 7250 4717 50  0000 C CNN
F 1 "74LS07" H 7250 4626 50  0000 C CNN
F 2 "" H 7250 4400 50  0001 C CNN
F 3 "www.ti.com/lit/ds/symlink/sn74ls07.pdf" H 7250 4400 50  0001 C CNN
	4    7250 4400
	0    1    1    0   
$EndComp
$Comp
L 74xx:74LS07 UD1
U 5 1 5E639CEF
P 7750 3200
F 0 "UD1" H 7750 3517 50  0000 C CNN
F 1 "74LS07" H 7750 3426 50  0000 C CNN
F 2 "" H 7750 3200 50  0001 C CNN
F 3 "www.ti.com/lit/ds/symlink/sn74ls07.pdf" H 7750 3200 50  0001 C CNN
	5    7750 3200
	0    1    -1   0   
$EndComp
$Comp
L 74xx:74LS07 UD1
U 4 1 5E639CE9
P 7750 4400
F 0 "UD1" H 7750 4717 50  0000 C CNN
F 1 "74LS07" H 7750 4626 50  0000 C CNN
F 2 "" H 7750 4400 50  0001 C CNN
F 3 "www.ti.com/lit/ds/symlink/sn74ls07.pdf" H 7750 4400 50  0001 C CNN
	4    7750 4400
	0    1    1    0   
$EndComp
$Comp
L 74xx:74LS07 UE1
U 1 1 5E64A938
P 8250 3200
F 0 "UE1" H 8250 3517 50  0000 C CNN
F 1 "74LS07" H 8250 3426 50  0000 C CNN
F 2 "" H 8250 3200 50  0001 C CNN
F 3 "www.ti.com/lit/ds/symlink/sn74ls07.pdf" H 8250 3200 50  0001 C CNN
	1    8250 3200
	0    1    -1   0   
$EndComp
$Comp
L 74xx:74LS07 UE1
U 2 1 5E64A93E
P 8250 4400
F 0 "UE1" H 8250 4717 50  0000 C CNN
F 1 "74LS07" H 8250 4626 50  0000 C CNN
F 2 "" H 8250 4400 50  0001 C CNN
F 3 "www.ti.com/lit/ds/symlink/sn74ls07.pdf" H 8250 4400 50  0001 C CNN
	2    8250 4400
	0    1    1    0   
$EndComp
$Comp
L 74xx:74LS07 UF2
U 5 1 5E654DE2
P 8750 3200
F 0 "UF2" H 8750 3517 50  0000 C CNN
F 1 "74LS07" H 8750 3426 50  0000 C CNN
F 2 "" H 8750 3200 50  0001 C CNN
F 3 "www.ti.com/lit/ds/symlink/sn74ls07.pdf" H 8750 3200 50  0001 C CNN
	5    8750 3200
	0    1    -1   0   
$EndComp
$Comp
L 74xx:74LS07 UF2
U 4 1 5E654DDC
P 8750 4400
F 0 "UF2" H 8750 4717 50  0000 C CNN
F 1 "74LS07" H 8750 4626 50  0000 C CNN
F 2 "" H 8750 4400 50  0001 C CNN
F 3 "www.ti.com/lit/ds/symlink/sn74ls07.pdf" H 8750 4400 50  0001 C CNN
	4    8750 4400
	0    1    1    0   
$EndComp
$Comp
L 74xx:74LS07 UE2
U 2 1 5E61BDC2
P 9250 3200
F 0 "UE2" H 9250 3517 50  0000 C CNN
F 1 "74LS07" H 9250 3426 50  0000 C CNN
F 2 "" H 9250 3200 50  0001 C CNN
F 3 "www.ti.com/lit/ds/symlink/sn74ls07.pdf" H 9250 3200 50  0001 C CNN
	2    9250 3200
	0    1    -1   0   
$EndComp
$Comp
L 74xx:74LS07 UE2
U 1 1 5E61AB16
P 9250 4400
F 0 "UE2" H 9250 4717 50  0000 C CNN
F 1 "74LS07" H 9250 4626 50  0000 C CNN
F 2 "" H 9250 4400 50  0001 C CNN
F 3 "www.ti.com/lit/ds/symlink/sn74ls07.pdf" H 9250 4400 50  0001 C CNN
	1    9250 4400
	0    1    1    0   
$EndComp
$Comp
L 74xx:74LS07 UD1
U 2 1 5E639CDD
P 9750 3200
F 0 "UD1" H 9750 3517 50  0000 C CNN
F 1 "74LS07" H 9750 3426 50  0000 C CNN
F 2 "" H 9750 3200 50  0001 C CNN
F 3 "www.ti.com/lit/ds/symlink/sn74ls07.pdf" H 9750 3200 50  0001 C CNN
	2    9750 3200
	0    1    -1   0   
$EndComp
$Comp
L 74xx:74LS07 UD1
U 3 1 5E639CE3
P 9750 4400
F 0 "UD1" H 9750 4717 50  0000 C CNN
F 1 "74LS07" H 9750 4626 50  0000 C CNN
F 2 "" H 9750 4400 50  0001 C CNN
F 3 "www.ti.com/lit/ds/symlink/sn74ls07.pdf" H 9750 4400 50  0001 C CNN
	3    9750 4400
	0    1    1    0   
$EndComp
$Comp
L 74xx:74LS07 UE1
U 5 1 5E64A950
P 10250 3200
F 0 "UE1" H 10250 3517 50  0000 C CNN
F 1 "74LS07" H 10250 3426 50  0000 C CNN
F 2 "" H 10250 3200 50  0001 C CNN
F 3 "www.ti.com/lit/ds/symlink/sn74ls07.pdf" H 10250 3200 50  0001 C CNN
	5    10250 3200
	0    1    -1   0   
$EndComp
$Comp
L 74xx:74LS07 UE1
U 6 1 5E64A956
P 10250 4400
F 0 "UE1" H 10250 4717 50  0000 C CNN
F 1 "74LS07" H 10250 4626 50  0000 C CNN
F 2 "" H 10250 4400 50  0001 C CNN
F 3 "www.ti.com/lit/ds/symlink/sn74ls07.pdf" H 10250 4400 50  0001 C CNN
	6    10250 4400
	0    1    1    0   
$EndComp
$Comp
L 74xx:74LS07 UF2
U 2 1 5E654DD0
P 10750 3200
F 0 "UF2" H 10750 3517 50  0000 C CNN
F 1 "74LS07" H 10750 3426 50  0000 C CNN
F 2 "" H 10750 3200 50  0001 C CNN
F 3 "www.ti.com/lit/ds/symlink/sn74ls07.pdf" H 10750 3200 50  0001 C CNN
	2    10750 3200
	0    1    -1   0   
$EndComp
$Comp
L 74xx:74LS07 UF2
U 1 1 5E654DCA
P 10750 4400
F 0 "UF2" H 10750 4717 50  0000 C CNN
F 1 "74LS07" H 10750 4626 50  0000 C CNN
F 2 "" H 10750 4400 50  0001 C CNN
F 3 "www.ti.com/lit/ds/symlink/sn74ls07.pdf" H 10750 4400 50  0001 C CNN
	1    10750 4400
	0    1    1    0   
$EndComp
$Comp
L CPS2-Custom:R089B RA3
U 1 1 5E951B84
P 4650 2500
F 0 "RA3" H 4500 2700 50  0000 C CNN
F 1 "R089B" H 4750 2700 50  0000 C CNN
F 2 "Resistor_THT:R_Array_SIP7" V 5025 2500 50  0001 C CNN
F 3 "http://www.vishay.com/docs/31509/csc.pdf" H 4650 2500 50  0001 C CNN
	1    4650 2500
	-1   0    0    -1  
$EndComp
$Comp
L CPS2-Custom:R089B RA12
U 1 1 5E7188C8
P 5250 1300
F 0 "RA12" H 5100 1500 50  0000 C CNN
F 1 "R089B" H 5350 1500 50  0000 C CNN
F 2 "Resistor_THT:R_Array_SIP7" V 5625 1300 50  0001 C CNN
F 3 "http://www.vishay.com/docs/31509/csc.pdf" H 5250 1300 50  0001 C CNN
	1    5250 1300
	0    1    1    0   
$EndComp
$Comp
L CPS2-Custom:R089B RA9
U 1 1 5E75B2E9
P 5250 1900
F 0 "RA9" H 5100 2100 50  0000 C CNN
F 1 "R089B" H 5350 2100 50  0000 C CNN
F 2 "Resistor_THT:R_Array_SIP7" V 5625 1900 50  0001 C CNN
F 3 "http://www.vishay.com/docs/31509/csc.pdf" H 5250 1900 50  0001 C CNN
	1    5250 1900
	0    1    1    0   
$EndComp
$Comp
L CPS2-Custom:R089B RA6
U 1 1 5E88DB72
P 5250 2500
F 0 "RA6" H 5100 2700 50  0000 C CNN
F 1 "R089B" H 5350 2700 50  0000 C CNN
F 2 "Resistor_THT:R_Array_SIP7" V 5625 2500 50  0001 C CNN
F 3 "http://www.vishay.com/docs/31509/csc.pdf" H 5250 2500 50  0001 C CNN
	1    5250 2500
	-1   0    0    -1  
$EndComp
$Comp
L CPS2-Custom:R089B RA10
U 1 1 5F15F968
P 7950 5400
F 0 "RA10" H 7800 5600 50  0000 C CNN
F 1 "R089B" H 8050 5600 50  0000 C CNN
F 2 "Resistor_THT:R_Array_SIP7" V 8325 5400 50  0001 C CNN
F 3 "http://www.vishay.com/docs/31509/csc.pdf" H 7950 5400 50  0001 C CNN
	1    7950 5400
	0    1    -1   0   
$EndComp
$Comp
L CPS2-Custom:R089B RA7
U 1 1 5F15F962
P 7950 6000
F 0 "RA7" H 7800 6200 50  0000 C CNN
F 1 "R089B" H 8050 6200 50  0000 C CNN
F 2 "Resistor_THT:R_Array_SIP7" V 8325 6000 50  0001 C CNN
F 3 "http://www.vishay.com/docs/31509/csc.pdf" H 7950 6000 50  0001 C CNN
	1    7950 6000
	0    1    -1   0   
$EndComp
$Comp
L CPS2-Custom:R089B RA11
U 1 1 5ED7B7CB
P 8650 1300
F 0 "RA11" H 8500 1500 50  0000 C CNN
F 1 "R089B" H 8750 1500 50  0000 C CNN
F 2 "Resistor_THT:R_Array_SIP7" V 9025 1300 50  0001 C CNN
F 3 "http://www.vishay.com/docs/31509/csc.pdf" H 8650 1300 50  0001 C CNN
	1    8650 1300
	0    1    1    0   
$EndComp
$Comp
L CPS2-Custom:R089B RA8
U 1 1 5ED7B7D1
P 8650 1900
F 0 "RA8" H 8500 2100 50  0000 C CNN
F 1 "R089B" H 8750 2100 50  0000 C CNN
F 2 "Resistor_THT:R_Array_SIP7" V 9025 1900 50  0001 C CNN
F 3 "http://www.vishay.com/docs/31509/csc.pdf" H 8650 1900 50  0001 C CNN
	1    8650 1900
	0    1    1    0   
$EndComp
$Comp
L CPS2-Custom:R089B RA2
U 1 1 5ECDB897
P 8650 2500
F 0 "RA2" H 8500 2700 50  0000 C CNN
F 1 "R089B" H 8750 2700 50  0000 C CNN
F 2 "Resistor_THT:R_Array_SIP7" V 9025 2500 50  0001 C CNN
F 3 "http://www.vishay.com/docs/31509/csc.pdf" H 8650 2500 50  0001 C CNN
	1    8650 2500
	-1   0    0    -1  
$EndComp
$Comp
L CPS2-Custom:R089B RA1
U 1 1 5EE4139D
P 8650 5100
F 0 "RA1" H 8500 5300 50  0000 C CNN
F 1 "R089B" H 8750 5300 50  0000 C CNN
F 2 "Resistor_THT:R_Array_SIP7" V 9025 5100 50  0001 C CNN
F 3 "http://www.vishay.com/docs/31509/csc.pdf" H 8650 5100 50  0001 C CNN
	1    8650 5100
	-1   0    0    1   
$EndComp
$Comp
L CPS2-Custom:R089B RA5
U 1 1 5E916CF9
P 9250 2500
F 0 "RA5" H 9100 2700 50  0000 C CNN
F 1 "R089B" H 9350 2700 50  0000 C CNN
F 2 "Resistor_THT:R_Array_SIP7" V 9625 2500 50  0001 C CNN
F 3 "http://www.vishay.com/docs/31509/csc.pdf" H 9250 2500 50  0001 C CNN
	1    9250 2500
	-1   0    0    -1  
$EndComp
$Comp
L CPS2-Custom:R089B RA4
U 1 1 5EE41397
P 9250 5100
F 0 "RA4" H 9100 5300 50  0000 C CNN
F 1 "R089B" H 9350 5300 50  0000 C CNN
F 2 "Resistor_THT:R_Array_SIP7" V 9625 5100 50  0001 C CNN
F 3 "http://www.vishay.com/docs/31509/csc.pdf" H 9250 5100 50  0001 C CNN
	1    9250 5100
	-1   0    0    1   
$EndComp
$Comp
L 74xx:74LS07 UE2
U 7 1 5E620623
P 3000 7000
F 0 "UE2" H 3230 7046 50  0000 L CNN
F 1 "74LS07" H 3230 6955 50  0000 L CNN
F 2 "" H 3000 7000 50  0001 C CNN
F 3 "www.ti.com/lit/ds/symlink/sn74ls07.pdf" H 3000 7000 50  0001 C CNN
	7    3000 7000
	1    0    0    -1  
$EndComp
$Comp
L 74xx:74LS07 UD1
U 7 1 5E63B138
P 3750 7000
F 0 "UD1" H 3980 7046 50  0000 L CNN
F 1 "74LS07" H 3980 6955 50  0000 L CNN
F 2 "" H 3750 7000 50  0001 C CNN
F 3 "www.ti.com/lit/ds/symlink/sn74ls07.pdf" H 3750 7000 50  0001 C CNN
	7    3750 7000
	1    0    0    -1  
$EndComp
$Comp
L 74xx:74LS07 UE1
U 7 1 5E64E07A
P 4500 7000
F 0 "UE1" H 4730 7046 50  0000 L CNN
F 1 "74LS07" H 4730 6955 50  0000 L CNN
F 2 "" H 4500 7000 50  0001 C CNN
F 3 "www.ti.com/lit/ds/symlink/sn74ls07.pdf" H 4500 7000 50  0001 C CNN
	7    4500 7000
	1    0    0    -1  
$EndComp
$Comp
L 74xx:74LS07 UF2
U 7 1 5E659EB4
P 5250 7000
F 0 "UF2" H 5480 7046 50  0000 L CNN
F 1 "74LS07" H 5480 6955 50  0000 L CNN
F 2 "" H 5250 7000 50  0001 C CNN
F 3 "www.ti.com/lit/ds/symlink/sn74ls07.pdf" H 5250 7000 50  0001 C CNN
	7    5250 7000
	1    0    0    -1  
$EndComp
$Comp
L 74xx:74LS367 UD3
U 1 1 5E618F83
P 3950 5250
F 0 "UD3" H 3700 5850 50  0000 C CNN
F 1 "74LS367" H 4150 4650 50  0000 C CNN
F 2 "" H 3950 5250 50  0001 C CNN
F 3 "http://www.ti.com/lit/gpn/sn74LS367" H 3950 5250 50  0001 C CNN
	1    3950 5250
	1    0    0    -1  
$EndComp
$Comp
L 74xx:74LS367 UE3
U 1 1 5E66AF6B
P 4150 1500
F 0 "UE3" H 3900 2100 50  0000 C CNN
F 1 "74LS367" H 4350 900 50  0000 C CNN
F 2 "" H 4150 1500 50  0001 C CNN
F 3 "http://www.ti.com/lit/gpn/sn74LS367" H 4150 1500 50  0001 C CNN
	1    4150 1500
	1    0    0    -1  
$EndComp
$Comp
L 74xx:74LS367 UD2
U 1 1 5E614207
P 6850 5700
F 0 "UD2" H 6600 6300 50  0000 C CNN
F 1 "74LS367" H 7050 5100 50  0000 C CNN
F 2 "" H 6850 5700 50  0001 C CNN
F 3 "http://www.ti.com/lit/gpn/sn74LS367" H 6850 5700 50  0001 C CNN
	1    6850 5700
	1    0    0    -1  
$EndComp
$Comp
L 74xx:74LS367 UF3
U 1 1 5E674B9B
P 7550 1500
F 0 "UF3" H 7300 2100 50  0000 C CNN
F 1 "74LS367" H 7750 900 50  0000 C CNN
F 2 "" H 7550 1500 50  0001 C CNN
F 3 "http://www.ti.com/lit/gpn/sn74LS367" H 7550 1500 50  0001 C CNN
	1    7550 1500
	1    0    0    -1  
$EndComp
$Comp
L 74xx:74LS273 UH3
U 1 1 5E60D069
P 2050 1700
F 0 "UH3" H 1800 2400 50  0000 C CNN
F 1 "74LS273" H 2250 1000 50  0000 C CNN
F 2 "" H 2050 1700 50  0001 C CNN
F 3 "http://www.ti.com/lit/gpn/sn74LS273" H 2050 1700 50  0001 C CNN
	1    2050 1700
	1    0    0    -1  
$EndComp
$Comp
L 74xx:74LS273 UH2
U 1 1 5E602989
P 2050 3750
F 0 "UH2" H 1800 4450 50  0000 C CNN
F 1 "74LS273" H 2250 3050 50  0000 C CNN
F 2 "" H 2050 3750 50  0001 C CNN
F 3 "http://www.ti.com/lit/gpn/sn74LS273" H 2050 3750 50  0001 C CNN
	1    2050 3750
	1    0    0    -1  
$EndComp
Connection ~ 8950 5700
Wire Wire Line
	4850 1900 5050 1900
Wire Wire Line
	4850 1400 4850 1900
Wire Wire Line
	4650 1700 5050 1700
Wire Wire Line
	8250 1900 8450 1900
Wire Wire Line
	8050 1700 8050 1600
Wire Wire Line
	8250 1400 8250 1900
Wire Wire Line
	8050 1700 8450 1700
Wire Wire Line
	7350 6100 7750 6100
Wire Wire Line
	7350 5200 7700 5200
Wire Wire Line
	7350 5300 7650 5300
Wire Bus Line
	1200 950  1200 1400
Wire Bus Line
	1200 1700 1200 2150
Wire Bus Line
	1200 3000 1200 3450
Wire Bus Line
	1200 3750 1200 4200
$EndSCHEMATC
