EESchema Schematic File Version 4
EELAYER 30 0
EELAYER END
$Descr A3 16535 11693
encoding utf-8
Sheet 21 83
Title "CPS Reverse Engineering: DL-0311"
Date "2021-09-12"
Rev ""
Comp ""
Comment1 ""
Comment2 ""
Comment3 "Licence: CC-BY"
Comment4 "Author: Loïc *WydD* Petit"
$EndDescr
Connection ~ 5700 9500
Connection ~ 5800 8350
Connection ~ 5800 8250
Connection ~ 5800 8150
Connection ~ 11000 8200
Connection ~ 10800 8400
Connection ~ 9900 7500
Connection ~ 10900 8300
Connection ~ 9800 5850
Connection ~ 9700 6350
Connection ~ 9900 5950
Connection ~ 9600 6150
Connection ~ 9500 5700
Connection ~ 9700 5750
Connection ~ 9600 5650
Connection ~ 8850 7500
Connection ~ 8750 6650
Connection ~ 8750 6200
Connection ~ 8750 5750
Connection ~ 8750 2900
Connection ~ 8700 7500
Connection ~ 9900 2950
Connection ~ 9800 2850
Connection ~ 9700 2400
Connection ~ 9800 2250
Connection ~ 9900 2350
Connection ~ 9700 2150
Connection ~ 9900 7150
Connection ~ 9800 7050
Connection ~ 12900 3750
Connection ~ 9900 6550
Connection ~ 9700 6600
Connection ~ 9800 6450
Connection ~ 11000 4000
Connection ~ 9900 3550
Connection ~ 10900 4100
Connection ~ 12900 6000
Connection ~ 11750 6400
Connection ~ 11850 6600
Connection ~ 11750 2850
Connection ~ 11750 2200
Connection ~ 11850 7250
Connection ~ 11750 7050
Connection ~ 11750 7700
Connection ~ 11850 7900
Connection ~ 12900 7300
Connection ~ 10700 8500
Connection ~ 12900 6650
Connection ~ 7150 8750
Connection ~ 10700 1550
Connection ~ 11850 2400
Connection ~ 8750 2450
Connection ~ 11850 3050
Connection ~ 12900 3100
Connection ~ 12900 2450
Connection ~ 10550 9150
Connection ~ 8200 7500
Connection ~ 4450 5750
NoConn ~ 13500 2250
NoConn ~ 13500 2900
NoConn ~ 13500 3550
NoConn ~ 13500 6450
NoConn ~ 13500 7100
NoConn ~ 13500 5800
NoConn ~ 13500 7750
Entry Wire Line
	2150 4350 2250 4450
Entry Wire Line
	2150 4450 2250 4550
Entry Wire Line
	2150 4550 2250 4650
Entry Wire Line
	2150 4650 2250 4750
Entry Wire Line
	3900 8950 4000 9050
Entry Wire Line
	3900 9050 4000 9150
Entry Wire Line
	3900 9150 4000 9250
Entry Wire Line
	3900 9250 4000 9350
Entry Wire Line
	4400 4550 4300 4450
Entry Wire Line
	4400 4650 4300 4550
Entry Wire Line
	4400 4750 4300 4650
Entry Wire Line
	4400 4850 4300 4750
Entry Wire Line
	4450 6100 4550 6200
Entry Wire Line
	4450 6200 4550 6300
Entry Wire Line
	4450 6300 4550 6400
Entry Wire Line
	4450 6400 4550 6500
Entry Wire Line
	6200 4900 6300 4800
Entry Wire Line
	6200 5000 6300 4900
Entry Wire Line
	6200 5100 6300 5000
Entry Wire Line
	6200 5200 6300 5100
Entry Wire Line
	6200 5300 6300 5200
Entry Wire Line
	6200 5400 6300 5300
Entry Wire Line
	7050 8150 7150 8250
Entry Wire Line
	7050 8250 7150 8350
Entry Wire Line
	7050 8350 7150 8450
Entry Wire Line
	7050 8450 7150 8550
Entry Wire Line
	7050 9050 7150 8950
Entry Wire Line
	7050 9150 7150 9050
Entry Wire Line
	7050 9250 7150 9150
Entry Wire Line
	7050 9350 7150 9250
Entry Wire Line
	7200 6200 7300 6100
Entry Wire Line
	7200 6300 7300 6200
Entry Wire Line
	7200 6400 7300 6300
Entry Wire Line
	7200 6500 7300 6400
Entry Wire Line
	14700 2350 14800 2450
Entry Wire Line
	14700 3000 14800 3100
Entry Wire Line
	14700 3650 14800 3750
Entry Wire Line
	14700 5900 14800 5800
Entry Wire Line
	14700 6550 14800 6450
Entry Wire Line
	14700 7200 14800 7100
Wire Wire Line
	2000 4950 3050 4950
Wire Wire Line
	2250 4450 3050 4450
Wire Wire Line
	2250 4550 3050 4550
Wire Wire Line
	2250 4650 3050 4650
Wire Wire Line
	2250 4750 3050 4750
Wire Wire Line
	2300 5750 2400 5750
Wire Wire Line
	2300 5900 2400 5900
Wire Wire Line
	2300 6050 2400 6050
Wire Wire Line
	2300 6150 2400 6150
Wire Wire Line
	2300 6250 2400 6250
Wire Wire Line
	2950 4250 2950 5050
Wire Wire Line
	2950 5050 3050 5050
Wire Wire Line
	3850 4450 4300 4450
Wire Wire Line
	3850 4550 4300 4550
Wire Wire Line
	3850 4650 4300 4650
Wire Wire Line
	3850 4750 4300 4750
Wire Wire Line
	3950 9550 4800 9550
Wire Wire Line
	4000 9050 4800 9050
Wire Wire Line
	4000 9150 4800 9150
Wire Wire Line
	4000 9250 4800 9250
Wire Wire Line
	4000 9350 4800 9350
Wire Wire Line
	4550 6200 4800 6200
Wire Wire Line
	4550 6300 4800 6300
Wire Wire Line
	4550 6400 4800 6400
Wire Wire Line
	4550 6500 4800 6500
Wire Wire Line
	4700 8850 4700 9650
Wire Wire Line
	4700 9650 4800 9650
Wire Wire Line
	4800 6800 4800 7250
Wire Wire Line
	4800 7250 4650 7250
Wire Wire Line
	5500 7150 5700 7150
Wire Wire Line
	5500 9900 5700 9900
Wire Wire Line
	5600 6200 5800 6200
Wire Wire Line
	5600 6300 5800 6300
Wire Wire Line
	5600 6400 5800 6400
Wire Wire Line
	5600 6500 5800 6500
Wire Wire Line
	5600 9050 5800 9050
Wire Wire Line
	5600 9150 5800 9150
Wire Wire Line
	5600 9250 5800 9250
Wire Wire Line
	5600 9350 5800 9350
Wire Wire Line
	5700 6650 5700 7150
Wire Wire Line
	5700 8600 5700 9500
Wire Wire Line
	5700 9500 5800 9500
Wire Wire Line
	5700 9900 5700 9500
Wire Wire Line
	5800 6650 5700 6650
Wire Wire Line
	5800 8150 5800 8250
Wire Wire Line
	5800 8250 5800 8350
Wire Wire Line
	5800 8350 5800 8450
Wire Wire Line
	5800 8600 5700 8600
Wire Wire Line
	6300 5300 6550 5300
Wire Wire Line
	6300 5200 6550 5200
Wire Wire Line
	6300 5100 6550 5100
Wire Wire Line
	6300 5000 6550 5000
Wire Wire Line
	6300 4900 6550 4900
Wire Wire Line
	6300 4800 6550 4800
Wire Wire Line
	6800 6200 7200 6200
Wire Wire Line
	6800 6300 7200 6300
Wire Wire Line
	6800 6400 7200 6400
Wire Wire Line
	6800 6500 7200 6500
Wire Wire Line
	6800 8150 7050 8150
Wire Wire Line
	6800 8250 7050 8250
Wire Wire Line
	6800 8350 7050 8350
Wire Wire Line
	6800 8450 7050 8450
Wire Wire Line
	6800 9050 7050 9050
Wire Wire Line
	6800 9150 7050 9150
Wire Wire Line
	6800 9250 7050 9250
Wire Wire Line
	6800 9350 7050 9350
Wire Wire Line
	8000 7500 8200 7500
Wire Wire Line
	8200 4750 8200 7500
Wire Wire Line
	8200 7500 8700 7500
Wire Wire Line
	8300 5650 8850 5650
Wire Wire Line
	8300 8500 8300 5650
Wire Wire Line
	8300 8500 10700 8500
Wire Wire Line
	8400 6100 8850 6100
Wire Wire Line
	8400 8400 8400 6100
Wire Wire Line
	8400 8400 10800 8400
Wire Wire Line
	8500 2350 8850 2350
Wire Wire Line
	8500 4100 8500 2350
Wire Wire Line
	8500 4100 10900 4100
Wire Wire Line
	8500 6550 8850 6550
Wire Wire Line
	8500 8300 8500 6550
Wire Wire Line
	8500 8300 10900 8300
Wire Wire Line
	8600 2800 8850 2800
Wire Wire Line
	8600 4000 8600 2800
Wire Wire Line
	8600 4000 11000 4000
Wire Wire Line
	8600 7000 8850 7000
Wire Wire Line
	8600 8200 8600 7000
Wire Wire Line
	8600 8200 11000 8200
Wire Wire Line
	8700 7500 8850 7500
Wire Wire Line
	8700 7750 8700 7500
Wire Wire Line
	8700 7750 11100 7750
Wire Wire Line
	8750 1550 8550 1550
Wire Wire Line
	8750 1550 8750 2450
Wire Wire Line
	8750 2450 8750 2900
Wire Wire Line
	8750 2900 8750 5750
Wire Wire Line
	8750 5750 8750 6200
Wire Wire Line
	8750 6200 8750 6650
Wire Wire Line
	8750 6650 8750 7100
Wire Wire Line
	8750 7100 8850 7100
Wire Wire Line
	8850 2450 8750 2450
Wire Wire Line
	8850 2900 8750 2900
Wire Wire Line
	8850 5750 8750 5750
Wire Wire Line
	8850 6200 8750 6200
Wire Wire Line
	8850 6650 8750 6650
Wire Wire Line
	8850 7450 8850 7500
Wire Wire Line
	8850 7500 8850 7550
Wire Wire Line
	9400 2400 9700 2400
Wire Wire Line
	9400 5700 9500 5700
Wire Wire Line
	9400 6150 9600 6150
Wire Wire Line
	9400 6600 9700 6600
Wire Wire Line
	9400 7500 9900 7500
Wire Wire Line
	9500 4850 9500 5700
Wire Wire Line
	9500 4850 9600 4850
Wire Wire Line
	9500 5700 9500 7600
Wire Wire Line
	9600 4750 8200 4750
Wire Wire Line
	9600 5000 9600 5650
Wire Wire Line
	9600 5000 10150 5000
Wire Wire Line
	9600 5650 9600 6150
Wire Wire Line
	9600 6150 9600 7600
Wire Wire Line
	9700 2150 9700 2050
Wire Wire Line
	9700 2150 9700 2400
Wire Wire Line
	9700 2150 10050 2150
Wire Wire Line
	9700 2400 9700 3050
Wire Wire Line
	9700 5100 9700 5750
Wire Wire Line
	9700 5100 10150 5100
Wire Wire Line
	9700 5750 9700 6350
Wire Wire Line
	9700 5750 10000 5750
Wire Wire Line
	9700 6350 9700 6600
Wire Wire Line
	9700 6350 10050 6350
Wire Wire Line
	9700 6600 9700 7600
Wire Wire Line
	9800 2250 9800 2050
Wire Wire Line
	9800 2250 9800 2850
Wire Wire Line
	9800 2250 10050 2250
Wire Wire Line
	9800 2850 9400 2850
Wire Wire Line
	9800 2850 9800 3050
Wire Wire Line
	9800 2850 10050 2850
Wire Wire Line
	9800 5200 9800 5850
Wire Wire Line
	9800 5200 10150 5200
Wire Wire Line
	9800 5850 9800 6450
Wire Wire Line
	9800 5850 10000 5850
Wire Wire Line
	9800 6450 9800 7050
Wire Wire Line
	9800 6450 10050 6450
Wire Wire Line
	9800 7050 9400 7050
Wire Wire Line
	9800 7050 9800 7600
Wire Wire Line
	9800 7050 10050 7050
Wire Wire Line
	9900 2350 9900 2050
Wire Wire Line
	9900 2350 9900 2950
Wire Wire Line
	9900 2350 10050 2350
Wire Wire Line
	9900 2950 9900 3550
Wire Wire Line
	9900 2950 10050 2950
Wire Wire Line
	9900 3550 9900 4450
Wire Wire Line
	9900 3550 11100 3550
Wire Wire Line
	9900 5950 9900 5550
Wire Wire Line
	9900 5950 9900 6550
Wire Wire Line
	9900 6550 9900 7150
Wire Wire Line
	9900 6550 10050 6550
Wire Wire Line
	9900 7150 9900 7500
Wire Wire Line
	9900 7150 10050 7150
Wire Wire Line
	9900 7600 9900 7500
Wire Wire Line
	10000 5650 9600 5650
Wire Wire Line
	10000 5950 9900 5950
Wire Wire Line
	10150 4900 10150 4800
Wire Wire Line
	10350 1550 10700 1550
Wire Wire Line
	10550 8750 10550 9150
Wire Wire Line
	10550 9150 10350 9150
Wire Wire Line
	10550 9150 11850 9150
Wire Wire Line
	10600 2900 11100 2900
Wire Wire Line
	10600 5800 11100 5800
Wire Wire Line
	10600 7100 11100 7100
Wire Wire Line
	10700 1550 11850 1550
Wire Wire Line
	10700 1950 10700 1550
Wire Wire Line
	10700 5900 11100 5900
Wire Wire Line
	10700 8500 10700 5900
Wire Wire Line
	10800 1950 10700 1950
Wire Wire Line
	10800 2350 11100 2350
Wire Wire Line
	10800 4200 10800 2350
Wire Wire Line
	10800 6550 11100 6550
Wire Wire Line
	10800 8400 10800 6550
Wire Wire Line
	10900 3000 10900 4100
Wire Wire Line
	10900 4100 13850 4100
Wire Wire Line
	10900 7200 10900 8300
Wire Wire Line
	10900 8300 13850 8300
Wire Wire Line
	11000 3650 11100 3650
Wire Wire Line
	11000 4000 11000 3650
Wire Wire Line
	11000 7850 11100 7850
Wire Wire Line
	11000 8200 11000 7850
Wire Wire Line
	11100 2250 10600 2250
Wire Wire Line
	11100 3000 10900 3000
Wire Wire Line
	11100 6450 10600 6450
Wire Wire Line
	11100 7200 10900 7200
Wire Wire Line
	11150 8750 11750 8750
Wire Wire Line
	11350 4450 9900 4450
Wire Wire Line
	11350 5050 11350 4450
Wire Wire Line
	11400 1950 11750 1950
Wire Wire Line
	11650 6500 11950 6500
Wire Wire Line
	11750 2200 11750 1950
Wire Wire Line
	11750 2200 11750 2850
Wire Wire Line
	11750 2850 11750 3500
Wire Wire Line
	11750 3500 11950 3500
Wire Wire Line
	11750 5750 11750 6400
Wire Wire Line
	11750 6400 11750 7050
Wire Wire Line
	11750 7050 11750 7700
Wire Wire Line
	11750 7700 11750 8750
Wire Wire Line
	11750 7700 11950 7700
Wire Wire Line
	11850 1550 11850 2400
Wire Wire Line
	11850 2400 11850 3050
Wire Wire Line
	11850 3050 11850 3700
Wire Wire Line
	11850 3700 11950 3700
Wire Wire Line
	11850 5950 11850 6600
Wire Wire Line
	11850 6600 11850 7250
Wire Wire Line
	11850 7250 11850 7900
Wire Wire Line
	11850 7900 11850 9150
Wire Wire Line
	11850 7900 11950 7900
Wire Wire Line
	11950 2200 11750 2200
Wire Wire Line
	11950 2300 11650 2300
Wire Wire Line
	11950 2400 11850 2400
Wire Wire Line
	11950 2850 11750 2850
Wire Wire Line
	11950 2950 11650 2950
Wire Wire Line
	11950 3050 11850 3050
Wire Wire Line
	11950 3600 11650 3600
Wire Wire Line
	11950 5750 11750 5750
Wire Wire Line
	11950 5850 11650 5850
Wire Wire Line
	11950 5950 11850 5950
Wire Wire Line
	11950 6400 11750 6400
Wire Wire Line
	11950 6600 11850 6600
Wire Wire Line
	11950 7050 11750 7050
Wire Wire Line
	11950 7150 11650 7150
Wire Wire Line
	11950 7250 11850 7250
Wire Wire Line
	11950 7600 11400 7600
Wire Wire Line
	11950 7800 11650 7800
Wire Wire Line
	12800 2250 13000 2250
Wire Wire Line
	12800 2900 13000 2900
Wire Wire Line
	12800 3550 13000 3550
Wire Wire Line
	12800 6450 13000 6450
Wire Wire Line
	12800 7100 13000 7100
Wire Wire Line
	12800 7750 13000 7750
Wire Wire Line
	12900 1550 12700 1550
Wire Wire Line
	12900 1550 12900 2450
Wire Wire Line
	12900 2450 12900 3100
Wire Wire Line
	12900 3100 12900 3750
Wire Wire Line
	12900 3750 13000 3750
Wire Wire Line
	12900 6000 12900 3750
Wire Wire Line
	12900 6650 12900 6000
Wire Wire Line
	12900 6650 12900 7300
Wire Wire Line
	12900 7300 12900 7950
Wire Wire Line
	12900 7950 13000 7950
Wire Wire Line
	13000 2450 12900 2450
Wire Wire Line
	13000 3100 12900 3100
Wire Wire Line
	13000 5800 12800 5800
Wire Wire Line
	13000 6000 12900 6000
Wire Wire Line
	13000 6650 12900 6650
Wire Wire Line
	13000 7300 12900 7300
Wire Wire Line
	13500 2350 13950 2350
Wire Wire Line
	13500 3000 13850 3000
Wire Wire Line
	13500 3650 13750 3650
Wire Wire Line
	13500 5900 14050 5900
Wire Wire Line
	13500 6550 13950 6550
Wire Wire Line
	13500 7200 13850 7200
Wire Wire Line
	13500 7850 13750 7850
Wire Wire Line
	13750 3650 13750 4000
Wire Wire Line
	13750 4000 11000 4000
Wire Wire Line
	13750 7850 13750 8200
Wire Wire Line
	13750 8200 11000 8200
Wire Wire Line
	13850 3000 13850 4100
Wire Wire Line
	13850 7200 13850 8300
Wire Wire Line
	13950 2350 13950 4200
Wire Wire Line
	13950 4200 10800 4200
Wire Wire Line
	13950 6550 13950 8400
Wire Wire Line
	13950 8400 10800 8400
Wire Wire Line
	14050 5900 14050 8500
Wire Wire Line
	14050 8500 10700 8500
Wire Bus Line
	2150 4250 2050 4250
Wire Bus Line
	2300 5600 2400 5600
Wire Bus Line
	3750 5750 4450 5750
Wire Bus Line
	3900 8850 3800 8850
Wire Bus Line
	4400 5600 3750 5600
Wire Bus Line
	4450 5750 6200 5750
Wire Bus Line
	7150 8750 7300 8750
Wire Bus Line
	7300 6000 7450 6000
Wire Bus Line
	14800 4750 15050 4750
Text Label 2750 4450 2    50   ~ 0
BUS-DATA3
Text Label 2750 4550 2    50   ~ 0
BUS-DATA2
Text Label 2750 4650 2    50   ~ 0
BUS-DATA1
Text Label 2750 4750 2    50   ~ 0
BUS-DATA0
Text Label 3900 4450 0    50   ~ 0
BASE-X3
Text Label 3900 4550 0    50   ~ 0
BASE-X2
Text Label 3900 4650 0    50   ~ 0
BASE-X1
Text Label 3900 4750 0    50   ~ 0
BASE-X0
Text Label 4500 9050 2    50   ~ 0
BUS-DATA3
Text Label 4500 9150 2    50   ~ 0
BUS-DATA2
Text Label 4500 9250 2    50   ~ 0
BUS-DATA1
Text Label 4500 9350 2    50   ~ 0
BUS-DATA0
Text Label 4600 6200 0    50   ~ 0
X3
Text Label 4600 6300 0    50   ~ 0
X2
Text Label 4600 6400 0    50   ~ 0
X1
Text Label 4600 6500 0    50   ~ 0
X0
Text Label 6350 5300 0    50   ~ 0
X4
Text Label 6350 5200 0    50   ~ 0
X5
Text Label 6350 5100 0    50   ~ 0
X6
Text Label 6350 5000 0    50   ~ 0
X7
Text Label 6350 4900 0    50   ~ 0
X8
Text Label 6350 4800 0    50   ~ 0
X9
Text Label 6850 6200 0    50   ~ 0
XSHIFT3
Text Label 6850 6300 0    50   ~ 0
XSHIFT2
Text Label 6850 6400 0    50   ~ 0
XSHIFT1
Text Label 6850 6500 0    50   ~ 0
XSHIFT0
Text Label 6850 8150 0    50   ~ 0
Y7
Text Label 6850 8250 0    50   ~ 0
Y6
Text Label 6850 8350 0    50   ~ 0
Y5
Text Label 6850 8450 0    50   ~ 0
Y4
Text Label 6850 9050 0    50   ~ 0
Y3
Text Label 6850 9150 0    50   ~ 0
Y2
Text Label 6850 9250 0    50   ~ 0
Y1
Text Label 6850 9350 0    50   ~ 0
Y0
Text Label 11950 2100 2    50   ~ 0
X9
Text Label 11950 2750 2    50   ~ 0
X8
Text Label 11950 3400 2    50   ~ 0
X7
Text Label 11950 5650 2    50   ~ 0
X6
Text Label 11950 6300 2    50   ~ 0
X5
Text Label 11950 6950 2    50   ~ 0
X4
Text HLabel 1450 4900 0    50   Input ~ 0
~SCROLL2-X
Text HLabel 1450 5000 0    50   Input ~ 0
~CLK4M
Text HLabel 2050 4250 0    50   Input ~ 0
BUS-DATA[0..8]
Text HLabel 2300 5600 0    50   Input ~ 0
BUS-DATA[0..8]
Text HLabel 2300 5750 0    50   Input ~ 0
~BUS-ROWSCROLL
Text HLabel 2300 5900 0    50   Input ~ 0
FLIP
Text HLabel 2300 6050 0    50   Input ~ 0
~CLK4M
Text HLabel 2300 6150 0    50   Input ~ 0
FI
Text HLabel 2300 6250 0    50   Input ~ 0
MAIN-RESET
Text HLabel 3400 9500 0    50   Input ~ 0
~SCROLL2-Y
Text HLabel 3400 9600 0    50   Input ~ 0
~CLK4M
Text HLabel 3800 8850 0    50   Input ~ 0
BUS-DATA[0..8]
Text HLabel 4250 6650 0    50   Input ~ 0
CLK4M
Text HLabel 4250 6750 0    50   Input ~ 0
LI
Text HLabel 5500 7150 0    50   Input ~ 0
~SCROLL2-T
Text HLabel 5500 9900 0    50   Input ~ 0
~SCROLL2-T
Text HLabel 7300 8750 2    50   3State ~ 0
Y[0..7]
Text HLabel 7450 6000 2    50   3State ~ 0
XSHIFT[0..3]
Text HLabel 8000 7500 0    50   Input ~ 0
~SCROLL2-T
Text HLabel 8550 1550 0    50   Input ~ 0
~FLIP
Text HLabel 10350 1550 0    50   Input ~ 0
~LI
Text HLabel 10350 9150 0    50   Input ~ 0
~LI
Text HLabel 11400 7600 0    50   Input ~ 0
FLIP
Text HLabel 12700 1550 0    50   Input ~ 0
~CLK4M
Text HLabel 15050 4750 2    50   Output ~ 0
SCROLL2-X[0..5]
$Comp
L power:VCC #PWR?
U 1 1 67343CB3
P 2950 4250
AR Path="/60EC0B61/67343CB3" Ref="#PWR?"  Part="1" 
AR Path="/60E86855/67343CB3" Ref="#PWR?"  Part="1" 
AR Path="/612D3239/612D3C9E/67343CB3" Ref="#PWR0254"  Part="1" 
F 0 "#PWR0254" H 2950 4100 50  0001 C CNN
F 1 "VCC" H 2965 4423 50  0000 C CNN
F 2 "" H 2950 4250 50  0001 C CNN
F 3 "" H 2950 4250 50  0001 C CNN
	1    2950 4250
	1    0    0    -1  
$EndComp
$Comp
L power:VCC #PWR0186
U 1 1 61118DF2
P 4650 7250
F 0 "#PWR0186" H 4650 7100 50  0001 C CNN
F 1 "VCC" H 4665 7423 50  0000 C CNN
F 2 "" H 4650 7250 50  0001 C CNN
F 3 "" H 4650 7250 50  0001 C CNN
	1    4650 7250
	1    0    0    -1  
$EndComp
$Comp
L power:VCC #PWR?
U 1 1 652DB58A
P 4700 8850
AR Path="/60EC0B61/652DB58A" Ref="#PWR?"  Part="1" 
AR Path="/60E86855/652DB58A" Ref="#PWR?"  Part="1" 
AR Path="/612D3239/612D3C9E/652DB58A" Ref="#PWR0255"  Part="1" 
F 0 "#PWR0255" H 4700 8700 50  0001 C CNN
F 1 "VCC" H 4715 9023 50  0000 C CNN
F 2 "" H 4700 8850 50  0001 C CNN
F 3 "" H 4700 8850 50  0001 C CNN
	1    4700 8850
	1    0    0    -1  
$EndComp
$Comp
L power:VCC #PWR0185
U 1 1 61118DFA
P 5800 8150
F 0 "#PWR0185" H 5800 8000 50  0001 C CNN
F 1 "VCC" H 5815 8323 50  0000 C CNN
F 2 "" H 5800 8150 50  0001 C CNN
F 3 "" H 5800 8150 50  0001 C CNN
	1    5800 8150
	1    0    0    -1  
$EndComp
$Comp
L A5C:OR02 UEK116
U 1 1 6BD0A7B4
P 1700 4950
AR Path="/60E86855/6BD0A7B4" Ref="UEK116"  Part="1" 
AR Path="/612D3239/612D3C9E/6BD0A7B4" Ref="UEK116"  Part="1" 
F 0 "UEK116" H 1725 5217 50  0000 C CNN
F 1 "OR02" H 1725 5126 50  0000 C CNN
F 2 "" H 1750 4950 50  0001 C CNN
F 3 "" H 1750 4950 50  0001 C CNN
	1    1700 4950
	1    0    0    -1  
$EndComp
$Comp
L A5C:OR02 UEK193
U 1 1 61118DF9
P 3650 9550
AR Path="/60E86855/61118DF9" Ref="UEK193"  Part="1" 
AR Path="/612D3239/612D3C9E/61118DF9" Ref="UEK193"  Part="1" 
F 0 "UEK193" H 3675 9817 50  0000 C CNN
F 1 "OR02" H 3675 9726 50  0000 C CNN
F 2 "" H 3700 9550 50  0001 C CNN
F 3 "" H 3700 9550 50  0001 C CNN
	1    3650 9550
	1    0    0    -1  
$EndComp
$Comp
L A5C:NAND02 UEJ60
U 1 1 7E851C9D
P 4500 6700
AR Path="/60E86855/7E851C9D" Ref="UEJ60"  Part="1" 
AR Path="/612D3239/612D3C9E/7E851C9D" Ref="UEJ60"  Part="1" 
F 0 "UEJ60" H 4525 6967 50  0000 C CNN
F 1 "NAND02" H 4525 6876 50  0000 C CNN
F 2 "" H 4500 6700 50  0001 C CNN
F 3 "" H 4500 6700 50  0001 C CNN
	1    4500 6700
	1    0    0    1   
$EndComp
$Comp
L A5C:XNOR02 UEE72
U 1 1 61118E0D
P 9100 2400
AR Path="/60E86855/61118E0D" Ref="UEE72"  Part="1" 
AR Path="/612D3239/612D3C9E/61118E0D" Ref="UEE72"  Part="1" 
F 0 "UEE72" H 9125 2667 50  0000 C CNN
F 1 "XNOR02" H 9125 2576 50  0000 C CNN
F 2 "" H 9125 2400 50  0001 C CNN
F 3 "" H 9125 2400 50  0001 C CNN
	1    9100 2400
	1    0    0    -1  
$EndComp
$Comp
L A5C:XNOR02 UEE85
U 1 1 61118E0E
P 9100 2850
AR Path="/60E86855/61118E0E" Ref="UEE85"  Part="1" 
AR Path="/612D3239/612D3C9E/61118E0E" Ref="UEE85"  Part="1" 
F 0 "UEE85" H 9125 3117 50  0000 C CNN
F 1 "XNOR02" H 9125 3026 50  0000 C CNN
F 2 "" H 9125 2850 50  0001 C CNN
F 3 "" H 9125 2850 50  0001 C CNN
	1    9100 2850
	1    0    0    -1  
$EndComp
$Comp
L A5C:XOR02 UEF30
U 1 1 7DF249E1
P 9100 5700
AR Path="/60E86855/7DF249E1" Ref="UEF30"  Part="1" 
AR Path="/612D3239/612D3C9E/7DF249E1" Ref="UEF30"  Part="1" 
F 0 "UEF30" H 9125 5967 50  0000 C CNN
F 1 "XOR02" H 9125 5876 50  0000 C CNN
F 2 "" H 9100 5700 50  0001 C CNN
F 3 "" H 9100 5700 50  0001 C CNN
	1    9100 5700
	1    0    0    -1  
$EndComp
$Comp
L A5C:XNOR02 UED103
U 1 1 77BDBFEB
P 9100 6150
AR Path="/60E86855/77BDBFEB" Ref="UED103"  Part="1" 
AR Path="/612D3239/612D3C9E/77BDBFEB" Ref="UED103"  Part="1" 
F 0 "UED103" H 9125 6417 50  0000 C CNN
F 1 "XNOR02" H 9125 6326 50  0000 C CNN
F 2 "" H 9125 6150 50  0001 C CNN
F 3 "" H 9125 6150 50  0001 C CNN
	1    9100 6150
	1    0    0    -1  
$EndComp
$Comp
L A5C:XNOR02 UEE126
U 1 1 761F633F
P 9100 6600
AR Path="/60E86855/761F633F" Ref="UEE126"  Part="1" 
AR Path="/612D3239/612D3C9E/761F633F" Ref="UEE126"  Part="1" 
F 0 "UEE126" H 9125 6867 50  0000 C CNN
F 1 "XNOR02" H 9125 6776 50  0000 C CNN
F 2 "" H 9125 6600 50  0001 C CNN
F 3 "" H 9125 6600 50  0001 C CNN
	1    9100 6600
	1    0    0    -1  
$EndComp
$Comp
L A5C:XNOR02 UEF49
U 1 1 61118DEA
P 9100 7050
AR Path="/60E86855/61118DEA" Ref="UEF49"  Part="1" 
AR Path="/612D3239/612D3C9E/61118DEA" Ref="UEF49"  Part="1" 
F 0 "UEF49" H 9125 7317 50  0000 C CNN
F 1 "XNOR02" H 9125 7226 50  0000 C CNN
F 2 "" H 9125 7050 50  0001 C CNN
F 3 "" H 9125 7050 50  0001 C CNN
	1    9100 7050
	1    0    0    -1  
$EndComp
$Comp
L A5C:NOR02 UEF72
U 1 1 61118DE9
P 9100 7500
AR Path="/60E86855/61118DE9" Ref="UEF72"  Part="1" 
AR Path="/612D3239/612D3C9E/61118DE9" Ref="UEF72"  Part="1" 
F 0 "UEF72" H 9125 7767 50  0000 C CNN
F 1 "NOR02" H 9125 7676 50  0000 C CNN
F 2 "" H 9100 7500 50  0001 C CNN
F 3 "" H 9100 7500 50  0001 C CNN
	1    9100 7500
	1    0    0    -1  
$EndComp
$Comp
L A5C:NOR02 UEF36
U 1 1 7EEE7A2A
P 9850 4800
AR Path="/60E86855/7EEE7A2A" Ref="UEF36"  Part="1" 
AR Path="/612D3239/612D3C9E/7EEE7A2A" Ref="UEF36"  Part="1" 
F 0 "UEF36" H 9875 5067 50  0000 C CNN
F 1 "NOR02" H 9875 4976 50  0000 C CNN
F 2 "" H 9850 4800 50  0001 C CNN
F 3 "" H 9850 4800 50  0001 C CNN
	1    9850 4800
	1    0    0    -1  
$EndComp
$Comp
L A5C:NAND02 UED68
U 1 1 61118E08
P 10300 2900
AR Path="/60E86855/61118E08" Ref="UED68"  Part="1" 
AR Path="/612D3239/612D3C9E/61118E08" Ref="UED68"  Part="1" 
F 0 "UED68" H 10325 3167 50  0000 C CNN
F 1 "NAND02" H 10325 3076 50  0000 C CNN
F 2 "" H 10300 2900 50  0001 C CNN
F 3 "" H 10300 2900 50  0001 C CNN
	1    10300 2900
	1    0    0    -1  
$EndComp
$Comp
L A5C:NAND02 UEE113
U 1 1 61118DED
P 10300 7100
AR Path="/60E86855/61118DED" Ref="UEE113"  Part="1" 
AR Path="/612D3239/612D3C9E/61118DED" Ref="UEE113"  Part="1" 
F 0 "UEE113" H 10325 7367 50  0000 C CNN
F 1 "NAND02" H 10325 7276 50  0000 C CNN
F 2 "" H 10300 7100 50  0001 C CNN
F 3 "" H 10300 7100 50  0001 C CNN
	1    10300 7100
	1    0    0    -1  
$EndComp
$Comp
L A5C:XNOR02 UEE66
U 1 1 61118E0C
P 11350 2300
AR Path="/60E86855/61118E0C" Ref="UEE66"  Part="1" 
AR Path="/612D3239/612D3C9E/61118E0C" Ref="UEE66"  Part="1" 
F 0 "UEE66" H 11375 2567 50  0000 C CNN
F 1 "XNOR02" H 11375 2476 50  0000 C CNN
F 2 "" H 11375 2300 50  0001 C CNN
F 3 "" H 11375 2300 50  0001 C CNN
	1    11350 2300
	1    0    0    1   
$EndComp
$Comp
L A5C:XNOR02 UEC63
U 1 1 61118E09
P 11350 2950
AR Path="/60E86855/61118E09" Ref="UEC63"  Part="1" 
AR Path="/612D3239/612D3C9E/61118E09" Ref="UEC63"  Part="1" 
F 0 "UEC63" H 11375 3217 50  0000 C CNN
F 1 "XNOR02" H 11375 3126 50  0000 C CNN
F 2 "" H 11375 2950 50  0001 C CNN
F 3 "" H 11375 2950 50  0001 C CNN
	1    11350 2950
	1    0    0    1   
$EndComp
$Comp
L A5C:XOR02 UEE77
U 1 1 61118E0A
P 11350 3600
AR Path="/60E86855/61118E0A" Ref="UEE77"  Part="1" 
AR Path="/612D3239/612D3C9E/61118E0A" Ref="UEE77"  Part="1" 
F 0 "UEE77" H 11375 3867 50  0000 C CNN
F 1 "XOR02" H 11375 3776 50  0000 C CNN
F 2 "" H 11350 3600 50  0001 C CNN
F 3 "" H 11350 3600 50  0001 C CNN
	1    11350 3600
	1    0    0    1   
$EndComp
$Comp
L A5C:XNOR02 UEH60
U 1 1 61118DF0
P 11350 5850
AR Path="/60E86855/61118DF0" Ref="UEH60"  Part="1" 
AR Path="/612D3239/612D3C9E/61118DF0" Ref="UEH60"  Part="1" 
F 0 "UEH60" H 11375 6117 50  0000 C CNN
F 1 "XNOR02" H 11375 6026 50  0000 C CNN
F 2 "" H 11375 5850 50  0001 C CNN
F 3 "" H 11375 5850 50  0001 C CNN
	1    11350 5850
	1    0    0    1   
$EndComp
$Comp
L A5C:XNOR02 UEG104
U 1 1 61118DF1
P 11350 6500
AR Path="/60E86855/61118DF1" Ref="UEG104"  Part="1" 
AR Path="/612D3239/612D3C9E/61118DF1" Ref="UEG104"  Part="1" 
F 0 "UEG104" H 11375 6767 50  0000 C CNN
F 1 "XNOR02" H 11375 6676 50  0000 C CNN
F 2 "" H 11375 6500 50  0001 C CNN
F 3 "" H 11375 6500 50  0001 C CNN
	1    11350 6500
	1    0    0    1   
$EndComp
$Comp
L A5C:XNOR02 UEE152
U 1 1 61118DEB
P 11350 7150
AR Path="/60E86855/61118DEB" Ref="UEE152"  Part="1" 
AR Path="/612D3239/612D3C9E/61118DEB" Ref="UEE152"  Part="1" 
F 0 "UEE152" H 11375 7417 50  0000 C CNN
F 1 "XNOR02" H 11375 7326 50  0000 C CNN
F 2 "" H 11375 7150 50  0001 C CNN
F 3 "" H 11375 7150 50  0001 C CNN
	1    11350 7150
	1    0    0    1   
$EndComp
$Comp
L A5C:XOR02 UEF57
U 1 1 61118DEE
P 11350 7800
AR Path="/60E86855/61118DEE" Ref="UEF57"  Part="1" 
AR Path="/612D3239/612D3C9E/61118DEE" Ref="UEF57"  Part="1" 
F 0 "UEF57" H 11375 8067 50  0000 C CNN
F 1 "XOR02" H 11375 7976 50  0000 C CNN
F 2 "" H 11350 7800 50  0001 C CNN
F 3 "" H 11350 7800 50  0001 C CNN
	1    11350 7800
	1    0    0    1   
$EndComp
$Comp
L A5C:NAND03 UEE75
U 1 1 7AAB42B6
P 10300 2250
AR Path="/60E86855/7AAB42B6" Ref="UEE75"  Part="1" 
AR Path="/612D3239/612D3C9E/7AAB42B6" Ref="UEE75"  Part="1" 
F 0 "UEE75" H 10325 2542 50  0000 C CNN
F 1 "NAND03" H 10325 2451 50  0000 C CNN
F 2 "" H 10300 2250 50  0001 C CNN
F 3 "" H 10300 2250 50  0001 C CNN
	1    10300 2250
	1    0    0    -1  
$EndComp
$Comp
L A5C:NAND03 UEE90
U 1 1 76C46969
P 10300 6450
AR Path="/60E86855/76C46969" Ref="UEE90"  Part="1" 
AR Path="/612D3239/612D3C9E/76C46969" Ref="UEE90"  Part="1" 
F 0 "UEE90" H 10325 6742 50  0000 C CNN
F 1 "NAND03" H 10325 6651 50  0000 C CNN
F 2 "" H 10300 6450 50  0001 C CNN
F 3 "" H 10300 6450 50  0001 C CNN
	1    10300 6450
	1    0    0    -1  
$EndComp
$Comp
L A5C:INV01 UEH129
U 1 1 61118DEC
P 10850 8750
AR Path="/60E86855/61118DEC" Ref="UEH129"  Part="1" 
AR Path="/612D3239/612D3C9E/61118DEC" Ref="UEH129"  Part="1" 
F 0 "UEH129" H 10850 9067 50  0000 C CNN
F 1 "INV01" H 10850 8976 50  0000 C CNN
F 2 "" H 10850 8550 50  0001 C CNN
F 3 "" H 10850 8550 50  0001 C CNN
	1    10850 8750
	1    0    0    1   
$EndComp
$Comp
L A5C:INV01 UED52
U 1 1 61118E16
P 11050 5050
AR Path="/60E86855/61118E16" Ref="UED52"  Part="1" 
AR Path="/612D3239/612D3C9E/61118E16" Ref="UED52"  Part="1" 
F 0 "UED52" H 11050 5367 50  0000 C CNN
F 1 "INV01" H 11050 5276 50  0000 C CNN
F 2 "" H 11050 4850 50  0001 C CNN
F 3 "" H 11050 4850 50  0001 C CNN
	1    11050 5050
	1    0    0    -1  
$EndComp
$Comp
L A5C:INV01 UEE65
U 1 1 61118E0B
P 11100 1950
AR Path="/60E86855/61118E0B" Ref="UEE65"  Part="1" 
AR Path="/612D3239/612D3C9E/61118E0B" Ref="UEE65"  Part="1" 
F 0 "UEE65" H 11100 2267 50  0000 C CNN
F 1 "INV01" H 11100 2176 50  0000 C CNN
F 2 "" H 11100 1750 50  0001 C CNN
F 3 "" H 11100 1750 50  0001 C CNN
	1    11100 1950
	1    0    0    -1  
$EndComp
$Comp
L A5C:DFFCOO UEE58
U 1 1 61118E11
P 13250 2350
AR Path="/60E86855/61118E11" Ref="UEE58"  Part="1" 
AR Path="/612D3239/612D3C9E/61118E11" Ref="UEE58"  Part="1" 
F 0 "UEE58" H 13250 2715 50  0000 C CNN
F 1 "DFFCOO" H 13250 2624 50  0000 C CNN
F 2 "" H 13250 2350 50  0001 C CNN
F 3 "" H 13250 2350 50  0001 C CNN
	1    13250 2350
	1    0    0    -1  
$EndComp
$Comp
L A5C:DFFCOO UEC66
U 1 1 61118E15
P 13250 3000
AR Path="/60E86855/61118E15" Ref="UEC66"  Part="1" 
AR Path="/612D3239/612D3C9E/61118E15" Ref="UEC66"  Part="1" 
F 0 "UEC66" H 13250 3365 50  0000 C CNN
F 1 "DFFCOO" H 13250 3274 50  0000 C CNN
F 2 "" H 13250 3000 50  0001 C CNN
F 3 "" H 13250 3000 50  0001 C CNN
	1    13250 3000
	1    0    0    -1  
$EndComp
$Comp
L A5C:DFFCOO UEF83
U 1 1 61118E14
P 13250 3650
AR Path="/60E86855/61118E14" Ref="UEF83"  Part="1" 
AR Path="/612D3239/612D3C9E/61118E14" Ref="UEF83"  Part="1" 
F 0 "UEF83" H 13250 4015 50  0000 C CNN
F 1 "DFFCOO" H 13250 3924 50  0000 C CNN
F 2 "" H 13250 3650 50  0001 C CNN
F 3 "" H 13250 3650 50  0001 C CNN
	1    13250 3650
	1    0    0    -1  
$EndComp
$Comp
L A5C:DFFCOO UEH53
U 1 1 61118E18
P 13250 5900
AR Path="/60E86855/61118E18" Ref="UEH53"  Part="1" 
AR Path="/612D3239/612D3C9E/61118E18" Ref="UEH53"  Part="1" 
F 0 "UEH53" H 13250 6265 50  0000 C CNN
F 1 "DFFCOO" H 13250 6174 50  0000 C CNN
F 2 "" H 13250 5900 50  0001 C CNN
F 3 "" H 13250 5900 50  0001 C CNN
	1    13250 5900
	1    0    0    -1  
$EndComp
$Comp
L A5C:DFFCOO UEH113
U 1 1 61118E04
P 13250 6550
AR Path="/60E86855/61118E04" Ref="UEH113"  Part="1" 
AR Path="/612D3239/612D3C9E/61118E04" Ref="UEH113"  Part="1" 
F 0 "UEH113" H 13250 6915 50  0000 C CNN
F 1 "DFFCOO" H 13250 6824 50  0000 C CNN
F 2 "" H 13250 6550 50  0001 C CNN
F 3 "" H 13250 6550 50  0001 C CNN
	1    13250 6550
	1    0    0    -1  
$EndComp
$Comp
L A5C:DFFCOO UEK142
U 1 1 61118E05
P 13250 7200
AR Path="/60E86855/61118E05" Ref="UEK142"  Part="1" 
AR Path="/612D3239/612D3C9E/61118E05" Ref="UEK142"  Part="1" 
F 0 "UEK142" H 13250 7565 50  0000 C CNN
F 1 "DFFCOO" H 13250 7474 50  0000 C CNN
F 2 "" H 13250 7200 50  0001 C CNN
F 3 "" H 13250 7200 50  0001 C CNN
	1    13250 7200
	1    0    0    -1  
$EndComp
$Comp
L A5C:DFFCOO UEF52
U 1 1 61118E07
P 13250 7850
AR Path="/60E86855/61118E07" Ref="UEF52"  Part="1" 
AR Path="/612D3239/612D3C9E/61118E07" Ref="UEF52"  Part="1" 
F 0 "UEF52" H 13250 8215 50  0000 C CNN
F 1 "DFFCOO" H 13250 8124 50  0000 C CNN
F 2 "" H 13250 7850 50  0001 C CNN
F 3 "" H 13250 7850 50  0001 C CNN
	1    13250 7850
	1    0    0    -1  
$EndComp
$Comp
L A5C:NAND04 UEE63
U 1 1 61118DEF
P 10300 5800
AR Path="/60E86855/61118DEF" Ref="UEE63"  Part="1" 
AR Path="/612D3239/612D3C9E/61118DEF" Ref="UEE63"  Part="1" 
F 0 "UEE63" H 10300 6142 50  0000 C CNN
F 1 "NAND04" H 10300 6051 50  0000 C CNN
F 2 "" H 10300 5550 50  0001 C CNN
F 3 "" H 10300 5550 50  0001 C CNN
	1    10300 5800
	1    0    0    -1  
$EndComp
$Comp
L A5C:NAND04 UED49
U 1 1 61118E0F
P 10450 5050
AR Path="/60E86855/61118E0F" Ref="UED49"  Part="1" 
AR Path="/612D3239/612D3C9E/61118E0F" Ref="UED49"  Part="1" 
F 0 "UED49" H 10450 5392 50  0000 C CNN
F 1 "NAND04" H 10450 5301 50  0000 C CNN
F 2 "" H 10450 4800 50  0001 C CNN
F 3 "" H 10450 4800 50  0001 C CNN
	1    10450 5050
	1    0    0    -1  
$EndComp
$Comp
L A5C:AOI22 UEE69
U 1 1 61118E10
P 12350 2200
AR Path="/60E86855/61118E10" Ref="UEE69"  Part="1" 
AR Path="/612D3239/612D3C9E/61118E10" Ref="UEE69"  Part="1" 
F 0 "UEE69" H 12375 2517 50  0000 C CNN
F 1 "AOI22" H 12375 2426 50  0000 C CNN
F 2 "" H 12500 2200 50  0001 C CNN
F 3 "" H 12500 2200 50  0001 C CNN
	1    12350 2200
	1    0    0    -1  
$EndComp
$Comp
L A5C:AOI22 UEC70
U 1 1 61118E12
P 12350 2850
AR Path="/60E86855/61118E12" Ref="UEC70"  Part="1" 
AR Path="/612D3239/612D3C9E/61118E12" Ref="UEC70"  Part="1" 
F 0 "UEC70" H 12375 3167 50  0000 C CNN
F 1 "AOI22" H 12375 3076 50  0000 C CNN
F 2 "" H 12500 2850 50  0001 C CNN
F 3 "" H 12500 2850 50  0001 C CNN
	1    12350 2850
	1    0    0    -1  
$EndComp
$Comp
L A5C:AOI22 UEF79
U 1 1 61118E13
P 12350 3500
AR Path="/60E86855/61118E13" Ref="UEF79"  Part="1" 
AR Path="/612D3239/612D3C9E/61118E13" Ref="UEF79"  Part="1" 
F 0 "UEF79" H 12375 3817 50  0000 C CNN
F 1 "AOI22" H 12375 3726 50  0000 C CNN
F 2 "" H 12500 3500 50  0001 C CNN
F 3 "" H 12500 3500 50  0001 C CNN
	1    12350 3500
	1    0    0    -1  
$EndComp
$Comp
L A5C:AOI22 UEH57
U 1 1 61118E17
P 12350 5750
AR Path="/60E86855/61118E17" Ref="UEH57"  Part="1" 
AR Path="/612D3239/612D3C9E/61118E17" Ref="UEH57"  Part="1" 
F 0 "UEH57" H 12375 6067 50  0000 C CNN
F 1 "AOI22" H 12375 5976 50  0000 C CNN
F 2 "" H 12500 5750 50  0001 C CNN
F 3 "" H 12500 5750 50  0001 C CNN
	1    12350 5750
	1    0    0    -1  
$EndComp
$Comp
L A5C:AOI22 UEH133
U 1 1 61118E03
P 12350 6400
AR Path="/60E86855/61118E03" Ref="UEH133"  Part="1" 
AR Path="/612D3239/612D3C9E/61118E03" Ref="UEH133"  Part="1" 
F 0 "UEH133" H 12375 6717 50  0000 C CNN
F 1 "AOI22" H 12375 6626 50  0000 C CNN
F 2 "" H 12500 6400 50  0001 C CNN
F 3 "" H 12500 6400 50  0001 C CNN
	1    12350 6400
	1    0    0    -1  
$EndComp
$Comp
L A5C:AOI22 UEH136
U 1 1 61118E02
P 12350 7050
AR Path="/60E86855/61118E02" Ref="UEH136"  Part="1" 
AR Path="/612D3239/612D3C9E/61118E02" Ref="UEH136"  Part="1" 
F 0 "UEH136" H 12375 7367 50  0000 C CNN
F 1 "AOI22" H 12375 7276 50  0000 C CNN
F 2 "" H 12500 7050 50  0001 C CNN
F 3 "" H 12500 7050 50  0001 C CNN
	1    12350 7050
	1    0    0    -1  
$EndComp
$Comp
L A5C:AOI22 UEF64
U 1 1 61118E06
P 12350 7700
AR Path="/60E86855/61118E06" Ref="UEF64"  Part="1" 
AR Path="/612D3239/612D3C9E/61118E06" Ref="UEF64"  Part="1" 
F 0 "UEF64" H 12375 8017 50  0000 C CNN
F 1 "AOI22" H 12375 7926 50  0000 C CNN
F 2 "" H 12500 7700 50  0001 C CNN
F 3 "" H 12500 7700 50  0001 C CNN
	1    12350 7700
	1    0    0    -1  
$EndComp
$Comp
L A5C:M175C UEK57
U 1 1 7202EA32
P 3450 4750
AR Path="/60E86855/7202EA32" Ref="UEK57"  Part="1" 
AR Path="/612D3239/612D3C9E/7202EA32" Ref="UEK57"  Part="1" 
F 0 "UEK57" H 3450 5315 50  0000 C CNN
F 1 "M175C" H 3450 5224 50  0000 C CNN
F 2 "" H 3450 4550 50  0001 C CNN
F 3 "" H 3450 4550 50  0001 C CNN
	1    3450 4750
	1    0    0    -1  
$EndComp
$Comp
L A5C:M175CL UEJ40
U 1 1 7489C085
P 5200 6500
AR Path="/60E86855/7489C085" Ref="UEJ40"  Part="1" 
AR Path="/612D3239/612D3C9E/7489C085" Ref="UEJ40"  Part="1" 
F 0 "UEJ40" H 5200 7065 50  0000 C CNN
F 1 "M175CL" H 5200 6974 50  0000 C CNN
F 2 "" H 5200 6300 50  0001 C CNN
F 3 "" H 5200 6300 50  0001 C CNN
	1    5200 6500
	1    0    0    -1  
$EndComp
$Comp
L A5C:M175CL UEK196
U 1 1 61118DF6
P 5200 9350
AR Path="/60E86855/61118DF6" Ref="UEK196"  Part="1" 
AR Path="/612D3239/612D3C9E/61118DF6" Ref="UEK196"  Part="1" 
F 0 "UEK196" H 5200 9915 50  0000 C CNN
F 1 "M175CL" H 5200 9824 50  0000 C CNN
F 2 "" H 5200 9150 50  0001 C CNN
F 3 "" H 5200 9150 50  0001 C CNN
	1    5200 9350
	1    0    0    -1  
$EndComp
$Comp
L A5C:M368C UEG?
U 1 1 75043E58
P 6300 6450
AR Path="/604B5523/75043E58" Ref="UEG?"  Part="1" 
AR Path="/75043E58" Ref="UEJ72"  Part="1" 
AR Path="/60E86855/75043E58" Ref="UEJ72"  Part="1" 
AR Path="/612D3239/612D3C9E/75043E58" Ref="UEJ72"  Part="1" 
F 0 "UEJ72" H 6300 6960 50  0000 C CNN
F 1 "M368C" H 6300 6870 50  0000 C CNN
F 2 "" H 6600 6250 50  0001 C CNN
F 3 "" H 6600 6250 50  0001 C CNN
	1    6300 6450
	1    0    0    -1  
$EndComp
$Comp
L A5C:M368C UEI?
U 1 1 61118DF7
P 6300 8400
AR Path="/604B5523/61118DF7" Ref="UEI?"  Part="1" 
AR Path="/61118DF7" Ref="UEJ14"  Part="1" 
AR Path="/60E86855/61118DF7" Ref="UEJ14"  Part="1" 
AR Path="/612D3239/612D3C9E/61118DF7" Ref="UEJ14"  Part="1" 
F 0 "UEJ14" H 6300 8910 50  0000 C CNN
F 1 "M368C" H 6300 8820 50  0000 C CNN
F 2 "" H 6600 8200 50  0001 C CNN
F 3 "" H 6600 8200 50  0001 C CNN
	1    6300 8400
	1    0    0    -1  
$EndComp
$Comp
L A5C:M368C UEJ?
U 1 1 61118DF8
P 6300 9300
AR Path="/604B5523/61118DF8" Ref="UEJ?"  Part="1" 
AR Path="/61118DF8" Ref="UEK183"  Part="1" 
AR Path="/60E86855/61118DF8" Ref="UEK183"  Part="1" 
AR Path="/612D3239/612D3C9E/61118DF8" Ref="UEK183"  Part="1" 
F 0 "UEK183" H 6300 9810 50  0000 C CNN
F 1 "M368C" H 6300 9720 50  0000 C CNN
F 2 "" H 6600 9100 50  0001 C CNN
F 3 "" H 6600 9100 50  0001 C CNN
	1    6300 9300
	1    0    0    -1  
$EndComp
$Sheet
S 2400 5450 1350 950 
U 6112B94A
F0 "scroll2-rowscroll" 50
F1 "scroll2-rowscroll.sch" 50
F2 "~BUS-ROWSCROLL" I L 2400 5750 50 
F3 "~CLK4M" I L 2400 6050 50 
F4 "FI" I L 2400 6150 50 
F5 "MAIN-RESET" I L 2400 6250 50 
F6 "BUS-DATA[0..8]" I L 2400 5600 50 
F7 "BASE-X[0..3]" I R 3750 5600 50 
F8 "FLIP" I L 2400 5900 50 
F9 "X[0..9]" O R 3750 5750 50 
$EndSheet
Text Label 3800 5750 0    50   ~ 0
X[0..9]
Text Label 3800 5600 0    50   ~ 0
BASE-X[0..3]
Wire Wire Line
	13850 7200 14700 7200
Wire Wire Line
	13950 6550 14700 6550
Wire Wire Line
	14050 5900 14700 5900
Text Label 14050 3650 0    50   ~ 0
SCROLL2-X3
Text Label 14050 3000 0    50   ~ 0
SCROLL2-X4
Text Label 14050 2350 0    50   ~ 0
SCROLL2-X5
Wire Wire Line
	13950 2350 14700 2350
Wire Wire Line
	13850 3000 14700 3000
Wire Wire Line
	13750 3650 14700 3650
Connection ~ 13850 7200
Connection ~ 13950 6550
Connection ~ 14050 5900
Connection ~ 14800 4750
Connection ~ 13750 3650
Connection ~ 13850 3000
Connection ~ 13950 2350
Text Label 14150 6550 0    50   ~ 0
SCROLL2-X1
Text Label 14150 5900 0    50   ~ 0
SCROLL2-X2
Text Label 14150 7200 0    50   ~ 0
SCROLL2-X0
Wire Bus Line
	14800 2450 14800 4750
Wire Bus Line
	14800 4750 14800 7100
Wire Bus Line
	7300 6000 7300 6400
Wire Bus Line
	7150 8750 7150 9250
Wire Bus Line
	7150 8250 7150 8750
Wire Bus Line
	4450 5750 4450 6400
Wire Bus Line
	4400 4550 4400 5600
Wire Bus Line
	3900 8850 3900 9250
Wire Bus Line
	2150 4250 2150 4650
Wire Bus Line
	6200 4900 6200 5750
$EndSCHEMATC
