EESchema Schematic File Version 4
EELAYER 30 0
EELAYER END
$Descr A4 11693 8268
encoding utf-8
Sheet 53 69
Title ""
Date "2020-11-26"
Rev ""
Comp ""
Comment1 "Licence: CC-BY"
Comment2 "Author: Loïc *WydD* Petit"
Comment3 ""
Comment4 ""
$EndDescr
Connection ~ 3600 2150
Connection ~ 2850 2700
Connection ~ 2700 950 
Connection ~ 3200 1300
Connection ~ 4200 2700
Connection ~ 4750 4250
Connection ~ 4850 4000
Connection ~ 4750 4750
Connection ~ 6500 4050
Connection ~ 8150 2250
Connection ~ 5350 4750
Connection ~ 7550 2250
Connection ~ 3950 3100
Connection ~ 3600 2900
Connection ~ 2950 4000
Connection ~ 4150 4750
Connection ~ 9450 3250
Connection ~ 7550 2750
Connection ~ 10050 3250
Connection ~ 1550 6000
Connection ~ 2950 4750
Connection ~ 2150 6000
Connection ~ 2350 6000
Connection ~ 2250 6000
Connection ~ 2950 5750
Connection ~ 8150 1750
NoConn ~ 5100 3700
NoConn ~ 4200 2800
NoConn ~ 4700 2700
Wire Wire Line
	1550 5750 1550 6000
Wire Wire Line
	1550 6000 950  6000
Wire Wire Line
	1550 6000 1550 6250
Wire Wire Line
	2150 5750 2150 6000
Wire Wire Line
	2150 6000 2150 6250
Wire Wire Line
	2150 6000 2250 6000
Wire Wire Line
	2250 6000 2250 6550
Wire Wire Line
	2250 6000 2350 6000
Wire Wire Line
	2250 6550 3550 6550
Wire Wire Line
	2350 5750 2350 6000
Wire Wire Line
	2350 6000 2350 6250
Wire Wire Line
	2450 950  2700 950 
Wire Wire Line
	2450 1300 3200 1300
Wire Wire Line
	2450 2150 3600 2150
Wire Wire Line
	2450 2700 2850 2700
Wire Wire Line
	2700 950  3300 950 
Wire Wire Line
	2700 1900 2700 950 
Wire Wire Line
	2850 2700 3700 2700
Wire Wire Line
	2850 3800 2850 2700
Wire Wire Line
	2850 3800 4600 3800
Wire Wire Line
	2950 3100 3950 3100
Wire Wire Line
	2950 4000 2950 3100
Wire Wire Line
	2950 4000 4850 4000
Wire Wire Line
	2950 4750 2950 4000
Wire Wire Line
	2950 4750 2950 5750
Wire Wire Line
	2950 6250 3550 6250
Wire Wire Line
	3200 1050 3200 1300
Wire Wire Line
	3200 1050 3300 1050
Wire Wire Line
	3200 1300 3200 1800
Wire Wire Line
	3300 1800 3200 1800
Wire Wire Line
	3550 5750 2950 5750
Wire Wire Line
	3600 2150 5100 2150
Wire Wire Line
	3600 2900 3600 2150
Wire Wire Line
	3600 3200 3600 2900
Wire Wire Line
	3600 3200 4200 3200
Wire Wire Line
	3700 2900 3600 2900
Wire Wire Line
	3950 3100 4450 3100
Wire Wire Line
	4150 4250 4150 4750
Wire Wire Line
	4150 4250 4300 4250
Wire Wire Line
	4200 2350 4200 2700
Wire Wire Line
	4200 2900 4200 3200
Wire Wire Line
	4250 1000 3850 1000
Wire Wire Line
	4350 3600 4600 3600
Wire Wire Line
	4600 4250 4750 4250
Wire Wire Line
	4700 2800 5100 2800
Wire Wire Line
	4750 4250 4750 4750
Wire Wire Line
	4750 4250 4900 4250
Wire Wire Line
	4800 2350 4200 2350
Wire Wire Line
	4800 2700 4800 2350
Wire Wire Line
	4850 4000 5950 4000
Wire Wire Line
	5000 1850 3850 1850
Wire Wire Line
	5000 1850 5000 2600
Wire Wire Line
	5000 2600 5100 2600
Wire Wire Line
	5100 2700 4800 2700
Wire Wire Line
	5100 3600 5100 2900
Wire Wire Line
	5200 4250 5350 4250
Wire Wire Line
	5350 4250 5350 4750
Wire Wire Line
	5700 2150 5700 2400
Wire Wire Line
	5700 2500 5700 2750
Wire Wire Line
	5950 4100 5950 4750
Wire Wire Line
	6250 1900 6250 2250
Wire Wire Line
	6500 2650 6500 4050
Wire Wire Line
	6500 4050 8400 4050
Wire Wire Line
	6750 2350 6850 2350
Wire Wire Line
	6850 1900 6250 1900
Wire Wire Line
	6850 1900 6850 2350
Wire Wire Line
	6950 2250 6750 2250
Wire Wire Line
	7550 2250 7550 1750
Wire Wire Line
	7550 2750 7550 2250
Wire Wire Line
	7550 2750 7550 3450
Wire Wire Line
	8150 1750 8150 2250
Wire Wire Line
	8150 2250 8150 2750
Wire Wire Line
	8150 2900 8150 3250
Wire Wire Line
	8400 4050 8400 3650
Wire Wire Line
	8650 3250 8850 3250
Wire Wire Line
	8650 3350 8750 3350
Wire Wire Line
	8750 1750 8150 1750
Wire Wire Line
	8750 2900 8150 2900
Wire Wire Line
	8750 3350 8750 2900
Wire Wire Line
	9450 3250 9450 2750
Wire Wire Line
	9450 3750 9450 3250
Wire Wire Line
	10050 2750 10050 3250
Wire Wire Line
	10050 3250 10050 3750
Wire Wire Line
	10050 3250 10200 3250
Text Notes 3850 1600 0    50   ~ 0
0 if 46 & /45
Text Notes 4600 2300 2    50   ~ 0
0 if 46 & /45
Text Label 2350 6550 0    50   ~ 0
MAIN-~RESETI
Text Label 3800 3550 2    50   ~ 0
~CLK4M
Text Label 3800 3650 2    50   ~ 0
CLK8M
Text Label 8150 1750 0    50   ~ 0
CLK8M
Text Label 10050 2750 0    50   ~ 0
~CLK4M
Text HLabel 950  6000 0    50   Input ~ 0
~RESETI
Text HLabel 2450 950  0    50   Input ~ 0
SEC-MODE0
Text HLabel 2450 1300 0    50   Input ~ 0
SEC-MODE1
Text HLabel 2450 2150 0    50   Input ~ 0
CLK16M
Text HLabel 2450 2700 0    50   Input ~ 0
LI
Text HLabel 3550 5750 2    50   Output ~ 0
~RESETI1
Text HLabel 3550 6250 2    50   Output ~ 0
~RESETI2
Text HLabel 3550 6550 2    50   Output ~ 0
MAIN-~RESETI
Text HLabel 4250 1000 2    50   Output ~ 0
DEFAULT
Text HLabel 8750 1750 2    50   Output ~ 0
CLK8M
Text HLabel 8750 2250 2    50   Output ~ 0
~CLK8M
Text HLabel 10200 3250 2    50   Output ~ 0
~CLK4M
$Comp
L Jumper:SolderJumper_2_Bridged JP1
U 1 1 74591725
P 4450 4250
F 0 "JP1" H 4450 4363 50  0000 C CNN
F 1 "SolderJumper_2_Bridged" H 4450 4364 50  0001 C CNN
F 2 "" H 4450 4250 50  0001 C CNN
F 3 "~" H 4450 4250 50  0001 C CNN
	1    4450 4250
	1    0    0    -1  
$EndComp
$Comp
L Jumper:SolderJumper_2_Bridged JP2
U 1 1 74596A4B
P 5050 4250
F 0 "JP2" H 5050 4363 50  0000 C CNN
F 1 "SolderJumper_2_Bridged" H 5050 4364 50  0001 C CNN
F 2 "" H 5050 4250 50  0001 C CNN
F 3 "~" H 5050 4250 50  0001 C CNN
	1    5050 4250
	1    0    0    -1  
$EndComp
$Comp
L A5C:AND02 UCR291
U 1 1 650DADBC
P 3550 1000
F 0 "UCR291" H 3575 733 50  0000 C CNN
F 1 "AND02" H 3575 824 50  0000 C CNN
F 2 "" H 3550 1000 50  0001 C CNN
F 3 "" H 3550 1000 50  0001 C CNN
	1    3550 1000
	1    0    0    1   
$EndComp
$Comp
L A5C:NAND02 UCR294
U 1 1 6539E887
P 3550 1850
F 0 "UCR294" H 3575 2117 50  0000 C CNN
F 1 "NAND02" H 3575 2026 50  0000 C CNN
F 2 "" H 3550 1850 50  0001 C CNN
F 3 "" H 3550 1850 50  0001 C CNN
	1    3550 1850
	1    0    0    -1  
$EndComp
$Comp
L A5C:OR02 UBR497
U 1 1 601E0AC5
P 4050 3600
F 0 "UBR497" H 4075 3867 50  0000 C CNN
F 1 "OR02" H 4075 3776 50  0000 C CNN
F 2 "" H 4100 3600 50  0001 C CNN
F 3 "" H 4100 3600 50  0001 C CNN
	1    4050 3600
	1    0    0    -1  
$EndComp
$Comp
L A5C:NAND02 UCG508
U 1 1 601E0AA1
P 5950 2450
F 0 "UCG508" H 5975 2717 50  0000 C CNN
F 1 "NAND02" H 5975 2626 50  0000 C CNN
F 2 "" H 5950 2450 50  0001 C CNN
F 3 "" H 5950 2450 50  0001 C CNN
	1    5950 2450
	1    0    0    -1  
$EndComp
$Comp
L A5C:OR02 UCO491
U 1 1 601E0AA2
P 6200 4050
F 0 "UCO491" H 6225 4317 50  0000 C CNN
F 1 "OR02" H 6225 4226 50  0000 C CNN
F 2 "" H 6250 4050 50  0001 C CNN
F 3 "" H 6250 4050 50  0001 C CNN
	1    6200 4050
	1    0    0    -1  
$EndComp
$Comp
L A5C:BUF12 UBH490
U 1 1 5FDD04B3
P 1850 5750
F 0 "UBH490" H 1850 6067 50  0000 C CNN
F 1 "BUF12" H 1850 5976 50  0000 C CNN
F 2 "" H 1850 5750 50  0001 C CNN
F 3 "" H 1850 5750 50  0001 C CNN
	1    1850 5750
	1    0    0    -1  
$EndComp
$Comp
L A5C:BUF12 UBH492
U 1 1 5FDD094A
P 1850 6250
F 0 "UBH492" H 1850 6567 50  0000 C CNN
F 1 "BUF12" H 1850 6476 50  0000 C CNN
F 2 "" H 1850 6250 50  0001 C CNN
F 3 "" H 1850 6250 50  0001 C CNN
	1    1850 6250
	1    0    0    -1  
$EndComp
$Comp
L A5C:BUF12 UBK328
U 1 1 61DC1F1D
P 2650 5750
F 0 "UBK328" H 2650 6067 50  0000 C CNN
F 1 "BUF12" H 2650 5976 50  0000 C CNN
F 2 "" H 2650 5750 50  0001 C CNN
F 3 "" H 2650 5750 50  0001 C CNN
	1    2650 5750
	1    0    0    -1  
$EndComp
$Comp
L A5C:BUF12 UBW424
U 1 1 60DBF8F6
P 2650 6250
F 0 "UBW424" H 2650 6567 50  0000 C CNN
F 1 "BUF12" H 2650 6476 50  0000 C CNN
F 2 "" H 2650 6250 50  0001 C CNN
F 3 "" H 2650 6250 50  0001 C CNN
	1    2650 6250
	1    0    0    -1  
$EndComp
$Comp
L A5C:INV01 UCR296
U 1 1 654BCBF2
P 3000 1900
F 0 "UCR296" H 3000 2217 50  0000 C CNN
F 1 "INV01" H 3000 2126 50  0000 C CNN
F 2 "" H 3000 1700 50  0001 C CNN
F 3 "" H 3000 1700 50  0001 C CNN
	1    3000 1900
	1    0    0    -1  
$EndComp
$Comp
L A5C:BUF12 UBN264
U 1 1 601E0AA5
P 3250 4750
F 0 "UBN264" H 3250 5067 50  0000 C CNN
F 1 "DELAY8" H 3250 4976 50  0000 C CNN
F 2 "" H 3250 4750 50  0001 C CNN
F 3 "" H 3250 4750 50  0001 C CNN
F 4 "UBN265;UBN267;UBN269;UBN270;UBN272;UBN274;UBN275" H 3250 4750 50  0001 C CNN "MiscRef"
	1    3250 4750
	1    0    0    -1  
$EndComp
$Comp
L A5C:BUF12 UBN362
U 1 1 601E0AA6
P 3850 4750
F 0 "UBN362" H 3850 5067 50  0000 C CNN
F 1 "DELAY8" H 3850 4976 50  0000 C CNN
F 2 "" H 3850 4750 50  0001 C CNN
F 3 "" H 3850 4750 50  0001 C CNN
F 4 "UBN364;UBN366;UBN367;UBN369;UBN371;UBN372;UBN374" H 3850 4750 50  0001 C CNN "MiscRef"
	1    3850 4750
	1    0    0    -1  
$EndComp
$Comp
L A5C:BUF12 UBU414
U 1 1 601E0AA7
P 4450 4750
F 0 "UBU414" H 4450 5067 50  0000 C CNN
F 1 "DELAY4" H 4450 4976 50  0000 C CNN
F 2 "" H 4450 4750 50  0001 C CNN
F 3 "" H 4450 4750 50  0001 C CNN
F 4 "UBU415;UBU417;UBU418" H 4450 4750 50  0001 C CNN "MiscRef"
	1    4450 4750
	1    0    0    -1  
$EndComp
$Comp
L A5C:BUF12 UBU420
U 1 1 601E0AA8
P 5050 4750
F 0 "UBU420" H 5050 5067 50  0000 C CNN
F 1 "DELAY4" H 5050 4976 50  0000 C CNN
F 2 "" H 5050 4750 50  0001 C CNN
F 3 "" H 5050 4750 50  0001 C CNN
F 4 "UBU422;UBU424;UBU425" H 5050 4750 50  0001 C CNN "MiscRef"
	1    5050 4750
	1    0    0    -1  
$EndComp
$Comp
L A5C:INV01 UCG507
U 1 1 601E0AA9
P 5400 2150
F 0 "UCG507" H 5400 2467 50  0000 C CNN
F 1 "INV01" H 5400 2376 50  0000 C CNN
F 2 "" H 5400 1950 50  0001 C CNN
F 3 "" H 5400 1950 50  0001 C CNN
	1    5400 2150
	1    0    0    -1  
$EndComp
$Comp
L A5C:INV01 UCL448
U 1 1 601E0AAB
P 5650 4750
F 0 "UCL448" H 5650 5067 50  0000 C CNN
F 1 "INV01" H 5650 4976 50  0000 C CNN
F 2 "" H 5650 4550 50  0001 C CNN
F 3 "" H 5650 4550 50  0001 C CNN
	1    5650 4750
	1    0    0    -1  
$EndComp
$Comp
L A5C:BUF12 UCT516
U 1 1 601E0AB0
P 7250 2250
F 0 "UCT516" H 7250 2567 50  0000 C CNN
F 1 "BUF12" H 7250 2476 50  0000 C CNN
F 2 "" H 7250 2250 50  0001 C CNN
F 3 "" H 7250 2250 50  0001 C CNN
	1    7250 2250
	1    0    0    -1  
$EndComp
$Comp
L A5C:BUF12 UCO494
U 1 1 601E0AB2
P 7850 1750
F 0 "UCO494" H 7850 2067 50  0000 C CNN
F 1 "BUF12" H 7850 1976 50  0000 C CNN
F 2 "" H 7850 1750 50  0001 C CNN
F 3 "" H 7850 1750 50  0001 C CNN
	1    7850 1750
	1    0    0    -1  
$EndComp
$Comp
L A5C:BUF12 UCL496
U 1 1 601E0AB3
P 7850 2250
F 0 "UCL496" H 7850 2567 50  0000 C CNN
F 1 "BUF12" H 7850 2476 50  0000 C CNN
F 2 "" H 7850 2250 50  0001 C CNN
F 3 "" H 7850 2250 50  0001 C CNN
	1    7850 2250
	1    0    0    -1  
$EndComp
$Comp
L A5C:BUF12 UCJ475
U 1 1 601E0AB5
P 7850 2750
F 0 "UCJ475" H 7850 3067 50  0000 C CNN
F 1 "BUF12" H 7850 2976 50  0000 C CNN
F 2 "" H 7850 2750 50  0001 C CNN
F 3 "" H 7850 2750 50  0001 C CNN
	1    7850 2750
	1    0    0    -1  
$EndComp
$Comp
L A5C:INV01 UCG492
U 1 1 601E0AB6
P 7850 3450
F 0 "UCG492" H 7850 3767 50  0000 C CNN
F 1 "INV01" H 7850 3676 50  0000 C CNN
F 2 "" H 7850 3250 50  0001 C CNN
F 3 "" H 7850 3250 50  0001 C CNN
	1    7850 3450
	1    0    0    -1  
$EndComp
$Comp
L A5C:NBUF03 UBD516
U 1 1 601E0AB7
P 8450 2250
F 0 "UBD516" H 8450 2567 50  0000 C CNN
F 1 "NBUF03" H 8450 2476 50  0000 C CNN
F 2 "" H 8450 2050 50  0001 C CNN
F 3 "" H 8450 2050 50  0001 C CNN
	1    8450 2250
	1    0    0    -1  
$EndComp
$Comp
L A5C:BUF12 UCG499
U 1 1 601E0A86
P 9150 3250
F 0 "UCG499" H 9150 3567 50  0000 C CNN
F 1 "BUF12" H 9150 3476 50  0000 C CNN
F 2 "" H 9150 3250 50  0001 C CNN
F 3 "" H 9150 3250 50  0001 C CNN
	1    9150 3250
	1    0    0    -1  
$EndComp
$Comp
L A5C:BUF12 UCL456
U 1 1 601E0A88
P 9750 2750
F 0 "UCL456" H 9750 3067 50  0000 C CNN
F 1 "BUF12" H 9750 2976 50  0000 C CNN
F 2 "" H 9750 2750 50  0001 C CNN
F 3 "" H 9750 2750 50  0001 C CNN
	1    9750 2750
	1    0    0    -1  
$EndComp
$Comp
L A5C:BUF12 UCL458
U 1 1 601E0A89
P 9750 3250
F 0 "UCL458" H 9750 3567 50  0000 C CNN
F 1 "BUF12" H 9750 3476 50  0000 C CNN
F 2 "" H 9750 3250 50  0001 C CNN
F 3 "" H 9750 3250 50  0001 C CNN
	1    9750 3250
	1    0    0    -1  
$EndComp
$Comp
L A5C:BUF12 UCG457
U 1 1 601E0A8A
P 9750 3750
F 0 "UCG457" H 9750 4067 50  0000 C CNN
F 1 "BUF12" H 9750 3976 50  0000 C CNN
F 2 "" H 9750 3750 50  0001 C CNN
F 3 "" H 9750 3750 50  0001 C CNN
	1    9750 3750
	1    0    0    -1  
$EndComp
$Comp
L A5C:NAND04 UCG504
U 1 1 601E0A8C
P 5400 2750
F 0 "UCG504" H 5400 3092 50  0000 C CNN
F 1 "NAND04" H 5400 3001 50  0000 C CNN
F 2 "" H 5400 2500 50  0001 C CNN
F 3 "" H 5400 2500 50  0001 C CNN
	1    5400 2750
	1    0    0    -1  
$EndComp
$Comp
L A5C:DFFCOR UCG511
U 1 1 601E0A8E
P 3950 2800
F 0 "UCG511" H 3950 3165 50  0000 C CNN
F 1 "DFFCOR" H 3950 3074 50  0000 C CNN
F 2 "" H 3950 2800 50  0001 C CNN
F 3 "" H 3950 2800 50  0001 C CNN
F 4 "UCG509;UCG520" H 3950 2800 50  0001 C CNN "MiscRef"
	1    3950 2800
	1    0    0    -1  
$EndComp
$Comp
L A5C:DFFCOR UCG516
U 1 1 601E0A8F
P 4450 2800
F 0 "UCG516" H 4450 3165 50  0000 C CNN
F 1 "DFFCOR" H 4450 3074 50  0000 C CNN
F 2 "" H 4450 2800 50  0001 C CNN
F 3 "" H 4450 2800 50  0001 C CNN
	1    4450 2800
	1    0    0    -1  
$EndComp
$Comp
L A5C:DFFCOR UBR501
U 1 1 601E0A90
P 4850 3700
F 0 "UBR501" H 4850 4065 50  0000 C CNN
F 1 "DFFCOR" H 4850 3974 50  0000 C CNN
F 2 "" H 4850 3700 50  0001 C CNN
F 3 "" H 4850 3700 50  0001 C CNN
F 4 "UBR499;UBR505" H 4850 3700 50  0001 C CNN "MiscRef"
	1    4850 3700
	1    0    0    -1  
$EndComp
$Comp
L A5C:DFFCOR UCT518
U 1 1 601E0A91
P 6500 2350
F 0 "UCT518" H 6500 2715 50  0000 C CNN
F 1 "DFFCOR" H 6500 2624 50  0000 C CNN
F 2 "" H 6500 2350 50  0001 C CNN
F 3 "" H 6500 2350 50  0001 C CNN
	1    6500 2350
	1    0    0    -1  
$EndComp
$Comp
L A5C:DFFCOR UCG493
U 1 1 601E0A85
P 8400 3350
F 0 "UCG493" H 8400 3715 50  0000 C CNN
F 1 "DFFCOR" H 8400 3624 50  0000 C CNN
F 2 "" H 8400 3350 50  0001 C CNN
F 3 "" H 8400 3350 50  0001 C CNN
	1    8400 3350
	1    0    0    -1  
$EndComp
$EndSCHEMATC
