EESchema Schematic File Version 4
EELAYER 30 0
EELAYER END
$Descr A4 11693 8268
encoding utf-8
Sheet 17 83
Title "CPS Reverse Engineering: DL-0311"
Date "2021-09-12"
Rev ""
Comp ""
Comment1 ""
Comment2 ""
Comment3 "Licence: CC-BY"
Comment4 "Author: Loïc *WydD* Petit"
$EndDescr
Connection ~ 2750 5850
Connection ~ 2750 5250
Connection ~ 2750 5350
Connection ~ 3750 1850
Connection ~ 2750 2000
Connection ~ 2650 2950
Connection ~ 7400 4800
Connection ~ 7300 5750
Connection ~ 8400 4650
Connection ~ 8400 1850
Connection ~ 7400 2000
Connection ~ 7300 2950
Connection ~ 3750 6750
Connection ~ 2750 4800
Connection ~ 2650 6800
Connection ~ 2650 5750
Connection ~ 1950 600 
Connection ~ 10000 700 
NoConn ~ 4850 5250
NoConn ~ 4850 5350
NoConn ~ 4850 1400
NoConn ~ 4850 1500
NoConn ~ 9500 5450
NoConn ~ 9500 5550
NoConn ~ 9500 2750
NoConn ~ 9500 1400
Entry Wire Line
	1950 2350 2050 2450
Entry Wire Line
	1950 2450 2050 2550
Entry Wire Line
	1950 2550 2050 2650
Entry Wire Line
	1950 2650 2050 2750
Entry Wire Line
	1950 4100 2050 4200
Entry Wire Line
	1950 4200 2050 4300
Entry Wire Line
	1950 4300 2050 4400
Entry Wire Line
	1950 4400 2050 4500
Entry Wire Line
	1950 5350 2050 5450
Entry Wire Line
	1950 5450 2050 5550
Entry Wire Line
	1950 6200 2050 6300
Entry Wire Line
	1950 6300 2050 6400
Entry Wire Line
	1950 6400 2050 6500
Entry Wire Line
	1950 6500 2050 6600
Entry Wire Line
	5250 1600 5350 1500
Entry Wire Line
	5250 1700 5350 1600
Entry Wire Line
	5250 2450 5350 2350
Entry Wire Line
	5250 2550 5350 2450
Entry Wire Line
	5250 2650 5350 2550
Entry Wire Line
	5250 2750 5350 2650
Entry Wire Line
	5250 4200 5350 4100
Entry Wire Line
	5250 4300 5350 4200
Entry Wire Line
	5250 4400 5350 4300
Entry Wire Line
	5250 4500 5350 4400
Entry Wire Line
	5250 5450 5350 5350
Entry Wire Line
	5250 5550 5350 5450
Entry Wire Line
	5250 6300 5350 6200
Entry Wire Line
	5250 6400 5350 6300
Entry Wire Line
	5250 6500 5350 6400
Entry Wire Line
	5250 6600 5350 6500
Entry Wire Line
	6600 1300 6700 1400
Entry Wire Line
	6600 1400 6700 1500
Entry Wire Line
	6600 1500 6700 1600
Entry Wire Line
	6600 1600 6700 1700
Entry Wire Line
	6600 2350 6700 2450
Entry Wire Line
	6600 2450 6700 2550
Entry Wire Line
	6600 2550 6700 2650
Entry Wire Line
	6600 2650 6700 2750
Entry Wire Line
	6600 4100 6700 4200
Entry Wire Line
	6600 4200 6700 4300
Entry Wire Line
	6600 4300 6700 4400
Entry Wire Line
	6600 4400 6700 4500
Entry Wire Line
	6600 5150 6700 5250
Entry Wire Line
	6600 5250 6700 5350
Entry Wire Line
	6600 5350 6700 5450
Entry Wire Line
	6600 5450 6700 5550
Entry Wire Line
	9900 1500 10000 1400
Entry Wire Line
	9900 1600 10000 1500
Entry Wire Line
	9900 1700 10000 1600
Entry Wire Line
	9900 2450 10000 2350
Entry Wire Line
	9900 2550 10000 2450
Entry Wire Line
	9900 2650 10000 2550
Entry Wire Line
	9900 4200 10000 4100
Entry Wire Line
	9900 4300 10000 4200
Entry Wire Line
	9900 4400 10000 4300
Entry Wire Line
	9900 4500 10000 4400
Entry Wire Line
	9900 5250 10000 5150
Entry Wire Line
	9900 5350 10000 5250
Wire Wire Line
	1800 2950 2650 2950
Wire Wire Line
	2000 6800 2650 6800
Wire Wire Line
	2050 1400 2850 1400
Wire Wire Line
	2050 1500 2850 1500
Wire Wire Line
	2050 1600 2850 1600
Wire Wire Line
	2050 1700 2850 1700
Wire Wire Line
	2050 2450 2850 2450
Wire Wire Line
	2050 2550 2850 2550
Wire Wire Line
	2050 2650 2850 2650
Wire Wire Line
	2050 2750 2850 2750
Wire Wire Line
	2050 4200 2850 4200
Wire Wire Line
	2050 4300 2850 4300
Wire Wire Line
	2050 4400 2850 4400
Wire Wire Line
	2050 4500 2850 4500
Wire Wire Line
	2050 5450 2850 5450
Wire Wire Line
	2050 5550 2850 5550
Wire Wire Line
	2050 6300 2850 6300
Wire Wire Line
	2050 6400 2850 6400
Wire Wire Line
	2050 6500 2850 6500
Wire Wire Line
	2050 6600 2850 6600
Wire Wire Line
	2650 1900 2850 1900
Wire Wire Line
	2650 2950 2650 1900
Wire Wire Line
	2650 4700 2850 4700
Wire Wire Line
	2650 5750 2650 4700
Wire Wire Line
	2650 5750 2850 5750
Wire Wire Line
	2650 6800 2650 5750
Wire Wire Line
	2650 6800 2850 6800
Wire Wire Line
	2750 1300 2750 2000
Wire Wire Line
	2750 2000 2750 3050
Wire Wire Line
	2750 2000 2850 2000
Wire Wire Line
	2750 3050 2850 3050
Wire Wire Line
	2750 4800 2750 3950
Wire Wire Line
	2750 4800 2750 5250
Wire Wire Line
	2750 4800 2850 4800
Wire Wire Line
	2750 5250 2850 5250
Wire Wire Line
	2750 5350 2750 5250
Wire Wire Line
	2750 5350 2750 5850
Wire Wire Line
	2750 5850 2750 6900
Wire Wire Line
	2750 6900 2850 6900
Wire Wire Line
	2850 2950 2650 2950
Wire Wire Line
	2850 5350 2750 5350
Wire Wire Line
	2850 5850 2750 5850
Wire Wire Line
	3400 1000 3750 1000
Wire Wire Line
	3650 1400 3850 1400
Wire Wire Line
	3650 1500 3850 1500
Wire Wire Line
	3650 1600 3850 1600
Wire Wire Line
	3650 1700 3850 1700
Wire Wire Line
	3650 2450 3850 2450
Wire Wire Line
	3650 2550 3850 2550
Wire Wire Line
	3650 2650 3850 2650
Wire Wire Line
	3650 2750 3850 2750
Wire Wire Line
	3650 4200 5250 4200
Wire Wire Line
	3650 4300 5250 4300
Wire Wire Line
	3650 4400 5250 4400
Wire Wire Line
	3650 4500 5250 4500
Wire Wire Line
	3650 5250 3850 5250
Wire Wire Line
	3650 5350 3850 5350
Wire Wire Line
	3650 5450 3850 5450
Wire Wire Line
	3650 5550 3850 5550
Wire Wire Line
	3650 6300 3850 6300
Wire Wire Line
	3650 6400 3850 6400
Wire Wire Line
	3650 6500 3850 6500
Wire Wire Line
	3650 6600 3850 6600
Wire Wire Line
	3650 7400 3750 7400
Wire Wire Line
	3750 1000 3750 1850
Wire Wire Line
	3750 1850 3750 2900
Wire Wire Line
	3750 5700 3750 6750
Wire Wire Line
	3750 5700 3850 5700
Wire Wire Line
	3750 6750 3750 7400
Wire Wire Line
	3750 6750 3850 6750
Wire Wire Line
	3850 1850 3750 1850
Wire Wire Line
	3850 2900 3750 2900
Wire Wire Line
	4850 1600 5250 1600
Wire Wire Line
	4850 1700 5250 1700
Wire Wire Line
	4850 2450 5250 2450
Wire Wire Line
	4850 2550 5250 2550
Wire Wire Line
	4850 2650 5250 2650
Wire Wire Line
	4850 2750 5250 2750
Wire Wire Line
	4850 5450 5250 5450
Wire Wire Line
	4850 5550 5250 5550
Wire Wire Line
	4850 6300 5250 6300
Wire Wire Line
	4850 6400 5250 6400
Wire Wire Line
	4850 6500 5250 6500
Wire Wire Line
	4850 6600 5250 6600
Wire Wire Line
	6450 2950 7300 2950
Wire Wire Line
	6450 5750 7300 5750
Wire Wire Line
	6700 1400 7500 1400
Wire Wire Line
	6700 1500 7500 1500
Wire Wire Line
	6700 1600 7500 1600
Wire Wire Line
	6700 1700 7500 1700
Wire Wire Line
	6700 2450 7500 2450
Wire Wire Line
	6700 2550 7500 2550
Wire Wire Line
	6700 2650 7500 2650
Wire Wire Line
	6700 2750 7500 2750
Wire Wire Line
	6700 4200 7500 4200
Wire Wire Line
	6700 4300 7500 4300
Wire Wire Line
	6700 4400 7500 4400
Wire Wire Line
	6700 4500 7500 4500
Wire Wire Line
	6700 5250 7500 5250
Wire Wire Line
	6700 5350 7500 5350
Wire Wire Line
	6700 5450 7500 5450
Wire Wire Line
	6700 5550 7500 5550
Wire Wire Line
	7300 1900 7500 1900
Wire Wire Line
	7300 2950 7300 1900
Wire Wire Line
	7300 4700 7500 4700
Wire Wire Line
	7300 5750 7300 4700
Wire Wire Line
	7400 1300 7400 2000
Wire Wire Line
	7400 2000 7400 3050
Wire Wire Line
	7400 2000 7500 2000
Wire Wire Line
	7400 3050 7500 3050
Wire Wire Line
	7400 4100 7400 4800
Wire Wire Line
	7400 4800 7400 5850
Wire Wire Line
	7400 4800 7500 4800
Wire Wire Line
	7400 5850 7500 5850
Wire Wire Line
	7500 2950 7300 2950
Wire Wire Line
	7500 5750 7300 5750
Wire Wire Line
	8050 1000 8400 1000
Wire Wire Line
	8050 3800 8400 3800
Wire Wire Line
	8300 1400 8500 1400
Wire Wire Line
	8300 1500 8500 1500
Wire Wire Line
	8300 1600 8500 1600
Wire Wire Line
	8300 1700 8500 1700
Wire Wire Line
	8300 2450 8500 2450
Wire Wire Line
	8300 2550 8500 2550
Wire Wire Line
	8300 2650 8500 2650
Wire Wire Line
	8300 2750 8500 2750
Wire Wire Line
	8300 4200 8500 4200
Wire Wire Line
	8300 4300 8500 4300
Wire Wire Line
	8300 4400 8500 4400
Wire Wire Line
	8300 4500 8500 4500
Wire Wire Line
	8300 5250 8500 5250
Wire Wire Line
	8300 5350 8500 5350
Wire Wire Line
	8300 5450 8500 5450
Wire Wire Line
	8300 5550 8500 5550
Wire Wire Line
	8400 1000 8400 1850
Wire Wire Line
	8400 1850 8400 2900
Wire Wire Line
	8400 3800 8400 4650
Wire Wire Line
	8400 4650 8400 5700
Wire Wire Line
	8500 1850 8400 1850
Wire Wire Line
	8500 2900 8400 2900
Wire Wire Line
	8500 4650 8400 4650
Wire Wire Line
	8500 5700 8400 5700
Wire Wire Line
	9500 1500 9900 1500
Wire Wire Line
	9500 1600 9900 1600
Wire Wire Line
	9500 1700 9900 1700
Wire Wire Line
	9500 2450 9900 2450
Wire Wire Line
	9500 2550 9900 2550
Wire Wire Line
	9500 2650 9900 2650
Wire Wire Line
	9500 4200 9900 4200
Wire Wire Line
	9500 4300 9900 4300
Wire Wire Line
	9500 4400 9900 4400
Wire Wire Line
	9500 4500 9900 4500
Wire Wire Line
	9500 5250 9900 5250
Wire Wire Line
	9500 5350 9900 5350
Wire Bus Line
	1950 600  1550 600 
Wire Bus Line
	5350 700  10000 700 
Wire Bus Line
	6600 600  1950 600 
Wire Bus Line
	10000 700  10250 700 
Text Label 2100 4200 0    50   ~ 0
BUS-DATA9
Text Label 2100 4300 0    50   ~ 0
BUS-DATA8
Text Label 2100 4400 0    50   ~ 0
BUS-DATA7
Text Label 2100 4500 0    50   ~ 0
BUS-DATA6
Text Label 2100 5450 0    50   ~ 0
BUS-DATA5
Text Label 2100 5550 0    50   ~ 0
BUS-DATA4
Text Label 2100 6300 0    50   ~ 0
BUS-DATA3
Text Label 2100 6400 0    50   ~ 0
BUS-DATA2
Text Label 2100 6500 0    50   ~ 0
BUS-DATA1
Text Label 2100 6600 0    50   ~ 0
BUS-DATA0
Text Label 2550 1400 2    50   ~ 0
BUS-DATA10
Text Label 2550 1500 2    50   ~ 0
BUS-DATA9
Text Label 2550 1600 2    50   ~ 0
BUS-DATA8
Text Label 2550 1700 2    50   ~ 0
BUS-DATA7
Text Label 2550 2450 2    50   ~ 0
BUS-DATA6
Text Label 2550 2550 2    50   ~ 0
BUS-DATA5
Text Label 2550 2650 2    50   ~ 0
BUS-DATA4
Text Label 2550 2750 2    50   ~ 0
BUS-DATA3
Text Label 4850 1600 0    50   ~ 0
BASE-Y5
Text Label 4850 1700 0    50   ~ 0
BASE-Y4
Text Label 4850 2450 0    50   ~ 0
BASE-Y3
Text Label 4850 2550 0    50   ~ 0
BASE-Y2
Text Label 4850 2650 0    50   ~ 0
BASE-Y1
Text Label 4850 2750 0    50   ~ 0
BASE-Y0
Text Label 4850 4200 0    50   ~ 0
BASE-Y9
Text Label 4850 4300 0    50   ~ 0
BASE-Y8
Text Label 4850 4400 0    50   ~ 0
BASE-Y7
Text Label 4850 4500 0    50   ~ 0
BASE-Y6
Text Label 4850 5450 0    50   ~ 0
BASE-Y5
Text Label 4850 5550 0    50   ~ 0
BASE-Y4
Text Label 4850 6300 0    50   ~ 0
BASE-Y3
Text Label 4850 6400 0    50   ~ 0
BASE-Y2
Text Label 4850 6500 0    50   ~ 0
BASE-Y1
Text Label 4850 6600 0    50   ~ 0
BASE-Y0
Text Label 7200 1400 2    50   ~ 0
BUS-DATA10
Text Label 7200 1500 2    50   ~ 0
BUS-DATA9
Text Label 7200 1600 2    50   ~ 0
BUS-DATA8
Text Label 7200 1700 2    50   ~ 0
BUS-DATA7
Text Label 7200 2450 2    50   ~ 0
BUS-DATA6
Text Label 7200 2550 2    50   ~ 0
BUS-DATA5
Text Label 7200 2650 2    50   ~ 0
BUS-DATA4
Text Label 7200 2750 2    50   ~ 0
BUS-DATA3
Text Label 7200 4200 2    50   ~ 0
BUS-DATA10
Text Label 7200 4300 2    50   ~ 0
BUS-DATA9
Text Label 7200 4400 2    50   ~ 0
BUS-DATA8
Text Label 7200 4500 2    50   ~ 0
BUS-DATA7
Text Label 7200 5250 2    50   ~ 0
BUS-DATA6
Text Label 7200 5350 2    50   ~ 0
BUS-DATA5
Text Label 7200 5450 2    50   ~ 0
BUS-DATA4
Text Label 7200 5550 2    50   ~ 0
BUS-DATA3
Text Label 9500 1500 0    50   ~ 0
BASE-Y5
Text Label 9500 1600 0    50   ~ 0
BASE-Y4
Text Label 9500 1700 0    50   ~ 0
BASE-Y3
Text Label 9500 2450 0    50   ~ 0
BASE-Y2
Text Label 9500 2550 0    50   ~ 0
BASE-Y1
Text Label 9500 2650 0    50   ~ 0
BASE-Y0
Text Label 9500 4200 0    50   ~ 0
BASE-Y5
Text Label 9500 4300 0    50   ~ 0
BASE-Y4
Text Label 9500 4400 0    50   ~ 0
BASE-Y3
Text Label 9500 4500 0    50   ~ 0
BASE-Y2
Text Label 9500 5250 0    50   ~ 0
BASE-Y1
Text Label 9500 5350 0    50   ~ 0
BASE-Y0
Text HLabel 1250 2900 0    50   Input ~ 0
~CLK4M
Text HLabel 1250 3000 0    50   Input ~ 0
~SCROLL1-Y
Text HLabel 1450 6750 0    50   Input ~ 0
~ROWSCROLL-OFFSET
Text HLabel 1450 6850 0    50   Input ~ 0
~CLK4M
Text HLabel 1550 600  0    50   Input ~ 0
BUS-DATA[0..10]
Text HLabel 3050 7400 0    50   Input ~ 0
BUS-ELSE
Text HLabel 3400 1000 0    50   Input ~ 0
~BUS-SCROLL1
Text HLabel 5900 2900 0    50   Input ~ 0
~CLK4M
Text HLabel 5900 3000 0    50   Input ~ 0
~SCROLL2-Y
Text HLabel 5900 5700 0    50   Input ~ 0
~CLK4M
Text HLabel 5900 5800 0    50   Input ~ 0
~SCROLL3-Y
Text HLabel 8050 1000 0    50   Input ~ 0
~BUS-SCROLL2
Text HLabel 8050 3800 0    50   Input ~ 0
~BUS-SCROLL3
Text HLabel 10250 700  2    50   Output ~ 0
BASE-Y[0..9]
$Comp
L power:VCC #PWR0248
U 1 1 611EFBDE
P 2750 1300
F 0 "#PWR0248" H 2750 1150 50  0001 C CNN
F 1 "VCC" H 2765 1473 50  0000 C CNN
F 2 "" H 2750 1300 50  0001 C CNN
F 3 "" H 2750 1300 50  0001 C CNN
	1    2750 1300
	1    0    0    -1  
$EndComp
$Comp
L power:VCC #PWR0126
U 1 1 6197B157
P 2750 3950
F 0 "#PWR0126" H 2750 3800 50  0001 C CNN
F 1 "VCC" H 2765 4123 50  0000 C CNN
F 2 "" H 2750 3950 50  0001 C CNN
F 3 "" H 2750 3950 50  0001 C CNN
	1    2750 3950
	1    0    0    -1  
$EndComp
$Comp
L power:VCC #PWR0249
U 1 1 61202829
P 7400 1300
F 0 "#PWR0249" H 7400 1150 50  0001 C CNN
F 1 "VCC" H 7415 1473 50  0000 C CNN
F 2 "" H 7400 1300 50  0001 C CNN
F 3 "" H 7400 1300 50  0001 C CNN
	1    7400 1300
	1    0    0    -1  
$EndComp
$Comp
L power:VCC #PWR0188
U 1 1 61118F2B
P 7400 4100
F 0 "#PWR0188" H 7400 3950 50  0001 C CNN
F 1 "VCC" H 7415 4273 50  0000 C CNN
F 2 "" H 7400 4100 50  0001 C CNN
F 3 "" H 7400 4100 50  0001 C CNN
	1    7400 4100
	1    0    0    -1  
$EndComp
$Comp
L A5C:OR02 UCB368
U 1 1 611EFC55
P 1500 2950
F 0 "UCB368" H 1525 3217 50  0000 C CNN
F 1 "OR02" H 1525 3126 50  0000 C CNN
F 2 "" H 1550 2950 50  0001 C CNN
F 3 "" H 1550 2950 50  0001 C CNN
	1    1500 2950
	1    0    0    -1  
$EndComp
$Comp
L A5C:OR02 UCB268
U 1 1 60C5BE7E
P 1700 6800
F 0 "UCB268" H 1725 7067 50  0000 C CNN
F 1 "OR02" H 1725 6976 50  0000 C CNN
F 2 "" H 1750 6800 50  0001 C CNN
F 3 "" H 1750 6800 50  0001 C CNN
	1    1700 6800
	1    0    0    -1  
$EndComp
$Comp
L A5C:OR02 UCC377
U 1 1 61202837
P 6150 2950
F 0 "UCC377" H 6175 3217 50  0000 C CNN
F 1 "OR02" H 6175 3126 50  0000 C CNN
F 2 "" H 6200 2950 50  0001 C CNN
F 3 "" H 6200 2950 50  0001 C CNN
	1    6150 2950
	1    0    0    -1  
$EndComp
$Comp
L A5C:OR02 UCB401
U 1 1 61118F26
P 6150 5750
F 0 "UCB401" H 6175 6017 50  0000 C CNN
F 1 "OR02" H 6175 5926 50  0000 C CNN
F 2 "" H 6200 5750 50  0001 C CNN
F 3 "" H 6200 5750 50  0001 C CNN
	1    6150 5750
	1    0    0    -1  
$EndComp
$Comp
L A5C:INV01 UCB399
U 1 1 61B0C403
P 3350 7400
F 0 "UCB399" H 3350 7717 50  0000 C CNN
F 1 "INV01" H 3350 7626 50  0000 C CNN
F 2 "" H 3350 7200 50  0001 C CNN
F 3 "" H 3350 7200 50  0001 C CNN
	1    3350 7400
	1    0    0    -1  
$EndComp
$Comp
L A5C:M175CL UCB86
U 1 1 611EFBB7
P 3250 1700
F 0 "UCB86" H 3250 2265 50  0000 C CNN
F 1 "M175CL" H 3250 2174 50  0000 C CNN
F 2 "" H 3250 1500 50  0001 C CNN
F 3 "" H 3250 1500 50  0001 C CNN
	1    3250 1700
	1    0    0    -1  
$EndComp
$Comp
L A5C:M175CL UEE263
U 1 1 611EFC67
P 3250 2750
F 0 "UEE263" H 3250 3315 50  0000 C CNN
F 1 "M175CL" H 3250 3224 50  0000 C CNN
F 2 "" H 3250 2550 50  0001 C CNN
F 3 "" H 3250 2550 50  0001 C CNN
	1    3250 2750
	1    0    0    -1  
$EndComp
$Comp
L A5C:M175C UEF297
U 1 1 61D313E4
P 3250 4500
F 0 "UEF297" H 3250 5065 50  0000 C CNN
F 1 "M175C" H 3250 4974 50  0000 C CNN
F 2 "" H 3250 4300 50  0001 C CNN
F 3 "" H 3250 4300 50  0001 C CNN
	1    3250 4500
	1    0    0    -1  
$EndComp
$Comp
L A5C:M175CL UCC109
U 1 1 609122CB
P 3250 5550
F 0 "UCC109" H 3250 6115 50  0000 C CNN
F 1 "M175CL" H 3250 6024 50  0000 C CNN
F 2 "" H 3250 5350 50  0001 C CNN
F 3 "" H 3250 5350 50  0001 C CNN
	1    3250 5550
	1    0    0    -1  
$EndComp
$Comp
L A5C:M175CL UCA504
U 1 1 61118F2C
P 3250 6600
F 0 "UCA504" H 3250 7165 50  0000 C CNN
F 1 "M175CL" H 3250 7074 50  0000 C CNN
F 2 "" H 3250 6400 50  0001 C CNN
F 3 "" H 3250 6400 50  0001 C CNN
	1    3250 6600
	1    0    0    -1  
$EndComp
$Comp
L A5C:M175CL UCC304
U 1 1 61202856
P 7900 1700
F 0 "UCC304" H 7900 2265 50  0000 C CNN
F 1 "M175CL" H 7900 2174 50  0000 C CNN
F 2 "" H 7900 1500 50  0001 C CNN
F 3 "" H 7900 1500 50  0001 C CNN
	1    7900 1700
	1    0    0    -1  
$EndComp
$Comp
L A5C:M175CL UEA287
U 1 1 61202881
P 7900 2750
F 0 "UEA287" H 7900 3315 50  0000 C CNN
F 1 "M175CL" H 7900 3224 50  0000 C CNN
F 2 "" H 7900 2550 50  0001 C CNN
F 3 "" H 7900 2550 50  0001 C CNN
	1    7900 2750
	1    0    0    -1  
$EndComp
$Comp
L A5C:M175CL UCC480
U 1 1 61118F2A
P 7900 4500
F 0 "UCC480" H 7900 5065 50  0000 C CNN
F 1 "M175CL" H 7900 4974 50  0000 C CNN
F 2 "" H 7900 4300 50  0001 C CNN
F 3 "" H 7900 4300 50  0001 C CNN
	1    7900 4500
	1    0    0    -1  
$EndComp
$Comp
L A5C:M175CL UEA311
U 1 1 61118F29
P 7900 5550
F 0 "UEA311" H 7900 6115 50  0000 C CNN
F 1 "M175CL" H 7900 6024 50  0000 C CNN
F 2 "" H 7900 5350 50  0001 C CNN
F 3 "" H 7900 5350 50  0001 C CNN
	1    7900 5550
	1    0    0    -1  
$EndComp
$Comp
L A5C:M368C UCA?
U 1 1 611EFBEE
P 4350 1650
AR Path="/604B5523/611EFBEE" Ref="UCA?"  Part="1" 
AR Path="/611EFBEE" Ref="UCA?"  Part="1" 
AR Path="/60EC0B61/611EFBEE" Ref="UCA?"  Part="1" 
AR Path="/61111462/611CEDF2/611EFBEE" Ref="UCB107"  Part="1" 
F 0 "UCB107" H 4350 2160 50  0000 C CNN
F 1 "M368C" H 4350 2070 50  0000 C CNN
F 2 "" H 4650 1450 50  0001 C CNN
F 3 "" H 4650 1450 50  0001 C CNN
	1    4350 1650
	1    0    0    -1  
$EndComp
$Comp
L A5C:M368C UEH?
U 1 1 611EFC2C
P 4350 2700
AR Path="/604B5523/611EFC2C" Ref="UEH?"  Part="1" 
AR Path="/611EFC2C" Ref="UEH?"  Part="1" 
AR Path="/60EC0B61/611EFC2C" Ref="UEH?"  Part="1" 
AR Path="/61111462/611CEDF2/611EFC2C" Ref="UED276"  Part="1" 
F 0 "UED276" H 4350 3210 50  0000 C CNN
F 1 "M368C" H 4350 3120 50  0000 C CNN
F 2 "" H 4650 2500 50  0001 C CNN
F 3 "" H 4650 2500 50  0001 C CNN
	1    4350 2700
	1    0    0    -1  
$EndComp
$Comp
L A5C:M368C UBK?
U 1 1 618A5676
P 4350 5500
AR Path="/604B5523/618A5676" Ref="UBK?"  Part="1" 
AR Path="/618A5676" Ref="UCC100"  Part="1" 
AR Path="/61111462/611CEDF2/618A5676" Ref="UCC100"  Part="1" 
F 0 "UCC100" H 4350 6010 50  0000 C CNN
F 1 "M368C" H 4350 5920 50  0000 C CNN
F 2 "" H 4650 5300 50  0001 C CNN
F 3 "" H 4650 5300 50  0001 C CNN
	1    4350 5500
	1    0    0    -1  
$EndComp
$Comp
L A5C:M368C UBK?
U 1 1 618E7A96
P 4350 6550
AR Path="/604B5523/618E7A96" Ref="UBK?"  Part="1" 
AR Path="/618E7A96" Ref="UCC517"  Part="1" 
AR Path="/61111462/611CEDF2/618E7A96" Ref="UCC517"  Part="1" 
F 0 "UCC517" H 4350 7060 50  0000 C CNN
F 1 "M368C" H 4350 6970 50  0000 C CNN
F 2 "" H 4650 6350 50  0001 C CNN
F 3 "" H 4650 6350 50  0001 C CNN
	1    4350 6550
	1    0    0    -1  
$EndComp
$Comp
L A5C:M368C UCB?
U 1 1 612028DB
P 9000 1650
AR Path="/604B5523/612028DB" Ref="UCB?"  Part="1" 
AR Path="/612028DB" Ref="UCB?"  Part="1" 
AR Path="/60E86855/612028DB" Ref="UCB?"  Part="1" 
AR Path="/61111462/611CEDF2/612028DB" Ref="UCB299"  Part="1" 
F 0 "UCB299" H 9000 2160 50  0000 C CNN
F 1 "M368C" H 9000 2070 50  0000 C CNN
F 2 "" H 9300 1450 50  0001 C CNN
F 3 "" H 9300 1450 50  0001 C CNN
	1    9000 1650
	1    0    0    -1  
$EndComp
$Comp
L A5C:M368C UED?
U 1 1 612028B2
P 9000 2700
AR Path="/604B5523/612028B2" Ref="UED?"  Part="1" 
AR Path="/612028B2" Ref="UED?"  Part="1" 
AR Path="/60E86855/612028B2" Ref="UED?"  Part="1" 
AR Path="/61111462/611CEDF2/612028B2" Ref="UEC283"  Part="1" 
F 0 "UEC283" H 9000 3210 50  0000 C CNN
F 1 "M368C" H 9000 3120 50  0000 C CNN
F 2 "" H 9300 2500 50  0001 C CNN
F 3 "" H 9300 2500 50  0001 C CNN
	1    9000 2700
	1    0    0    -1  
$EndComp
$Comp
L A5C:M368C UCB?
U 1 1 61118F28
P 9000 4450
AR Path="/604B5523/61118F28" Ref="UCB?"  Part="1" 
AR Path="/61118F28" Ref="UCC503"  Part="1" 
AR Path="/60E34936/61118F28" Ref="UCC503"  Part="1" 
AR Path="/61111462/611CEDF2/61118F28" Ref="UCC503"  Part="1" 
F 0 "UCC503" H 9000 4960 50  0000 C CNN
F 1 "M368C" H 9000 4870 50  0000 C CNN
F 2 "" H 9300 4250 50  0001 C CNN
F 3 "" H 9300 4250 50  0001 C CNN
	1    9000 4450
	1    0    0    -1  
$EndComp
$Comp
L A5C:M368C UEC?
U 1 1 61118F27
P 9000 5500
AR Path="/604B5523/61118F27" Ref="UEC?"  Part="1" 
AR Path="/61118F27" Ref="UEC328"  Part="1" 
AR Path="/60E34936/61118F27" Ref="UEC328"  Part="1" 
AR Path="/61111462/611CEDF2/61118F27" Ref="UEC328"  Part="1" 
F 0 "UEC328" H 9000 6010 50  0000 C CNN
F 1 "M368C" H 9000 5920 50  0000 C CNN
F 2 "" H 9300 5300 50  0001 C CNN
F 3 "" H 9300 5300 50  0001 C CNN
	1    9000 5500
	1    0    0    -1  
$EndComp
Text Notes 6550 7700 0    50   ~ 0
BASE-Y\n9\n8\n7\n6\n5\n4\n3\n2\n1\n0
Text Notes 5600 7700 0    50   ~ 0
SCROLL3\nxx\nDATA10\nDATA9\nDATA8\nDATA7\nDATA6\nDATA5
Text Notes 6050 7700 0    50   ~ 0
ROWSCROLL\nDATA9\nDATA8\nDATA7\nDATA6\nDATA5\nDATA4\nDATA3\nDATA2\nDATA1\nDATA0
Text Notes 5150 7700 0    50   ~ 0
SCROLL2\nxx\nDATA9\nDATA8\nDATA7\nDATA6\nDATA5\nDATA4
Text Notes 4700 7700 0    50   ~ 0
SCROLL1\nxx\nDATA8\nDATA7\nDATA6\nDATA5\nDATA4\nDATA3
Wire Bus Line
	1950 600  1950 6500
Wire Bus Line
	10000 700  10000 5250
Wire Bus Line
	5350 700  5350 6500
Wire Bus Line
	6600 600  6600 5450
$EndSCHEMATC
