EESchema Schematic File Version 4
EELAYER 30 0
EELAYER END
$Descr A4 8268 11693 portrait
encoding utf-8
Sheet 27 69
Title ""
Date "2020-11-26"
Rev ""
Comp ""
Comment1 "Licence: CC-BY"
Comment2 "Author: Loïc *WydD* Petit"
Comment3 ""
Comment4 ""
$EndDescr
Connection ~ 5100 9000
Connection ~ 5200 8900
Connection ~ 5300 8800
Connection ~ 5600 8600
Connection ~ 5600 7900
Connection ~ 5400 8000
Connection ~ 5400 2800
Connection ~ 5300 2900
Connection ~ 5400 2100
Connection ~ 5300 2200
Connection ~ 5200 3000
Connection ~ 4300 2400
Connection ~ 4300 3200
Connection ~ 1750 3200
Connection ~ 5100 3800
Connection ~ 5200 3700
Connection ~ 4300 8400
Connection ~ 2450 7700
Connection ~ 2450 7600
Connection ~ 5400 1400
Connection ~ 5300 3600
Connection ~ 5400 3500
Connection ~ 4300 4000
Connection ~ 4300 6800
Connection ~ 4300 7600
Connection ~ 5600 6500
Connection ~ 5400 6600
Connection ~ 5400 7300
Connection ~ 5600 7200
Connection ~ 5200 8200
Connection ~ 5300 8100
Connection ~ 5300 7400
Connection ~ 5400 8700
NoConn ~ 5000 3100
NoConn ~ 5000 3900
NoConn ~ 5000 8300
NoConn ~ 5000 1500
NoConn ~ 5000 2300
NoConn ~ 5000 7500
NoConn ~ 5000 6700
NoConn ~ 5000 9100
Entry Wire Line
	1650 2100 1750 2200
Entry Wire Line
	1650 2200 1750 2300
Entry Wire Line
	1650 2300 1750 2400
Entry Wire Line
	1650 2400 1750 2500
Entry Wire Line
	1650 2500 1750 2600
Wire Wire Line
	1650 3200 1750 3200
Wire Wire Line
	1650 3700 2550 3700
Wire Wire Line
	1650 8550 2950 8550
Wire Wire Line
	1750 3200 1750 8400
Wire Wire Line
	1750 3200 2950 3200
Wire Wire Line
	1750 8400 2950 8400
Wire Wire Line
	2200 7700 2450 7700
Wire Wire Line
	2450 2600 1750 2600
Wire Wire Line
	2450 7400 2450 2600
Wire Wire Line
	2450 7500 2450 7600
Wire Wire Line
	2450 7500 2950 7500
Wire Wire Line
	2450 7600 2450 7700
Wire Wire Line
	2450 7600 2950 7600
Wire Wire Line
	2450 7700 2950 7700
Wire Wire Line
	2550 500  7450 500 
Wire Wire Line
	2550 3000 2550 500 
Wire Wire Line
	2550 3350 2550 3700
Wire Wire Line
	2550 5700 7650 5700
Wire Wire Line
	2550 8200 2550 5700
Wire Wire Line
	2650 600  2650 2900
Wire Wire Line
	2650 600  7350 600 
Wire Wire Line
	2650 2900 2950 2900
Wire Wire Line
	2650 5800 2650 8100
Wire Wire Line
	2650 5800 7550 5800
Wire Wire Line
	2650 8100 2950 8100
Wire Wire Line
	2750 700  7250 700 
Wire Wire Line
	2750 2800 2750 700 
Wire Wire Line
	2750 5900 7450 5900
Wire Wire Line
	2750 8000 2750 5900
Wire Wire Line
	2850 800  7150 800 
Wire Wire Line
	2850 2700 2850 800 
Wire Wire Line
	2850 6000 7350 6000
Wire Wire Line
	2850 7900 2850 6000
Wire Wire Line
	2950 2200 1750 2200
Wire Wire Line
	2950 2300 1750 2300
Wire Wire Line
	2950 2400 1750 2400
Wire Wire Line
	2950 2500 1750 2500
Wire Wire Line
	2950 2700 2850 2700
Wire Wire Line
	2950 2800 2750 2800
Wire Wire Line
	2950 3000 2550 3000
Wire Wire Line
	2950 3350 2550 3350
Wire Wire Line
	2950 7400 2450 7400
Wire Wire Line
	2950 7900 2850 7900
Wire Wire Line
	2950 8000 2750 8000
Wire Wire Line
	2950 8200 2550 8200
Wire Wire Line
	3950 2450 4050 2450
Wire Wire Line
	3950 2550 4150 2550
Wire Wire Line
	3950 2650 4150 2650
Wire Wire Line
	3950 2750 4050 2750
Wire Wire Line
	3950 7650 4050 7650
Wire Wire Line
	3950 7750 4150 7750
Wire Wire Line
	3950 7850 4150 7850
Wire Wire Line
	3950 7950 4050 7950
Wire Wire Line
	4050 1400 4500 1400
Wire Wire Line
	4050 2450 4050 1400
Wire Wire Line
	4050 2750 4050 3800
Wire Wire Line
	4050 3800 4500 3800
Wire Wire Line
	4050 4000 4300 4000
Wire Wire Line
	4050 6600 4500 6600
Wire Wire Line
	4050 7650 4050 6600
Wire Wire Line
	4050 7950 4050 9000
Wire Wire Line
	4050 9000 4500 9000
Wire Wire Line
	4150 2200 4500 2200
Wire Wire Line
	4150 2550 4150 2200
Wire Wire Line
	4150 2650 4150 3000
Wire Wire Line
	4150 3000 4500 3000
Wire Wire Line
	4150 7400 4500 7400
Wire Wire Line
	4150 7750 4150 7400
Wire Wire Line
	4150 7850 4150 8200
Wire Wire Line
	4150 8200 4500 8200
Wire Wire Line
	4300 1600 4500 1600
Wire Wire Line
	4300 2400 4300 1600
Wire Wire Line
	4300 2400 4500 2400
Wire Wire Line
	4300 3200 4300 2400
Wire Wire Line
	4300 4000 4300 3200
Wire Wire Line
	4300 4000 4300 6800
Wire Wire Line
	4300 4000 4500 4000
Wire Wire Line
	4300 6800 4500 6800
Wire Wire Line
	4300 7600 4300 6800
Wire Wire Line
	4300 7600 4500 7600
Wire Wire Line
	4300 8400 4300 7600
Wire Wire Line
	4300 9200 4300 8400
Wire Wire Line
	4300 9200 4500 9200
Wire Wire Line
	4500 3200 4300 3200
Wire Wire Line
	4500 8400 4300 8400
Wire Wire Line
	5000 1400 5400 1400
Wire Wire Line
	5000 2200 5300 2200
Wire Wire Line
	5000 3000 5200 3000
Wire Wire Line
	5000 3800 5100 3800
Wire Wire Line
	5000 6600 5400 6600
Wire Wire Line
	5000 7400 5300 7400
Wire Wire Line
	5000 8200 5200 8200
Wire Wire Line
	5000 9000 5100 9000
Wire Wire Line
	5100 1000 5100 3800
Wire Wire Line
	5100 3800 5100 4500
Wire Wire Line
	5100 6200 5100 9000
Wire Wire Line
	5100 9000 5100 9800
Wire Wire Line
	5200 3000 5200 1000
Wire Wire Line
	5200 3000 5200 3700
Wire Wire Line
	5200 3700 5200 4400
Wire Wire Line
	5200 8200 5200 6200
Wire Wire Line
	5200 8200 5200 8900
Wire Wire Line
	5200 8900 5200 9700
Wire Wire Line
	5300 2200 5300 1000
Wire Wire Line
	5300 2200 5300 2900
Wire Wire Line
	5300 2900 5300 3600
Wire Wire Line
	5300 3600 5300 4300
Wire Wire Line
	5300 3600 6000 3600
Wire Wire Line
	5300 7400 5300 6200
Wire Wire Line
	5300 7400 5300 8100
Wire Wire Line
	5300 8100 5300 8800
Wire Wire Line
	5300 8800 5300 9600
Wire Wire Line
	5400 1000 5400 1400
Wire Wire Line
	5400 1400 5400 2100
Wire Wire Line
	5400 1400 7150 1400
Wire Wire Line
	5400 2100 5400 2800
Wire Wire Line
	5400 2100 6600 2100
Wire Wire Line
	5400 2800 5400 3500
Wire Wire Line
	5400 2800 6050 2800
Wire Wire Line
	5400 3500 5400 4200
Wire Wire Line
	5400 3500 6000 3500
Wire Wire Line
	5400 4200 6000 4200
Wire Wire Line
	5400 6200 5400 6600
Wire Wire Line
	5400 6600 5400 7300
Wire Wire Line
	5400 7300 5400 8000
Wire Wire Line
	5400 8000 5400 8700
Wire Wire Line
	5400 8000 6100 8000
Wire Wire Line
	5400 8700 5400 9500
Wire Wire Line
	5600 5500 7450 5500
Wire Wire Line
	5600 6500 5600 5500
Wire Wire Line
	5600 6500 5600 7200
Wire Wire Line
	5600 7200 5600 7900
Wire Wire Line
	5600 7900 5600 8600
Wire Wire Line
	5600 8600 5600 9400
Wire Wire Line
	6000 3700 5200 3700
Wire Wire Line
	6000 4300 5300 4300
Wire Wire Line
	6000 4400 5200 4400
Wire Wire Line
	6000 4500 5100 4500
Wire Wire Line
	6000 9400 5600 9400
Wire Wire Line
	6000 9500 5400 9500
Wire Wire Line
	6000 9600 5300 9600
Wire Wire Line
	6000 9700 5200 9700
Wire Wire Line
	6000 9800 5100 9800
Wire Wire Line
	6050 2900 5300 2900
Wire Wire Line
	6100 7900 5600 7900
Wire Wire Line
	6100 8100 5300 8100
Wire Wire Line
	6100 8600 5600 8600
Wire Wire Line
	6100 8700 5400 8700
Wire Wire Line
	6100 8800 5300 8800
Wire Wire Line
	6100 8900 5200 8900
Wire Wire Line
	6150 7200 5600 7200
Wire Wire Line
	6150 7300 5400 7300
Wire Wire Line
	6600 2200 5300 2200
Wire Wire Line
	6600 2900 6600 2850
Wire Wire Line
	6600 3000 5200 3000
Wire Wire Line
	6600 3700 6600 3600
Wire Wire Line
	6600 3800 5100 3800
Wire Wire Line
	6700 6500 5600 6500
Wire Wire Line
	6700 6600 5400 6600
Wire Wire Line
	6700 7300 6700 7250
Wire Wire Line
	6700 7400 5300 7400
Wire Wire Line
	6700 8100 6700 8000
Wire Wire Line
	6700 8200 5200 8200
Wire Wire Line
	6700 8750 6700 8900
Wire Wire Line
	6700 9000 5100 9000
Wire Wire Line
	7150 1400 7150 800 
Wire Wire Line
	7150 2150 7250 2150
Wire Wire Line
	7150 3750 7450 3750
Wire Wire Line
	7250 700  7250 2150
Wire Wire Line
	7250 6550 7350 6550
Wire Wire Line
	7250 8150 7550 8150
Wire Wire Line
	7250 8950 7650 8950
Wire Wire Line
	7350 600  7350 2950
Wire Wire Line
	7350 2950 7150 2950
Wire Wire Line
	7350 6550 7350 6000
Wire Wire Line
	7450 500  7450 3750
Wire Wire Line
	7450 4350 7200 4350
Wire Wire Line
	7450 5500 7450 4350
Wire Wire Line
	7450 5900 7450 7350
Wire Wire Line
	7450 7350 7250 7350
Wire Wire Line
	7550 8150 7550 5800
Wire Wire Line
	7650 8950 7650 5700
Wire Bus Line
	1650 1950 1550 1950
Wire Bus Line
	1650 1950 1650 2500
Text Label 1000 3850 2    50   ~ 0
~MAIN-RESET
Text Label 1850 2200 0    50   ~ 0
~PD0
Text Label 1850 2300 0    50   ~ 0
~PD1
Text Label 1850 2400 0    50   ~ 0
~PD2
Text Label 1850 2500 0    50   ~ 0
~PD3
Text Label 1850 2600 0    50   ~ 0
~PD4
Text HLabel 1050 3200 0    50   Input ~ 0
LOAD
Text HLabel 1050 3700 0    50   Input ~ 0
~RESET
Text HLabel 1050 8550 0    50   Input ~ 0
~RESET
Text HLabel 1550 1950 0    50   Input ~ 0
~PD[0..4]
Text HLabel 4050 4000 0    50   Input ~ 0
~CLK8M
Text HLabel 6750 9600 2    50   Output ~ 0
ZERO
$Comp
L power:VCC #PWR?
U 1 1 61FC28EE
P 2200 7700
AR Path="/5FC4E2F1/61FC28EE" Ref="#PWR?"  Part="1" 
AR Path="/621ABC04/61FC28EE" Ref="#PWR?"  Part="1" 
AR Path="/5FAC57E1/61FC28EE" Ref="#PWR?"  Part="1" 
AR Path="/61FB86DB/61FC28EE" Ref="#PWR?"  Part="1" 
AR Path="/5FBCE4A9/5FBD0B2C/61FC28EE" Ref="#PWR0114"  Part="1" 
F 0 "#PWR0114" H 2200 7550 50  0001 C CNN
F 1 "VCC" H 2215 7873 50  0000 C CNN
F 2 "" H 2200 7700 50  0001 C CNN
F 3 "" H 2200 7700 50  0001 C CNN
	1    2200 7700
	1    0    0    -1  
$EndComp
$Comp
L A5C:NOR02 UCC?
U 1 1 61FC28F4
P 6300 2850
AR Path="/5FD56F21/61FC28F4" Ref="UCC?"  Part="1" 
AR Path="/621ABC04/61FC28F4" Ref="UCC?"  Part="1" 
AR Path="/5FAC57E1/61FC28F4" Ref="UCC?"  Part="1" 
AR Path="/61FB86DB/61FC28F4" Ref="UBZ55"  Part="1" 
AR Path="/5FBCE4A9/5FBD0B2C/61FC28F4" Ref="UBZ55"  Part="1" 
F 0 "UBZ55" H 6325 3116 50  0000 C CNN
F 1 "NOR02" H 6325 3025 50  0000 C CNN
F 2 "" H 6300 2850 50  0001 C CNN
F 3 "" H 6300 2850 50  0001 C CNN
	1    6300 2850
	1    0    0    -1  
$EndComp
$Comp
L A5C:NOR02 UBR?
U 1 1 61FC28FA
P 6400 7250
AR Path="/5FD56F21/61FC28FA" Ref="UBR?"  Part="1" 
AR Path="/621ABC04/61FC28FA" Ref="UBR?"  Part="1" 
AR Path="/5FAC57E1/61FC28FA" Ref="UBR?"  Part="1" 
AR Path="/61FB86DB/61FC28FA" Ref="UBU70"  Part="1" 
AR Path="/5FBCE4A9/5FBD0B2C/61FC28FA" Ref="UBU70"  Part="1" 
F 0 "UBU70" H 6425 7516 50  0000 C CNN
F 1 "NOR02" H 6425 7425 50  0000 C CNN
F 2 "" H 6400 7250 50  0001 C CNN
F 3 "" H 6400 7250 50  0001 C CNN
	1    6400 7250
	1    0    0    -1  
$EndComp
$Comp
L A5C:XOR02 UCC?
U 1 1 61FC2900
P 6850 2150
AR Path="/5FD56F21/61FC2900" Ref="UCC?"  Part="1" 
AR Path="/621ABC04/61FC2900" Ref="UCC?"  Part="1" 
AR Path="/5FAC57E1/61FC2900" Ref="UCC?"  Part="1" 
AR Path="/61FB86DB/61FC2900" Ref="UBZ52"  Part="1" 
AR Path="/5FBCE4A9/5FBD0B2C/61FC2900" Ref="UBZ52"  Part="1" 
F 0 "UBZ52" H 6875 2417 50  0000 C CNN
F 1 "XOR02" H 6875 2326 50  0000 C CNN
F 2 "" H 6850 2150 50  0001 C CNN
F 3 "" H 6850 2150 50  0001 C CNN
	1    6850 2150
	1    0    0    -1  
$EndComp
$Comp
L A5C:XNOR02 UCC?
U 1 1 61FC2906
P 6850 2950
AR Path="/5FD56F21/61FC2906" Ref="UCC?"  Part="1" 
AR Path="/621ABC04/61FC2906" Ref="UCC?"  Part="1" 
AR Path="/5FAC57E1/61FC2906" Ref="UCC?"  Part="1" 
AR Path="/61FB86DB/61FC2906" Ref="UBZ58"  Part="1" 
AR Path="/5FBCE4A9/5FBD0B2C/61FC2906" Ref="UBZ58"  Part="1" 
F 0 "UBZ58" H 6850 3267 50  0000 C CNN
F 1 "XNOR02" H 6850 3176 50  0000 C CNN
F 2 "" H 6850 2950 50  0001 C CNN
F 3 "" H 6850 2950 50  0001 C CNN
	1    6850 2950
	1    0    0    -1  
$EndComp
$Comp
L A5C:XNOR02 UCC?
U 1 1 61FC290C
P 6850 3750
AR Path="/5FD56F21/61FC290C" Ref="UCC?"  Part="1" 
AR Path="/621ABC04/61FC290C" Ref="UCC?"  Part="1" 
AR Path="/5FAC57E1/61FC290C" Ref="UCC?"  Part="1" 
AR Path="/61FB86DB/61FC290C" Ref="UBW38"  Part="1" 
AR Path="/5FBCE4A9/5FBD0B2C/61FC290C" Ref="UBW38"  Part="1" 
F 0 "UBW38" H 6850 4067 50  0000 C CNN
F 1 "XNOR02" H 6850 3976 50  0000 C CNN
F 2 "" H 6850 3750 50  0001 C CNN
F 3 "" H 6850 3750 50  0001 C CNN
	1    6850 3750
	1    0    0    -1  
$EndComp
$Comp
L A5C:XOR02 UBU?
U 1 1 61FC2912
P 6950 6550
AR Path="/5FD56F21/61FC2912" Ref="UBU?"  Part="1" 
AR Path="/621ABC04/61FC2912" Ref="UBU?"  Part="1" 
AR Path="/5FAC57E1/61FC2912" Ref="UBU?"  Part="1" 
AR Path="/61FB86DB/61FC2912" Ref="UBU73"  Part="1" 
AR Path="/5FBCE4A9/5FBD0B2C/61FC2912" Ref="UBU73"  Part="1" 
F 0 "UBU73" H 6975 6817 50  0000 C CNN
F 1 "XOR02" H 6975 6726 50  0000 C CNN
F 2 "" H 6950 6550 50  0001 C CNN
F 3 "" H 6950 6550 50  0001 C CNN
	1    6950 6550
	1    0    0    -1  
$EndComp
$Comp
L A5C:XNOR02 UBR?
U 1 1 61FC2918
P 6950 7350
AR Path="/5FD56F21/61FC2918" Ref="UBR?"  Part="1" 
AR Path="/621ABC04/61FC2918" Ref="UBR?"  Part="1" 
AR Path="/5FAC57E1/61FC2918" Ref="UBR?"  Part="1" 
AR Path="/61FB86DB/61FC2918" Ref="UBU96"  Part="1" 
AR Path="/5FBCE4A9/5FBD0B2C/61FC2918" Ref="UBU96"  Part="1" 
F 0 "UBU96" H 6950 7667 50  0000 C CNN
F 1 "XNOR02" H 6950 7576 50  0000 C CNN
F 2 "" H 6950 7350 50  0001 C CNN
F 3 "" H 6950 7350 50  0001 C CNN
	1    6950 7350
	1    0    0    -1  
$EndComp
$Comp
L A5C:XNOR02 UBU?
U 1 1 61FC291E
P 6950 8150
AR Path="/5FD56F21/61FC291E" Ref="UBU?"  Part="1" 
AR Path="/621ABC04/61FC291E" Ref="UBU?"  Part="1" 
AR Path="/5FAC57E1/61FC291E" Ref="UBU?"  Part="1" 
AR Path="/61FB86DB/61FC291E" Ref="UBU98"  Part="1" 
AR Path="/5FBCE4A9/5FBD0B2C/61FC291E" Ref="UBU98"  Part="1" 
F 0 "UBU98" H 6950 8467 50  0000 C CNN
F 1 "XNOR02" H 6950 8376 50  0000 C CNN
F 2 "" H 6950 8150 50  0001 C CNN
F 3 "" H 6950 8150 50  0001 C CNN
	1    6950 8150
	1    0    0    -1  
$EndComp
$Comp
L A5C:XNOR02 UBU?
U 1 1 61FC2924
P 6950 8950
AR Path="/5FD56F21/61FC2924" Ref="UBU?"  Part="1" 
AR Path="/621ABC04/61FC2924" Ref="UBU?"  Part="1" 
AR Path="/5FAC57E1/61FC2924" Ref="UBU?"  Part="1" 
AR Path="/61FB86DB/61FC2924" Ref="UBW117"  Part="1" 
AR Path="/5FBCE4A9/5FBD0B2C/61FC2924" Ref="UBW117"  Part="1" 
F 0 "UBW117" H 6950 9267 50  0000 C CNN
F 1 "XNOR02" H 6950 9176 50  0000 C CNN
F 2 "" H 6950 8950 50  0001 C CNN
F 3 "" H 6950 8950 50  0001 C CNN
	1    6950 8950
	1    0    0    -1  
$EndComp
$Comp
L A5C:INV01 UBU?
U 1 1 61FC292A
P 1350 3200
AR Path="/61FC292A" Ref="UBU?"  Part="1" 
AR Path="/621ABC04/61FC292A" Ref="UBU?"  Part="1" 
AR Path="/5FAC57E1/61FC292A" Ref="UBU?"  Part="1" 
AR Path="/61FB86DB/61FC292A" Ref="UBR50"  Part="1" 
AR Path="/5FBCE4A9/5FBD0B2C/61FC292A" Ref="UBR50"  Part="1" 
F 0 "UBR50" H 1350 3516 50  0000 C CNN
F 1 "INV01" H 1350 3425 50  0000 C CNN
F 2 "" H 1350 3000 50  0001 C CNN
F 3 "" H 1350 3000 50  0001 C CNN
	1    1350 3200
	1    0    0    -1  
$EndComp
$Comp
L A5C:INV01 UBZ?
U 1 1 620DC786
P 1350 3700
AR Path="/620DC786" Ref="UBZ?"  Part="1" 
AR Path="/61FB86DB/620DC786" Ref="UBZ49"  Part="1" 
AR Path="/5FBCE4A9/5FBD0B2C/620DC786" Ref="UBZ49"  Part="1" 
F 0 "UBZ49" H 1350 4017 50  0000 C CNN
F 1 "INV01" H 1350 3926 50  0000 C CNN
F 2 "" H 1350 3500 50  0001 C CNN
F 3 "" H 1350 3500 50  0001 C CNN
	1    1350 3700
	1    0    0    -1  
$EndComp
$Comp
L A5C:INV01 UAA?
U 1 1 621BCAFE
P 1350 8550
AR Path="/621BCAFE" Ref="UAA?"  Part="1" 
AR Path="/61FB86DB/621BCAFE" Ref="UAA484"  Part="1" 
AR Path="/5FBCE4A9/5FBD0B2C/621BCAFE" Ref="UAA484"  Part="1" 
F 0 "UAA484" H 1350 8867 50  0000 C CNN
F 1 "INV01" H 1350 8776 50  0000 C CNN
F 2 "" H 1350 8350 50  0001 C CNN
F 3 "" H 1350 8350 50  0001 C CNN
	1    1350 8550
	1    0    0    -1  
$EndComp
$Comp
L A5C:NOR03 UCC?
U 1 1 61FC293C
P 6300 3600
AR Path="/5FD56F21/61FC293C" Ref="UCC?"  Part="1" 
AR Path="/621ABC04/61FC293C" Ref="UCC?"  Part="1" 
AR Path="/5FAC57E1/61FC293C" Ref="UCC?"  Part="1" 
AR Path="/61FB86DB/61FC293C" Ref="UBW35"  Part="1" 
AR Path="/5FBCE4A9/5FBD0B2C/61FC293C" Ref="UBW35"  Part="1" 
F 0 "UBW35" H 6300 3916 50  0000 C CNN
F 1 "NOR03" H 6300 3825 50  0000 C CNN
F 2 "" H 6300 3600 50  0001 C CNN
F 3 "" H 6300 3600 50  0001 C CNN
	1    6300 3600
	1    0    0    -1  
$EndComp
$Comp
L A5C:NOR03 UBU?
U 1 1 61FC2942
P 6400 8000
AR Path="/5FD56F21/61FC2942" Ref="UBU?"  Part="1" 
AR Path="/621ABC04/61FC2942" Ref="UBU?"  Part="1" 
AR Path="/5FAC57E1/61FC2942" Ref="UBU?"  Part="1" 
AR Path="/61FB86DB/61FC2942" Ref="UBU92"  Part="1" 
AR Path="/5FBCE4A9/5FBD0B2C/61FC2942" Ref="UBU92"  Part="1" 
F 0 "UBU92" H 6400 8316 50  0000 C CNN
F 1 "NOR03" H 6400 8225 50  0000 C CNN
F 2 "" H 6400 8000 50  0001 C CNN
F 3 "" H 6400 8000 50  0001 C CNN
	1    6400 8000
	1    0    0    -1  
$EndComp
$Comp
L A5C:INV01 UBU?
U 1 1 61FC2948
P 6900 4350
AR Path="/5FD56F21/61FC2948" Ref="UBU?"  Part="1" 
AR Path="/621ABC04/61FC2948" Ref="UBU?"  Part="1" 
AR Path="/5FAC57E1/61FC2948" Ref="UBU?"  Part="1" 
AR Path="/61FB86DB/61FC2948" Ref="UBU68"  Part="1" 
AR Path="/5FBCE4A9/5FBD0B2C/61FC2948" Ref="UBU68"  Part="1" 
F 0 "UBU68" H 6900 4666 50  0000 C CNN
F 1 "INV01" H 6900 4575 50  0000 C CNN
F 2 "" H 6900 4150 50  0001 C CNN
F 3 "" H 6900 4150 50  0001 C CNN
	1    6900 4350
	1    0    0    -1  
$EndComp
$Comp
L A5C:DFFCOO UCC?
U 1 1 61FC294F
P 4750 1500
AR Path="/5FD56F21/61FC294F" Ref="UCC?"  Part="1" 
AR Path="/621ABC04/61FC294F" Ref="UCC?"  Part="1" 
AR Path="/5FAC57E1/61FC294F" Ref="UCC?"  Part="1" 
AR Path="/61FB86DB/61FC294F" Ref="UBU52"  Part="1" 
AR Path="/5FBCE4A9/5FBD0B2C/61FC294F" Ref="UBU52"  Part="1" 
F 0 "UBU52" H 4750 1861 50  0000 C CNN
F 1 "DFFCOO" H 4750 1770 50  0000 C CNN
F 2 "" H 4750 1500 50  0001 C CNN
F 3 "" H 4750 1500 50  0001 C CNN
F 4 "UBU50" H 4750 1500 50  0001 C CNN "MiscRef"
	1    4750 1500
	1    0    0    -1  
$EndComp
$Comp
L A5C:DFFCOO UCC?
U 1 1 61FC2955
P 4750 2300
AR Path="/5FD56F21/61FC2955" Ref="UCC?"  Part="1" 
AR Path="/621ABC04/61FC2955" Ref="UCC?"  Part="1" 
AR Path="/5FAC57E1/61FC2955" Ref="UCC?"  Part="1" 
AR Path="/61FB86DB/61FC2955" Ref="UBU56"  Part="1" 
AR Path="/5FBCE4A9/5FBD0B2C/61FC2955" Ref="UBU56"  Part="1" 
F 0 "UBU56" H 4750 2661 50  0000 C CNN
F 1 "DFFCOO" H 4750 2570 50  0000 C CNN
F 2 "" H 4750 2300 50  0001 C CNN
F 3 "" H 4750 2300 50  0001 C CNN
	1    4750 2300
	1    0    0    -1  
$EndComp
$Comp
L A5C:DFFCOO UCC?
U 1 1 61FC295B
P 4750 3100
AR Path="/5FD56F21/61FC295B" Ref="UCC?"  Part="1" 
AR Path="/621ABC04/61FC295B" Ref="UCC?"  Part="1" 
AR Path="/5FAC57E1/61FC295B" Ref="UCC?"  Part="1" 
AR Path="/61FB86DB/61FC295B" Ref="UBU60"  Part="1" 
AR Path="/5FBCE4A9/5FBD0B2C/61FC295B" Ref="UBU60"  Part="1" 
F 0 "UBU60" H 4750 3461 50  0000 C CNN
F 1 "DFFCOO" H 4750 3370 50  0000 C CNN
F 2 "" H 4750 3100 50  0001 C CNN
F 3 "" H 4750 3100 50  0001 C CNN
	1    4750 3100
	1    0    0    -1  
$EndComp
$Comp
L A5C:DFFCOO UCC?
U 1 1 61FC2961
P 4750 3900
AR Path="/5FD56F21/61FC2961" Ref="UCC?"  Part="1" 
AR Path="/621ABC04/61FC2961" Ref="UCC?"  Part="1" 
AR Path="/5FAC57E1/61FC2961" Ref="UCC?"  Part="1" 
AR Path="/61FB86DB/61FC2961" Ref="UBU64"  Part="1" 
AR Path="/5FBCE4A9/5FBD0B2C/61FC2961" Ref="UBU64"  Part="1" 
F 0 "UBU64" H 4750 4261 50  0000 C CNN
F 1 "DFFCOO" H 4750 4170 50  0000 C CNN
F 2 "" H 4750 3900 50  0001 C CNN
F 3 "" H 4750 3900 50  0001 C CNN
	1    4750 3900
	1    0    0    -1  
$EndComp
$Comp
L A5C:DFFCOO UBR?
U 1 1 61FC2968
P 4750 6700
AR Path="/5FD56F21/61FC2968" Ref="UBR?"  Part="1" 
AR Path="/621ABC04/61FC2968" Ref="UBR?"  Part="1" 
AR Path="/5FAC57E1/61FC2968" Ref="UBR?"  Part="1" 
AR Path="/61FB86DB/61FC2968" Ref="UBU109"  Part="1" 
AR Path="/5FBCE4A9/5FBD0B2C/61FC2968" Ref="UBU109"  Part="1" 
F 0 "UBU109" H 4750 7061 50  0000 C CNN
F 1 "DFFCOO" H 4750 6970 50  0000 C CNN
F 2 "" H 4750 6700 50  0001 C CNN
F 3 "" H 4750 6700 50  0001 C CNN
F 4 "UBU108" H 4750 6700 50  0001 C CNN "MiscRef"
	1    4750 6700
	1    0    0    -1  
$EndComp
$Comp
L A5C:DFFCOO UBR?
U 1 1 61FC296E
P 4750 7500
AR Path="/5FD56F21/61FC296E" Ref="UBR?"  Part="1" 
AR Path="/621ABC04/61FC296E" Ref="UBR?"  Part="1" 
AR Path="/5FAC57E1/61FC296E" Ref="UBR?"  Part="1" 
AR Path="/61FB86DB/61FC296E" Ref="UBU113"  Part="1" 
AR Path="/5FBCE4A9/5FBD0B2C/61FC296E" Ref="UBU113"  Part="1" 
F 0 "UBU113" H 4750 7861 50  0000 C CNN
F 1 "DFFCOO" H 4750 7770 50  0000 C CNN
F 2 "" H 4750 7500 50  0001 C CNN
F 3 "" H 4750 7500 50  0001 C CNN
	1    4750 7500
	1    0    0    -1  
$EndComp
$Comp
L A5C:DFFCOO UBR?
U 1 1 61FC2974
P 4750 8300
AR Path="/5FD56F21/61FC2974" Ref="UBR?"  Part="1" 
AR Path="/621ABC04/61FC2974" Ref="UBR?"  Part="1" 
AR Path="/5FAC57E1/61FC2974" Ref="UBR?"  Part="1" 
AR Path="/61FB86DB/61FC2974" Ref="UBU117"  Part="1" 
AR Path="/5FBCE4A9/5FBD0B2C/61FC2974" Ref="UBU117"  Part="1" 
F 0 "UBU117" H 4750 8661 50  0000 C CNN
F 1 "DFFCOO" H 4750 8570 50  0000 C CNN
F 2 "" H 4750 8300 50  0001 C CNN
F 3 "" H 4750 8300 50  0001 C CNN
	1    4750 8300
	1    0    0    -1  
$EndComp
$Comp
L A5C:DFFCOO UBR?
U 1 1 61FC297A
P 4750 9100
AR Path="/5FD56F21/61FC297A" Ref="UBR?"  Part="1" 
AR Path="/621ABC04/61FC297A" Ref="UBR?"  Part="1" 
AR Path="/5FAC57E1/61FC297A" Ref="UBR?"  Part="1" 
AR Path="/61FB86DB/61FC297A" Ref="UBU121"  Part="1" 
AR Path="/5FBCE4A9/5FBD0B2C/61FC297A" Ref="UBU121"  Part="1" 
F 0 "UBU121" H 4750 9461 50  0000 C CNN
F 1 "DFFCOO" H 4750 9370 50  0000 C CNN
F 2 "" H 4750 9100 50  0001 C CNN
F 3 "" H 4750 9100 50  0001 C CNN
	1    4750 9100
	1    0    0    -1  
$EndComp
$Comp
L A5C:NOR04 UCC?
U 1 1 61FC2980
P 6300 4350
AR Path="/5FD56F21/61FC2980" Ref="UCC?"  Part="1" 
AR Path="/621ABC04/61FC2980" Ref="UCC?"  Part="1" 
AR Path="/5FAC57E1/61FC2980" Ref="UCC?"  Part="1" 
AR Path="/61FB86DB/61FC2980" Ref="UBU24"  Part="1" 
AR Path="/5FBCE4A9/5FBD0B2C/61FC2980" Ref="UBU24"  Part="1" 
F 0 "UBU24" H 6300 4691 50  0000 C CNN
F 1 "NOR04" H 6300 4600 50  0000 C CNN
F 2 "" H 6300 4350 50  0001 C CNN
F 3 "" H 6300 4350 50  0001 C CNN
	1    6300 4350
	1    0    0    -1  
$EndComp
$Comp
L A5C:NOR04 UBU?
U 1 1 61FC2986
P 6400 8750
AR Path="/5FD56F21/61FC2986" Ref="UBU?"  Part="1" 
AR Path="/621ABC04/61FC2986" Ref="UBU?"  Part="1" 
AR Path="/5FAC57E1/61FC2986" Ref="UBU?"  Part="1" 
AR Path="/61FB86DB/61FC2986" Ref="UBW107"  Part="1" 
AR Path="/5FBCE4A9/5FBD0B2C/61FC2986" Ref="UBW107"  Part="1" 
F 0 "UBW107" H 6400 9091 50  0000 C CNN
F 1 "NOR04" H 6400 9000 50  0000 C CNN
F 2 "" H 6400 8750 50  0001 C CNN
F 3 "" H 6400 8750 50  0001 C CNN
	1    6400 8750
	1    0    0    -1  
$EndComp
$Comp
L A5C:NOR05 UBR?
U 1 1 61FC298C
P 6300 9600
AR Path="/5FD56F21/61FC298C" Ref="UBR?"  Part="1" 
AR Path="/621ABC04/61FC298C" Ref="UBR?"  Part="1" 
AR Path="/5FAC57E1/61FC298C" Ref="UBR?"  Part="1" 
AR Path="/61FB86DB/61FC298C" Ref="UBW113"  Part="1" 
AR Path="/5FBCE4A9/5FBD0B2C/61FC298C" Ref="UBW113"  Part="1" 
F 0 "UBW113" H 6375 10011 50  0000 C CNN
F 1 "NOR05" H 6375 9920 50  0000 C CNN
F 2 "" H 6300 9650 50  0001 C CNN
F 3 "" H 6300 9650 50  0001 C CNN
	1    6300 9600
	1    0    0    -1  
$EndComp
$Comp
L A5C:M258C UCC?
U 1 1 61FC2992
P 3450 2800
AR Path="/5FAC57E1/61FC2992" Ref="UCC?"  Part="1" 
AR Path="/61FB86DB/61FC2992" Ref="UBW48"  Part="1" 
AR Path="/5FBCE4A9/5FBD0B2C/61FC2992" Ref="UBW48"  Part="1" 
F 0 "UBW48" H 3450 3665 50  0000 C CNN
F 1 "M258C" H 3450 3574 50  0000 C CNN
F 2 "" H 3450 2800 50  0001 C CNN
F 3 "" H 3450 2800 50  0001 C CNN
	1    3450 2800
	1    0    0    -1  
$EndComp
$Comp
L A5C:M258C UBU?
U 1 1 61FC2998
P 3450 8000
AR Path="/5FD56F21/61FC2998" Ref="UBU?"  Part="1" 
AR Path="/621ABC04/61FC2998" Ref="UBU?"  Part="1" 
AR Path="/5FAC57E1/61FC2998" Ref="UBU?"  Part="1" 
AR Path="/61FB86DB/61FC2998" Ref="UBU125"  Part="1" 
AR Path="/5FBCE4A9/5FBD0B2C/61FC2998" Ref="UBU125"  Part="1" 
F 0 "UBU125" H 3450 8861 50  0000 C CNN
F 1 "M258C" H 3450 8770 50  0000 C CNN
F 2 "" H 3450 8000 50  0001 C CNN
F 3 "" H 3450 8000 50  0001 C CNN
	1    3450 8000
	1    0    0    -1  
$EndComp
$EndSCHEMATC
