EESchema Schematic File Version 4
EELAYER 30 0
EELAYER END
$Descr A3 16535 11693
encoding utf-8
Sheet 59 69
Title ""
Date "2020-11-26"
Rev ""
Comp ""
Comment1 "Licence: CC-BY"
Comment2 "Author: Loïc *WydD* Petit"
Comment3 ""
Comment4 ""
$EndDescr
Connection ~ 1650 6150
Connection ~ 11750 1350
Connection ~ 10600 3150
Connection ~ 11050 2750
Connection ~ 3700 6750
Connection ~ 3800 6650
Connection ~ 11400 7250
Connection ~ 3600 7850
Connection ~ 3500 8750
Connection ~ 3400 9750
Connection ~ 2500 10150
Connection ~ 2500 9150
Connection ~ 2600 8950
Connection ~ 3600 8800
Connection ~ 3500 8900
Connection ~ 3700 7750
Connection ~ 3800 7650
Connection ~ 2500 8150
Connection ~ 3600 7750
Connection ~ 2600 7950
Connection ~ 3800 8600
Connection ~ 3700 8700
Connection ~ 10300 2750
Connection ~ 9500 2750
Connection ~ 9100 3150
Connection ~ 10250 3250
Connection ~ 9500 3250
Connection ~ 9850 3150
Connection ~ 2600 9950
Connection ~ 2600 3850
Connection ~ 2500 3950
Connection ~ 2600 2950
Connection ~ 1650 4050
Connection ~ 2400 4950
Connection ~ 2300 4250
Connection ~ 2500 4250
Connection ~ 2400 5100
Connection ~ 2500 4850
Connection ~ 2600 4750
Connection ~ 1650 4950
Connection ~ 2000 5150
Connection ~ 3650 2950
Connection ~ 5550 1500
Connection ~ 1650 5500
Connection ~ 8800 1350
Connection ~ 8700 2950
Connection ~ 2400 4750
Connection ~ 2500 3850
Connection ~ 3500 8350
Connection ~ 3600 7350
Connection ~ 3400 9350
Wire Wire Line
	950  1000 1150 1000
Wire Wire Line
	950  1250 1850 1250
Wire Wire Line
	1100 6150 1650 6150
Wire Wire Line
	1150 5150 2000 5150
Wire Wire Line
	1200 5500 1650 5500
Wire Wire Line
	1200 9950 2600 9950
Wire Wire Line
	1200 10150 2500 10150
Wire Wire Line
	1450 2350 1450 4750
Wire Wire Line
	1450 4750 1750 4750
Wire Wire Line
	1550 2450 3750 2450
Wire Wire Line
	1550 3850 1550 2450
Wire Wire Line
	1650 2550 1650 2950
Wire Wire Line
	1650 2950 1750 2950
Wire Wire Line
	1650 3150 1650 4050
Wire Wire Line
	1650 4050 1650 4950
Wire Wire Line
	1650 4050 1750 4050
Wire Wire Line
	1650 4950 1750 4950
Wire Wire Line
	1650 5500 1650 4950
Wire Wire Line
	1650 6150 1650 6800
Wire Wire Line
	1650 6150 3800 6150
Wire Wire Line
	1650 7250 4550 7250
Wire Wire Line
	1650 7800 1650 7250
Wire Wire Line
	1650 8250 4550 8250
Wire Wire Line
	1650 8800 1650 8250
Wire Wire Line
	1650 9250 4550 9250
Wire Wire Line
	1650 9800 1650 9250
Wire Wire Line
	1750 3150 1650 3150
Wire Wire Line
	1750 3850 1550 3850
Wire Wire Line
	1750 6350 1750 6700
Wire Wire Line
	1750 6350 3700 6350
Wire Wire Line
	1750 6700 1850 6700
Wire Wire Line
	1750 7350 1750 7700
Wire Wire Line
	1750 7700 1850 7700
Wire Wire Line
	1750 8350 1750 8700
Wire Wire Line
	1750 8700 1850 8700
Wire Wire Line
	1750 9350 1750 9700
Wire Wire Line
	1750 9700 1850 9700
Wire Wire Line
	1850 1100 2000 1100
Wire Wire Line
	1850 1250 1850 1100
Wire Wire Line
	1850 6800 1650 6800
Wire Wire Line
	1850 7800 1650 7800
Wire Wire Line
	1850 8800 1650 8800
Wire Wire Line
	1850 9800 1650 9800
Wire Wire Line
	2000 1000 1750 1000
Wire Wire Line
	2000 5150 2300 5150
Wire Wire Line
	2250 2950 2600 2950
Wire Wire Line
	2250 3850 2500 3850
Wire Wire Line
	2250 4750 2400 4750
Wire Wire Line
	2300 3350 2000 3350
Wire Wire Line
	2300 4250 2000 4250
Wire Wire Line
	2300 4250 2300 3350
Wire Wire Line
	2300 5150 2300 4250
Wire Wire Line
	2400 3050 2400 4750
Wire Wire Line
	2400 4750 2400 4950
Wire Wire Line
	2400 4950 2400 5100
Wire Wire Line
	2400 4950 3300 4950
Wire Wire Line
	2400 5100 2400 5200
Wire Wire Line
	2400 7750 2700 7750
Wire Wire Line
	2400 9750 2700 9750
Wire Wire Line
	2500 3050 2500 3850
Wire Wire Line
	2500 3850 2500 3950
Wire Wire Line
	2500 3950 2500 4250
Wire Wire Line
	2500 3950 3050 3950
Wire Wire Line
	2500 4250 2500 4850
Wire Wire Line
	2500 4250 3950 4250
Wire Wire Line
	2500 4850 2500 5200
Wire Wire Line
	2500 4850 2750 4850
Wire Wire Line
	2500 7150 2500 8150
Wire Wire Line
	2500 7150 2950 7150
Wire Wire Line
	2500 8150 2500 9150
Wire Wire Line
	2500 8150 2950 8150
Wire Wire Line
	2500 9150 2500 10150
Wire Wire Line
	2500 9150 2950 9150
Wire Wire Line
	2550 1050 2900 1050
Wire Wire Line
	2600 2950 2600 3850
Wire Wire Line
	2600 2950 3050 2950
Wire Wire Line
	2600 3850 2600 4750
Wire Wire Line
	2600 4750 2600 5200
Wire Wire Line
	2600 4750 2750 4750
Wire Wire Line
	2600 6950 2700 6950
Wire Wire Line
	2600 7950 2600 6950
Wire Wire Line
	2600 7950 2600 8950
Wire Wire Line
	2600 7950 2700 7950
Wire Wire Line
	2600 8950 2600 9950
Wire Wire Line
	2600 9950 2700 9950
Wire Wire Line
	2700 6750 2400 6750
Wire Wire Line
	2700 8750 2400 8750
Wire Wire Line
	2700 8950 2600 8950
Wire Wire Line
	2950 10150 2500 10150
Wire Wire Line
	3050 3850 2600 3850
Wire Wire Line
	3200 6750 3700 6750
Wire Wire Line
	3250 5500 1650 5500
Wire Wire Line
	3300 4800 3300 4850
Wire Wire Line
	3400 6650 3400 9350
Wire Wire Line
	3400 9350 1750 9350
Wire Wire Line
	3400 9350 3400 9750
Wire Wire Line
	3400 9750 3200 9750
Wire Wire Line
	3400 9750 3400 10000
Wire Wire Line
	3400 10000 3900 10000
Wire Wire Line
	3500 6650 3500 8350
Wire Wire Line
	3500 8350 1750 8350
Wire Wire Line
	3500 8750 3200 8750
Wire Wire Line
	3500 8750 3500 8350
Wire Wire Line
	3500 8900 3500 8750
Wire Wire Line
	3500 8900 3500 9900
Wire Wire Line
	3500 9900 3900 9900
Wire Wire Line
	3600 6650 3600 7350
Wire Wire Line
	3600 7350 1750 7350
Wire Wire Line
	3600 7350 3600 7750
Wire Wire Line
	3600 7750 3200 7750
Wire Wire Line
	3600 7750 3600 7850
Wire Wire Line
	3600 7850 3600 8800
Wire Wire Line
	3600 8800 3600 9800
Wire Wire Line
	3600 8800 3900 8800
Wire Wire Line
	3600 9800 3900 9800
Wire Wire Line
	3650 2550 1650 2550
Wire Wire Line
	3650 2950 3650 2550
Wire Wire Line
	3700 6350 3700 6750
Wire Wire Line
	3700 6750 3700 7750
Wire Wire Line
	3700 6750 3900 6750
Wire Wire Line
	3700 7750 3700 8700
Wire Wire Line
	3700 7750 3900 7750
Wire Wire Line
	3700 8700 3700 9700
Wire Wire Line
	3700 8700 3900 8700
Wire Wire Line
	3700 9700 3900 9700
Wire Wire Line
	3750 2450 3750 3900
Wire Wire Line
	3750 3900 3600 3900
Wire Wire Line
	3800 6150 3800 6650
Wire Wire Line
	3800 6650 3800 7650
Wire Wire Line
	3800 7650 3800 8600
Wire Wire Line
	3800 8600 3800 9600
Wire Wire Line
	3850 2350 1450 2350
Wire Wire Line
	3850 4900 3850 2350
Wire Wire Line
	3900 6650 3800 6650
Wire Wire Line
	3900 7650 3800 7650
Wire Wire Line
	3900 7850 3600 7850
Wire Wire Line
	3900 8600 3800 8600
Wire Wire Line
	3900 8900 3500 8900
Wire Wire Line
	3900 9600 3800 9600
Wire Wire Line
	4450 6700 4550 6700
Wire Wire Line
	4500 8750 4550 8750
Wire Wire Line
	4550 4250 4650 4250
Wire Wire Line
	4550 7250 4550 6700
Wire Wire Line
	4550 7750 4450 7750
Wire Wire Line
	4550 7750 4550 8250
Wire Wire Line
	4550 8750 4550 9250
Wire Wire Line
	4650 2950 3650 2950
Wire Wire Line
	4650 4150 4650 2950
Wire Wire Line
	4650 4350 4650 5100
Wire Wire Line
	4650 5100 2400 5100
Wire Wire Line
	4750 4450 4750 5500
Wire Wire Line
	4750 5500 3850 5500
Wire Wire Line
	4950 4650 5450 4650
Wire Wire Line
	5100 1500 5550 1500
Wire Wire Line
	5150 9800 5550 9800
Wire Wire Line
	5200 4450 4750 4450
Wire Wire Line
	5250 10000 5550 10000
Wire Wire Line
	5250 10200 5800 10200
Wire Wire Line
	5550 1150 5550 1500
Wire Wire Line
	5550 1150 5700 1150
Wire Wire Line
	5550 1500 5550 1950
Wire Wire Line
	5700 1050 5000 1050
Wire Wire Line
	5700 1850 5000 1850
Wire Wire Line
	5700 1950 5550 1950
Wire Wire Line
	5700 4250 6150 4250
Wire Wire Line
	6200 9600 6500 9600
Wire Wire Line
	6250 1100 7200 1100
Wire Wire Line
	6250 1900 6500 1900
Wire Wire Line
	6500 9800 6050 9800
Wire Wire Line
	7000 9600 7550 9600
Wire Wire Line
	7100 1900 7200 1900
Wire Wire Line
	8350 1350 8800 1350
Wire Wire Line
	8500 2750 8850 2750
Wire Wire Line
	8500 2950 8700 2950
Wire Wire Line
	8700 2950 8700 3250
Wire Wire Line
	8700 2950 8850 2950
Wire Wire Line
	8800 1350 8800 3150
Wire Wire Line
	9100 3150 8800 3150
Wire Wire Line
	9350 2750 9500 2750
Wire Wire Line
	9500 1750 9500 2750
Wire Wire Line
	9500 2750 9600 2750
Wire Wire Line
	9500 2950 9500 3250
Wire Wire Line
	9500 3250 8700 3250
Wire Wire Line
	9600 2950 9500 2950
Wire Wire Line
	9850 3150 9100 3150
Wire Wire Line
	10100 2750 10300 2750
Wire Wire Line
	10250 2950 10250 3250
Wire Wire Line
	10250 3250 9500 3250
Wire Wire Line
	10300 1850 10300 2750
Wire Wire Line
	10300 1850 12250 1850
Wire Wire Line
	10300 2750 10350 2750
Wire Wire Line
	10350 2950 10250 2950
Wire Wire Line
	10600 3150 9850 3150
Wire Wire Line
	10600 7250 11400 7250
Wire Wire Line
	10850 2750 11050 2750
Wire Wire Line
	11000 2950 11000 3250
Wire Wire Line
	11000 3250 10250 3250
Wire Wire Line
	11050 1350 8800 1350
Wire Wire Line
	11050 2750 11050 2250
Wire Wire Line
	11050 2750 11100 2750
Wire Wire Line
	11100 2950 11000 2950
Wire Wire Line
	11350 3150 10600 3150
Wire Wire Line
	11400 7250 11800 7250
Wire Wire Line
	11400 8150 11400 7250
Wire Wire Line
	11400 8150 11800 8150
Wire Wire Line
	11500 7350 11800 7350
Wire Wire Line
	11600 2750 11850 2750
Wire Wire Line
	11650 1350 11750 1350
Wire Wire Line
	11650 2250 11750 2250
Wire Wire Line
	11750 1350 11750 1650
Wire Wire Line
	11750 1650 12250 1650
Wire Wire Line
	11750 1950 12250 1950
Wire Wire Line
	11750 2250 11750 1950
Wire Wire Line
	11800 8250 11550 8250
Wire Wire Line
	11850 2050 11850 2750
Wire Wire Line
	11850 2050 12250 2050
Wire Wire Line
	12250 1750 10100 1750
Wire Wire Line
	13050 2050 13350 2050
Wire Wire Line
	13050 2250 13600 2250
Wire Wire Line
	13350 1850 13000 1850
Wire Wire Line
	13850 1850 14100 1850
Wire Wire Line
	14100 1350 11750 1350
Wire Wire Line
	14100 1350 14100 1650
Wire Wire Line
	14600 1650 15200 1650
Text Notes 1000 10900 0    100  ~ 0
Stage 3:\n- After that, inject 15 falling edge of PIN61 (CLK)\n- On the next CLK rising edge, the stage 3 will complete and stage 4 will also start
Text Notes 1050 1950 0    100  ~ 0
Stage 0: Unlock security\n- PIN43 LOW\n- PIN44 HIGH
Text Notes 3950 2900 0    50   ~ 0
D-flip flops constitutes a 3 bit counter\nUCS44 requires 4 to INput 1
Text Notes 4700 7850 0    50   ~ 0
4 bit binary counter with the carry signal coming from UCT38\nCounts 15 falling edges
Text Notes 4950 5450 0    100  ~ 0
Stage 1:\n- Inject 4 impulse on PIN42\n- On the 4th falling edge the stage 1 is complete
Text Notes 5750 9200 0    50   ~ 0
UCT42 latch keeps HIGH if stage 3 is complete\nEven if gargage is sent via CLK/DATA
Text Notes 9200 1200 0    50   ~ 0
4 bit shift register\nUCT27 opens if we have the key 1010 inside
Text Notes 10100 9050 0    100  ~ 0
Stage 4: Inject parameters\n- Use CLK/DATA pins to inject the 144 bits of keys\n- When you are done, relock the security using PIN42/43
Text Notes 11150 3900 0    100  ~ 0
Stage 2:\n- Inject 1>0>1 using PIN61 (CLK) and PIN62 (DATA)\n- Data is registered on the falling edge\n- After an additional rise edge, it completes the stage 2
Text Notes 13900 2300 0    50   ~ 0
UCT38 latch keeps HIGH if stage 2 is complete\nEven if gargage is sent via CLK/DATA
Text Label 1100 6150 0    50   ~ 0
STAGE2-Q
Text Label 1150 5150 0    50   ~ 0
~RESET
Text Label 1250 9950 0    50   ~ 0
~CLK
Text Label 1250 10150 0    50   ~ 0
~RESET
Text Label 2600 1050 0    50   ~ 0
~RESET
Text Label 4950 4650 0    50   ~ 0
~RESET
Text Label 5100 1500 0    50   ~ 0
~RESET
Text Label 5300 10000 0    50   ~ 0
CLK
Text Label 5300 10200 0    50   ~ 0
~RESET
Text Label 6100 4250 2    50   ~ 0
STAGE1-Q
Text Label 6300 1900 0    50   ~ 0
CLK
Text Label 6500 9600 2    50   ~ 0
STAGE-RESET
Text Label 7200 1100 2    50   ~ 0
DATA
Text Label 7200 1900 2    50   ~ 0
~CLK
Text Label 7500 9600 2    50   ~ 0
STAGE3-Q
Text Label 8500 2750 0    50   ~ 0
DATA
Text Label 8500 2950 0    50   ~ 0
~CLK
Text Label 8750 1350 2    50   ~ 0
STAGE1-Q
Text Label 11100 7250 2    50   ~ 0
STAGE3-Q
Text Label 11550 7350 0    50   ~ 0
CLK
Text Label 11750 8250 2    50   ~ 0
DATA
Text Label 11850 1350 0    50   ~ 0
STAGE-RESET
Text Label 13100 2050 0    50   ~ 0
CLK
Text Label 13100 2250 0    50   ~ 0
~RESET
Text Label 15050 1650 2    50   ~ 0
STAGE2-Q
Text HLabel 950  1000 0    50   Input ~ 0
~E1
Text HLabel 950  1250 0    50   Input ~ 0
E2
Text HLabel 1200 5500 0    50   Input ~ 0
S1-STROBE
Text HLabel 6150 4250 2    50   Output ~ 0
STAGE1-Q
Text HLabel 12350 7300 2    50   Output ~ 0
KEY-CLK
Text HLabel 12350 8200 2    50   Output ~ 0
KEY-DATA
$Comp
L A5C:XOR02 UCT2
U 1 1 5FDBF612
P 2100 6750
AR Path="/5F5F73C6/5FDBF612" Ref="UCT2"  Part="1" 
AR Path="/5FBF8EAD/5FBFA081/5FDBF612" Ref="UCT2"  Part="1" 
F 0 "UCT2" H 2100 7067 50  0000 C CNN
F 1 "XOR02" H 2100 6976 50  0000 C CNN
F 2 "" H 2100 6750 50  0001 C CNN
F 3 "" H 2100 6750 50  0001 C CNN
	1    2100 6750
	1    0    0    -1  
$EndComp
$Comp
L A5C:XNOR02 UCQ1
U 1 1 5FED9D74
P 2100 7750
AR Path="/5F5F73C6/5FED9D74" Ref="UCQ1"  Part="1" 
AR Path="/5FBF8EAD/5FBFA081/5FED9D74" Ref="UCQ1"  Part="1" 
F 0 "UCQ1" H 2100 8067 50  0000 C CNN
F 1 "XNOR02" H 2100 7976 50  0000 C CNN
F 2 "" H 2100 7750 50  0001 C CNN
F 3 "" H 2100 7750 50  0001 C CNN
	1    2100 7750
	1    0    0    -1  
$EndComp
$Comp
L A5C:XNOR02 UCS6
U 1 1 5FEDAB1A
P 2100 8750
AR Path="/5F5F73C6/5FEDAB1A" Ref="UCS6"  Part="1" 
AR Path="/5FBF8EAD/5FBFA081/5FEDAB1A" Ref="UCS6"  Part="1" 
F 0 "UCS6" H 2100 9067 50  0000 C CNN
F 1 "XNOR02" H 2100 8976 50  0000 C CNN
F 2 "" H 2100 8750 50  0001 C CNN
F 3 "" H 2100 8750 50  0001 C CNN
	1    2100 8750
	1    0    0    -1  
$EndComp
$Comp
L A5C:XNOR02 UCS18
U 1 1 5FEDAFC2
P 2100 9750
AR Path="/5F5F73C6/5FEDAFC2" Ref="UCS18"  Part="1" 
AR Path="/5FBF8EAD/5FBFA081/5FEDAFC2" Ref="UCS18"  Part="1" 
F 0 "UCS18" H 2100 10067 50  0000 C CNN
F 1 "XNOR02" H 2100 9976 50  0000 C CNN
F 2 "" H 2100 9750 50  0001 C CNN
F 3 "" H 2100 9750 50  0001 C CNN
	1    2100 9750
	1    0    0    -1  
$EndComp
$Comp
L A5C:AND02 UCQ32
U 1 1 5EB54C3B
P 2250 1050
AR Path="/5F5F73C6/5EB54C3B" Ref="UCQ32"  Part="1" 
AR Path="/5FBF8EAD/5FBFA081/5EB54C3B" Ref="UCQ32"  Part="1" 
F 0 "UCQ32" H 2275 1317 50  0000 C CNN
F 1 "AND02" H 2275 1226 50  0000 C CNN
F 2 "" H 2250 1050 50  0001 C CNN
F 3 "" H 2250 1050 50  0001 C CNN
	1    2250 1050
	1    0    0    -1  
$EndComp
$Comp
L A5C:NAND02 UCS50
U 1 1 5F3E6692
P 3000 4800
AR Path="/5F5F73C6/5F3E6692" Ref="UCS50"  Part="1" 
AR Path="/5FBF8EAD/5FBFA081/5F3E6692" Ref="UCS50"  Part="1" 
F 0 "UCS50" H 3025 5067 50  0000 C CNN
F 1 "NAND02" H 3025 4976 50  0000 C CNN
F 2 "" H 3000 4800 50  0001 C CNN
F 3 "" H 3000 4800 50  0001 C CNN
	1    3000 4800
	1    0    0    -1  
$EndComp
$Comp
L A5C:XOR02 UCS41
U 1 1 5F1AC0E7
P 3300 3900
AR Path="/5F5F73C6/5F1AC0E7" Ref="UCS41"  Part="1" 
AR Path="/5FBF8EAD/5FBFA081/5F1AC0E7" Ref="UCS41"  Part="1" 
F 0 "UCS41" H 3300 4217 50  0000 C CNN
F 1 "XOR02" H 3300 4126 50  0000 C CNN
F 2 "" H 3300 3900 50  0001 C CNN
F 3 "" H 3300 3900 50  0001 C CNN
	1    3300 3900
	1    0    0    -1  
$EndComp
$Comp
L A5C:XNOR02 UCS52
U 1 1 5F33ED78
P 3550 4900
AR Path="/5F5F73C6/5F33ED78" Ref="UCS52"  Part="1" 
AR Path="/5FBF8EAD/5FBFA081/5F33ED78" Ref="UCS52"  Part="1" 
F 0 "UCS52" H 3550 5217 50  0000 C CNN
F 1 "XNOR02" H 3550 5126 50  0000 C CNN
F 2 "" H 3550 4900 50  0001 C CNN
F 3 "" H 3550 4900 50  0001 C CNN
	1    3550 4900
	1    0    0    -1  
$EndComp
$Comp
L A5C:NAND02 UCS4
U 1 1 5FD7CBC2
P 4150 6700
AR Path="/5F5F73C6/5FD7CBC2" Ref="UCS4"  Part="1" 
AR Path="/5FBF8EAD/5FBFA081/5FD7CBC2" Ref="UCS4"  Part="1" 
F 0 "UCS4" H 4175 6967 50  0000 C CNN
F 1 "NAND02" H 4175 6876 50  0000 C CNN
F 2 "" H 4150 6700 50  0001 C CNN
F 3 "" H 4150 6700 50  0001 C CNN
	1    4150 6700
	1    0    0    -1  
$EndComp
$Comp
L A5C:AND02 UCQ25
U 1 1 5EB9CDDF
P 5950 1100
AR Path="/5F5F73C6/5EB9CDDF" Ref="UCQ25"  Part="1" 
AR Path="/5FBF8EAD/5FBFA081/5EB9CDDF" Ref="UCQ25"  Part="1" 
F 0 "UCQ25" H 5975 1367 50  0000 C CNN
F 1 "AND02" H 5975 1276 50  0000 C CNN
F 2 "" H 5950 1100 50  0001 C CNN
F 3 "" H 5950 1100 50  0001 C CNN
	1    5950 1100
	1    0    0    -1  
$EndComp
$Comp
L A5C:AND02 UCS21
U 1 1 5EB8EEFF
P 5950 1900
AR Path="/5F5F73C6/5EB8EEFF" Ref="UCS21"  Part="1" 
AR Path="/5FBF8EAD/5FBFA081/5EB8EEFF" Ref="UCS21"  Part="1" 
F 0 "UCS21" H 5975 2167 50  0000 C CNN
F 1 "AND02" H 5975 2076 50  0000 C CNN
F 2 "" H 5950 1900 50  0001 C CNN
F 3 "" H 5950 1900 50  0001 C CNN
	1    5950 1900
	1    0    0    -1  
$EndComp
$Comp
L A5C:AND02 UCS26
U 1 1 5EEB4CC9
P 12050 7300
AR Path="/5F5F73C6/5EEB4CC9" Ref="UCS26"  Part="1" 
AR Path="/5FBF8EAD/5FBFA081/5EEB4CC9" Ref="UCS26"  Part="1" 
F 0 "UCS26" H 12075 7567 50  0000 C CNN
F 1 "AND02" H 12075 7476 50  0000 C CNN
F 2 "" H 12050 7300 50  0001 C CNN
F 3 "" H 12050 7300 50  0001 C CNN
	1    12050 7300
	1    0    0    -1  
$EndComp
$Comp
L A5C:AND02 UCQ28
U 1 1 5EBAEDA9
P 12050 8200
AR Path="/5F5F73C6/5EBAEDA9" Ref="UCQ28"  Part="1" 
AR Path="/5FBF8EAD/5FBFA081/5EBAEDA9" Ref="UCQ28"  Part="1" 
F 0 "UCQ28" H 12075 8467 50  0000 C CNN
F 1 "AND02" H 12075 8376 50  0000 C CNN
F 2 "" H 12050 8200 50  0001 C CNN
F 3 "" H 12050 8200 50  0001 C CNN
	1    12050 8200
	1    0    0    -1  
$EndComp
$Comp
L A5C:NAND03 UCS1
U 1 1 5FD7C20F
P 4150 7750
AR Path="/5F5F73C6/5FD7C20F" Ref="UCS1"  Part="1" 
AR Path="/5FBF8EAD/5FBFA081/5FD7C20F" Ref="UCS1"  Part="1" 
F 0 "UCS1" H 4175 8042 50  0000 C CNN
F 1 "NAND03" H 4175 7951 50  0000 C CNN
F 2 "" H 4150 7750 50  0001 C CNN
F 3 "" H 4150 7750 50  0001 C CNN
	1    4150 7750
	1    0    0    -1  
$EndComp
$Comp
L A5C:AND03 UCS44
U 1 1 5F1B906D
P 4900 4250
AR Path="/5F5F73C6/5F1B906D" Ref="UCS44"  Part="1" 
AR Path="/5FBF8EAD/5FBFA081/5F1B906D" Ref="UCS44"  Part="1" 
F 0 "UCS44" H 4925 4542 50  0000 C CNN
F 1 "AND03" H 4925 4451 50  0000 C CNN
F 2 "" H 4900 4250 50  0001 C CNN
F 3 "" H 4900 4250 50  0001 C CNN
	1    4900 4250
	1    0    0    -1  
$EndComp
$Comp
L A5C:INV01 UCQ31
U 1 1 5EB3CEC0
P 1450 1000
AR Path="/5F5F73C6/5EB3CEC0" Ref="UCQ31"  Part="1" 
AR Path="/5FBF8EAD/5FBFA081/5EB3CEC0" Ref="UCQ31"  Part="1" 
F 0 "UCQ31" H 1450 1317 50  0000 C CNN
F 1 "INV01" H 1450 1226 50  0000 C CNN
F 2 "" H 1450 800 50  0001 C CNN
F 3 "" H 1450 800 50  0001 C CNN
	1    1450 1000
	1    0    0    -1  
$EndComp
$Comp
L A5C:INV01 UCS39
U 1 1 5F101AF4
P 3350 2950
AR Path="/5F5F73C6/5F101AF4" Ref="UCS39"  Part="1" 
AR Path="/5FBF8EAD/5FBFA081/5F101AF4" Ref="UCS39"  Part="1" 
F 0 "UCS39" H 3350 3267 50  0000 C CNN
F 1 "INV01" H 3350 3176 50  0000 C CNN
F 2 "" H 3350 2750 50  0001 C CNN
F 3 "" H 3350 2750 50  0001 C CNN
	1    3350 2950
	1    0    0    -1  
$EndComp
$Comp
L A5C:INV01 UCQ36
U 1 1 5EB1815A
P 3550 5500
AR Path="/5F5F73C6/5EB1815A" Ref="UCQ36"  Part="1" 
AR Path="/5FBF8EAD/5FBFA081/5EB1815A" Ref="UCQ36"  Part="1" 
F 0 "UCQ36" H 3550 5817 50  0000 C CNN
F 1 "INV01" H 3550 5726 50  0000 C CNN
F 2 "" H 3550 5300 50  0001 C CNN
F 3 "" H 3550 5300 50  0001 C CNN
	1    3550 5500
	1    0    0    -1  
$EndComp
$Comp
L A5C:INV01 UCS48
U 1 1 5F1DA88F
P 4250 4250
AR Path="/5F5F73C6/5F1DA88F" Ref="UCS48"  Part="1" 
AR Path="/5FBF8EAD/5FBFA081/5F1DA88F" Ref="UCS48"  Part="1" 
F 0 "UCS48" H 4250 4567 50  0000 C CNN
F 1 "INV01" H 4250 4476 50  0000 C CNN
F 2 "" H 4250 4050 50  0001 C CNN
F 3 "" H 4250 4050 50  0001 C CNN
	1    4250 4250
	1    0    0    -1  
$EndComp
$Comp
L A5C:INV01 UCS29
U 1 1 60CE6A05
P 4850 9800
AR Path="/5F5F73C6/60CE6A05" Ref="UCS29"  Part="1" 
AR Path="/5FBF8EAD/5FBFA081/60CE6A05" Ref="UCS29"  Part="1" 
F 0 "UCS29" H 4850 10117 50  0000 C CNN
F 1 "INV01" H 4850 10026 50  0000 C CNN
F 2 "" H 4850 9600 50  0001 C CNN
F 3 "" H 4850 9600 50  0001 C CNN
	1    4850 9800
	1    0    0    -1  
$EndComp
$Comp
L A5C:INV01 UCS16
U 1 1 5EBC8070
P 6800 1900
AR Path="/5F5F73C6/5EBC8070" Ref="UCS16"  Part="1" 
AR Path="/5FBF8EAD/5FBFA081/5EBC8070" Ref="UCS16"  Part="1" 
F 0 "UCS16" H 6800 2217 50  0000 C CNN
F 1 "INV01" H 6800 2126 50  0000 C CNN
F 2 "" H 6800 1700 50  0001 C CNN
F 3 "" H 6800 1700 50  0001 C CNN
	1    6800 1900
	1    0    0    -1  
$EndComp
$Comp
L A5C:INV01 UCT0
U 1 1 5ED59B1A
P 9800 1750
AR Path="/5F5F73C6/5ED59B1A" Ref="UCT0"  Part="1" 
AR Path="/5FBF8EAD/5FBFA081/5ED59B1A" Ref="UCT0"  Part="1" 
F 0 "UCT0" H 9800 2067 50  0000 C CNN
F 1 "INV01" H 9800 1976 50  0000 C CNN
F 2 "" H 9800 1550 50  0001 C CNN
F 3 "" H 9800 1550 50  0001 C CNN
	1    9800 1750
	1    0    0    -1  
$EndComp
$Comp
L A5C:INV01 UCT45
U 1 1 5EDED33D
P 11350 1350
AR Path="/5F5F73C6/5EDED33D" Ref="UCT45"  Part="1" 
AR Path="/5FBF8EAD/5FBFA081/5EDED33D" Ref="UCT45"  Part="1" 
F 0 "UCT45" H 11350 1667 50  0000 C CNN
F 1 "INV01" H 11350 1576 50  0000 C CNN
F 2 "" H 11350 1150 50  0001 C CNN
F 3 "" H 11350 1150 50  0001 C CNN
	1    11350 1350
	1    0    0    -1  
$EndComp
$Comp
L A5C:INV01 UCS24
U 1 1 5ED60EFC
P 11350 2250
AR Path="/5F5F73C6/5ED60EFC" Ref="UCS24"  Part="1" 
AR Path="/5FBF8EAD/5FBFA081/5ED60EFC" Ref="UCS24"  Part="1" 
F 0 "UCS24" H 11350 2567 50  0000 C CNN
F 1 "INV01" H 11350 2476 50  0000 C CNN
F 2 "" H 11350 2050 50  0001 C CNN
F 3 "" H 11350 2050 50  0001 C CNN
	1    11350 2250
	1    0    0    -1  
$EndComp
$Comp
L A5C:RSLT UCT42
U 1 1 5EE3489A
P 6750 9700
AR Path="/5F5F73C6/5EE3489A" Ref="UCT42"  Part="1" 
AR Path="/5FBF8EAD/5FBFA081/5EE3489A" Ref="UCT42"  Part="1" 
F 0 "UCT42" H 6750 10065 50  0000 C CNN
F 1 "RSLT" H 6750 9974 50  0000 C CNN
F 2 "" H 6750 9700 50  0001 C CNN
F 3 "" H 6750 9700 50  0001 C CNN
	1    6750 9700
	1    0    0    -1  
$EndComp
$Comp
L A5C:RSLT UCT38
U 1 1 5EE44F06
P 14350 1750
AR Path="/5F5F73C6/5EE44F06" Ref="UCT38"  Part="1" 
AR Path="/5FBF8EAD/5FBFA081/5EE44F06" Ref="UCT38"  Part="1" 
F 0 "UCT38" H 14350 2115 50  0000 C CNN
F 1 "RSLT" H 14350 2024 50  0000 C CNN
F 2 "" H 14350 1750 50  0001 C CNN
F 3 "" H 14350 1750 50  0001 C CNN
	1    14350 1750
	1    0    0    -1  
$EndComp
$Comp
L A5C:NAND04 UCS9
U 1 1 5FD51E94
P 4200 8750
AR Path="/5F5F73C6/5FD51E94" Ref="UCS9"  Part="1" 
AR Path="/5FBF8EAD/5FBFA081/5FD51E94" Ref="UCS9"  Part="1" 
F 0 "UCS9" H 4200 9092 50  0000 C CNN
F 1 "NAND04" H 4200 9001 50  0000 C CNN
F 2 "" H 4200 8500 50  0001 C CNN
F 3 "" H 4200 8500 50  0001 C CNN
	1    4200 8750
	1    0    0    -1  
$EndComp
$Comp
L A5C:DFFCOR UCQ40
U 1 1 5EAF6B01
P 2000 3050
AR Path="/5F5F73C6/5EAF6B01" Ref="UCQ40"  Part="1" 
AR Path="/5FBF8EAD/5FBFA081/5EAF6B01" Ref="UCQ40"  Part="1" 
F 0 "UCQ40" H 2000 3415 50  0000 C CNN
F 1 "DFFCOR" H 2000 3324 50  0000 C CNN
F 2 "" H 2000 3050 50  0001 C CNN
F 3 "" H 2000 3050 50  0001 C CNN
F 4 "UCQ38;UCQ53" H 2000 3050 50  0001 C CNN "MiscRef"
	1    2000 3050
	1    0    0    -1  
$EndComp
$Comp
L A5C:DFFCOR UCQ44
U 1 1 5EAF9E3E
P 2000 3950
AR Path="/5F5F73C6/5EAF9E3E" Ref="UCQ44"  Part="1" 
AR Path="/5FBF8EAD/5FBFA081/5EAF9E3E" Ref="UCQ44"  Part="1" 
F 0 "UCQ44" H 2000 4315 50  0000 C CNN
F 1 "DFFCOR" H 2000 4224 50  0000 C CNN
F 2 "" H 2000 3950 50  0001 C CNN
F 3 "" H 2000 3950 50  0001 C CNN
	1    2000 3950
	1    0    0    -1  
$EndComp
$Comp
L A5C:DFFCOR UCQ48
U 1 1 5EAFA423
P 2000 4850
AR Path="/5F5F73C6/5EAFA423" Ref="UCQ48"  Part="1" 
AR Path="/5FBF8EAD/5FBFA081/5EAFA423" Ref="UCQ48"  Part="1" 
F 0 "UCQ48" H 2000 5215 50  0000 C CNN
F 1 "DFFCOR" H 2000 5124 50  0000 C CNN
F 2 "" H 2000 4850 50  0001 C CNN
F 3 "" H 2000 4850 50  0001 C CNN
	1    2000 4850
	1    0    0    -1  
$EndComp
$Comp
L A5C:DFFCOR UCQ6
U 1 1 5FE6AA95
P 2950 6850
AR Path="/5F5F73C6/5FE6AA95" Ref="UCQ6"  Part="1" 
AR Path="/5FBF8EAD/5FBFA081/5FE6AA95" Ref="UCQ6"  Part="1" 
F 0 "UCQ6" H 2950 7215 50  0000 C CNN
F 1 "DFFCOR" H 2950 7124 50  0000 C CNN
F 2 "" H 2950 6850 50  0001 C CNN
F 3 "" H 2950 6850 50  0001 C CNN
F 4 "UCQ4;UCQ24" H 2950 6850 50  0001 C CNN "MiscRef"
	1    2950 6850
	1    0    0    -1  
$EndComp
$Comp
L A5C:DFFCOR UCQ10
U 1 1 5FE6AA9B
P 2950 7850
AR Path="/5F5F73C6/5FE6AA9B" Ref="UCQ10"  Part="1" 
AR Path="/5FBF8EAD/5FBFA081/5FE6AA9B" Ref="UCQ10"  Part="1" 
F 0 "UCQ10" H 2950 8215 50  0000 C CNN
F 1 "DFFCOR" H 2950 8124 50  0000 C CNN
F 2 "" H 2950 7850 50  0001 C CNN
F 3 "" H 2950 7850 50  0001 C CNN
	1    2950 7850
	1    0    0    -1  
$EndComp
$Comp
L A5C:DFFCOR UCQ15
U 1 1 5FE6AAA1
P 2950 8850
AR Path="/5F5F73C6/5FE6AAA1" Ref="UCQ15"  Part="1" 
AR Path="/5FBF8EAD/5FBFA081/5FE6AAA1" Ref="UCQ15"  Part="1" 
F 0 "UCQ15" H 2950 9215 50  0000 C CNN
F 1 "DFFCOR" H 2950 9124 50  0000 C CNN
F 2 "" H 2950 8850 50  0001 C CNN
F 3 "" H 2950 8850 50  0001 C CNN
	1    2950 8850
	1    0    0    -1  
$EndComp
$Comp
L A5C:DFFCOR UCQ19
U 1 1 5FE6AAA7
P 2950 9850
AR Path="/5F5F73C6/5FE6AAA7" Ref="UCQ19"  Part="1" 
AR Path="/5FBF8EAD/5FBFA081/5FE6AAA7" Ref="UCQ19"  Part="1" 
F 0 "UCQ19" H 2950 10215 50  0000 C CNN
F 1 "DFFCOR" H 2950 10124 50  0000 C CNN
F 2 "" H 2950 9850 50  0001 C CNN
F 3 "" H 2950 9850 50  0001 C CNN
	1    2950 9850
	1    0    0    -1  
$EndComp
$Comp
L A5C:DFFCOR UCT48
U 1 1 5EB1C902
P 5450 4350
AR Path="/5F5F73C6/5EB1C902" Ref="UCT48"  Part="1" 
AR Path="/5FBF8EAD/5FBFA081/5EB1C902" Ref="UCT48"  Part="1" 
F 0 "UCT48" H 5450 4715 50  0000 C CNN
F 1 "DFFCOR" H 5450 4624 50  0000 C CNN
F 2 "" H 5450 4350 50  0001 C CNN
F 3 "" H 5450 4350 50  0001 C CNN
F 4 "UCT47;UCT53" H 5450 4350 50  0001 C CNN "MiscRef"
	1    5450 4350
	1    0    0    -1  
$EndComp
$Comp
L A5C:DFFCOR UCS32
U 1 1 5EE98EF0
P 5800 9900
AR Path="/5F5F73C6/5EE98EF0" Ref="UCS32"  Part="1" 
AR Path="/5FBF8EAD/5FBFA081/5EE98EF0" Ref="UCS32"  Part="1" 
F 0 "UCS32" H 5800 10265 50  0000 C CNN
F 1 "DFFCOR" H 5800 10174 50  0000 C CNN
F 2 "" H 5800 9900 50  0001 C CNN
F 3 "" H 5800 9900 50  0001 C CNN
F 4 "UCS31;UCS37" H 5800 9900 50  0001 C CNN "MiscRef"
	1    5800 9900
	1    0    0    -1  
$EndComp
$Comp
L A5C:DFFCOR UCT7
U 1 1 5EBBD769
P 9100 2850
AR Path="/5F5F73C6/5EBBD769" Ref="UCT7"  Part="1" 
AR Path="/5FBF8EAD/5FBFA081/5EBBD769" Ref="UCT7"  Part="1" 
F 0 "UCT7" H 9100 3215 50  0000 C CNN
F 1 "DFFCOR" H 9100 3124 50  0000 C CNN
F 2 "" H 9100 2850 50  0001 C CNN
F 3 "" H 9100 2850 50  0001 C CNN
F 4 "UCT6;UCT25" H 9100 2850 50  0001 C CNN "MiscRef"
	1    9100 2850
	1    0    0    -1  
$EndComp
$Comp
L A5C:DFFCOR UCT12
U 1 1 5EBD7E59
P 9850 2850
AR Path="/5F5F73C6/5EBD7E59" Ref="UCT12"  Part="1" 
AR Path="/5FBF8EAD/5FBFA081/5EBD7E59" Ref="UCT12"  Part="1" 
F 0 "UCT12" H 9850 3215 50  0000 C CNN
F 1 "DFFCOR" H 9850 3124 50  0000 C CNN
F 2 "" H 9850 2850 50  0001 C CNN
F 3 "" H 9850 2850 50  0001 C CNN
	1    9850 2850
	1    0    0    -1  
$EndComp
$Comp
L A5C:DFFCOR UCT16
U 1 1 5EBD8465
P 10600 2850
AR Path="/5F5F73C6/5EBD8465" Ref="UCT16"  Part="1" 
AR Path="/5FBF8EAD/5FBFA081/5EBD8465" Ref="UCT16"  Part="1" 
F 0 "UCT16" H 10600 3215 50  0000 C CNN
F 1 "DFFCOR" H 10600 3124 50  0000 C CNN
F 2 "" H 10600 2850 50  0001 C CNN
F 3 "" H 10600 2850 50  0001 C CNN
	1    10600 2850
	1    0    0    -1  
$EndComp
$Comp
L A5C:DFFCOR UCT21
U 1 1 5EBD8865
P 11350 2850
AR Path="/5F5F73C6/5EBD8865" Ref="UCT21"  Part="1" 
AR Path="/5FBF8EAD/5FBFA081/5EBD8865" Ref="UCT21"  Part="1" 
F 0 "UCT21" H 11350 3215 50  0000 C CNN
F 1 "DFFCOR" H 11350 3124 50  0000 C CNN
F 2 "" H 11350 2850 50  0001 C CNN
F 3 "" H 11350 2850 50  0001 C CNN
	1    11350 2850
	1    0    0    -1  
$EndComp
$Comp
L A5C:DFFCOR UCT32
U 1 1 5EE1B2F2
P 13600 1950
AR Path="/5F5F73C6/5EE1B2F2" Ref="UCT32"  Part="1" 
AR Path="/5FBF8EAD/5FBFA081/5EE1B2F2" Ref="UCT32"  Part="1" 
F 0 "UCT32" H 13600 2315 50  0000 C CNN
F 1 "DFFCOR" H 13600 2224 50  0000 C CNN
F 2 "" H 13600 1950 50  0001 C CNN
F 3 "" H 13600 1950 50  0001 C CNN
F 4 "UCT31;UCT37" H 13600 1950 50  0001 C CNN "MiscRef"
	1    13600 1950
	1    0    0    -1  
$EndComp
$Comp
L A5C:NAND05 UCS12
U 1 1 5FD61C7F
P 4200 9800
AR Path="/5F5F73C6/5FD61C7F" Ref="UCS12"  Part="1" 
AR Path="/5FBF8EAD/5FBFA081/5FD61C7F" Ref="UCS12"  Part="1" 
F 0 "UCS12" H 4225 10190 50  0000 C CNN
F 1 "NAND05" H 4225 10099 50  0000 C CNN
F 2 "" H 4200 9500 50  0001 C CNN
F 3 "" H 4200 9500 50  0001 C CNN
	1    4200 9800
	1    0    0    -1  
$EndComp
$Comp
L A5C:NOR05 UCT27
U 1 1 5ED6E1E0
P 12550 1850
AR Path="/5F5F73C6/5ED6E1E0" Ref="UCT27"  Part="1" 
AR Path="/5FBF8EAD/5FBFA081/5ED6E1E0" Ref="UCT27"  Part="1" 
F 0 "UCT27" H 12625 2265 50  0000 C CNN
F 1 "NOR05" H 12625 2174 50  0000 C CNN
F 2 "" H 12550 1900 50  0001 C CNN
F 3 "" H 12550 1900 50  0001 C CNN
	1    12550 1850
	1    0    0    -1  
$EndComp
Text HLabel 5000 1050 0    50   Input ~ 0
SEC-DATA
Text HLabel 5000 1850 0    50   Input ~ 0
SEC-CLK
NoConn ~ 13850 1950
NoConn ~ 9350 2850
NoConn ~ 10100 2850
NoConn ~ 10850 2850
NoConn ~ 11600 2850
NoConn ~ 2250 3050
NoConn ~ 2250 3950
NoConn ~ 2250 4850
NoConn ~ 5700 4350
NoConn ~ 3200 6850
NoConn ~ 3200 7850
NoConn ~ 3200 8850
NoConn ~ 3200 9850
NoConn ~ 6050 9900
$EndSCHEMATC
