EESchema Schematic File Version 4
EELAYER 30 0
EELAYER END
$Descr A3 16535 11693
encoding utf-8
Sheet 76 83
Title "CPS Reverse Engineering: DL-0311"
Date "2021-09-12"
Rev ""
Comp ""
Comment1 ""
Comment2 ""
Comment3 "Licence: CC-BY"
Comment4 "Author: Loïc *WydD* Petit"
$EndDescr
Connection ~ 10150 10300
Connection ~ 10150 8450
Connection ~ 10150 3500
Connection ~ 10150 6900
Connection ~ 10150 5050
Connection ~ 10150 1650
Connection ~ 4550 5900
Connection ~ 4650 6200
Connection ~ 4450 6000
Connection ~ 4450 9400
Connection ~ 4450 2600
Connection ~ 6150 6250
Connection ~ 6150 9650
Connection ~ 9450 3600
Connection ~ 9450 5250
Connection ~ 9450 7000
Connection ~ 9450 8650
Connection ~ 9450 10400
Connection ~ 6150 10850
Connection ~ 1900 9350
Connection ~ 4100 6000
Connection ~ 4200 6550
Connection ~ 4200 9950
Connection ~ 4100 9400
Connection ~ 4550 8800
Connection ~ 4650 9050
Connection ~ 3250 8800
Connection ~ 3300 9900
NoConn ~ 6750 9450
NoConn ~ 10050 10200
NoConn ~ 10050 6800
NoConn ~ 10050 3400
NoConn ~ 6750 2650
NoConn ~ 6750 6050
NoConn ~ 10050 1750
NoConn ~ 10050 5150
NoConn ~ 10050 8550
Entry Wire Line
	1750 2250 1850 2350
Entry Wire Line
	1750 2350 1850 2450
Entry Wire Line
	1750 2450 1850 2550
Entry Wire Line
	1750 2550 1850 2650
Entry Wire Line
	1750 2650 1850 2750
Entry Wire Line
	1750 2750 1850 2850
Entry Wire Line
	10750 3500 10850 3400
Entry Wire Line
	10750 6900 10850 6800
Entry Wire Line
	10750 10300 10850 10200
Entry Wire Line
	11000 1650 11100 1550
Entry Wire Line
	11000 5050 11100 4950
Entry Wire Line
	11000 8450 11100 8350
Wire Wire Line
	1800 9350 1900 9350
Wire Wire Line
	1850 2350 2450 2350
Wire Wire Line
	1850 2450 2450 2450
Wire Wire Line
	1850 2550 2450 2550
Wire Wire Line
	1850 2650 2450 2650
Wire Wire Line
	1850 2750 2450 2750
Wire Wire Line
	1850 2850 2450 2850
Wire Wire Line
	1900 9350 3300 9350
Wire Wire Line
	1900 10400 1900 9350
Wire Wire Line
	2700 10400 1900 10400
Wire Wire Line
	3250 8800 3150 8800
Wire Wire Line
	3250 9050 3250 8800
Wire Wire Line
	3250 9050 4650 9050
Wire Wire Line
	3300 9450 3300 9900
Wire Wire Line
	3300 10000 3300 10400
Wire Wire Line
	3850 8800 4550 8800
Wire Wire Line
	3850 9400 4100 9400
Wire Wire Line
	3850 9950 4200 9950
Wire Wire Line
	4100 2600 4100 6000
Wire Wire Line
	4100 6000 4100 9400
Wire Wire Line
	4100 9400 4450 9400
Wire Wire Line
	4200 3150 8400 3150
Wire Wire Line
	4200 6550 4200 3150
Wire Wire Line
	4200 6550 4200 9950
Wire Wire Line
	4200 6550 8400 6550
Wire Wire Line
	4200 9950 8400 9950
Wire Wire Line
	4450 2600 4100 2600
Wire Wire Line
	4450 2600 5150 2600
Wire Wire Line
	4450 2900 4450 2600
Wire Wire Line
	4450 2900 5150 2900
Wire Wire Line
	4450 6000 4100 6000
Wire Wire Line
	4450 6000 5150 6000
Wire Wire Line
	4450 6300 4450 6000
Wire Wire Line
	4450 6300 5150 6300
Wire Wire Line
	4450 9400 5150 9400
Wire Wire Line
	4450 9700 4450 9400
Wire Wire Line
	4450 9700 5150 9700
Wire Wire Line
	4550 2500 4550 5900
Wire Wire Line
	4550 2500 5150 2500
Wire Wire Line
	4550 5900 4550 8800
Wire Wire Line
	4550 5900 5150 5900
Wire Wire Line
	4550 8800 4550 9300
Wire Wire Line
	4550 9300 5150 9300
Wire Wire Line
	4650 2800 4650 6200
Wire Wire Line
	4650 2800 5150 2800
Wire Wire Line
	4650 6200 4650 9050
Wire Wire Line
	4650 6200 5150 6200
Wire Wire Line
	4650 9050 4650 9600
Wire Wire Line
	4650 9600 5150 9600
Wire Wire Line
	6050 10850 6150 10850
Wire Wire Line
	6150 2850 6250 2850
Wire Wire Line
	6150 6250 6150 2850
Wire Wire Line
	6150 9650 6150 6250
Wire Wire Line
	6150 10850 6150 9650
Wire Wire Line
	6250 2650 6050 2650
Wire Wire Line
	6250 6050 6050 6050
Wire Wire Line
	6250 6250 6150 6250
Wire Wire Line
	6250 9450 6050 9450
Wire Wire Line
	6250 9650 6150 9650
Wire Wire Line
	6750 2750 7400 2750
Wire Wire Line
	6750 6150 7400 6150
Wire Wire Line
	6750 9550 7400 9550
Wire Wire Line
	7400 3050 7400 2750
Wire Wire Line
	7400 6450 7400 6150
Wire Wire Line
	7400 9850 7400 9550
Wire Wire Line
	7600 2600 7700 2600
Wire Wire Line
	7600 2750 7600 2600
Wire Wire Line
	7600 6000 7700 6000
Wire Wire Line
	7600 6150 7600 6000
Wire Wire Line
	7600 9400 7700 9400
Wire Wire Line
	7600 9550 7600 9400
Wire Wire Line
	8250 750  8450 750 
Wire Wire Line
	8250 1650 8650 1650
Wire Wire Line
	8250 2550 8450 2550
Wire Wire Line
	8250 4150 8450 4150
Wire Wire Line
	8250 5050 8650 5050
Wire Wire Line
	8250 5950 8450 5950
Wire Wire Line
	8250 7550 8450 7550
Wire Wire Line
	8250 8450 8650 8450
Wire Wire Line
	8250 9350 8450 9350
Wire Wire Line
	8300 3650 8300 3900
Wire Wire Line
	8300 3900 10150 3900
Wire Wire Line
	8300 7050 8300 7300
Wire Wire Line
	8300 7300 10150 7300
Wire Wire Line
	8300 10450 8300 10700
Wire Wire Line
	8300 10700 10150 10700
Wire Wire Line
	8350 1200 8250 1200
Wire Wire Line
	8350 1550 8350 1200
Wire Wire Line
	8350 1750 8350 2100
Wire Wire Line
	8350 2100 8250 2100
Wire Wire Line
	8350 4600 8250 4600
Wire Wire Line
	8350 4950 8350 4600
Wire Wire Line
	8350 5150 8350 5500
Wire Wire Line
	8350 5500 8250 5500
Wire Wire Line
	8350 8000 8250 8000
Wire Wire Line
	8350 8350 8350 8000
Wire Wire Line
	8350 8550 8350 8900
Wire Wire Line
	8350 8900 8250 8900
Wire Wire Line
	8400 3050 7400 3050
Wire Wire Line
	8400 3650 8300 3650
Wire Wire Line
	8400 3750 7800 3750
Wire Wire Line
	8400 6450 7400 6450
Wire Wire Line
	8400 7050 8300 7050
Wire Wire Line
	8400 7150 7800 7150
Wire Wire Line
	8400 9850 7400 9850
Wire Wire Line
	8400 10450 8300 10450
Wire Wire Line
	8400 10550 7800 10550
Wire Wire Line
	8450 750  8450 1450
Wire Wire Line
	8450 1450 8650 1450
Wire Wire Line
	8450 1850 8650 1850
Wire Wire Line
	8450 2550 8450 1850
Wire Wire Line
	8450 4150 8450 4850
Wire Wire Line
	8450 4850 8650 4850
Wire Wire Line
	8450 5250 8650 5250
Wire Wire Line
	8450 5950 8450 5250
Wire Wire Line
	8450 7550 8450 8250
Wire Wire Line
	8450 8250 8650 8250
Wire Wire Line
	8450 8650 8650 8650
Wire Wire Line
	8450 9350 8450 8650
Wire Wire Line
	8650 1550 8350 1550
Wire Wire Line
	8650 1750 8350 1750
Wire Wire Line
	8650 4950 8350 4950
Wire Wire Line
	8650 5150 8350 5150
Wire Wire Line
	8650 8350 8350 8350
Wire Wire Line
	8650 8550 8350 8550
Wire Wire Line
	9300 1650 9550 1650
Wire Wire Line
	9300 3400 9550 3400
Wire Wire Line
	9300 5050 9550 5050
Wire Wire Line
	9300 6800 9550 6800
Wire Wire Line
	9300 8450 9550 8450
Wire Wire Line
	9300 10200 9550 10200
Wire Wire Line
	9450 1850 9450 3600
Wire Wire Line
	9450 3600 9450 5250
Wire Wire Line
	9450 3600 9550 3600
Wire Wire Line
	9450 5250 9450 7000
Wire Wire Line
	9450 7000 9450 8650
Wire Wire Line
	9450 8650 9450 10400
Wire Wire Line
	9450 10400 9450 10850
Wire Wire Line
	9450 10850 6150 10850
Wire Wire Line
	9550 1850 9450 1850
Wire Wire Line
	9550 5250 9450 5250
Wire Wire Line
	9550 7000 9450 7000
Wire Wire Line
	9550 8650 9450 8650
Wire Wire Line
	9550 10400 9450 10400
Wire Wire Line
	10050 3500 10150 3500
Wire Wire Line
	10050 6900 10150 6900
Wire Wire Line
	10050 8450 10150 8450
Wire Wire Line
	10050 10300 10150 10300
Wire Wire Line
	10150 1650 10050 1650
Wire Wire Line
	10150 1650 10150 2750
Wire Wire Line
	10150 1650 11000 1650
Wire Wire Line
	10150 2750 7600 2750
Wire Wire Line
	10150 3500 10150 3900
Wire Wire Line
	10150 3500 10750 3500
Wire Wire Line
	10150 5050 10050 5050
Wire Wire Line
	10150 5050 10150 6150
Wire Wire Line
	10150 5050 11000 5050
Wire Wire Line
	10150 6150 7600 6150
Wire Wire Line
	10150 6900 10150 7300
Wire Wire Line
	10150 6900 10750 6900
Wire Wire Line
	10150 8450 10150 9550
Wire Wire Line
	10150 8450 11000 8450
Wire Wire Line
	10150 9550 7600 9550
Wire Wire Line
	10150 10300 10150 10700
Wire Wire Line
	10150 10300 10750 10300
Wire Bus Line
	1750 2150 1650 2150
Wire Bus Line
	10850 1050 11300 1050
Wire Bus Line
	11100 1200 11300 1200
Text Notes 10250 1550 0    50   ~ 0
GFX-CHNL
Text Notes 10250 3400 0    50   ~ 0
~GFX-CHNL
Text Notes 10250 4950 0    50   ~ 0
GFX-CHNL
Text Notes 10250 6800 0    50   ~ 0
~GFX-CHNL
Text Notes 10250 8350 0    50   ~ 0
GFX-CHNL
Text Notes 10250 10200 0    50   ~ 0
~GFX-CHNL
Text Label 1900 2350 0    50   ~ 0
GFX-ADDR13
Text Label 1900 2450 0    50   ~ 0
GFX-ADDR14
Text Label 1900 2550 0    50   ~ 0
GFX-ADDR15
Text Label 1900 2650 0    50   ~ 0
GFX-ADDR16
Text Label 1900 2750 0    50   ~ 0
GFX-ADDR17
Text Label 1900 2850 0    50   ~ 0
GFX-ADDR18
Text Label 5150 2400 2    50   ~ 0
GFX-ADDR18
Text Label 5150 2700 2    50   ~ 0
GFX-ADDR16
Text Label 5150 5800 2    50   ~ 0
GFX-ADDR17
Text Label 5150 6100 2    50   ~ 0
GFX-ADDR15
Text Label 5150 9200 2    50   ~ 0
GFX-ADDR16
Text Label 5150 9500 2    50   ~ 0
GFX-ADDR14
Text Label 7700 700  2    50   ~ 0
GFX-ADDR18
Text Label 7700 1150 2    50   ~ 0
GFX-ADDR17
Text Label 7700 1600 2    50   ~ 0
GFX-ADDR16
Text Label 7700 2050 2    50   ~ 0
GFX-ADDR15
Text Label 7700 2500 2    50   ~ 0
~GFX-CHNL
Text Label 7700 4100 2    50   ~ 0
GFX-ADDR17
Text Label 7700 4200 2    50   ~ 0
SCROLL1.GFX-CHNL
Text Label 7700 4550 2    50   ~ 0
GFX-ADDR16
Text Label 7700 4650 2    50   ~ 0
ELSE.GFX-CHNL
Text Label 7700 5000 2    50   ~ 0
GFX-ADDR15
Text Label 7700 5100 2    50   ~ 0
STARS.GFX-CHNL
Text Label 7700 5450 2    50   ~ 0
GFX-ADDR14
Text Label 7700 5550 2    50   ~ 0
SCROLL3.GFX-CHNL
Text Label 7700 5900 2    50   ~ 0
~GFX-CHNL
Text Label 7700 7500 2    50   ~ 0
GFX-ADDR16
Text Label 7700 7600 2    50   ~ 0
SCROLL1.GFX-CHNL
Text Label 7700 7950 2    50   ~ 0
GFX-ADDR15
Text Label 7700 8050 2    50   ~ 0
ELSE.GFX-CHNL
Text Label 7700 8400 2    50   ~ 0
GFX-ADDR14
Text Label 7700 8500 2    50   ~ 0
STARS.GFX-CHNL
Text Label 7700 8850 2    50   ~ 0
GFX-ADDR13
Text Label 7700 8950 2    50   ~ 0
SCROLL3.GFX-CHNL
Text Label 7700 9300 2    50   ~ 0
~GFX-CHNL
Text Label 7800 3750 0    50   ~ 0
~GFX-CHNL
Text Label 7800 7150 0    50   ~ 0
~GFX-CHNL
Text Label 7800 10550 0    50   ~ 0
~GFX-CHNL
Text Label 8400 3250 2    50   ~ 0
GFX-ADDR17
Text Label 8400 3350 2    50   ~ 0
ELSE.GFX-CHNL
Text Label 8400 3450 2    50   ~ 0
GFX-ADDR15
Text Label 8400 3550 2    50   ~ 0
SCROLL3.GFX-CHNL
Text Label 8400 6650 2    50   ~ 0
GFX-ADDR16
Text Label 8400 6750 2    50   ~ 0
ELSE.GFX-CHNL
Text Label 8400 6850 2    50   ~ 0
GFX-ADDR14
Text Label 8400 6950 2    50   ~ 0
SCROLL3.GFX-CHNL
Text Label 8400 10050 2    50   ~ 0
GFX-ADDR15
Text Label 8400 10150 2    50   ~ 0
ELSE.GFX-CHNL
Text Label 8400 10250 2    50   ~ 0
GFX-ADDR13
Text Label 8400 10350 2    50   ~ 0
SCROLL3.GFX-CHNL
Text Label 10250 1650 0    50   ~ 0
B-ROMA17
Text Label 10250 3500 0    50   ~ 0
A-ROMA17
Text Label 10250 5050 0    50   ~ 0
B-ROMA16
Text Label 10250 6900 0    50   ~ 0
A-ROMA16
Text Label 10250 8450 0    50   ~ 0
B-ROMA15
Text Label 10250 10300 0    50   ~ 0
A-ROMA15
Text HLabel 1650 2150 0    50   Input ~ 0
GFX-ADDR[13..18]
Text HLabel 1800 9350 0    50   Input ~ 0
~GFX-CHNL
Text HLabel 2700 9900 0    50   Input ~ 0
~SCROLL1-STARS
Text HLabel 3150 8800 0    50   Input ~ 0
SCROLL3-STARS
Text HLabel 6050 10850 0    50   Input ~ 0
~CLK4M
Text HLabel 7700 800  0    50   Input ~ 0
SCROLL1.GFX-CHNL
Text HLabel 7700 1250 0    50   Input ~ 0
ELSE.GFX-CHNL
Text HLabel 7700 1700 0    50   Input ~ 0
STARS.GFX-CHNL
Text HLabel 7700 2150 0    50   Input ~ 0
SCROLL3.GFX-CHNL
Text HLabel 11300 1050 2    50   Output ~ 0
A-ROMA[15..17]
Text HLabel 11300 1200 2    50   Output ~ 0
B-ROMA[15..17]
$Comp
L A5C:AND02 UEB131
U 1 1 6432579B
P 3550 9400
F 0 "UEB131" H 3575 9667 50  0000 C CNN
F 1 "AND02" H 3575 9576 50  0000 C CNN
F 2 "" H 3550 9400 50  0001 C CNN
F 3 "" H 3550 9400 50  0001 C CNN
	1    3550 9400
	1    0    0    -1  
$EndComp
$Comp
L A5C:AND02 UEB127
U 1 1 643257A1
P 3550 9950
F 0 "UEB127" H 3575 10217 50  0000 C CNN
F 1 "AND02" H 3575 10126 50  0000 C CNN
F 2 "" H 3550 9950 50  0001 C CNN
F 3 "" H 3550 9950 50  0001 C CNN
	1    3550 9950
	1    0    0    -1  
$EndComp
$Comp
L A5C:NAND02 UED13
U 1 1 64325746
P 7950 750
F 0 "UED13" H 7975 1017 50  0000 C CNN
F 1 "NAND02" H 7975 926 50  0000 C CNN
F 2 "" H 7950 750 50  0001 C CNN
F 3 "" H 7950 750 50  0001 C CNN
	1    7950 750 
	1    0    0    -1  
$EndComp
$Comp
L A5C:NAND02 UED41
U 1 1 64325740
P 7950 1200
F 0 "UED41" H 7975 1467 50  0000 C CNN
F 1 "NAND02" H 7975 1376 50  0000 C CNN
F 2 "" H 7950 1200 50  0001 C CNN
F 3 "" H 7950 1200 50  0001 C CNN
	1    7950 1200
	1    0    0    -1  
$EndComp
$Comp
L A5C:NAND02 UED44
U 1 1 6432573A
P 7950 1650
F 0 "UED44" H 7975 1917 50  0000 C CNN
F 1 "NAND02" H 7975 1826 50  0000 C CNN
F 2 "" H 7950 1650 50  0001 C CNN
F 3 "" H 7950 1650 50  0001 C CNN
	1    7950 1650
	1    0    0    -1  
$EndComp
$Comp
L A5C:NAND02 UED45
U 1 1 64325734
P 7950 2100
F 0 "UED45" H 7975 2367 50  0000 C CNN
F 1 "NAND02" H 7975 2276 50  0000 C CNN
F 2 "" H 7950 2100 50  0001 C CNN
F 3 "" H 7950 2100 50  0001 C CNN
	1    7950 2100
	1    0    0    -1  
$EndComp
$Comp
L A5C:NAND02 UED32
U 1 1 6432572E
P 7950 2550
F 0 "UED32" H 7975 2817 50  0000 C CNN
F 1 "NAND02" H 7975 2726 50  0000 C CNN
F 2 "" H 7950 2550 50  0001 C CNN
F 3 "" H 7950 2550 50  0001 C CNN
	1    7950 2550
	1    0    0    -1  
$EndComp
$Comp
L A5C:NAND02 UEF74
U 1 1 64325632
P 7950 4150
F 0 "UEF74" H 7975 4417 50  0000 C CNN
F 1 "NAND02" H 7975 4326 50  0000 C CNN
F 2 "" H 7950 4150 50  0001 C CNN
F 3 "" H 7950 4150 50  0001 C CNN
	1    7950 4150
	1    0    0    -1  
$EndComp
$Comp
L A5C:NAND02 UEG64
U 1 1 6432562C
P 7950 4600
F 0 "UEG64" H 7975 4867 50  0000 C CNN
F 1 "NAND02" H 7975 4776 50  0000 C CNN
F 2 "" H 7950 4600 50  0001 C CNN
F 3 "" H 7950 4600 50  0001 C CNN
	1    7950 4600
	1    0    0    -1  
$EndComp
$Comp
L A5C:NAND02 UEF87
U 1 1 64325626
P 7950 5050
F 0 "UEF87" H 7975 5317 50  0000 C CNN
F 1 "NAND02" H 7975 5226 50  0000 C CNN
F 2 "" H 7950 5050 50  0001 C CNN
F 3 "" H 7950 5050 50  0001 C CNN
	1    7950 5050
	1    0    0    -1  
$EndComp
$Comp
L A5C:NAND02 UEF110
U 1 1 64325620
P 7950 5500
F 0 "UEF110" H 7975 5767 50  0000 C CNN
F 1 "NAND02" H 7975 5676 50  0000 C CNN
F 2 "" H 7950 5500 50  0001 C CNN
F 3 "" H 7950 5500 50  0001 C CNN
	1    7950 5500
	1    0    0    -1  
$EndComp
$Comp
L A5C:NAND02 UEF82
U 1 1 6432561A
P 7950 5950
F 0 "UEF82" H 7975 6217 50  0000 C CNN
F 1 "NAND02" H 7975 6126 50  0000 C CNN
F 2 "" H 7950 5950 50  0001 C CNN
F 3 "" H 7950 5950 50  0001 C CNN
	1    7950 5950
	1    0    0    -1  
$EndComp
$Comp
L A5C:NAND02 UEB191
U 1 1 64325663
P 7950 7550
F 0 "UEB191" H 7975 7817 50  0000 C CNN
F 1 "NAND02" H 7975 7726 50  0000 C CNN
F 2 "" H 7950 7550 50  0001 C CNN
F 3 "" H 7950 7550 50  0001 C CNN
	1    7950 7550
	1    0    0    -1  
$EndComp
$Comp
L A5C:NAND02 UEB201
U 1 1 64325669
P 7950 8000
F 0 "UEB201" H 7975 8267 50  0000 C CNN
F 1 "NAND02" H 7975 8176 50  0000 C CNN
F 2 "" H 7950 8000 50  0001 C CNN
F 3 "" H 7950 8000 50  0001 C CNN
	1    7950 8000
	1    0    0    -1  
$EndComp
$Comp
L A5C:NAND02 UEB199
U 1 1 6432566F
P 7950 8450
F 0 "UEB199" H 7975 8717 50  0000 C CNN
F 1 "NAND02" H 7975 8626 50  0000 C CNN
F 2 "" H 7950 8450 50  0001 C CNN
F 3 "" H 7950 8450 50  0001 C CNN
	1    7950 8450
	1    0    0    -1  
$EndComp
$Comp
L A5C:NAND02 UEA208
U 1 1 64325675
P 7950 8900
F 0 "UEA208" H 7975 9167 50  0000 C CNN
F 1 "NAND02" H 7975 9076 50  0000 C CNN
F 2 "" H 7950 8900 50  0001 C CNN
F 3 "" H 7950 8900 50  0001 C CNN
	1    7950 8900
	1    0    0    -1  
$EndComp
$Comp
L A5C:NAND02 UEB195
U 1 1 6432567B
P 7950 9350
F 0 "UEB195" H 7975 9617 50  0000 C CNN
F 1 "NAND02" H 7975 9526 50  0000 C CNN
F 2 "" H 7950 9350 50  0001 C CNN
F 3 "" H 7950 9350 50  0001 C CNN
	1    7950 9350
	1    0    0    -1  
$EndComp
$Comp
L A5C:INV01 UEC133
U 1 1 64325794
P 3000 9900
F 0 "UEC133" H 3000 10217 50  0000 C CNN
F 1 "INV01" H 3000 10126 50  0000 C CNN
F 2 "" H 3000 9700 50  0001 C CNN
F 3 "" H 3000 9700 50  0001 C CNN
	1    3000 9900
	1    0    0    -1  
$EndComp
$Comp
L A5C:INV01 UEB125
U 1 1 6432578D
P 3000 10400
F 0 "UEB125" H 3000 10717 50  0000 C CNN
F 1 "INV01" H 3000 10626 50  0000 C CNN
F 2 "" H 3000 10200 50  0001 C CNN
F 3 "" H 3000 10200 50  0001 C CNN
	1    3000 10400
	1    0    0    -1  
$EndComp
$Comp
L A5C:INV01 UEB186
U 1 1 643256CE
P 3550 8800
F 0 "UEB186" H 3550 9117 50  0000 C CNN
F 1 "INV01" H 3550 9026 50  0000 C CNN
F 2 "" H 3550 8600 50  0001 C CNN
F 3 "" H 3550 8600 50  0001 C CNN
	1    3550 8800
	1    0    0    -1  
$EndComp
$Comp
L A5C:DFFCOO UEB121
U 1 1 64325761
P 6500 2750
F 0 "UEB121" H 6500 3115 50  0000 C CNN
F 1 "DFFCOO" H 6500 3024 50  0000 C CNN
F 2 "" H 6500 2750 50  0001 C CNN
F 3 "" H 6500 2750 50  0001 C CNN
	1    6500 2750
	1    0    0    -1  
$EndComp
$Comp
L A5C:DFFCOO UED196
U 1 1 643256D8
P 6500 6150
F 0 "UED196" H 6500 6515 50  0000 C CNN
F 1 "DFFCOO" H 6500 6424 50  0000 C CNN
F 2 "" H 6500 6150 50  0001 C CNN
F 3 "" H 6500 6150 50  0001 C CNN
	1    6500 6150
	1    0    0    -1  
$EndComp
$Comp
L A5C:DFFCOO UEC92
U 1 1 6432569E
P 6500 9550
F 0 "UEC92" H 6500 9915 50  0000 C CNN
F 1 "DFFCOO" H 6500 9824 50  0000 C CNN
F 2 "" H 6500 9550 50  0001 C CNN
F 3 "" H 6500 9550 50  0001 C CNN
	1    6500 9550
	1    0    0    -1  
$EndComp
$Comp
L A5C:DFFCOO UED25
U 1 1 64325718
P 9800 1750
F 0 "UED25" H 9800 2115 50  0000 C CNN
F 1 "DFFCOO" H 9800 2024 50  0000 C CNN
F 2 "" H 9800 1750 50  0001 C CNN
F 3 "" H 9800 1750 50  0001 C CNN
	1    9800 1750
	1    0    0    -1  
$EndComp
$Comp
L A5C:DFFCOO UEC128
U 1 1 643256FE
P 9800 3500
F 0 "UEC128" H 9800 3865 50  0000 C CNN
F 1 "DFFCOO" H 9800 3774 50  0000 C CNN
F 2 "" H 9800 3500 50  0001 C CNN
F 3 "" H 9800 3500 50  0001 C CNN
	1    9800 3500
	1    0    0    -1  
$EndComp
$Comp
L A5C:DFFCOO UEE80
U 1 1 64325604
P 9800 5150
F 0 "UEE80" H 9800 5515 50  0000 C CNN
F 1 "DFFCOO" H 9800 5424 50  0000 C CNN
F 2 "" H 9800 5150 50  0001 C CNN
F 3 "" H 9800 5150 50  0001 C CNN
	1    9800 5150
	1    0    0    -1  
$EndComp
$Comp
L A5C:DFFCOO UED160
U 1 1 643255EA
P 9800 6900
F 0 "UED160" H 9800 7265 50  0000 C CNN
F 1 "DFFCOO" H 9800 7174 50  0000 C CNN
F 2 "" H 9800 6900 50  0001 C CNN
F 3 "" H 9800 6900 50  0001 C CNN
	1    9800 6900
	1    0    0    -1  
$EndComp
$Comp
L A5C:DFFCOO UEE208
U 1 1 643256AE
P 9800 8550
F 0 "UEE208" H 9800 8915 50  0000 C CNN
F 1 "DFFCOO" H 9800 8824 50  0000 C CNN
F 2 "" H 9800 8550 50  0001 C CNN
F 3 "" H 9800 8550 50  0001 C CNN
	1    9800 8550
	1    0    0    -1  
$EndComp
$Comp
L A5C:DFFCOO UEC76
U 1 1 643256C8
P 9800 10300
F 0 "UEC76" H 9800 10665 50  0000 C CNN
F 1 "DFFCOO" H 9800 10574 50  0000 C CNN
F 2 "" H 9800 10300 50  0001 C CNN
F 3 "" H 9800 10300 50  0001 C CNN
	1    9800 10300
	1    0    0    -1  
$EndComp
$Comp
L A5C:NAND05 UED22
U 1 1 64325726
P 8950 1650
F 0 "UED22" H 8975 2040 50  0000 C CNN
F 1 "NAND05" H 8975 1949 50  0000 C CNN
F 2 "" H 8950 1350 50  0001 C CNN
F 3 "" H 8950 1350 50  0001 C CNN
	1    8950 1650
	1    0    0    -1  
$EndComp
$Comp
L A5C:NAND05 UEF76
U 1 1 64325612
P 8950 5050
F 0 "UEF76" H 8975 5440 50  0000 C CNN
F 1 "NAND05" H 8975 5349 50  0000 C CNN
F 2 "" H 8950 4750 50  0001 C CNN
F 3 "" H 8950 4750 50  0001 C CNN
	1    8950 5050
	1    0    0    -1  
$EndComp
$Comp
L A5C:NAND05 UEB203
U 1 1 64325681
P 8950 8450
F 0 "UEB203" H 8975 8840 50  0000 C CNN
F 1 "NAND05" H 8975 8749 50  0000 C CNN
F 2 "" H 8950 8150 50  0001 C CNN
F 3 "" H 8950 8150 50  0001 C CNN
	1    8950 8450
	1    0    0    -1  
$EndComp
$Comp
L A5C:AOI32 UEB136
U 1 1 6432576A
P 5600 2650
F 0 "UEB136" H 5600 3092 50  0000 C CNN
F 1 "AOI32" H 5600 3001 50  0000 C CNN
F 2 "" H 5750 2650 50  0001 C CNN
F 3 "" H 5750 2650 50  0001 C CNN
	1    5600 2650
	1    0    0    -1  
$EndComp
$Comp
L A5C:AOI32 UEC163
U 1 1 643256E1
P 5600 6050
F 0 "UEC163" H 5600 6492 50  0000 C CNN
F 1 "AOI32" H 5600 6401 50  0000 C CNN
F 2 "" H 5750 6050 50  0001 C CNN
F 3 "" H 5750 6050 50  0001 C CNN
	1    5600 6050
	1    0    0    -1  
$EndComp
$Comp
L A5C:AOI32 UEC134
U 1 1 64325695
P 5600 9450
F 0 "UEC134" H 5600 9892 50  0000 C CNN
F 1 "AOI32" H 5600 9801 50  0000 C CNN
F 2 "" H 5750 9450 50  0001 C CNN
F 3 "" H 5750 9450 50  0001 C CNN
	1    5600 9450
	1    0    0    -1  
$EndComp
$Comp
L A5C:AOI24 UEC124
U 1 1 64325707
P 8850 3400
F 0 "UEC124" H 8850 3967 50  0000 C CNN
F 1 "AOI24" H 8850 3876 50  0000 C CNN
F 2 "" H 9050 3700 50  0001 C CNN
F 3 "" H 9050 3700 50  0001 C CNN
	1    8850 3400
	1    0    0    -1  
$EndComp
$Comp
L A5C:AOI24 UED156
U 1 1 643255F3
P 8850 6800
F 0 "UED156" H 8850 7367 50  0000 C CNN
F 1 "AOI24" H 8850 7276 50  0000 C CNN
F 2 "" H 9050 7100 50  0001 C CNN
F 3 "" H 9050 7100 50  0001 C CNN
	1    8850 6800
	1    0    0    -1  
$EndComp
$Comp
L A5C:AOI24 UEC86
U 1 1 643256BF
P 8850 10200
F 0 "UEC86" H 8850 10767 50  0000 C CNN
F 1 "AOI24" H 8850 10676 50  0000 C CNN
F 2 "" H 9050 10500 50  0001 C CNN
F 3 "" H 9050 10500 50  0001 C CNN
	1    8850 10200
	1    0    0    -1  
$EndComp
Wire Bus Line
	10850 1050 10850 10200
Wire Bus Line
	11100 1200 11100 8350
Wire Bus Line
	1750 2150 1750 2750
$EndSCHEMATC
