EESchema Schematic File Version 4
EELAYER 30 0
EELAYER END
$Descr A4 11693 8268
encoding utf-8
Sheet 56 83
Title "CPS Reverse Engineering: DL-0311"
Date "2021-09-12"
Rev ""
Comp ""
Comment1 ""
Comment2 ""
Comment3 "Licence: CC-BY"
Comment4 "Author: Loïc *WydD* Petit"
$EndDescr
Connection ~ 5850 4550
Connection ~ 3850 2000
Connection ~ 3950 6400
Connection ~ 3850 6500
Connection ~ 3850 4750
Connection ~ 5750 4750
Connection ~ 5750 6400
Connection ~ 5800 3600
Connection ~ 5700 3800
Connection ~ 5600 4000
Connection ~ 3850 4300
Connection ~ 3850 3150
Connection ~ 3950 3050
Connection ~ 3950 4200
NoConn ~ 7300 4150
NoConn ~ 7300 4550
NoConn ~ 7300 4450
NoConn ~ 7300 3950
NoConn ~ 2150 5650
NoConn ~ 4850 4300
NoConn ~ 4850 4200
Entry Wire Line
	3100 1200 3200 1300
Entry Wire Line
	3100 1300 3200 1400
Entry Wire Line
	3100 1400 3200 1500
Entry Wire Line
	3100 1500 3200 1600
Entry Wire Line
	3100 2350 3200 2450
Entry Wire Line
	3100 2450 3200 2550
Entry Wire Line
	3100 2550 3200 2650
Entry Wire Line
	3100 2650 3200 2750
Entry Wire Line
	3100 3500 3200 3600
Entry Wire Line
	3100 3600 3200 3700
Entry Wire Line
	3100 3700 3200 3800
Entry Wire Line
	3100 5050 3200 5150
Entry Wire Line
	3100 5700 3200 5800
Entry Wire Line
	3100 5800 3200 5900
Entry Wire Line
	3100 5900 3200 6000
Entry Wire Line
	3100 6000 3200 6100
Entry Wire Line
	5450 1400 5550 1300
Entry Wire Line
	5450 1600 5550 1500
Entry Wire Line
	5450 1800 5550 1700
Entry Wire Line
	5450 2000 5550 1900
Entry Wire Line
	5450 2550 5550 2450
Entry Wire Line
	5450 2750 5550 2650
Entry Wire Line
	5450 2950 5550 2850
Entry Wire Line
	5450 3150 5550 3050
Entry Wire Line
	5650 1250 5750 1150
Entry Wire Line
	5650 1450 5750 1350
Entry Wire Line
	5650 1650 5750 1550
Entry Wire Line
	5650 1850 5750 1750
Entry Wire Line
	5650 2400 5750 2300
Entry Wire Line
	5650 2600 5750 2500
Entry Wire Line
	5650 2800 5750 2700
Entry Wire Line
	5650 3000 5750 2900
Entry Wire Line
	5950 7000 6050 6900
Entry Wire Line
	5950 7100 6050 7000
Entry Wire Line
	5950 7200 6050 7100
Entry Wire Line
	5950 7300 6050 7200
Entry Wire Line
	5950 7400 6050 7300
Entry Wire Line
	8150 5700 8250 5600
Entry Wire Line
	8150 5800 8250 5700
Entry Wire Line
	8150 5900 8250 5800
Entry Wire Line
	8150 6000 8250 5900
Entry Wire Line
	8150 6100 8250 6000
Wire Wire Line
	1450 5900 1450 6350
Wire Wire Line
	1450 6350 2100 6350
Wire Wire Line
	2150 5550 2250 5550
Wire Wire Line
	2200 4100 2450 4100
Wire Wire Line
	2250 5550 2250 5900
Wire Wire Line
	2250 5900 1450 5900
Wire Wire Line
	2900 6350 3200 6350
Wire Wire Line
	3000 2000 3850 2000
Wire Wire Line
	3000 4200 3950 4200
Wire Wire Line
	3200 1300 4050 1300
Wire Wire Line
	3200 1400 4050 1400
Wire Wire Line
	3200 1500 4050 1500
Wire Wire Line
	3200 1600 4050 1600
Wire Wire Line
	3200 2450 4050 2450
Wire Wire Line
	3200 2550 4050 2550
Wire Wire Line
	3200 2650 4050 2650
Wire Wire Line
	3200 2750 4050 2750
Wire Wire Line
	3200 3600 4050 3600
Wire Wire Line
	3200 3700 4050 3700
Wire Wire Line
	3200 3800 4050 3800
Wire Wire Line
	3200 5150 4200 5150
Wire Wire Line
	3200 5800 4050 5800
Wire Wire Line
	3200 5900 4050 5900
Wire Wire Line
	3200 6000 4050 6000
Wire Wire Line
	3200 6100 4050 6100
Wire Wire Line
	3750 6400 3950 6400
Wire Wire Line
	3850 2000 3850 3150
Wire Wire Line
	3850 2000 4050 2000
Wire Wire Line
	3850 3150 4050 3150
Wire Wire Line
	3850 4300 3850 3150
Wire Wire Line
	3850 4300 3850 4750
Wire Wire Line
	3850 4750 3850 6500
Wire Wire Line
	3850 6500 3850 6650
Wire Wire Line
	3850 6500 4050 6500
Wire Wire Line
	3850 6650 5750 6650
Wire Wire Line
	3950 1900 3950 3050
Wire Wire Line
	3950 3050 3950 4200
Wire Wire Line
	3950 4200 4050 4200
Wire Wire Line
	3950 5350 3950 6400
Wire Wire Line
	3950 6400 4050 6400
Wire Wire Line
	4050 1900 3950 1900
Wire Wire Line
	4050 3050 3950 3050
Wire Wire Line
	4050 4300 3850 4300
Wire Wire Line
	4200 5350 3950 5350
Wire Wire Line
	4700 5150 4950 5150
Wire Wire Line
	4700 5250 5300 5250
Wire Wire Line
	4850 1300 5450 1300
Wire Wire Line
	4850 1400 5450 1400
Wire Wire Line
	4850 1500 5450 1500
Wire Wire Line
	4850 1600 5450 1600
Wire Wire Line
	4850 1700 5450 1700
Wire Wire Line
	4850 1800 5450 1800
Wire Wire Line
	4850 1900 5450 1900
Wire Wire Line
	4850 2000 5450 2000
Wire Wire Line
	4850 2450 5450 2450
Wire Wire Line
	4850 2550 5450 2550
Wire Wire Line
	4850 2650 5450 2650
Wire Wire Line
	4850 2750 5450 2750
Wire Wire Line
	4850 2850 5450 2850
Wire Wire Line
	4850 2950 5450 2950
Wire Wire Line
	4850 3050 5450 3050
Wire Wire Line
	4850 3150 5450 3150
Wire Wire Line
	4850 3600 5800 3600
Wire Wire Line
	4850 3800 5700 3800
Wire Wire Line
	4850 5800 5950 5800
Wire Wire Line
	4850 5900 5200 5900
Wire Wire Line
	4850 6000 5400 6000
Wire Wire Line
	4850 6100 5100 6100
Wire Wire Line
	4850 6200 5500 6200
Wire Wire Line
	4850 6300 5000 6300
Wire Wire Line
	4850 6400 5600 6400
Wire Wire Line
	4900 6500 4850 6500
Wire Wire Line
	4950 4250 6500 4250
Wire Wire Line
	4950 5150 4950 4250
Wire Wire Line
	5000 6300 5000 7300
Wire Wire Line
	5100 6100 5100 7200
Wire Wire Line
	5200 5900 5200 7100
Wire Wire Line
	5300 5250 5300 7000
Wire Wire Line
	5400 5900 5400 6000
Wire Wire Line
	5400 5900 5950 5900
Wire Wire Line
	5450 1300 5450 1250
Wire Wire Line
	5450 1500 5450 1450
Wire Wire Line
	5450 1700 5450 1650
Wire Wire Line
	5450 1850 5450 1900
Wire Wire Line
	5450 1850 5650 1850
Wire Wire Line
	5450 2450 5450 2400
Wire Wire Line
	5450 2650 5450 2600
Wire Wire Line
	5450 2850 5450 2800
Wire Wire Line
	5450 3000 5450 3050
Wire Wire Line
	5450 3000 5650 3000
Wire Wire Line
	5500 6000 5950 6000
Wire Wire Line
	5500 6200 5500 6000
Wire Wire Line
	5600 3450 5900 3450
Wire Wire Line
	5600 4000 4850 4000
Wire Wire Line
	5600 4000 5600 3450
Wire Wire Line
	5600 4150 5600 4000
Wire Wire Line
	5600 6100 5600 6400
Wire Wire Line
	5600 6100 5950 6100
Wire Wire Line
	5650 1250 5450 1250
Wire Wire Line
	5650 1450 5450 1450
Wire Wire Line
	5650 1650 5450 1650
Wire Wire Line
	5650 2400 5450 2400
Wire Wire Line
	5650 2600 5450 2600
Wire Wire Line
	5650 2800 5450 2800
Wire Wire Line
	5700 3350 5900 3350
Wire Wire Line
	5700 3800 5700 3350
Wire Wire Line
	5700 3800 5700 4050
Wire Wire Line
	5700 4050 6500 4050
Wire Wire Line
	5750 4750 3850 4750
Wire Wire Line
	5750 6400 5750 4750
Wire Wire Line
	5750 6400 5750 6650
Wire Wire Line
	5800 3250 5800 3600
Wire Wire Line
	5800 3600 5800 3950
Wire Wire Line
	5850 4550 6500 4550
Wire Wire Line
	5850 6300 5850 4550
Wire Wire Line
	5900 3250 5800 3250
Wire Wire Line
	5950 4650 5950 4750
Wire Wire Line
	5950 4750 5750 4750
Wire Wire Line
	5950 6300 5850 6300
Wire Wire Line
	5950 6400 5750 6400
Wire Wire Line
	5950 7100 5200 7100
Wire Wire Line
	5950 7300 5000 7300
Wire Wire Line
	6500 3950 5800 3950
Wire Wire Line
	6500 4150 5600 4150
Wire Wire Line
	6500 4650 5950 4650
Wire Wire Line
	6750 5800 8150 5800
Wire Wire Line
	6750 5900 8150 5900
Wire Wire Line
	6750 6000 8150 6000
Wire Wire Line
	6750 6100 8150 6100
Wire Wire Line
	7450 4650 7300 4650
Wire Wire Line
	7450 4650 7450 5700
Wire Wire Line
	7450 5700 8150 5700
Wire Wire Line
	7650 4350 7300 4350
Wire Wire Line
	8200 4050 7300 4050
Wire Wire Line
	8200 4250 7300 4250
Wire Bus Line
	3100 1100 3000 1100
Wire Bus Line
	5550 950  5900 950 
Wire Bus Line
	5550 2100 5900 2100
Wire Bus Line
	5750 1050 5900 1050
Wire Bus Line
	5750 2200 5900 2200
Wire Bus Line
	6050 6800 6150 6800
Wire Bus Line
	8250 5500 8350 5500
Text Notes 5200 5700 2    50   ~ 0
Colour
Text Notes 6550 3300 0    50   ~ 0
X & Y offset toggle in MAME
Text Notes 6550 3400 0    50   ~ 0
Y Flip
Text Notes 6550 3500 0    50   ~ 0
X Flip
Text Label 2100 6250 2    50   ~ 0
~ATTR-LOOKUP
Text Label 3250 1300 0    50   ~ 0
BUS-DATA15
Text Label 3250 1400 0    50   ~ 0
BUS-DATA14
Text Label 3250 1500 0    50   ~ 0
BUS-DATA13
Text Label 3250 1600 0    50   ~ 0
BUS-DATA12
Text Label 3250 2450 0    50   ~ 0
BUS-DATA11
Text Label 3250 2550 0    50   ~ 0
BUS-DATA10
Text Label 3250 2650 0    50   ~ 0
BUS-DATA9
Text Label 3250 2750 0    50   ~ 0
BUS-DATA8
Text Label 3250 3600 0    50   ~ 0
BUS-DATA7
Text Label 3250 3700 0    50   ~ 0
BUS-DATA6
Text Label 3250 3800 0    50   ~ 0
BUS-DATA5
Text Label 3250 5150 0    50   ~ 0
BUS-DATA4
Text Label 3250 5800 0    50   ~ 0
BUS-DATA3
Text Label 3250 5900 0    50   ~ 0
BUS-DATA2
Text Label 3250 6000 0    50   ~ 0
BUS-DATA1
Text Label 3250 6100 0    50   ~ 0
BUS-DATA0
Text Label 4850 1300 0    50   ~ 0
ATTR-YBLOCK3
Text Label 4850 1400 0    50   ~ 0
~ATTR-YBLOCK3
Text Label 4850 1500 0    50   ~ 0
ATTR-YBLOCK2
Text Label 4850 1600 0    50   ~ 0
~ATTR-YBLOCK2
Text Label 4850 1700 0    50   ~ 0
ATTR-YBLOCK1
Text Label 4850 1800 0    50   ~ 0
~ATTR-YBLOCK1
Text Label 4850 1900 0    50   ~ 0
ATTR-YBLOCK0
Text Label 4850 2000 0    50   ~ 0
~ATTR-YBLOCK0
Text Label 4850 2450 0    50   ~ 0
ATTR-XBLOCK3
Text Label 4850 2550 0    50   ~ 0
~ATTR-XBLOCK3
Text Label 4850 2650 0    50   ~ 0
ATTR-XBLOCK2
Text Label 4850 2750 0    50   ~ 0
~ATTR-XBLOCK2
Text Label 4850 2850 0    50   ~ 0
ATTR-XBLOCK1
Text Label 4850 2950 0    50   ~ 0
~ATTR-XBLOCK1
Text Label 4850 3050 0    50   ~ 0
ATTR-XBLOCK0
Text Label 4850 3150 0    50   ~ 0
~ATTR-XBLOCK0
Text Label 4850 3700 0    50   ~ 0
~ATTR-LOOKUP
Text Label 8100 5700 2    50   ~ 0
~COLOUR4
Text Label 8100 5800 2    50   ~ 0
~COLOUR3
Text Label 8100 5900 2    50   ~ 0
~COLOUR2
Text Label 8100 6000 2    50   ~ 0
~COLOUR1
Text Label 8100 6100 2    50   ~ 0
~COLOUR0
Text HLabel 1600 4100 0    50   Input ~ 0
~BUS-SPRITE-ATTR
Text HLabel 1650 5550 0    50   Input ~ 0
~BUS-SPRITE-LOOKUP
Text HLabel 1650 5750 0    50   Input ~ 0
~CLK4M
Text HLabel 2100 6450 0    50   Input ~ 0
~BUS-SPRITE-ATTR
Text HLabel 2450 4200 0    50   Input ~ 0
CLK4M
Text HLabel 2450 4300 0    50   Input ~ 0
SPRITE-BLOCK-READY
Text HLabel 3000 1100 0    50   Input ~ 0
BUS-DATA[0..15]
Text HLabel 3000 2000 0    50   Input ~ 0
~RESET-SCAN243
Text HLabel 3200 6450 0    50   Input ~ 0
CLK4M
Text HLabel 4850 3900 2    50   Output ~ 0
~ATTR-YFLIP
Text HLabel 4850 4100 2    50   Output ~ 0
~ATTR-XFLIP
Text HLabel 5300 4500 0    50   Input ~ 0
CLK4M
Text HLabel 5300 4600 0    50   Input ~ 0
LI
Text HLabel 5900 950  2    50   Output ~ 0
ATTR-YBLOCK[0..3]
Text HLabel 5900 1050 2    50   Output ~ 0
~ATTR-YBLOCK[0..3]
Text HLabel 5900 2100 2    50   Output ~ 0
ATTR-XBLOCK[0..3]
Text HLabel 5900 2200 2    50   Output ~ 0
~ATTR-XBLOCK[0..3]
Text HLabel 5900 3250 2    50   Output ~ 0
ATTR-LOOKUP
Text HLabel 5900 3350 2    50   Output ~ 0
ATTR-YFLIP
Text HLabel 5900 3450 2    50   Output ~ 0
ATTR-XFLIP
Text HLabel 6150 6800 2    50   Output ~ 0
~LOOKUP-IDX[0..4]
Text HLabel 7650 4450 0    50   Input ~ 0
FLIP
Text HLabel 8200 4050 2    50   Output ~ 0
~LOOKUP
Text HLabel 8200 4250 2    50   Output ~ 0
~YFLIP
Text HLabel 8200 4400 2    50   Output ~ 0
~XFLIP
Text HLabel 8350 5500 2    50   Output ~ 0
~COLOUR[0..4]
$Comp
L power:GND #PWR0148
U 1 1 702E2A40
P 4050 3900
F 0 "#PWR0148" H 4050 3650 50  0001 C CNN
F 1 "GND" H 4055 3727 50  0001 C CNN
F 2 "" H 4050 3900 50  0001 C CNN
F 3 "" H 4050 3900 50  0001 C CNN
	1    4050 3900
	1    0    0    -1  
$EndComp
$Comp
L A5C:NAND02 UCB116
U 1 1 61118D77
P 3450 6400
F 0 "UCB116" H 3475 6667 50  0000 C CNN
F 1 "NAND02" H 3475 6576 50  0000 C CNN
F 2 "" H 3450 6400 50  0001 C CNN
F 3 "" H 3450 6400 50  0001 C CNN
	1    3450 6400
	1    0    0    1   
$EndComp
$Comp
L A5C:NAND02 UCA188
U 1 1 61118D7A
P 5550 4550
F 0 "UCA188" H 5575 4817 50  0000 C CNN
F 1 "NAND02" H 5575 4726 50  0000 C CNN
F 2 "" H 5550 4550 50  0001 C CNN
F 3 "" H 5550 4550 50  0001 C CNN
	1    5550 4550
	1    0    0    -1  
$EndComp
$Comp
L A5C:XNOR02 UCC168
U 1 1 61118D2F
P 7900 4400
F 0 "UCC168" H 7925 4667 50  0000 C CNN
F 1 "XNOR02" H 7925 4576 50  0000 C CNN
F 2 "" H 7925 4400 50  0001 C CNN
F 3 "" H 7925 4400 50  0001 C CNN
	1    7900 4400
	1    0    0    1   
$EndComp
$Comp
L A5C:NAND03 UCA68
U 1 1 70B46EA7
P 2700 4200
F 0 "UCA68" H 2725 4492 50  0000 C CNN
F 1 "NAND03" H 2725 4401 50  0000 C CNN
F 2 "" H 2700 4200 50  0001 C CNN
F 3 "" H 2700 4200 50  0001 C CNN
	1    2700 4200
	1    0    0    -1  
$EndComp
$Comp
L A5C:INV01 UCA54
U 1 1 730C5E8D
P 1900 4100
F 0 "UCA54" H 1900 4417 50  0000 C CNN
F 1 "INV01" H 1900 4326 50  0000 C CNN
F 2 "" H 1900 3900 50  0001 C CNN
F 3 "" H 1900 3900 50  0001 C CNN
	1    1900 4100
	1    0    0    -1  
$EndComp
$Comp
L A5C:DFFCOO UCB119
U 1 1 7B953B30
P 1900 5650
F 0 "UCB119" H 1900 6015 50  0000 C CNN
F 1 "DFFCOO" H 1900 5924 50  0000 C CNN
F 2 "" H 1900 5650 50  0001 C CNN
F 3 "" H 1900 5650 50  0001 C CNN
	1    1900 5650
	1    0    0    -1  
$EndComp
$Comp
L A5C:DFFCOO UCA137
U 1 1 61118D79
P 4450 5250
F 0 "UCA137" H 4450 5615 50  0000 C CNN
F 1 "DFFCOO" H 4450 5524 50  0000 C CNN
F 2 "" H 4450 5250 50  0001 C CNN
F 3 "" H 4450 5250 50  0001 C CNN
	1    4450 5250
	1    0    0    -1  
$EndComp
$Comp
L A5C:OAI21 UCB59
U 1 1 61118D78
P 2500 6350
F 0 "UCB59" H 2500 6667 50  0000 C CNN
F 1 "OAI21" H 2500 6576 50  0000 C CNN
F 2 "" H 2550 6200 50  0001 C CNN
F 3 "" H 2550 6200 50  0001 C CNN
	1    2500 6350
	1    0    0    -1  
$EndComp
$Comp
L A5C:M175CL UCA10
U 1 1 61118D81
P 6350 6100
F 0 "UCA10" H 6350 6665 50  0000 C CNN
F 1 "M175CL" H 6350 6574 50  0000 C CNN
F 2 "" H 6350 5900 50  0001 C CNN
F 3 "" H 6350 5900 50  0001 C CNN
	1    6350 6100
	1    0    0    -1  
$EndComp
$Comp
L A5C:M175CLH UBF0
U 1 1 63314479
P 4450 1600
F 0 "UBF0" H 4450 2165 50  0000 C CNN
F 1 "M175CLH" H 4450 2074 50  0000 C CNN
F 2 "" H 4450 1400 50  0001 C CNN
F 3 "" H 4450 1400 50  0001 C CNN
	1    4450 1600
	1    0    0    -1  
$EndComp
$Comp
L A5C:M175CLH UCA314
U 1 1 61307DA5
P 4450 2750
F 0 "UCA314" H 4450 3315 50  0000 C CNN
F 1 "M175CLH" H 4450 3224 50  0000 C CNN
F 2 "" H 4450 2550 50  0001 C CNN
F 3 "" H 4450 2550 50  0001 C CNN
	1    4450 2750
	1    0    0    -1  
$EndComp
$Comp
L A5C:M175CLH UBJ15
U 1 1 63F3413D
P 4450 3900
F 0 "UBJ15" H 4450 4465 50  0000 C CNN
F 1 "M175CLH" H 4450 4374 50  0000 C CNN
F 2 "" H 4450 3700 50  0001 C CNN
F 3 "" H 4450 3700 50  0001 C CNN
	1    4450 3900
	1    0    0    -1  
$EndComp
$Comp
L A5C:M175CLH UCA33
U 1 1 61118D76
P 4450 6100
F 0 "UCA33" H 4450 6665 50  0000 C CNN
F 1 "M175CLH" H 4450 6574 50  0000 C CNN
F 2 "" H 4450 5900 50  0001 C CNN
F 3 "" H 4450 5900 50  0001 C CNN
	1    4450 6100
	1    0    0    -1  
$EndComp
$Comp
L A5C:M175CLH UCC147
U 1 1 62F2C6C9
P 6900 4250
F 0 "UCC147" H 6900 4815 50  0000 C CNN
F 1 "M175CLH" H 6900 4724 50  0000 C CNN
F 2 "" H 6900 4050 50  0001 C CNN
F 3 "" H 6900 4050 50  0001 C CNN
	1    6900 4250
	1    0    0    -1  
$EndComp
Text Label 5350 7400 0    50   ~ 0
~LOOKUP-IDX0
Text Label 5350 7300 0    50   ~ 0
~LOOKUP-IDX1
Text Label 5350 7200 0    50   ~ 0
~LOOKUP-IDX2
Text Label 5350 7100 0    50   ~ 0
~LOOKUP-IDX3
Text Label 5350 7000 0    50   ~ 0
~LOOKUP-IDX4
Wire Wire Line
	5100 7200 5950 7200
Wire Wire Line
	5300 7000 5950 7000
Wire Bus Line
	5550 950  5550 1900
Wire Bus Line
	5550 2100 5550 3050
Wire Bus Line
	5750 1050 5750 1750
Wire Bus Line
	5750 2200 5750 2900
Wire Bus Line
	6050 6800 6050 7300
Wire Bus Line
	8250 5500 8250 6000
Wire Bus Line
	3100 1100 3100 6000
Wire Wire Line
	4900 7400 5950 7400
Wire Wire Line
	4900 6500 4900 7400
$EndSCHEMATC
