EESchema Schematic File Version 4
EELAYER 30 0
EELAYER END
$Descr A4 11693 8268
encoding utf-8
Sheet 41 83
Title "CPS Reverse Engineering: DL-0311"
Date "2021-09-12"
Rev ""
Comp ""
Comment1 ""
Comment2 ""
Comment3 "Licence: CC-BY"
Comment4 "Author: Loïc *WydD* Petit"
$EndDescr
Connection ~ 5850 4700
Connection ~ 6400 4200
Connection ~ 6400 1700
Connection ~ 6400 3700
Connection ~ 6400 2200
Connection ~ 6400 2700
Connection ~ 6400 3200
Connection ~ 3550 3350
Connection ~ 3550 2900
Connection ~ 3550 2450
Connection ~ 1800 4100
Connection ~ 1900 4000
Connection ~ 3550 3800
Connection ~ 3550 4250
Connection ~ 3450 1550
Connection ~ 3450 4700
Connection ~ 3200 1900
Connection ~ 3300 2000
Connection ~ 3450 4000
Connection ~ 5150 5650
Connection ~ 1800 6450
Connection ~ 4100 6800
Connection ~ 1900 6350
Connection ~ 3150 4250
Connection ~ 3150 5150
Connection ~ 7750 3000
Connection ~ 8950 6250
Connection ~ 1800 7550
Connection ~ 7650 2800
NoConn ~ 8900 2400
NoConn ~ 8900 2700
NoConn ~ 8900 2200
NoConn ~ 8900 2500
NoConn ~ 2800 3500
NoConn ~ 2800 3900
NoConn ~ 2800 3700
NoConn ~ 3100 7150
NoConn ~ 6150 5650
NoConn ~ 9550 5850
Entry Wire Line
	1500 1900 1400 1800
Entry Wire Line
	1500 2000 1400 1900
Entry Wire Line
	1500 2100 1400 2000
Entry Wire Line
	1500 2200 1400 2100
Entry Wire Line
	1500 3400 1400 3300
Entry Wire Line
	1500 3500 1400 3400
Entry Wire Line
	1500 3600 1400 3500
Entry Wire Line
	1500 4600 1400 4500
Entry Wire Line
	4600 1850 4500 1950
Entry Wire Line
	4600 2300 4500 2400
Entry Wire Line
	4600 2750 4500 2850
Entry Wire Line
	4600 3200 4500 3300
Entry Wire Line
	4600 3650 4500 3750
Entry Wire Line
	4600 4100 4500 4200
Entry Wire Line
	4600 4550 4500 4650
Entry Wire Line
	4600 5100 4500 5200
Entry Wire Line
	5500 900  5600 1000
Entry Wire Line
	5500 1050 5600 1150
Entry Wire Line
	5500 1550 5600 1650
Entry Wire Line
	5500 2050 5600 2150
Entry Wire Line
	5500 2550 5600 2650
Entry Wire Line
	5500 3050 5600 3150
Entry Wire Line
	5500 3550 5600 3650
Entry Wire Line
	5500 4050 5600 4150
Entry Wire Line
	10350 1800 10250 1900
Entry Wire Line
	10350 2250 10250 2350
Entry Wire Line
	10350 2500 10250 2600
Entry Wire Line
	10350 2700 10250 2800
Entry Wire Line
	10350 3150 10250 3250
Entry Wire Line
	10350 3250 10250 3350
Entry Wire Line
	10350 3350 10250 3450
Entry Wire Line
	10350 3450 10250 3550
Wire Wire Line
	1300 3700 2000 3700
Wire Wire Line
	1400 6050 2000 6050
Wire Wire Line
	1750 5850 2000 5850
Wire Wire Line
	1800 2500 2000 2500
Wire Wire Line
	1800 4100 1800 2500
Wire Wire Line
	1800 4100 1800 6450
Wire Wire Line
	1800 7550 1800 6450
Wire Wire Line
	1800 7550 2850 7550
Wire Wire Line
	1900 2400 1900 4000
Wire Wire Line
	1900 4000 1900 6350
Wire Wire Line
	1900 6350 1400 6350
Wire Wire Line
	1900 6350 2000 6350
Wire Wire Line
	2000 1900 1500 1900
Wire Wire Line
	2000 2000 1500 2000
Wire Wire Line
	2000 2100 1500 2100
Wire Wire Line
	2000 2200 1500 2200
Wire Wire Line
	2000 2400 1900 2400
Wire Wire Line
	2000 3400 1500 3400
Wire Wire Line
	2000 3500 1500 3500
Wire Wire Line
	2000 3600 1500 3600
Wire Wire Line
	2000 4000 1900 4000
Wire Wire Line
	2000 4100 1800 4100
Wire Wire Line
	2000 5950 1750 5950
Wire Wire Line
	2000 6150 1750 6150
Wire Wire Line
	2000 6450 1800 6450
Wire Wire Line
	2800 1900 3200 1900
Wire Wire Line
	2800 2000 3300 2000
Wire Wire Line
	2800 2100 3200 2100
Wire Wire Line
	2800 3400 3100 3400
Wire Wire Line
	2800 3600 3250 3600
Wire Wire Line
	2800 3800 3250 3800
Wire Wire Line
	2800 4000 3450 4000
Wire Wire Line
	2800 4100 3150 4100
Wire Wire Line
	3000 6250 3250 6250
Wire Wire Line
	3050 5250 3350 5250
Wire Wire Line
	3100 2200 2800 2200
Wire Wire Line
	3100 2200 3100 3250
Wire Wire Line
	3100 3250 3650 3250
Wire Wire Line
	3100 7250 3450 7250
Wire Wire Line
	3150 4250 3150 4100
Wire Wire Line
	3150 4250 3150 5150
Wire Wire Line
	3150 4250 3550 4250
Wire Wire Line
	3150 5450 3150 5150
Wire Wire Line
	3200 1000 3650 1000
Wire Wire Line
	3200 1900 3200 1000
Wire Wire Line
	3200 1900 3650 1900
Wire Wire Line
	3200 2800 3200 2100
Wire Wire Line
	3250 3600 3250 3700
Wire Wire Line
	3250 3700 3650 3700
Wire Wire Line
	3250 3800 3250 4150
Wire Wire Line
	3250 4150 3650 4150
Wire Wire Line
	3250 4700 3250 5350
Wire Wire Line
	3250 6150 2800 6150
Wire Wire Line
	3300 1450 3300 2000
Wire Wire Line
	3300 1450 3650 1450
Wire Wire Line
	3300 2000 3300 2350
Wire Wire Line
	3300 2350 3650 2350
Wire Wire Line
	3350 5050 3050 5050
Wire Wire Line
	3350 5150 3150 5150
Wire Wire Line
	3350 5350 3250 5350
Wire Wire Line
	3450 1100 3450 1550
Wire Wire Line
	3450 1100 3650 1100
Wire Wire Line
	3450 1550 3450 4000
Wire Wire Line
	3450 1550 3650 1550
Wire Wire Line
	3450 4000 3450 4700
Wire Wire Line
	3450 4700 3250 4700
Wire Wire Line
	3550 2000 3650 2000
Wire Wire Line
	3550 2450 3550 2000
Wire Wire Line
	3550 2900 3550 2450
Wire Wire Line
	3550 2900 3650 2900
Wire Wire Line
	3550 3350 3550 2900
Wire Wire Line
	3550 3350 3550 3800
Wire Wire Line
	3550 3800 3550 4250
Wire Wire Line
	3650 2450 3550 2450
Wire Wire Line
	3650 2800 3200 2800
Wire Wire Line
	3650 3350 3550 3350
Wire Wire Line
	3650 3800 3550 3800
Wire Wire Line
	3650 4250 3550 4250
Wire Wire Line
	3650 4600 1500 4600
Wire Wire Line
	3650 4700 3450 4700
Wire Wire Line
	4000 7300 4450 7300
Wire Wire Line
	4100 6800 4000 6800
Wire Wire Line
	4100 6800 4450 6800
Wire Wire Line
	4100 7200 4100 6800
Wire Wire Line
	4100 7200 4450 7200
Wire Wire Line
	4200 1050 4300 1050
Wire Wire Line
	4200 1950 4500 1950
Wire Wire Line
	4200 2400 4500 2400
Wire Wire Line
	4200 2850 4500 2850
Wire Wire Line
	4200 3300 4500 3300
Wire Wire Line
	4200 3750 4500 3750
Wire Wire Line
	4200 4200 4500 4200
Wire Wire Line
	4200 4650 4500 4650
Wire Wire Line
	4200 5200 4500 5200
Wire Wire Line
	4300 600  9200 600 
Wire Wire Line
	4300 1050 4300 600 
Wire Wire Line
	4400 700  4400 1500
Wire Wire Line
	4400 700  9100 700 
Wire Wire Line
	4400 1500 4200 1500
Wire Wire Line
	5050 5950 5350 5950
Wire Wire Line
	5150 5050 5150 5650
Wire Wire Line
	5150 5650 5150 6050
Wire Wire Line
	5150 6050 5350 6050
Wire Wire Line
	5250 5100 5250 5550
Wire Wire Line
	5250 5100 6250 5100
Wire Wire Line
	5250 5550 5350 5550
Wire Wire Line
	5350 5450 3150 5450
Wire Wire Line
	5350 5650 5150 5650
Wire Wire Line
	5350 5750 5050 5750
Wire Wire Line
	5600 1000 6450 1000
Wire Wire Line
	5700 4700 5850 4700
Wire Wire Line
	5850 1150 5600 1150
Wire Wire Line
	5850 1550 5850 1250
Wire Wire Line
	5850 1550 6400 1550
Wire Wire Line
	5850 1650 5600 1650
Wire Wire Line
	5850 2050 5850 1750
Wire Wire Line
	5850 2050 6400 2050
Wire Wire Line
	5850 2150 5600 2150
Wire Wire Line
	5850 2550 5850 2250
Wire Wire Line
	5850 2650 5600 2650
Wire Wire Line
	5850 3050 5850 2750
Wire Wire Line
	5850 3150 5600 3150
Wire Wire Line
	5850 3550 5850 3250
Wire Wire Line
	5850 3650 5600 3650
Wire Wire Line
	5850 4050 5850 3750
Wire Wire Line
	5850 4150 5600 4150
Wire Wire Line
	5850 4250 5850 4700
Wire Wire Line
	5850 4700 6700 4700
Wire Wire Line
	6150 5550 6750 5550
Wire Wire Line
	6250 5450 6150 5450
Wire Wire Line
	6250 5450 6250 5100
Wire Wire Line
	6400 1550 6400 1700
Wire Wire Line
	6400 2050 6400 2200
Wire Wire Line
	6400 2550 5850 2550
Wire Wire Line
	6400 2550 6400 2700
Wire Wire Line
	6400 3050 5850 3050
Wire Wire Line
	6400 3200 6400 3050
Wire Wire Line
	6400 3550 5850 3550
Wire Wire Line
	6400 3700 6400 3550
Wire Wire Line
	6400 4050 5850 4050
Wire Wire Line
	6400 4050 6400 4200
Wire Wire Line
	6450 1000 6450 1100
Wire Wire Line
	6450 1100 6700 1100
Wire Wire Line
	6700 1200 6400 1200
Wire Wire Line
	6700 1700 6400 1700
Wire Wire Line
	6700 2200 6400 2200
Wire Wire Line
	6700 2700 6400 2700
Wire Wire Line
	6700 3200 6400 3200
Wire Wire Line
	6700 3700 6400 3700
Wire Wire Line
	6700 4200 6400 4200
Wire Wire Line
	7250 4150 7450 4150
Wire Wire Line
	7350 2150 7250 2150
Wire Wire Line
	7350 2300 7350 2150
Wire Wire Line
	7350 2300 8100 2300
Wire Wire Line
	7350 2400 7350 2650
Wire Wire Line
	7350 2400 8100 2400
Wire Wire Line
	7350 2650 7250 2650
Wire Wire Line
	7350 3150 7250 3150
Wire Wire Line
	7350 3250 7350 3150
Wire Wire Line
	7350 3250 8100 3250
Wire Wire Line
	7350 3350 7350 3650
Wire Wire Line
	7350 3350 8100 3350
Wire Wire Line
	7350 3650 7250 3650
Wire Wire Line
	7450 1650 7250 1650
Wire Wire Line
	7450 2200 7450 1650
Wire Wire Line
	7450 2200 8100 2200
Wire Wire Line
	7450 3450 7450 4150
Wire Wire Line
	7450 3450 8100 3450
Wire Wire Line
	7550 1150 7250 1150
Wire Wire Line
	7550 2100 7550 1150
Wire Wire Line
	7550 2100 8100 2100
Wire Wire Line
	7550 3550 7550 4650
Wire Wire Line
	7550 3550 8100 3550
Wire Wire Line
	7550 4650 7250 4650
Wire Wire Line
	7650 2800 7400 2800
Wire Wire Line
	7650 2800 7650 3850
Wire Wire Line
	7650 3850 8100 3850
Wire Wire Line
	7750 2700 7750 3000
Wire Wire Line
	7750 2700 8100 2700
Wire Wire Line
	7750 3750 7750 3000
Wire Wire Line
	7850 3000 7750 3000
Wire Wire Line
	8100 2800 7650 2800
Wire Wire Line
	8100 3750 7750 3750
Wire Wire Line
	8900 2100 9000 2100
Wire Wire Line
	8900 2600 10250 2600
Wire Wire Line
	8900 2800 10250 2800
Wire Wire Line
	8900 3250 10250 3250
Wire Wire Line
	8900 3350 10250 3350
Wire Wire Line
	8900 3450 10250 3450
Wire Wire Line
	8900 3550 10250 3550
Wire Wire Line
	8950 6250 8950 6050
Wire Wire Line
	9000 1850 9000 2100
Wire Wire Line
	9050 5850 8400 5850
Wire Wire Line
	9050 6050 8950 6050
Wire Wire Line
	9100 2400 9100 700 
Wire Wire Line
	9100 2400 9300 2400
Wire Wire Line
	9200 600  9200 1950
Wire Wire Line
	9200 1950 9300 1950
Wire Wire Line
	9250 6250 8950 6250
Wire Wire Line
	9300 1850 9000 1850
Wire Wire Line
	9300 2300 8900 2300
Wire Wire Line
	9850 1900 10250 1900
Wire Wire Line
	9850 2350 10250 2350
Wire Bus Line
	1300 1650 1400 1650
Wire Bus Line
	4600 1700 4700 1700
Wire Bus Line
	5500 800  5400 800 
Wire Bus Line
	10350 1650 10450 1650
Text Notes 4050 7450 0    50   ~ 0
COL != 3
Text Notes 5550 6950 0    50   ~ 0
A = SYNC(COL=2-3) MOD 32\nB = else
Text Notes 8300 1650 0    50   ~ 0
IF FLIP\nInput is LINE-1\nELSE\nInput is LINE
Text Label 1400 6050 2    50   ~ 0
COL4
Text Label 1750 1900 2    50   ~ 0
COL8
Text Label 1750 2000 2    50   ~ 0
COL7
Text Label 1750 2100 2    50   ~ 0
COL6
Text Label 1750 2200 2    50   ~ 0
COL5
Text Label 1750 3400 2    50   ~ 0
COL4
Text Label 1750 3500 2    50   ~ 0
COL3
Text Label 1750 3600 2    50   ~ 0
COL2
Text Label 1750 4600 2    50   ~ 0
COL1
Text Label 1850 7550 0    50   ~ 0
~RESET
Text Label 2800 3400 0    50   ~ 0
_FWE
Text Label 3000 6250 0    50   ~ 0
~CLK4M
Text Label 3400 6800 2    50   ~ 0
_FWE
Text Label 4200 1950 0    50   ~ 0
~RX-A7
Text Label 4200 2400 0    50   ~ 0
~RX-A6
Text Label 4200 2850 0    50   ~ 0
~RX-A5
Text Label 4200 3300 0    50   ~ 0
~RX-A4
Text Label 4200 3750 0    50   ~ 0
~RX-A3
Text Label 4200 4200 0    50   ~ 0
~RX-A2
Text Label 4200 4650 0    50   ~ 0
~RX-A1
Text Label 4200 5200 0    50   ~ 0
~RX-A0
Text Label 4450 6900 2    50   ~ 0
COL1
Text Label 5850 1150 2    50   ~ 0
LINE6
Text Label 5850 1650 2    50   ~ 0
LINE5
Text Label 5850 2150 2    50   ~ 0
LINE4
Text Label 5850 2650 2    50   ~ 0
LINE3
Text Label 5850 3150 2    50   ~ 0
LINE2
Text Label 5850 3650 2    50   ~ 0
LINE1
Text Label 5850 4150 2    50   ~ 0
LINE0
Text Label 6700 1100 2    50   ~ 0
LINE7
Text Label 6700 1600 2    50   ~ 0
LINE6
Text Label 6700 2100 2    50   ~ 0
LINE5
Text Label 6700 2600 2    50   ~ 0
LINE4
Text Label 6700 3100 2    50   ~ 0
LINE3
Text Label 6700 3600 2    50   ~ 0
LINE2
Text Label 6700 4100 2    50   ~ 0
LINE1
Text Label 6700 4600 2    50   ~ 0
LINE0
Text Label 7400 2800 0    50   ~ 0
~RESET
Text Label 9250 6250 2    50   ~ 0
~CLK4M
Text Label 10200 1900 2    50   ~ 0
~RY-A7
Text Label 10200 2350 2    50   ~ 0
~RY-A6
Text Label 10200 2600 2    50   ~ 0
~RY-A5
Text Label 10200 2800 2    50   ~ 0
~RY-A4
Text Label 10200 3250 2    50   ~ 0
~RY-A3
Text Label 10200 3350 2    50   ~ 0
~RY-A2
Text Label 10200 3450 2    50   ~ 0
~RY-A1
Text Label 10200 3550 2    50   ~ 0
~RY-A0
Text HLabel 1200 7550 0    50   Input ~ 0
MAIN-RESET
Text HLabel 1300 1650 0    50   Input ~ 0
COL[1..8]
Text HLabel 1300 3700 0    50   Input ~ 0
_WRITE-MODE
Text HLabel 1400 6350 0    50   Input ~ 0
~CLK8M4M
Text HLabel 1750 5850 0    50   Input ~ 0
_~R-OE
Text HLabel 1750 5950 0    50   Input ~ 0
_~W-OE
Text HLabel 1750 6150 0    50   Input ~ 0
_~W-CAS-E
Text HLabel 2600 7150 0    50   Input ~ 0
~COL=3
Text HLabel 2600 7350 0    50   Input ~ 0
~CLK8M4M
Text HLabel 2800 5850 2    50   Output ~ 0
~R-OE
Text HLabel 2800 5950 2    50   Output ~ 0
~W-OE
Text HLabel 2800 6050 2    50   Output ~ 0
W-CAS
Text HLabel 3050 5050 0    50   Input ~ 0
CLK4M
Text HLabel 3050 5250 0    50   Input ~ 0
~FLIP
Text HLabel 3100 3400 2    50   Output ~ 0
_FWE
Text HLabel 3450 7350 0    50   Input ~ 0
CLK4M
Text HLabel 3800 6200 2    50   Output ~ 0
~W-CAS-E
Text HLabel 4700 1700 2    50   Output ~ 0
~RX-A[0..7]
Text HLabel 5000 6850 2    50   Output ~ 0
ADDR-X~Y~
Text HLabel 5000 7250 2    50   Output ~ 0
R-CAS
Text HLabel 5050 5750 0    50   Input ~ 0
_FRAS
Text HLabel 5050 5950 0    50   Input ~ 0
~CLK8M
Text HLabel 5400 800  0    50   Input ~ 0
LINE[0..7]
Text HLabel 5700 4700 0    50   Input ~ 0
~FLIP
Text HLabel 6750 5550 2    50   Output ~ 0
~WRITE-MODE
Text HLabel 6750 5750 2    50   Output ~ 0
~FRAS
Text HLabel 7850 3000 2    50   Input ~ 0
~CLK8M4M
Text HLabel 8350 6250 0    50   Input ~ 0
CLK4M
Text HLabel 8400 5850 0    50   Input ~ 0
SCAN-240-245
Text HLabel 9550 5950 2    50   Output ~ 0
~SCAN-240-245
Text HLabel 10450 1650 2    50   Output ~ 0
~RY-A[0..7]
$Comp
L power:VCC #PWR0230
U 1 1 618CAA82
P 5150 5050
F 0 "#PWR0230" H 5150 4900 50  0001 C CNN
F 1 "VCC" H 5165 5223 50  0000 C CNN
F 2 "" H 5150 5050 50  0001 C CNN
F 3 "" H 5150 5050 50  0001 C CNN
	1    5150 5050
	1    0    0    -1  
$EndComp
$Comp
L A5C:OR02 UDL?
U 1 1 6165CCDE
P 3500 6200
AR Path="/613100A2/613B471F/6165CCDE" Ref="UDL?"  Part="1" 
AR Path="/613100A2/6134DE5F/6165CCDE" Ref="UDL83"  Part="1" 
F 0 "UDL83" H 3525 6467 50  0000 C CNN
F 1 "OR02" H 3525 6376 50  0000 C CNN
F 2 "" H 3550 6200 50  0001 C CNN
F 3 "" H 3550 6200 50  0001 C CNN
	1    3500 6200
	1    0    0    -1  
$EndComp
$Comp
L A5C:NAND02 UDI47
U 1 1 6710C0BE
P 3700 7300
F 0 "UDI47" H 3725 7567 50  0000 C CNN
F 1 "NAND02" H 3725 7476 50  0000 C CNN
F 2 "" H 3700 7300 50  0001 C CNN
F 3 "" H 3700 7300 50  0001 C CNN
	1    3700 7300
	1    0    0    -1  
$EndComp
$Comp
L A5C:AND02 UDG49
U 1 1 6ACDC6C0
P 3900 1050
F 0 "UDG49" H 3925 1317 50  0000 C CNN
F 1 "AND02" H 3925 1226 50  0000 C CNN
F 2 "" H 3900 1050 50  0001 C CNN
F 3 "" H 3900 1050 50  0001 C CNN
	1    3900 1050
	1    0    0    -1  
$EndComp
$Comp
L A5C:AND02 UDH78
U 1 1 6ACDE37E
P 3900 1500
F 0 "UDH78" H 3925 1767 50  0000 C CNN
F 1 "AND02" H 3925 1676 50  0000 C CNN
F 2 "" H 3900 1500 50  0001 C CNN
F 3 "" H 3900 1500 50  0001 C CNN
	1    3900 1500
	1    0    0    -1  
$EndComp
$Comp
L A5C:NAND02 UDG88
U 1 1 66A0E4CA
P 3900 1950
F 0 "UDG88" H 3925 2217 50  0000 C CNN
F 1 "NAND02" H 3925 2126 50  0000 C CNN
F 2 "" H 3900 1950 50  0001 C CNN
F 3 "" H 3900 1950 50  0001 C CNN
	1    3900 1950
	1    0    0    -1  
$EndComp
$Comp
L A5C:NAND02 UDH74
U 1 1 66A0FC03
P 3900 2400
F 0 "UDH74" H 3925 2667 50  0000 C CNN
F 1 "NAND02" H 3925 2576 50  0000 C CNN
F 2 "" H 3900 2400 50  0001 C CNN
F 3 "" H 3900 2400 50  0001 C CNN
	1    3900 2400
	1    0    0    -1  
$EndComp
$Comp
L A5C:NAND02 UDH70
U 1 1 66A10122
P 3900 2850
F 0 "UDH70" H 3925 3117 50  0000 C CNN
F 1 "NAND02" H 3925 3026 50  0000 C CNN
F 2 "" H 3900 2850 50  0001 C CNN
F 3 "" H 3900 2850 50  0001 C CNN
	1    3900 2850
	1    0    0    -1  
$EndComp
$Comp
L A5C:NAND02 UDH82
U 1 1 66A1058D
P 3900 3300
F 0 "UDH82" H 3925 3567 50  0000 C CNN
F 1 "NAND02" H 3925 3476 50  0000 C CNN
F 2 "" H 3900 3300 50  0001 C CNN
F 3 "" H 3900 3300 50  0001 C CNN
	1    3900 3300
	1    0    0    -1  
$EndComp
$Comp
L A5C:NAND02 UDG52
U 1 1 66C27020
P 3900 3750
F 0 "UDG52" H 3925 4017 50  0000 C CNN
F 1 "NAND02" H 3925 3926 50  0000 C CNN
F 2 "" H 3900 3750 50  0001 C CNN
F 3 "" H 3900 3750 50  0001 C CNN
	1    3900 3750
	1    0    0    -1  
$EndComp
$Comp
L A5C:NAND02 UDH46
U 1 1 66C27026
P 3900 4200
F 0 "UDH46" H 3925 4467 50  0000 C CNN
F 1 "NAND02" H 3925 4376 50  0000 C CNN
F 2 "" H 3900 4200 50  0001 C CNN
F 3 "" H 3900 4200 50  0001 C CNN
	1    3900 4200
	1    0    0    -1  
$EndComp
$Comp
L A5C:OR02 UDI44
U 1 1 6A98A8A7
P 3900 4650
F 0 "UDI44" H 3925 4917 50  0000 C CNN
F 1 "OR02" H 3925 4826 50  0000 C CNN
F 2 "" H 3950 4650 50  0001 C CNN
F 3 "" H 3950 4650 50  0001 C CNN
	1    3900 4650
	1    0    0    -1  
$EndComp
$Comp
L A5C:NAND02 UDI?
U 1 1 61555D82
P 4700 6850
AR Path="/613100A2/612DDDDA/61555D82" Ref="UDI?"  Part="1" 
AR Path="/613100A2/6134DE5F/61555D82" Ref="UDI49"  Part="1" 
F 0 "UDI49" H 4725 7117 50  0000 C CNN
F 1 "NAND02" H 4725 7026 50  0000 C CNN
F 2 "" H 4700 6850 50  0001 C CNN
F 3 "" H 4700 6850 50  0001 C CNN
	1    4700 6850
	1    0    0    -1  
$EndComp
$Comp
L A5C:NAND02 UDI51
U 1 1 67228CC5
P 4700 7250
F 0 "UDI51" H 4725 7517 50  0000 C CNN
F 1 "NAND02" H 4725 7426 50  0000 C CNN
F 2 "" H 4700 7250 50  0001 C CNN
F 3 "" H 4700 7250 50  0001 C CNN
	1    4700 7250
	1    0    0    -1  
$EndComp
$Comp
L A5C:OR02 UDH107
U 1 1 61118E72
P 6100 1200
F 0 "UDH107" H 6125 1467 50  0000 C CNN
F 1 "OR02" H 6125 1376 50  0000 C CNN
F 2 "" H 6150 1200 50  0001 C CNN
F 3 "" H 6150 1200 50  0001 C CNN
	1    6100 1200
	1    0    0    1   
$EndComp
$Comp
L A5C:OR02 UDH137
U 1 1 61118E73
P 6100 1700
F 0 "UDH137" H 6125 1967 50  0000 C CNN
F 1 "OR02" H 6125 1876 50  0000 C CNN
F 2 "" H 6150 1700 50  0001 C CNN
F 3 "" H 6150 1700 50  0001 C CNN
	1    6100 1700
	1    0    0    1   
$EndComp
$Comp
L A5C:OR02 UDI135
U 1 1 61118E74
P 6100 2200
F 0 "UDI135" H 6125 2467 50  0000 C CNN
F 1 "OR02" H 6125 2376 50  0000 C CNN
F 2 "" H 6150 2200 50  0001 C CNN
F 3 "" H 6150 2200 50  0001 C CNN
	1    6100 2200
	1    0    0    1   
$EndComp
$Comp
L A5C:OR02 UDI142
U 1 1 61118E70
P 6100 2700
F 0 "UDI142" H 6125 2967 50  0000 C CNN
F 1 "OR02" H 6125 2876 50  0000 C CNN
F 2 "" H 6150 2700 50  0001 C CNN
F 3 "" H 6150 2700 50  0001 C CNN
	1    6100 2700
	1    0    0    1   
$EndComp
$Comp
L A5C:OR02 UDK102
U 1 1 61118E7D
P 6100 3200
F 0 "UDK102" H 6125 3467 50  0000 C CNN
F 1 "OR02" H 6125 3376 50  0000 C CNN
F 2 "" H 6150 3200 50  0001 C CNN
F 3 "" H 6150 3200 50  0001 C CNN
	1    6100 3200
	1    0    0    1   
$EndComp
$Comp
L A5C:OR02 UDJ93
U 1 1 61118E7A
P 6100 3700
F 0 "UDJ93" H 6125 3967 50  0000 C CNN
F 1 "OR02" H 6125 3876 50  0000 C CNN
F 2 "" H 6150 3700 50  0001 C CNN
F 3 "" H 6150 3700 50  0001 C CNN
	1    6100 3700
	1    0    0    1   
$EndComp
$Comp
L A5C:OR02 UDJ65
U 1 1 61118E7F
P 6100 4200
F 0 "UDJ65" H 6125 4467 50  0000 C CNN
F 1 "OR02" H 6125 4376 50  0000 C CNN
F 2 "" H 6150 4200 50  0001 C CNN
F 3 "" H 6150 4200 50  0001 C CNN
	1    6100 4200
	1    0    0    1   
$EndComp
$Comp
L A5C:XNOR02 UDH?
U 1 1 61118E75
P 6950 1150
AR Path="/61118E75" Ref="UDH?"  Part="1" 
AR Path="/613100A2/61118E75" Ref="UDH75"  Part="1" 
AR Path="/613100A2/6134DE5F/61118E75" Ref="UDH75"  Part="1" 
F 0 "UDH75" H 6975 1417 50  0000 C CNN
F 1 "XNOR02" H 6975 1326 50  0000 C CNN
F 2 "" H 6975 1150 50  0001 C CNN
F 3 "" H 6975 1150 50  0001 C CNN
	1    6950 1150
	1    0    0    -1  
$EndComp
$Comp
L A5C:XNOR02 UDH?
U 1 1 61118E71
P 6950 1650
AR Path="/61118E71" Ref="UDH?"  Part="1" 
AR Path="/613100A2/61118E71" Ref="UDH84"  Part="1" 
AR Path="/613100A2/6134DE5F/61118E71" Ref="UDH84"  Part="1" 
F 0 "UDH84" H 6975 1917 50  0000 C CNN
F 1 "XNOR02" H 6975 1826 50  0000 C CNN
F 2 "" H 6975 1650 50  0001 C CNN
F 3 "" H 6975 1650 50  0001 C CNN
	1    6950 1650
	1    0    0    -1  
$EndComp
$Comp
L A5C:XNOR02 UDI?
U 1 1 61118E6E
P 6950 2150
AR Path="/61118E6E" Ref="UDI?"  Part="1" 
AR Path="/613100A2/61118E6E" Ref="UDH139"  Part="1" 
AR Path="/613100A2/6134DE5F/61118E6E" Ref="UDH139"  Part="1" 
F 0 "UDH139" H 6975 2417 50  0000 C CNN
F 1 "XNOR02" H 6975 2326 50  0000 C CNN
F 2 "" H 6975 2150 50  0001 C CNN
F 3 "" H 6975 2150 50  0001 C CNN
	1    6950 2150
	1    0    0    -1  
$EndComp
$Comp
L A5C:XNOR02 UDL?
U 1 1 61118E6F
P 6950 2650
AR Path="/61118E6F" Ref="UDL?"  Part="1" 
AR Path="/613100A2/61118E6F" Ref="UDI107"  Part="1" 
AR Path="/613100A2/6134DE5F/61118E6F" Ref="UDI107"  Part="1" 
F 0 "UDI107" H 6975 2917 50  0000 C CNN
F 1 "XNOR02" H 6975 2826 50  0000 C CNN
F 2 "" H 6975 2650 50  0001 C CNN
F 3 "" H 6975 2650 50  0001 C CNN
	1    6950 2650
	1    0    0    -1  
$EndComp
$Comp
L A5C:XNOR02 UDJ?
U 1 1 61118E6D
P 6950 3150
AR Path="/61118E6D" Ref="UDJ?"  Part="1" 
AR Path="/613100A2/61118E6D" Ref="UDL128"  Part="1" 
AR Path="/613100A2/6134DE5F/61118E6D" Ref="UDL128"  Part="1" 
F 0 "UDL128" H 6975 3417 50  0000 C CNN
F 1 "XNOR02" H 6975 3326 50  0000 C CNN
F 2 "" H 6975 3150 50  0001 C CNN
F 3 "" H 6975 3150 50  0001 C CNN
	1    6950 3150
	1    0    0    -1  
$EndComp
$Comp
L A5C:XNOR02 UDI?
U 1 1 61118E7B
P 6950 3650
AR Path="/61118E7B" Ref="UDI?"  Part="1" 
AR Path="/613100A2/61118E7B" Ref="UDJ99"  Part="1" 
AR Path="/613100A2/6134DE5F/61118E7B" Ref="UDJ99"  Part="1" 
F 0 "UDJ99" H 6975 3917 50  0000 C CNN
F 1 "XNOR02" H 6975 3826 50  0000 C CNN
F 2 "" H 6975 3650 50  0001 C CNN
F 3 "" H 6975 3650 50  0001 C CNN
	1    6950 3650
	1    0    0    -1  
$EndComp
$Comp
L A5C:XNOR02 UDD?
U 1 1 61118E7C
P 6950 4150
AR Path="/61118E7C" Ref="UDD?"  Part="1" 
AR Path="/613100A2/61118E7C" Ref="UDI79"  Part="1" 
AR Path="/613100A2/6134DE5F/61118E7C" Ref="UDI79"  Part="1" 
F 0 "UDI79" H 6975 4417 50  0000 C CNN
F 1 "XNOR02" H 6975 4326 50  0000 C CNN
F 2 "" H 6975 4150 50  0001 C CNN
F 3 "" H 6975 4150 50  0001 C CNN
	1    6950 4150
	1    0    0    -1  
$EndComp
$Comp
L A5C:XNOR02 UDI?
U 1 1 61118E7E
P 6950 4650
AR Path="/61118E7E" Ref="UDI?"  Part="1" 
AR Path="/613100A2/61118E7E" Ref="UDI73"  Part="1" 
AR Path="/613100A2/6134DE5F/61118E7E" Ref="UDI73"  Part="1" 
F 0 "UDI73" H 6975 4917 50  0000 C CNN
F 1 "XNOR02" H 6975 4826 50  0000 C CNN
F 2 "" H 6975 4650 50  0001 C CNN
F 3 "" H 6975 4650 50  0001 C CNN
	1    6950 4650
	1    0    0    -1  
$EndComp
$Comp
L A5C:XNOR02 UDF49
U 1 1 61118E78
P 9550 1900
F 0 "UDF49" H 9575 2167 50  0000 C CNN
F 1 "XNOR02" H 9575 2076 50  0000 C CNN
F 2 "" H 9575 1900 50  0001 C CNN
F 3 "" H 9575 1900 50  0001 C CNN
	1    9550 1900
	1    0    0    -1  
$EndComp
$Comp
L A5C:XNOR02 UDH68
U 1 1 61118E79
P 9550 2350
F 0 "UDH68" H 9575 2617 50  0000 C CNN
F 1 "XNOR02" H 9575 2526 50  0000 C CNN
F 2 "" H 9575 2350 50  0001 C CNN
F 3 "" H 9575 2350 50  0001 C CNN
	1    9550 2350
	1    0    0    -1  
$EndComp
$Comp
L A5C:INV01 UDG?
U 1 1 78774959
P 1500 7550
AR Path="/78774959" Ref="UDG?"  Part="1" 
AR Path="/613100A2/78774959" Ref="UDG95"  Part="1" 
AR Path="/613100A2/6134DE5F/78774959" Ref="UDG95"  Part="1" 
F 0 "UDG95" H 1500 7867 50  0000 C CNN
F 1 "INV01" H 1500 7776 50  0000 C CNN
F 2 "" H 1500 7350 50  0001 C CNN
F 3 "" H 1500 7350 50  0001 C CNN
	1    1500 7550
	1    0    0    -1  
$EndComp
$Comp
L A5C:INV01 UDI48
U 1 1 6162B9CC
P 3700 6800
F 0 "UDI48" H 3700 7117 50  0000 C CNN
F 1 "INV01" H 3700 7026 50  0000 C CNN
F 2 "" H 3700 6600 50  0001 C CNN
F 3 "" H 3700 6600 50  0001 C CNN
	1    3700 6800
	1    0    0    -1  
$EndComp
$Comp
L A5C:NBUF03 UDL95
U 1 1 6A451E64
P 6450 5750
F 0 "UDL95" H 6450 6067 50  0000 C CNN
F 1 "NBUF03" H 6450 5976 50  0000 C CNN
F 2 "" H 6450 5550 50  0001 C CNN
F 3 "" H 6450 5550 50  0001 C CNN
	1    6450 5750
	1    0    0    1   
$EndComp
$Comp
L A5C:NBUF02 UDD?
U 1 1 6163F3CC
P 8650 6250
AR Path="/613100A2/613B471F/6163F3CC" Ref="UDD?"  Part="1" 
AR Path="/613100A2/6134DE5F/6163F3CC" Ref="UDD130"  Part="1" 
F 0 "UDD130" H 8650 6567 50  0000 C CNN
F 1 "NBUF02" H 8650 6476 50  0000 C CNN
F 2 "" H 8650 6050 50  0001 C CNN
F 3 "" H 8650 6050 50  0001 C CNN
	1    8650 6250
	1    0    0    -1  
$EndComp
$Comp
L A5C:DFFCOO UDL?
U 1 1 6163F3D2
P 9300 5950
AR Path="/613100A2/613B471F/6163F3D2" Ref="UDL?"  Part="1" 
AR Path="/613100A2/6134DE5F/6163F3D2" Ref="UDL140"  Part="1" 
F 0 "UDL140" H 9300 6315 50  0000 C CNN
F 1 "DFFCOO" H 9300 6224 50  0000 C CNN
F 2 "" H 9300 5950 50  0001 C CNN
F 3 "" H 9300 5950 50  0001 C CNN
	1    9300 5950
	1    0    0    -1  
$EndComp
$Comp
L A5C:DFFCOR UDJ67
U 1 1 65573057
P 2850 7250
F 0 "UDJ67" H 2850 7615 50  0000 C CNN
F 1 "DFFCOR" H 2850 7524 50  0000 C CNN
F 2 "" H 2850 7250 50  0001 C CNN
F 3 "" H 2850 7250 50  0001 C CNN
	1    2850 7250
	1    0    0    -1  
$EndComp
$Comp
L A5C:AOI22 UDH43
U 1 1 6AA377A5
P 3750 5150
F 0 "UDH43" H 3775 5467 50  0000 C CNN
F 1 "AOI22" H 3775 5376 50  0000 C CNN
F 2 "" H 3900 5150 50  0001 C CNN
F 3 "" H 3900 5150 50  0001 C CNN
	1    3750 5150
	1    0    0    -1  
$EndComp
$Comp
L A5C:M175C UDH87
U 1 1 661275CE
P 2400 2200
F 0 "UDH87" H 2400 2765 50  0000 C CNN
F 1 "M175C" H 2400 2674 50  0000 C CNN
F 2 "" H 2400 2000 50  0001 C CNN
F 3 "" H 2400 2000 50  0001 C CNN
	1    2400 2200
	1    0    0    -1  
$EndComp
$Comp
L A5C:M175C UDL63
U 1 1 64BA8F79
P 2400 6150
F 0 "UDL63" H 2400 6715 50  0000 C CNN
F 1 "M175C" H 2400 6624 50  0000 C CNN
F 2 "" H 2400 5950 50  0001 C CNN
F 3 "" H 2400 5950 50  0001 C CNN
	1    2400 6150
	1    0    0    -1  
$EndComp
$Comp
L A5C:M175C UDL97
U 1 1 618350F2
P 5750 5750
F 0 "UDL97" H 5750 6315 50  0000 C CNN
F 1 "M175C" H 5750 6224 50  0000 C CNN
F 2 "" H 5750 5550 50  0001 C CNN
F 3 "" H 5750 5550 50  0001 C CNN
	1    5750 5750
	1    0    0    -1  
$EndComp
$Comp
L A5C:M175CL UDI53
U 1 1 61118E76
P 8500 3550
F 0 "UDI53" H 8500 4115 50  0000 C CNN
F 1 "M175CL" H 8500 4024 50  0000 C CNN
F 2 "" H 8500 3350 50  0001 C CNN
F 3 "" H 8500 3350 50  0001 C CNN
	1    8500 3550
	1    0    0    -1  
$EndComp
$Comp
L A5C:M175CLH UDK53
U 1 1 664D0DE6
P 2400 3700
F 0 "UDK53" H 2400 4265 50  0000 C CNN
F 1 "M175CLH" H 2400 4174 50  0000 C CNN
F 2 "" H 2400 3500 50  0001 C CNN
F 3 "" H 2400 3500 50  0001 C CNN
	1    2400 3700
	1    0    0    -1  
$EndComp
$Comp
L A5C:M175CLH UDH48
U 1 1 61118E77
P 8500 2400
F 0 "UDH48" H 8500 2965 50  0000 C CNN
F 1 "M175CLH" H 8500 2874 50  0000 C CNN
F 2 "" H 8500 2200 50  0001 C CNN
F 3 "" H 8500 2200 50  0001 C CNN
	1    8500 2400
	1    0    0    -1  
$EndComp
Text Notes 6800 5900 0    50   ~ 0
COL = ~3 mod 8
Text Notes 9250 1550 0    50   ~ 0
COL8 & WRITE
Text Notes 9250 2550 0    50   ~ 0
COL7 & WRITE
Wire Bus Line
	1400 1650 1400 4500
Wire Bus Line
	4600 1700 4600 5100
Wire Bus Line
	5500 800  5500 4050
Wire Bus Line
	10350 1650 10350 3450
$EndSCHEMATC
