EESchema Schematic File Version 4
EELAYER 30 0
EELAYER END
$Descr A4 11693 8268
encoding utf-8
Sheet 7 83
Title "CPS Reverse Engineering: DL-0311"
Date "2021-09-12"
Rev ""
Comp ""
Comment1 ""
Comment2 ""
Comment3 "Licence: CC-BY"
Comment4 "Author: Loïc *WydD* Petit"
$EndDescr
Connection ~ 4200 3750
Connection ~ 5750 3700
Connection ~ 7600 1400
Connection ~ 6900 1950
Connection ~ 6900 2650
Connection ~ 7600 3650
Connection ~ 7600 2550
Connection ~ 5850 3250
Connection ~ 5750 2600
Connection ~ 5850 2400
Connection ~ 2450 6100
Connection ~ 3700 3200
NoConn ~ 7500 1300
NoConn ~ 7500 3550
NoConn ~ 7500 2450
NoConn ~ 3450 6100
Entry Wire Line
	4900 1050 5000 1150
Entry Wire Line
	4900 2200 5000 2300
Entry Wire Line
	4900 3300 5000 3400
Entry Wire Line
	8200 1300 8100 1400
Entry Wire Line
	8200 2450 8100 2550
Entry Wire Line
	8200 3550 8100 3650
Wire Wire Line
	1950 5500 2450 5500
Wire Wire Line
	1950 5600 2450 5600
Wire Wire Line
	2450 5400 1950 5400
Wire Wire Line
	2450 6000 2450 6100
Wire Wire Line
	3300 3750 4200 3750
Wire Wire Line
	3450 5500 3900 5500
Wire Wire Line
	3450 5800 4000 5800
Wire Wire Line
	3450 6000 3800 6000
Wire Wire Line
	3700 3200 3300 3200
Wire Wire Line
	3700 3200 3700 3650
Wire Wire Line
	3700 3650 4300 3650
Wire Wire Line
	3800 4950 3800 5400
Wire Wire Line
	3800 4950 4650 4950
Wire Wire Line
	3800 5400 3450 5400
Wire Wire Line
	3800 6000 3800 7200
Wire Wire Line
	3800 7200 4050 7200
Wire Wire Line
	3900 5100 3900 5500
Wire Wire Line
	3900 5100 4650 5100
Wire Wire Line
	3900 5900 3450 5900
Wire Wire Line
	3900 6700 3900 5900
Wire Wire Line
	4000 5250 4000 5600
Wire Wire Line
	4000 5250 4650 5250
Wire Wire Line
	4000 5600 3450 5600
Wire Wire Line
	4000 5800 4000 6200
Wire Wire Line
	4000 6200 4050 6200
Wire Wire Line
	4050 5700 3450 5700
Wire Wire Line
	4050 6700 3900 6700
Wire Wire Line
	4200 3300 4200 3750
Wire Wire Line
	4200 3750 4300 3750
Wire Wire Line
	4300 3300 4200 3300
Wire Wire Line
	4850 3250 5850 3250
Wire Wire Line
	4850 3700 5750 3700
Wire Wire Line
	5000 1150 5950 1150
Wire Wire Line
	5000 2300 5950 2300
Wire Wire Line
	5000 3400 5950 3400
Wire Wire Line
	5650 1350 5650 1700
Wire Wire Line
	5650 1350 5950 1350
Wire Wire Line
	5650 2500 5650 2850
Wire Wire Line
	5650 3600 5650 3950
Wire Wire Line
	5650 3600 5950 3600
Wire Wire Line
	5650 3950 7600 3950
Wire Wire Line
	5750 1450 5750 2600
Wire Wire Line
	5750 2600 5750 3700
Wire Wire Line
	5750 2600 5950 2600
Wire Wire Line
	5850 1250 5850 2400
Wire Wire Line
	5850 2400 5850 3250
Wire Wire Line
	5850 2400 5950 2400
Wire Wire Line
	5850 3250 5850 3500
Wire Wire Line
	5950 1250 5850 1250
Wire Wire Line
	5950 1450 5750 1450
Wire Wire Line
	5950 2500 5650 2500
Wire Wire Line
	5950 3500 5850 3500
Wire Wire Line
	5950 3700 5750 3700
Wire Wire Line
	6800 2450 7000 2450
Wire Wire Line
	6800 3550 7000 3550
Wire Wire Line
	6900 1500 6900 1950
Wire Wire Line
	6900 1950 6550 1950
Wire Wire Line
	6900 1950 6900 2650
Wire Wire Line
	6900 2650 6900 3750
Wire Wire Line
	7000 1300 6800 1300
Wire Wire Line
	7000 1500 6900 1500
Wire Wire Line
	7000 2650 6900 2650
Wire Wire Line
	7000 3750 6900 3750
Wire Wire Line
	7600 1400 7500 1400
Wire Wire Line
	7600 1700 5650 1700
Wire Wire Line
	7600 1700 7600 1400
Wire Wire Line
	7600 2550 7500 2550
Wire Wire Line
	7600 2850 5650 2850
Wire Wire Line
	7600 2850 7600 2550
Wire Wire Line
	7600 3650 7500 3650
Wire Wire Line
	7600 3650 7600 3950
Wire Wire Line
	8100 1400 7600 1400
Wire Wire Line
	8100 2550 7600 2550
Wire Wire Line
	8100 3650 7600 3650
Wire Bus Line
	4900 900  4700 900 
Wire Bus Line
	8200 1150 8400 1150
Text Notes 5500 5100 0    50   ~ 0
WSTROM\n~2~ & ~1~ & ~0~
Text Notes 5500 5350 0    50   ~ 0
WSTOBJ\n~2~ & ~1~ & 0
Text Notes 5500 5550 0    50   ~ 0
ROWSCROLL\n~2~ & 1 & ~0
Text Notes 5500 5800 0    50   ~ 0
SCROLL1\n~2~ & 1 & 0
Text Notes 5500 6300 0    50   ~ 0
SCROLL2\n2 & ~1~ & ~0~
Text Notes 5500 6800 0    50   ~ 0
SCROLL3\n2 & ~1~ & 0
Text Notes 5500 7200 0    50   ~ 0
WSTLUT\n2 & 1 & ~0
Text Label 1950 5400 0    50   ~ 0
BUS-STATE0
Text Label 1950 5500 0    50   ~ 0
BUS-STATE1
Text Label 1950 5600 0    50   ~ 0
BUS-STATE2
Text Label 5050 1150 0    50   ~ 0
NEW-STATE0
Text Label 5050 2300 0    50   ~ 0
NEW-STATE1
Text Label 5050 3400 0    50   ~ 0
NEW-STATE2
Text Label 8100 1400 2    50   ~ 0
BUS-STATE0
Text Label 8100 2550 2    50   ~ 0
BUS-STATE1
Text Label 8100 3650 2    50   ~ 0
BUS-STATE2
Text HLabel 2450 5900 0    50   Input ~ 0
BUS-READY
Text HLabel 3300 3200 0    50   Input ~ 0
~LOAD-STATE
Text HLabel 3300 3750 0    50   Input ~ 0
~RESET
Text HLabel 4650 4950 2    50   Output ~ 0
~BUS-WSTROM
Text HLabel 4650 5100 2    50   Output ~ 0
~BUS-WSTOBJ
Text HLabel 4650 5250 2    50   Output ~ 0
~BUS-ROWSCROLL
Text HLabel 4650 5700 2    50   Output ~ 0
~BUS-SCROLL1
Text HLabel 4650 6200 2    50   Output ~ 0
~BUS-SCROLL2
Text HLabel 4650 6700 2    50   Output ~ 0
~BUS-SCROLL3
Text HLabel 4650 7200 2    50   Output ~ 0
~BUS-WSTLUT
Text HLabel 4700 900  0    50   Input ~ 0
NEW-STATE[0..2]
Text HLabel 8400 1150 2    50   Output ~ 0
BUS-STATE[0..2]
$Comp
L power:GND #PWR0144
U 1 1 68157394
P 2450 6100
F 0 "#PWR0144" H 2450 5850 50  0001 C CNN
F 1 "GND" H 2455 5927 50  0000 C CNN
F 2 "" H 2450 6100 50  0001 C CNN
F 3 "" H 2450 6100 50  0001 C CNN
	1    2450 6100
	1    0    0    -1  
$EndComp
$Comp
L A5C:AND02 UAB413
U 1 1 7D6B838C
P 4550 3250
F 0 "UAB413" H 4575 3517 50  0000 C CNN
F 1 "AND02" H 4575 3426 50  0000 C CNN
F 2 "" H 4550 3250 50  0001 C CNN
F 3 "" H 4550 3250 50  0001 C CNN
	1    4550 3250
	1    0    0    -1  
$EndComp
$Comp
L A5C:AND02 UAC415
U 1 1 7D6BE9EB
P 4550 3700
F 0 "UAC415" H 4575 3967 50  0000 C CNN
F 1 "AND02" H 4575 3876 50  0000 C CNN
F 2 "" H 4550 3700 50  0001 C CNN
F 3 "" H 4550 3700 50  0001 C CNN
	1    4550 3700
	1    0    0    -1  
$EndComp
$Comp
L A5C:INV01 UBD100
U 1 1 61118EFD
P 4000 3200
F 0 "UBD100" H 4000 3517 50  0000 C CNN
F 1 "INV01" H 4000 3426 50  0000 C CNN
F 2 "" H 4000 3000 50  0001 C CNN
F 3 "" H 4000 3000 50  0001 C CNN
	1    4000 3200
	1    0    0    -1  
$EndComp
$Comp
L A5C:BUF12 UCB330
U 1 1 659A4326
P 4350 5700
F 0 "UCB330" H 4350 6017 50  0000 C CNN
F 1 "BUF12" H 4350 5926 50  0000 C CNN
F 2 "" H 4350 5700 50  0001 C CNN
F 3 "" H 4350 5700 50  0001 C CNN
	1    4350 5700
	1    0    0    -1  
$EndComp
$Comp
L A5C:BUF12 UCC353
U 1 1 64A69A5D
P 4350 6200
F 0 "UCC353" H 4350 6517 50  0000 C CNN
F 1 "BUF12" H 4350 6426 50  0000 C CNN
F 2 "" H 4350 6200 50  0001 C CNN
F 3 "" H 4350 6200 50  0001 C CNN
	1    4350 6200
	1    0    0    -1  
$EndComp
$Comp
L A5C:BUF12 UCB349
U 1 1 67A6433C
P 4350 6700
F 0 "UCB349" H 4350 7017 50  0000 C CNN
F 1 "BUF12" H 4350 6926 50  0000 C CNN
F 2 "" H 4350 6700 50  0001 C CNN
F 3 "" H 4350 6700 50  0001 C CNN
	1    4350 6700
	1    0    0    -1  
$EndComp
$Comp
L A5C:BUF12 UEE308
U 1 1 7FCE8F1A
P 4350 7200
F 0 "UEE308" H 4350 7517 50  0000 C CNN
F 1 "BUF12" H 4350 7426 50  0000 C CNN
F 2 "" H 4350 7200 50  0001 C CNN
F 3 "" H 4350 7200 50  0001 C CNN
	1    4350 7200
	1    0    0    -1  
$EndComp
$Comp
L A5C:DFFCOO UAB375
U 1 1 68F252D2
P 7250 1400
F 0 "UAB375" H 7250 1765 50  0000 C CNN
F 1 "DFFCOO" H 7250 1674 50  0000 C CNN
F 2 "" H 7250 1400 50  0001 C CNN
F 3 "" H 7250 1400 50  0001 C CNN
	1    7250 1400
	1    0    0    -1  
$EndComp
$Comp
L A5C:DFFCOO UAA396
U 1 1 630B7C1A
P 7250 2550
F 0 "UAA396" H 7250 2915 50  0000 C CNN
F 1 "DFFCOO" H 7250 2824 50  0000 C CNN
F 2 "" H 7250 2550 50  0001 C CNN
F 3 "" H 7250 2550 50  0001 C CNN
	1    7250 2550
	1    0    0    -1  
$EndComp
$Comp
L A5C:DFFCOO UAA356
U 1 1 62F6A5B6
P 7250 3650
F 0 "UAA356" H 7250 4015 50  0000 C CNN
F 1 "DFFCOO" H 7250 3924 50  0000 C CNN
F 2 "" H 7250 3650 50  0001 C CNN
F 3 "" H 7250 3650 50  0001 C CNN
	1    7250 3650
	1    0    0    -1  
$EndComp
$Comp
L A5C:AOI22 UAA364
U 1 1 6961AF38
P 6350 1250
F 0 "UAA364" H 6375 1567 50  0000 C CNN
F 1 "AOI22" H 6375 1476 50  0000 C CNN
F 2 "" H 6500 1250 50  0001 C CNN
F 3 "" H 6500 1250 50  0001 C CNN
	1    6350 1250
	1    0    0    -1  
$EndComp
$Comp
L A5C:AOI22 UAA374
U 1 1 65B25422
P 6350 2400
F 0 "UAA374" H 6375 2717 50  0000 C CNN
F 1 "AOI22" H 6375 2626 50  0000 C CNN
F 2 "" H 6500 2400 50  0001 C CNN
F 3 "" H 6500 2400 50  0001 C CNN
	1    6350 2400
	1    0    0    -1  
$EndComp
$Comp
L A5C:AOI22 UAA361
U 1 1 65873A4E
P 6350 3500
F 0 "UAA361" H 6375 3817 50  0000 C CNN
F 1 "AOI22" H 6375 3726 50  0000 C CNN
F 2 "" H 6500 3500 50  0001 C CNN
F 3 "" H 6500 3500 50  0001 C CNN
	1    6350 3500
	1    0    0    -1  
$EndComp
$Comp
L A5C:D38GL UCC327
U 1 1 6805D5CB
P 2950 5750
F 0 "UCC327" H 2950 6367 50  0000 C CNN
F 1 "D38GL" H 2950 6276 50  0000 C CNN
F 2 "" H 2950 6275 50  0001 C CNN
F 3 "" H 2950 6275 50  0001 C CNN
	1    2950 5750
	1    0    0    -1  
$EndComp
Text HLabel 6550 1950 0    50   Input ~ 0
~CLK4M
Wire Bus Line
	4900 900  4900 3300
Wire Bus Line
	8200 1150 8200 3550
$EndSCHEMATC
