EESchema Schematic File Version 4
EELAYER 30 0
EELAYER END
$Descr A4 11693 8268
encoding utf-8
Sheet 54 83
Title "CPS Reverse Engineering: DL-0311"
Date "2021-09-12"
Rev ""
Comp ""
Comment1 ""
Comment2 ""
Comment3 "Licence: CC-BY"
Comment4 "Author: Loïc *WydD* Petit"
$EndDescr
Connection ~ 4500 4350
Connection ~ 8650 2800
Connection ~ 9650 1200
Connection ~ 8650 3750
Connection ~ 1400 1400
NoConn ~ 9250 1950
NoConn ~ 9250 2600
Entry Wire Line
	1400 1850 1500 1950
Entry Wire Line
	1400 2350 1500 2450
Entry Wire Line
	1400 2850 1500 2950
Entry Wire Line
	1400 3350 1500 3450
Entry Wire Line
	1400 3850 1500 3950
Entry Wire Line
	1400 4350 1500 4450
Entry Wire Line
	1400 4850 1500 4950
Entry Wire Line
	1400 5350 1500 5450
Entry Wire Line
	5700 2550 5800 2450
Entry Wire Line
	5700 2650 5800 2550
Entry Wire Line
	5700 2750 5800 2650
Entry Wire Line
	5700 2850 5800 2750
Entry Wire Line
	5700 4550 5800 4450
Entry Wire Line
	5700 4650 5800 4550
Entry Wire Line
	5700 4750 5800 4650
Entry Wire Line
	5700 4850 5800 4750
Entry Wire Line
	6400 1850 6500 1950
Entry Wire Line
	6400 2500 6500 2600
Entry Wire Line
	9550 2050 9650 1950
Entry Wire Line
	9550 2700 9650 2600
Wire Wire Line
	1750 1950 1500 1950
Wire Wire Line
	1750 2450 1500 2450
Wire Wire Line
	1750 2950 1500 2950
Wire Wire Line
	1750 3450 1500 3450
Wire Wire Line
	1750 3950 1500 3950
Wire Wire Line
	1750 4450 1500 4450
Wire Wire Line
	1750 4950 1500 4950
Wire Wire Line
	1750 5450 1500 5450
Wire Wire Line
	3550 2450 3650 2450
Wire Wire Line
	3550 2950 3650 2950
Wire Wire Line
	3550 3450 3750 3450
Wire Wire Line
	3550 3950 4300 3950
Wire Wire Line
	3550 4450 3750 4450
Wire Wire Line
	3550 4950 4300 4950
Wire Wire Line
	3550 5450 4400 5450
Wire Wire Line
	3650 2450 3650 2650
Wire Wire Line
	3650 2650 4600 2650
Wire Wire Line
	3650 2750 3650 2950
Wire Wire Line
	3650 2750 4600 2750
Wire Wire Line
	3750 1950 3550 1950
Wire Wire Line
	3750 2550 3750 1950
Wire Wire Line
	3750 2550 4600 2550
Wire Wire Line
	3750 2850 4600 2850
Wire Wire Line
	3750 3450 3750 2850
Wire Wire Line
	3750 4600 3750 4450
Wire Wire Line
	4300 3950 4300 4550
Wire Wire Line
	4300 4550 4600 4550
Wire Wire Line
	4300 4650 4600 4650
Wire Wire Line
	4300 4750 4300 4950
Wire Wire Line
	4300 4750 4600 4750
Wire Wire Line
	4400 4850 4600 4850
Wire Wire Line
	4400 5450 4400 4850
Wire Wire Line
	4500 2350 4500 4350
Wire Wire Line
	4500 4350 4500 5800
Wire Wire Line
	4500 5800 8650 5800
Wire Wire Line
	4600 2350 4500 2350
Wire Wire Line
	4600 4350 4500 4350
Wire Wire Line
	5400 2550 5700 2550
Wire Wire Line
	5400 2650 5700 2650
Wire Wire Line
	5400 2750 5700 2750
Wire Wire Line
	5400 2850 5700 2850
Wire Wire Line
	5400 4550 5700 4550
Wire Wire Line
	5400 4650 5700 4650
Wire Wire Line
	5400 4750 5700 4750
Wire Wire Line
	5400 4850 5700 4850
Wire Wire Line
	6750 1950 6500 1950
Wire Wire Line
	6750 2600 6500 2600
Wire Wire Line
	8550 2600 8750 2600
Wire Wire Line
	8650 2150 8650 2800
Wire Wire Line
	8650 2800 8650 3750
Wire Wire Line
	8650 3750 8000 3750
Wire Wire Line
	8650 3750 8650 5800
Wire Wire Line
	8750 1950 8550 1950
Wire Wire Line
	8750 2150 8650 2150
Wire Wire Line
	8750 2800 8650 2800
Wire Wire Line
	9250 2050 9550 2050
Wire Wire Line
	9250 2700 9550 2700
Wire Bus Line
	1200 1400 1400 1400
Wire Bus Line
	1400 1400 1400 5350
Wire Bus Line
	1400 1400 6400 1400
Wire Bus Line
	5800 1200 5800 4750
Wire Bus Line
	5800 1200 9650 1200
Wire Bus Line
	6400 1400 6400 2500
Wire Bus Line
	9650 1200 9650 2600
Wire Bus Line
	9650 1200 10550 1200
Text Label 1750 1950 2    50   ~ 0
IN0
Text Label 1750 2450 2    50   ~ 0
IN1
Text Label 1750 2950 2    50   ~ 0
IN2
Text Label 1750 3450 2    50   ~ 0
IN3
Text Label 1750 3950 2    50   ~ 0
IN4
Text Label 1750 4450 2    50   ~ 0
IN5
Text Label 1750 4950 2    50   ~ 0
IN6
Text Label 1750 5450 2    50   ~ 0
IN7
Text Label 5400 2550 0    50   ~ 0
~OUT0
Text Label 5400 2650 0    50   ~ 0
~OUT1
Text Label 5400 2750 0    50   ~ 0
~OUT2
Text Label 5400 2850 0    50   ~ 0
~OUT3
Text Label 5400 4550 0    50   ~ 0
~OUT4
Text Label 5400 4650 0    50   ~ 0
~OUT5
Text Label 5400 4750 0    50   ~ 0
~OUT6
Text Label 5400 4850 0    50   ~ 0
~OUT7
Text Label 6750 1950 2    50   ~ 0
IN8
Text Label 6750 2600 2    50   ~ 0
IN9
Text Label 9300 2050 0    50   ~ 0
~OUT8
Text Label 9300 2700 0    50   ~ 0
~OUT9
Text HLabel 1200 1400 0    50   Input ~ 0
IN[0..9]
Text HLabel 3750 4700 0    50   Input ~ 0
XFLIP
Text HLabel 8000 3750 0    50   Input ~ 0
CLK
Text HLabel 10550 1200 2    50   Output ~ 0
~OUT[0..9]
$Comp
L power:VCC #PWR?
U 1 1 617AF1A5
P 4600 2250
AR Path="/7FFFFFFF/60A9C2DF/617AF1A5" Ref="#PWR?"  Part="1" 
AR Path="/7FFFFFFF/6178A503/617AF1A5" Ref="#PWR0194"  Part="1" 
AR Path="/61118D89/6178A503/617AF1A5" Ref="#PWR0194"  Part="1" 
AR Path="/61116467/61117C32/6178A503/617AF1A5" Ref="#PWR0194"  Part="1" 
AR Path="/6112ED27/6178A503/617AF1A5" Ref="#PWR0194"  Part="1" 
AR Path="/612E497E/612E4DFA/6178A503/617AF1A5" Ref="#PWR0194"  Part="1" 
F 0 "#PWR0194" H 4600 2100 50  0001 C CNN
F 1 "VCC" H 4615 2423 50  0000 C CNN
F 2 "" H 4600 2250 50  0001 C CNN
F 3 "" H 4600 2250 50  0001 C CNN
	1    4600 2250
	1    0    0    -1  
$EndComp
$Comp
L power:VCC #PWR?
U 1 1 617AF1AB
P 4600 4250
AR Path="/7FFFFFFF/60A9C2DF/617AF1AB" Ref="#PWR?"  Part="1" 
AR Path="/7FFFFFFF/6178A503/617AF1AB" Ref="#PWR0195"  Part="1" 
AR Path="/61118D89/6178A503/617AF1AB" Ref="#PWR0195"  Part="1" 
AR Path="/61116467/61117C32/6178A503/617AF1AB" Ref="#PWR0195"  Part="1" 
AR Path="/6112ED27/6178A503/617AF1AB" Ref="#PWR0195"  Part="1" 
AR Path="/612E497E/612E4DFA/6178A503/617AF1AB" Ref="#PWR0195"  Part="1" 
F 0 "#PWR0195" H 4600 4100 50  0001 C CNN
F 1 "VCC" H 4615 4423 50  0000 C CNN
F 2 "" H 4600 4250 50  0001 C CNN
F 3 "" H 4600 4250 50  0001 C CNN
	1    4600 4250
	1    0    0    -1  
$EndComp
$Comp
L A5C:XNOR02 UAD120
U 1 1 61118F35
P 4000 4650
AR Path="/7FFFFFFF/6178A503/61118F35" Ref="UAD120"  Part="1" 
AR Path="/61118D89/6178A503/61118F35" Ref="UAD120"  Part="1" 
AR Path="/61116467/61117C32/6178A503/61118F35" Ref="UAD120"  Part="1" 
AR Path="/6112ED27/6178A503/61118F35" Ref="UAD120"  Part="1" 
AR Path="/612E497E/612E4DFA/6178A503/61118F35" Ref="UAD120"  Part="1" 
F 0 "UAD120" H 4025 4917 50  0000 C CNN
F 1 "XNOR02" H 4025 4826 50  0000 C CNN
F 2 "" H 4025 4650 50  0001 C CNN
F 3 "" H 4025 4650 50  0001 C CNN
	1    4000 4650
	1    0    0    -1  
$EndComp
$Comp
L A5C:BUF12 UAD?
U 1 1 617AF050
P 2050 1950
AR Path="/617AF050/60A9C2DF/617AF050" Ref="UAD?"  Part="1" 
AR Path="/7FFFFFFF/6178A503/617AF050" Ref="UAD98"  Part="1" 
AR Path="/61118D89/6178A503/617AF050" Ref="UAD98"  Part="1" 
AR Path="/61116467/61117C32/6178A503/617AF050" Ref="UAD98"  Part="1" 
AR Path="/6112ED27/6178A503/617AF050" Ref="UAD98"  Part="1" 
AR Path="/612E497E/612E4DFA/6178A503/617AF050" Ref="UAD98"  Part="1" 
F 0 "UAD98" H 2050 2267 50  0000 C CNN
F 1 "BUF11" H 2050 2176 50  0000 C CNN
F 2 "" H 2050 1950 50  0001 C CNN
F 3 "" H 2050 1950 50  0001 C CNN
	1    2050 1950
	1    0    0    -1  
$EndComp
$Comp
L A5C:BUF12 UAA?
U 1 1 617AF056
P 2050 2450
AR Path="/617AF056/60A9C2DF/617AF056" Ref="UAA?"  Part="1" 
AR Path="/7FFFFFFF/6178A503/617AF056" Ref="UAD100"  Part="1" 
AR Path="/61118D89/6178A503/617AF056" Ref="UAD100"  Part="1" 
AR Path="/61116467/61117C32/6178A503/617AF056" Ref="UAD100"  Part="1" 
AR Path="/6112ED27/6178A503/617AF056" Ref="UAD100"  Part="1" 
AR Path="/612E497E/612E4DFA/6178A503/617AF056" Ref="UAD100"  Part="1" 
F 0 "UAD100" H 2050 2767 50  0000 C CNN
F 1 "BUF11" H 2050 2676 50  0000 C CNN
F 2 "" H 2050 2450 50  0001 C CNN
F 3 "" H 2050 2450 50  0001 C CNN
	1    2050 2450
	1    0    0    -1  
$EndComp
$Comp
L A5C:BUF12 UAC?
U 1 1 617AF05C
P 2050 2950
AR Path="/617AF05C/60A9C2DF/617AF05C" Ref="UAC?"  Part="1" 
AR Path="/7FFFFFFF/6178A503/617AF05C" Ref="UAC92"  Part="1" 
AR Path="/61118D89/6178A503/617AF05C" Ref="UAC92"  Part="1" 
AR Path="/61116467/61117C32/6178A503/617AF05C" Ref="UAC92"  Part="1" 
AR Path="/6112ED27/6178A503/617AF05C" Ref="UAC92"  Part="1" 
AR Path="/612E497E/612E4DFA/6178A503/617AF05C" Ref="UAC92"  Part="1" 
F 0 "UAC92" H 2050 3267 50  0000 C CNN
F 1 "BUF11" H 2050 3176 50  0000 C CNN
F 2 "" H 2050 2950 50  0001 C CNN
F 3 "" H 2050 2950 50  0001 C CNN
	1    2050 2950
	1    0    0    -1  
$EndComp
$Comp
L A5C:BUF12 UAD?
U 1 1 617AF062
P 2050 3450
AR Path="/617AF062/60A9C2DF/617AF062" Ref="UAD?"  Part="1" 
AR Path="/7FFFFFFF/6178A503/617AF062" Ref="UAC55"  Part="1" 
AR Path="/61118D89/6178A503/617AF062" Ref="UAC55"  Part="1" 
AR Path="/61116467/61117C32/6178A503/617AF062" Ref="UAC55"  Part="1" 
AR Path="/6112ED27/6178A503/617AF062" Ref="UAC55"  Part="1" 
AR Path="/612E497E/612E4DFA/6178A503/617AF062" Ref="UAC55"  Part="1" 
F 0 "UAC55" H 2050 3767 50  0000 C CNN
F 1 "BUF11" H 2050 3676 50  0000 C CNN
F 2 "" H 2050 3450 50  0001 C CNN
F 3 "" H 2050 3450 50  0001 C CNN
	1    2050 3450
	1    0    0    -1  
$EndComp
$Comp
L A5C:BUF12 UAC?
U 1 1 617AF068
P 2050 3950
AR Path="/617AF068/60A9C2DF/617AF068" Ref="UAC?"  Part="1" 
AR Path="/7FFFFFFF/6178A503/617AF068" Ref="UAC59"  Part="1" 
AR Path="/61118D89/6178A503/617AF068" Ref="UAC59"  Part="1" 
AR Path="/61116467/61117C32/6178A503/617AF068" Ref="UAC59"  Part="1" 
AR Path="/6112ED27/6178A503/617AF068" Ref="UAC59"  Part="1" 
AR Path="/612E497E/612E4DFA/6178A503/617AF068" Ref="UAC59"  Part="1" 
F 0 "UAC59" H 2050 4267 50  0000 C CNN
F 1 "BUF11" H 2050 4176 50  0000 C CNN
F 2 "" H 2050 3950 50  0001 C CNN
F 3 "" H 2050 3950 50  0001 C CNN
	1    2050 3950
	1    0    0    -1  
$EndComp
$Comp
L A5C:BUF12 UAD?
U 1 1 617AF06E
P 2050 4450
AR Path="/617AF06E/60A9C2DF/617AF06E" Ref="UAD?"  Part="1" 
AR Path="/7FFFFFFF/6178A503/617AF06E" Ref="UAD48"  Part="1" 
AR Path="/61118D89/6178A503/617AF06E" Ref="UAD48"  Part="1" 
AR Path="/61116467/61117C32/6178A503/617AF06E" Ref="UAD48"  Part="1" 
AR Path="/6112ED27/6178A503/617AF06E" Ref="UAD48"  Part="1" 
AR Path="/612E497E/612E4DFA/6178A503/617AF06E" Ref="UAD48"  Part="1" 
F 0 "UAD48" H 2050 4767 50  0000 C CNN
F 1 "BUF11" H 2050 4676 50  0000 C CNN
F 2 "" H 2050 4450 50  0001 C CNN
F 3 "" H 2050 4450 50  0001 C CNN
	1    2050 4450
	1    0    0    -1  
$EndComp
$Comp
L A5C:BUF12 UAD?
U 1 1 617AF074
P 2050 4950
AR Path="/617AF074/60A9C2DF/617AF074" Ref="UAD?"  Part="1" 
AR Path="/7FFFFFFF/6178A503/617AF074" Ref="UAD44"  Part="1" 
AR Path="/61118D89/6178A503/617AF074" Ref="UAD44"  Part="1" 
AR Path="/61116467/61117C32/6178A503/617AF074" Ref="UAD44"  Part="1" 
AR Path="/6112ED27/6178A503/617AF074" Ref="UAD44"  Part="1" 
AR Path="/612E497E/612E4DFA/6178A503/617AF074" Ref="UAD44"  Part="1" 
F 0 "UAD44" H 2050 5267 50  0000 C CNN
F 1 "BUF11" H 2050 5176 50  0000 C CNN
F 2 "" H 2050 4950 50  0001 C CNN
F 3 "" H 2050 4950 50  0001 C CNN
	1    2050 4950
	1    0    0    -1  
$EndComp
$Comp
L A5C:BUF12 UAD?
U 1 1 617AF07A
P 2050 5450
AR Path="/617AF07A/60A9C2DF/617AF07A" Ref="UAD?"  Part="1" 
AR Path="/7FFFFFFF/6178A503/617AF07A" Ref="UAD30"  Part="1" 
AR Path="/61118D89/6178A503/617AF07A" Ref="UAD30"  Part="1" 
AR Path="/61116467/61117C32/6178A503/617AF07A" Ref="UAD30"  Part="1" 
AR Path="/6112ED27/6178A503/617AF07A" Ref="UAD30"  Part="1" 
AR Path="/612E497E/612E4DFA/6178A503/617AF07A" Ref="UAD30"  Part="1" 
F 0 "UAD30" H 2050 5767 50  0000 C CNN
F 1 "BUF11" H 2050 5676 50  0000 C CNN
F 2 "" H 2050 5450 50  0001 C CNN
F 3 "" H 2050 5450 50  0001 C CNN
	1    2050 5450
	1    0    0    -1  
$EndComp
$Comp
L A5C:BUF12 UAD?
U 1 1 617AF080
P 2650 1950
AR Path="/617AF080/60A9C2DF/617AF080" Ref="UAD?"  Part="1" 
AR Path="/7FFFFFFF/6178A503/617AF080" Ref="UAD101"  Part="1" 
AR Path="/61118D89/6178A503/617AF080" Ref="UAD101"  Part="1" 
AR Path="/61116467/61117C32/6178A503/617AF080" Ref="UAD101"  Part="1" 
AR Path="/6112ED27/6178A503/617AF080" Ref="UAD101"  Part="1" 
AR Path="/612E497E/612E4DFA/6178A503/617AF080" Ref="UAD101"  Part="1" 
F 0 "UAD101" H 2650 2267 50  0000 C CNN
F 1 "BUF11" H 2650 2176 50  0000 C CNN
F 2 "" H 2650 1950 50  0001 C CNN
F 3 "" H 2650 1950 50  0001 C CNN
	1    2650 1950
	1    0    0    -1  
$EndComp
$Comp
L A5C:BUF12 UAA?
U 1 1 617AF086
P 2650 2450
AR Path="/617AF086/60A9C2DF/617AF086" Ref="UAA?"  Part="1" 
AR Path="/7FFFFFFF/6178A503/617AF086" Ref="UCB125"  Part="1" 
AR Path="/61118D89/6178A503/617AF086" Ref="UCB125"  Part="1" 
AR Path="/61116467/61117C32/6178A503/617AF086" Ref="UCB125"  Part="1" 
AR Path="/6112ED27/6178A503/617AF086" Ref="UCB125"  Part="1" 
AR Path="/612E497E/612E4DFA/6178A503/617AF086" Ref="UCB125"  Part="1" 
F 0 "UCB125" H 2650 2767 50  0000 C CNN
F 1 "BUF11" H 2650 2676 50  0000 C CNN
F 2 "" H 2650 2450 50  0001 C CNN
F 3 "" H 2650 2450 50  0001 C CNN
	1    2650 2450
	1    0    0    -1  
$EndComp
$Comp
L A5C:BUF12 UAC?
U 1 1 617AF08C
P 2650 2950
AR Path="/617AF08C/60A9C2DF/617AF08C" Ref="UAC?"  Part="1" 
AR Path="/7FFFFFFF/6178A503/617AF08C" Ref="UAC95"  Part="1" 
AR Path="/61118D89/6178A503/617AF08C" Ref="UAC95"  Part="1" 
AR Path="/61116467/61117C32/6178A503/617AF08C" Ref="UAC95"  Part="1" 
AR Path="/6112ED27/6178A503/617AF08C" Ref="UAC95"  Part="1" 
AR Path="/612E497E/612E4DFA/6178A503/617AF08C" Ref="UAC95"  Part="1" 
F 0 "UAC95" H 2650 3267 50  0000 C CNN
F 1 "BUF11" H 2650 3176 50  0000 C CNN
F 2 "" H 2650 2950 50  0001 C CNN
F 3 "" H 2650 2950 50  0001 C CNN
	1    2650 2950
	1    0    0    -1  
$EndComp
$Comp
L A5C:BUF12 UAD?
U 1 1 617AF092
P 2650 3450
AR Path="/617AF092/60A9C2DF/617AF092" Ref="UAD?"  Part="1" 
AR Path="/7FFFFFFF/6178A503/617AF092" Ref="UAC48"  Part="1" 
AR Path="/61118D89/6178A503/617AF092" Ref="UAC48"  Part="1" 
AR Path="/61116467/61117C32/6178A503/617AF092" Ref="UAC48"  Part="1" 
AR Path="/6112ED27/6178A503/617AF092" Ref="UAC48"  Part="1" 
AR Path="/612E497E/612E4DFA/6178A503/617AF092" Ref="UAC48"  Part="1" 
F 0 "UAC48" H 2650 3767 50  0000 C CNN
F 1 "BUF11" H 2650 3676 50  0000 C CNN
F 2 "" H 2650 3450 50  0001 C CNN
F 3 "" H 2650 3450 50  0001 C CNN
	1    2650 3450
	1    0    0    -1  
$EndComp
$Comp
L A5C:BUF12 UAA?
U 1 1 617AF098
P 2650 3950
AR Path="/617AF098/60A9C2DF/617AF098" Ref="UAA?"  Part="1" 
AR Path="/7FFFFFFF/6178A503/617AF098" Ref="UAC36"  Part="1" 
AR Path="/61118D89/6178A503/617AF098" Ref="UAC36"  Part="1" 
AR Path="/61116467/61117C32/6178A503/617AF098" Ref="UAC36"  Part="1" 
AR Path="/6112ED27/6178A503/617AF098" Ref="UAC36"  Part="1" 
AR Path="/612E497E/612E4DFA/6178A503/617AF098" Ref="UAC36"  Part="1" 
F 0 "UAC36" H 2650 4267 50  0000 C CNN
F 1 "BUF11" H 2650 4176 50  0000 C CNN
F 2 "" H 2650 3950 50  0001 C CNN
F 3 "" H 2650 3950 50  0001 C CNN
	1    2650 3950
	1    0    0    -1  
$EndComp
$Comp
L A5C:BUF12 UAD?
U 1 1 617AF09E
P 2650 4450
AR Path="/617AF09E/60A9C2DF/617AF09E" Ref="UAD?"  Part="1" 
AR Path="/7FFFFFFF/6178A503/617AF09E" Ref="UAD59"  Part="1" 
AR Path="/61118D89/6178A503/617AF09E" Ref="UAD59"  Part="1" 
AR Path="/61116467/61117C32/6178A503/617AF09E" Ref="UAD59"  Part="1" 
AR Path="/6112ED27/6178A503/617AF09E" Ref="UAD59"  Part="1" 
AR Path="/612E497E/612E4DFA/6178A503/617AF09E" Ref="UAD59"  Part="1" 
F 0 "UAD59" H 2650 4767 50  0000 C CNN
F 1 "BUF11" H 2650 4676 50  0000 C CNN
F 2 "" H 2650 4450 50  0001 C CNN
F 3 "" H 2650 4450 50  0001 C CNN
	1    2650 4450
	1    0    0    -1  
$EndComp
$Comp
L A5C:BUF12 UAD?
U 1 1 617AF0A4
P 2650 4950
AR Path="/617AF0A4/60A9C2DF/617AF0A4" Ref="UAD?"  Part="1" 
AR Path="/7FFFFFFF/6178A503/617AF0A4" Ref="UAD46"  Part="1" 
AR Path="/61118D89/6178A503/617AF0A4" Ref="UAD46"  Part="1" 
AR Path="/61116467/61117C32/6178A503/617AF0A4" Ref="UAD46"  Part="1" 
AR Path="/6112ED27/6178A503/617AF0A4" Ref="UAD46"  Part="1" 
AR Path="/612E497E/612E4DFA/6178A503/617AF0A4" Ref="UAD46"  Part="1" 
F 0 "UAD46" H 2650 5267 50  0000 C CNN
F 1 "BUF11" H 2650 5176 50  0000 C CNN
F 2 "" H 2650 4950 50  0001 C CNN
F 3 "" H 2650 4950 50  0001 C CNN
	1    2650 4950
	1    0    0    -1  
$EndComp
$Comp
L A5C:BUF12 UAC?
U 1 1 617AF0AA
P 2650 5450
AR Path="/617AF0AA/60A9C2DF/617AF0AA" Ref="UAC?"  Part="1" 
AR Path="/7FFFFFFF/6178A503/617AF0AA" Ref="UAD32"  Part="1" 
AR Path="/61118D89/6178A503/617AF0AA" Ref="UAD32"  Part="1" 
AR Path="/61116467/61117C32/6178A503/617AF0AA" Ref="UAD32"  Part="1" 
AR Path="/6112ED27/6178A503/617AF0AA" Ref="UAD32"  Part="1" 
AR Path="/612E497E/612E4DFA/6178A503/617AF0AA" Ref="UAD32"  Part="1" 
F 0 "UAD32" H 2650 5767 50  0000 C CNN
F 1 "BUF11" H 2650 5676 50  0000 C CNN
F 2 "" H 2650 5450 50  0001 C CNN
F 3 "" H 2650 5450 50  0001 C CNN
	1    2650 5450
	1    0    0    -1  
$EndComp
$Comp
L A5C:BUF12 UCA?
U 1 1 617AF0B0
P 3250 1950
AR Path="/617AF0B0/60A9C2DF/617AF0B0" Ref="UCA?"  Part="1" 
AR Path="/7FFFFFFF/6178A503/617AF0B0" Ref="UCB84"  Part="1" 
AR Path="/61118D89/6178A503/617AF0B0" Ref="UCB84"  Part="1" 
AR Path="/61116467/61117C32/6178A503/617AF0B0" Ref="UCB84"  Part="1" 
AR Path="/6112ED27/6178A503/617AF0B0" Ref="UCB84"  Part="1" 
AR Path="/612E497E/612E4DFA/6178A503/617AF0B0" Ref="UCB84"  Part="1" 
F 0 "UCB84" H 3250 2267 50  0000 C CNN
F 1 "BUF11" H 3250 2176 50  0000 C CNN
F 2 "" H 3250 1950 50  0001 C CNN
F 3 "" H 3250 1950 50  0001 C CNN
	1    3250 1950
	1    0    0    -1  
$EndComp
$Comp
L A5C:BUF12 UAB?
U 1 1 617AF0B6
P 3250 2450
AR Path="/617AF0B6/60A9C2DF/617AF0B6" Ref="UAB?"  Part="1" 
AR Path="/7FFFFFFF/6178A503/617AF0B6" Ref="UCC108"  Part="1" 
AR Path="/61118D89/6178A503/617AF0B6" Ref="UCC108"  Part="1" 
AR Path="/61116467/61117C32/6178A503/617AF0B6" Ref="UCC108"  Part="1" 
AR Path="/6112ED27/6178A503/617AF0B6" Ref="UCC108"  Part="1" 
AR Path="/612E497E/612E4DFA/6178A503/617AF0B6" Ref="UCC108"  Part="1" 
F 0 "UCC108" H 3250 2767 50  0000 C CNN
F 1 "BUF11" H 3250 2676 50  0000 C CNN
F 2 "" H 3250 2450 50  0001 C CNN
F 3 "" H 3250 2450 50  0001 C CNN
	1    3250 2450
	1    0    0    -1  
$EndComp
$Comp
L A5C:BUF12 UAC?
U 1 1 617AF0BC
P 3250 2950
AR Path="/617AF0BC/60A9C2DF/617AF0BC" Ref="UAC?"  Part="1" 
AR Path="/7FFFFFFF/6178A503/617AF0BC" Ref="UCB82"  Part="1" 
AR Path="/61118D89/6178A503/617AF0BC" Ref="UCB82"  Part="1" 
AR Path="/61116467/61117C32/6178A503/617AF0BC" Ref="UCB82"  Part="1" 
AR Path="/6112ED27/6178A503/617AF0BC" Ref="UCB82"  Part="1" 
AR Path="/612E497E/612E4DFA/6178A503/617AF0BC" Ref="UCB82"  Part="1" 
F 0 "UCB82" H 3250 3267 50  0000 C CNN
F 1 "BUF11" H 3250 3176 50  0000 C CNN
F 2 "" H 3250 2950 50  0001 C CNN
F 3 "" H 3250 2950 50  0001 C CNN
	1    3250 2950
	1    0    0    -1  
$EndComp
$Comp
L A5C:BUF12 UAD?
U 1 1 617AF0C2
P 3250 3450
AR Path="/617AF0C2/60A9C2DF/617AF0C2" Ref="UAD?"  Part="1" 
AR Path="/7FFFFFFF/6178A503/617AF0C2" Ref="UAD74"  Part="1" 
AR Path="/61118D89/6178A503/617AF0C2" Ref="UAD74"  Part="1" 
AR Path="/61116467/61117C32/6178A503/617AF0C2" Ref="UAD74"  Part="1" 
AR Path="/6112ED27/6178A503/617AF0C2" Ref="UAD74"  Part="1" 
AR Path="/612E497E/612E4DFA/6178A503/617AF0C2" Ref="UAD74"  Part="1" 
F 0 "UAD74" H 3250 3767 50  0000 C CNN
F 1 "BUF11" H 3250 3676 50  0000 C CNN
F 2 "" H 3250 3450 50  0001 C CNN
F 3 "" H 3250 3450 50  0001 C CNN
	1    3250 3450
	1    0    0    -1  
$EndComp
$Comp
L A5C:BUF12 UAA?
U 1 1 617AF0C8
P 3250 3950
AR Path="/617AF0C8/60A9C2DF/617AF0C8" Ref="UAA?"  Part="1" 
AR Path="/7FFFFFFF/6178A503/617AF0C8" Ref="UAC41"  Part="1" 
AR Path="/61118D89/6178A503/617AF0C8" Ref="UAC41"  Part="1" 
AR Path="/61116467/61117C32/6178A503/617AF0C8" Ref="UAC41"  Part="1" 
AR Path="/6112ED27/6178A503/617AF0C8" Ref="UAC41"  Part="1" 
AR Path="/612E497E/612E4DFA/6178A503/617AF0C8" Ref="UAC41"  Part="1" 
F 0 "UAC41" H 3250 4267 50  0000 C CNN
F 1 "BUF11" H 3250 4176 50  0000 C CNN
F 2 "" H 3250 3950 50  0001 C CNN
F 3 "" H 3250 3950 50  0001 C CNN
	1    3250 3950
	1    0    0    -1  
$EndComp
$Comp
L A5C:BUF12 UAD?
U 1 1 617AF0CE
P 3250 4450
AR Path="/617AF0CE/60A9C2DF/617AF0CE" Ref="UAD?"  Part="1" 
AR Path="/7FFFFFFF/6178A503/617AF0CE" Ref="UAD65"  Part="1" 
AR Path="/61118D89/6178A503/617AF0CE" Ref="UAD65"  Part="1" 
AR Path="/61116467/61117C32/6178A503/617AF0CE" Ref="UAD65"  Part="1" 
AR Path="/6112ED27/6178A503/617AF0CE" Ref="UAD65"  Part="1" 
AR Path="/612E497E/612E4DFA/6178A503/617AF0CE" Ref="UAD65"  Part="1" 
F 0 "UAD65" H 3250 4767 50  0000 C CNN
F 1 "BUF11" H 3250 4676 50  0000 C CNN
F 2 "" H 3250 4450 50  0001 C CNN
F 3 "" H 3250 4450 50  0001 C CNN
	1    3250 4450
	1    0    0    -1  
$EndComp
$Comp
L A5C:BUF12 UAD?
U 1 1 617AF0D4
P 3250 4950
AR Path="/617AF0D4/60A9C2DF/617AF0D4" Ref="UAD?"  Part="1" 
AR Path="/7FFFFFFF/6178A503/617AF0D4" Ref="UCA108"  Part="1" 
AR Path="/61118D89/6178A503/617AF0D4" Ref="UCA108"  Part="1" 
AR Path="/61116467/61117C32/6178A503/617AF0D4" Ref="UCA108"  Part="1" 
AR Path="/6112ED27/6178A503/617AF0D4" Ref="UCA108"  Part="1" 
AR Path="/612E497E/612E4DFA/6178A503/617AF0D4" Ref="UCA108"  Part="1" 
F 0 "UCA108" H 3250 5267 50  0000 C CNN
F 1 "BUF11" H 3250 5176 50  0000 C CNN
F 2 "" H 3250 4950 50  0001 C CNN
F 3 "" H 3250 4950 50  0001 C CNN
	1    3250 4950
	1    0    0    -1  
$EndComp
$Comp
L A5C:BUF12 UAD?
U 1 1 617AF0DA
P 3250 5450
AR Path="/617AF0DA/60A9C2DF/617AF0DA" Ref="UAD?"  Part="1" 
AR Path="/7FFFFFFF/6178A503/617AF0DA" Ref="UAD128"  Part="1" 
AR Path="/61118D89/6178A503/617AF0DA" Ref="UAD128"  Part="1" 
AR Path="/61116467/61117C32/6178A503/617AF0DA" Ref="UAD128"  Part="1" 
AR Path="/6112ED27/6178A503/617AF0DA" Ref="UAD128"  Part="1" 
AR Path="/612E497E/612E4DFA/6178A503/617AF0DA" Ref="UAD128"  Part="1" 
F 0 "UAD128" H 3250 5767 50  0000 C CNN
F 1 "BUF11" H 3250 5676 50  0000 C CNN
F 2 "" H 3250 5450 50  0001 C CNN
F 3 "" H 3250 5450 50  0001 C CNN
	1    3250 5450
	1    0    0    -1  
$EndComp
$Comp
L A5C:BUF12 UAA?
U 1 1 617AF0E0
P 7050 1950
AR Path="/617AF0E0/60A9C2DF/617AF0E0" Ref="UAA?"  Part="1" 
AR Path="/7FFFFFFF/6178A503/617AF0E0" Ref="UAD36"  Part="1" 
AR Path="/61118D89/6178A503/617AF0E0" Ref="UAD36"  Part="1" 
AR Path="/61116467/61117C32/6178A503/617AF0E0" Ref="UAD36"  Part="1" 
AR Path="/6112ED27/6178A503/617AF0E0" Ref="UAD36"  Part="1" 
AR Path="/612E497E/612E4DFA/6178A503/617AF0E0" Ref="UAD36"  Part="1" 
F 0 "UAD36" H 7050 2267 50  0000 C CNN
F 1 "BUF11" H 7050 2176 50  0000 C CNN
F 2 "" H 7050 1950 50  0001 C CNN
F 3 "" H 7050 1950 50  0001 C CNN
	1    7050 1950
	1    0    0    -1  
$EndComp
$Comp
L A5C:BUF12 UAB?
U 1 1 617AF0E6
P 7050 2600
AR Path="/617AF0E6/60A9C2DF/617AF0E6" Ref="UAB?"  Part="1" 
AR Path="/7FFFFFFF/6178A503/617AF0E6" Ref="UAD11"  Part="1" 
AR Path="/61118D89/6178A503/617AF0E6" Ref="UAD11"  Part="1" 
AR Path="/61116467/61117C32/6178A503/617AF0E6" Ref="UAD11"  Part="1" 
AR Path="/6112ED27/6178A503/617AF0E6" Ref="UAD11"  Part="1" 
AR Path="/612E497E/612E4DFA/6178A503/617AF0E6" Ref="UAD11"  Part="1" 
F 0 "UAD11" H 7050 2917 50  0000 C CNN
F 1 "BUF11" H 7050 2826 50  0000 C CNN
F 2 "" H 7050 2600 50  0001 C CNN
F 3 "" H 7050 2600 50  0001 C CNN
	1    7050 2600
	1    0    0    -1  
$EndComp
$Comp
L A5C:BUF12 UAA?
U 1 1 617AF110
P 7650 1950
AR Path="/617AF110/60A9C2DF/617AF110" Ref="UAA?"  Part="1" 
AR Path="/7FFFFFFF/6178A503/617AF110" Ref="UAD38"  Part="1" 
AR Path="/61118D89/6178A503/617AF110" Ref="UAD38"  Part="1" 
AR Path="/61116467/61117C32/6178A503/617AF110" Ref="UAD38"  Part="1" 
AR Path="/6112ED27/6178A503/617AF110" Ref="UAD38"  Part="1" 
AR Path="/612E497E/612E4DFA/6178A503/617AF110" Ref="UAD38"  Part="1" 
F 0 "UAD38" H 7650 2267 50  0000 C CNN
F 1 "BUF11" H 7650 2176 50  0000 C CNN
F 2 "" H 7650 1950 50  0001 C CNN
F 3 "" H 7650 1950 50  0001 C CNN
	1    7650 1950
	1    0    0    -1  
$EndComp
$Comp
L A5C:BUF12 UAB?
U 1 1 617AF116
P 7650 2600
AR Path="/617AF116/60A9C2DF/617AF116" Ref="UAB?"  Part="1" 
AR Path="/7FFFFFFF/6178A503/617AF116" Ref="UAD13"  Part="1" 
AR Path="/61118D89/6178A503/617AF116" Ref="UAD13"  Part="1" 
AR Path="/61116467/61117C32/6178A503/617AF116" Ref="UAD13"  Part="1" 
AR Path="/6112ED27/6178A503/617AF116" Ref="UAD13"  Part="1" 
AR Path="/612E497E/612E4DFA/6178A503/617AF116" Ref="UAD13"  Part="1" 
F 0 "UAD13" H 7650 2917 50  0000 C CNN
F 1 "BUF11" H 7650 2826 50  0000 C CNN
F 2 "" H 7650 2600 50  0001 C CNN
F 3 "" H 7650 2600 50  0001 C CNN
	1    7650 2600
	1    0    0    -1  
$EndComp
$Comp
L A5C:BUF12 UBH?
U 1 1 617AF140
P 8250 1950
AR Path="/617AF140/60A9C2DF/617AF140" Ref="UBH?"  Part="1" 
AR Path="/7FFFFFFF/6178A503/617AF140" Ref="UAC57"  Part="1" 
AR Path="/61118D89/6178A503/617AF140" Ref="UAC57"  Part="1" 
AR Path="/61116467/61117C32/6178A503/617AF140" Ref="UAC57"  Part="1" 
AR Path="/6112ED27/6178A503/617AF140" Ref="UAC57"  Part="1" 
AR Path="/612E497E/612E4DFA/6178A503/617AF140" Ref="UAC57"  Part="1" 
F 0 "UAC57" H 8250 2267 50  0000 C CNN
F 1 "BUF11" H 8250 2176 50  0000 C CNN
F 2 "" H 8250 1950 50  0001 C CNN
F 3 "" H 8250 1950 50  0001 C CNN
	1    8250 1950
	1    0    0    -1  
$EndComp
$Comp
L A5C:BUF12 UAB?
U 1 1 617AF146
P 8250 2600
AR Path="/617AF146/60A9C2DF/617AF146" Ref="UAB?"  Part="1" 
AR Path="/7FFFFFFF/6178A503/617AF146" Ref="UAD67"  Part="1" 
AR Path="/61118D89/6178A503/617AF146" Ref="UAD67"  Part="1" 
AR Path="/61116467/61117C32/6178A503/617AF146" Ref="UAD67"  Part="1" 
AR Path="/6112ED27/6178A503/617AF146" Ref="UAD67"  Part="1" 
AR Path="/612E497E/612E4DFA/6178A503/617AF146" Ref="UAD67"  Part="1" 
F 0 "UAD67" H 8250 2917 50  0000 C CNN
F 1 "BUF11" H 8250 2826 50  0000 C CNN
F 2 "" H 8250 2600 50  0001 C CNN
F 3 "" H 8250 2600 50  0001 C CNN
	1    8250 2600
	1    0    0    -1  
$EndComp
$Comp
L A5C:DFFCOO UAC262
U 1 1 6180DC0D
P 9000 2050
AR Path="/7FFFFFFF/6178A503/6180DC0D" Ref="UAC262"  Part="1" 
AR Path="/61118D89/6178A503/6180DC0D" Ref="UAC262"  Part="1" 
AR Path="/61116467/61117C32/6178A503/6180DC0D" Ref="UAC262"  Part="1" 
AR Path="/6112ED27/6178A503/6180DC0D" Ref="UAC262"  Part="1" 
AR Path="/612E497E/612E4DFA/6178A503/6180DC0D" Ref="UAC262"  Part="1" 
F 0 "UAC262" H 9000 2415 50  0000 C CNN
F 1 "DFFCOO" H 9000 2324 50  0000 C CNN
F 2 "" H 9000 2050 50  0001 C CNN
F 3 "" H 9000 2050 50  0001 C CNN
	1    9000 2050
	1    0    0    -1  
$EndComp
$Comp
L A5C:DFFCOO UAD84
U 1 1 6181A73F
P 9000 2700
AR Path="/7FFFFFFF/6178A503/6181A73F" Ref="UAD84"  Part="1" 
AR Path="/61118D89/6178A503/6181A73F" Ref="UAD84"  Part="1" 
AR Path="/61116467/61117C32/6178A503/6181A73F" Ref="UAD84"  Part="1" 
AR Path="/6112ED27/6178A503/6181A73F" Ref="UAD84"  Part="1" 
AR Path="/612E497E/612E4DFA/6178A503/6181A73F" Ref="UAD84"  Part="1" 
F 0 "UAD84" H 9000 3065 50  0000 C CNN
F 1 "DFFCOO" H 9000 2974 50  0000 C CNN
F 2 "" H 9000 2700 50  0001 C CNN
F 3 "" H 9000 2700 50  0001 C CNN
	1    9000 2700
	1    0    0    -1  
$EndComp
$Comp
L A5C:M175CL UCC?
U 1 1 617AF17C
P 5000 2550
AR Path="/617AF17C/60A9C2DF/617AF17C" Ref="UCC?"  Part="1" 
AR Path="/7FFFFFFF/6178A503/617AF17C" Ref="UCB62"  Part="1" 
AR Path="/61118D89/6178A503/617AF17C" Ref="UCB62"  Part="1" 
AR Path="/61116467/61117C32/6178A503/617AF17C" Ref="UCB62"  Part="1" 
AR Path="/6112ED27/6178A503/617AF17C" Ref="UCB62"  Part="1" 
AR Path="/612E497E/612E4DFA/6178A503/617AF17C" Ref="UCB62"  Part="1" 
F 0 "UCB62" H 5000 3115 50  0000 C CNN
F 1 "M175CL" H 5000 3024 50  0000 C CNN
F 2 "" H 5000 2350 50  0001 C CNN
F 3 "" H 5000 2350 50  0001 C CNN
	1    5000 2550
	1    0    0    1   
$EndComp
$Comp
L A5C:M175CL UBH?
U 1 1 617AF190
P 5000 4550
AR Path="/617AF190/60A9C2DF/617AF190" Ref="UBH?"  Part="1" 
AR Path="/7FFFFFFF/6178A503/617AF190" Ref="UCB147"  Part="1" 
AR Path="/61118D89/6178A503/617AF190" Ref="UCB147"  Part="1" 
AR Path="/61116467/61117C32/6178A503/617AF190" Ref="UCB147"  Part="1" 
AR Path="/6112ED27/6178A503/617AF190" Ref="UCB147"  Part="1" 
AR Path="/612E497E/612E4DFA/6178A503/617AF190" Ref="UCB147"  Part="1" 
F 0 "UCB147" H 5000 5115 50  0000 C CNN
F 1 "M175CL" H 5000 5024 50  0000 C CNN
F 2 "" H 5000 4350 50  0001 C CNN
F 3 "" H 5000 4350 50  0001 C CNN
	1    5000 4550
	1    0    0    1   
$EndComp
$EndSCHEMATC
