EESchema Schematic File Version 4
EELAYER 30 0
EELAYER END
$Descr A3 11693 16535 portrait
encoding utf-8
Sheet 24 24
Title ""
Date ""
Rev ""
Comp ""
Comment1 ""
Comment2 ""
Comment3 ""
Comment4 ""
$EndDescr
$Comp
L A5C:DFFCOO UCC293
U 1 1 5F78A452
P 5800 2150
F 0 "UCC293" H 5800 2515 50  0000 C CNN
F 1 "DFFCOO" H 5800 2424 50  0000 C CNN
F 2 "" H 5800 2150 50  0001 C CNN
F 3 "" H 5800 2150 50  0001 C CNN
	1    5800 2150
	1    0    0    -1  
$EndComp
$Comp
L A5C:DFFCOO UCC296
U 1 1 5F78A90E
P 5800 2800
F 0 "UCC296" H 5800 3165 50  0000 C CNN
F 1 "DFFCOO" H 5800 3074 50  0000 C CNN
F 2 "" H 5800 2800 50  0001 C CNN
F 3 "" H 5800 2800 50  0001 C CNN
	1    5800 2800
	1    0    0    -1  
$EndComp
$Comp
L A5C:DFFCOO UCC300
U 1 1 5F78AB0D
P 5800 3450
F 0 "UCC300" H 5800 3815 50  0000 C CNN
F 1 "DFFCOO" H 5800 3724 50  0000 C CNN
F 2 "" H 5800 3450 50  0001 C CNN
F 3 "" H 5800 3450 50  0001 C CNN
	1    5800 3450
	1    0    0    -1  
$EndComp
$Comp
L A5C:DFFCOO UCC304
U 1 1 5F78ACDF
P 5800 4100
F 0 "UCC304" H 5800 4465 50  0000 C CNN
F 1 "DFFCOO" H 5800 4374 50  0000 C CNN
F 2 "" H 5800 4100 50  0001 C CNN
F 3 "" H 5800 4100 50  0001 C CNN
	1    5800 4100
	1    0    0    -1  
$EndComp
Wire Wire Line
	5550 4200 5450 4200
Wire Wire Line
	5450 4200 5450 3550
Wire Wire Line
	5450 3550 5550 3550
Wire Wire Line
	5450 3550 5450 2900
Wire Wire Line
	5450 2900 5550 2900
Connection ~ 5450 3550
Wire Wire Line
	5450 2900 5450 2250
Wire Wire Line
	5450 2250 5550 2250
Connection ~ 5450 2900
$Comp
L A5C:NAND02 UCC308
U 1 1 5F78B05D
P 5050 2050
F 0 "UCC308" H 5075 2317 50  0000 C CNN
F 1 "NAND02" H 5075 2226 50  0000 C CNN
F 2 "" H 5050 2050 50  0001 C CNN
F 3 "" H 5050 2050 50  0001 C CNN
	1    5050 2050
	1    0    0    -1  
$EndComp
$Comp
L A5C:NAND02 UCC310
U 1 1 5F78B40D
P 5050 2700
F 0 "UCC310" H 5075 2967 50  0000 C CNN
F 1 "NAND02" H 5075 2876 50  0000 C CNN
F 2 "" H 5050 2700 50  0001 C CNN
F 3 "" H 5050 2700 50  0001 C CNN
	1    5050 2700
	1    0    0    -1  
$EndComp
$Comp
L A5C:NAND02 UCC312
U 1 1 5F78B7A8
P 5050 3350
F 0 "UCC312" H 5075 3617 50  0000 C CNN
F 1 "NAND02" H 5075 3526 50  0000 C CNN
F 2 "" H 5050 3350 50  0001 C CNN
F 3 "" H 5050 3350 50  0001 C CNN
	1    5050 3350
	1    0    0    -1  
$EndComp
$Comp
L A5C:NAND02 UCC313
U 1 1 5F78BA76
P 5050 4000
F 0 "UCC313" H 5075 4267 50  0000 C CNN
F 1 "NAND02" H 5075 4176 50  0000 C CNN
F 2 "" H 5050 4000 50  0001 C CNN
F 3 "" H 5050 4000 50  0001 C CNN
	1    5050 4000
	1    0    0    -1  
$EndComp
Wire Wire Line
	5350 2050 5550 2050
Wire Wire Line
	5550 2700 5350 2700
Wire Wire Line
	5350 3350 5550 3350
Wire Wire Line
	5550 4000 5350 4000
Wire Wire Line
	4800 4050 4700 4050
Wire Wire Line
	4700 4050 4700 3400
Wire Wire Line
	4700 2100 4800 2100
Wire Wire Line
	4800 2750 4700 2750
Connection ~ 4700 2750
Wire Wire Line
	4700 2750 4700 2100
Wire Wire Line
	4800 3400 4700 3400
Connection ~ 4700 3400
Wire Wire Line
	4700 3400 4700 2750
$Comp
L A5C:AND02 UCG?
U 1 1 5F8A7C46
P 3800 5150
AR Path="/5F8A7C46" Ref="UCG?"  Part="1" 
AR Path="/5F78A177/5F8A7C46" Ref="UCG309"  Part="1" 
F 0 "UCG309" H 3825 5417 50  0000 C CNN
F 1 "AND02" H 3825 5326 50  0000 C CNN
F 2 "" H 3800 5150 50  0001 C CNN
F 3 "" H 3800 5150 50  0001 C CNN
	1    3800 5150
	1    0    0    -1  
$EndComp
$Comp
L A5C:AND02 UCG?
U 1 1 5F8A7C4C
P 3800 9000
AR Path="/5F8A7C4C" Ref="UCG?"  Part="1" 
AR Path="/5F78A177/5F8A7C4C" Ref="UCG334"  Part="1" 
F 0 "UCG334" H 3825 9267 50  0000 C CNN
F 1 "AND02" H 3825 9176 50  0000 C CNN
F 2 "" H 3800 9000 50  0001 C CNN
F 3 "" H 3800 9000 50  0001 C CNN
	1    3800 9000
	1    0    0    -1  
$EndComp
Wire Wire Line
	4100 5150 4700 5150
Connection ~ 4700 4050
Text Label 2100 11650 2    50   ~ 0
CG452
$Comp
L A5C:XOR02 UCC277
U 1 1 5F94092C
P 7150 2200
F 0 "UCC277" H 7175 2467 50  0000 C CNN
F 1 "XOR02" H 7175 2376 50  0000 C CNN
F 2 "" H 7150 2200 50  0001 C CNN
F 3 "" H 7150 2200 50  0001 C CNN
	1    7150 2200
	1    0    0    -1  
$EndComp
Wire Wire Line
	6900 2150 6150 2150
Connection ~ 6150 2150
Wire Wire Line
	6150 2150 6050 2150
Wire Wire Line
	6050 2800 6250 2800
Wire Wire Line
	6250 2800 6250 1950
Connection ~ 6250 2800
Wire Wire Line
	6150 2150 6150 1950
Wire Wire Line
	6100 950  6650 950 
Wire Wire Line
	6650 2250 6900 2250
Connection ~ 6650 2250
$Comp
L A5C:BUF12 UBZ320
U 1 1 5F94BCD9
P 5800 950
F 0 "UBZ320" H 5800 1267 50  0000 C CNN
F 1 "BUF11" H 5800 1176 50  0000 C CNN
F 2 "" H 5800 950 50  0001 C CNN
F 3 "" H 5800 950 50  0001 C CNN
	1    5800 950 
	1    0    0    -1  
$EndComp
Text HLabel 5500 950  0    50   Input ~ 0
WSTLUT
Wire Wire Line
	7450 2200 8150 2200
Wire Wire Line
	8150 2200 8150 1600
Wire Wire Line
	8150 1600 4600 1600
Wire Wire Line
	4600 1600 4600 2000
Wire Wire Line
	4600 2000 4800 2000
$Comp
L A5C:NAND03 UCC280
U 1 1 5F956B4C
P 7150 3250
F 0 "UCC280" H 7175 3542 50  0000 C CNN
F 1 "NAND03" H 7175 3451 50  0000 C CNN
F 2 "" H 7150 3250 50  0001 C CNN
F 3 "" H 7150 3250 50  0001 C CNN
	1    7150 3250
	1    0    0    -1  
$EndComp
Wire Wire Line
	6900 3250 6650 3250
Wire Wire Line
	6900 3350 6250 3350
Wire Wire Line
	6900 3150 6150 3150
$Comp
L A5C:XNOR02 UCC316
U 1 1 5F95F2FC
P 7700 3400
F 0 "UCC316" H 7725 3667 50  0000 C CNN
F 1 "XNOR02" H 7725 3576 50  0000 C CNN
F 2 "" H 7725 3400 50  0001 C CNN
F 3 "" H 7725 3400 50  0001 C CNN
	1    7700 3400
	1    0    0    -1  
$EndComp
Wire Wire Line
	7450 3450 6350 3450
Wire Wire Line
	7450 3350 7450 3250
Wire Wire Line
	6650 2250 6650 2700
Wire Wire Line
	6150 2150 6150 2600
Wire Wire Line
	6350 3450 6050 3450
$Comp
L A5C:XNOR02 UCC275
U 1 1 5F966834
P 7700 2750
F 0 "UCC275" H 7725 3017 50  0000 C CNN
F 1 "XNOR02" H 7725 2926 50  0000 C CNN
F 2 "" H 7725 2750 50  0001 C CNN
F 3 "" H 7725 2750 50  0001 C CNN
	1    7700 2750
	1    0    0    -1  
$EndComp
$Comp
L A5C:NAND02 UCG281
U 1 1 5F966E97
P 7150 2650
F 0 "UCG281" H 7175 2917 50  0000 C CNN
F 1 "NAND02" H 7175 2826 50  0000 C CNN
F 2 "" H 7150 2650 50  0001 C CNN
F 3 "" H 7150 2650 50  0001 C CNN
	1    7150 2650
	1    0    0    -1  
$EndComp
Wire Wire Line
	7450 2700 7450 2650
Wire Wire Line
	6900 2600 6150 2600
Connection ~ 6150 2600
Wire Wire Line
	6900 2700 6650 2700
Connection ~ 6650 2700
Wire Wire Line
	7450 2800 6250 2800
Wire Wire Line
	8000 2750 8250 2750
Wire Wire Line
	8250 2750 8250 1500
Wire Wire Line
	8250 1500 4500 1500
Wire Wire Line
	4500 1500 4500 2650
Wire Wire Line
	4500 2650 4800 2650
Wire Wire Line
	8000 3400 8350 3400
Wire Wire Line
	8350 1400 4400 1400
Wire Wire Line
	4400 1400 4400 3300
Wire Wire Line
	4400 3300 4800 3300
Wire Wire Line
	4800 3950 4300 3950
Wire Wire Line
	4300 3950 4300 1300
Wire Wire Line
	4300 1300 8450 1300
$Comp
L A5C:NAND04 UBZ318
U 1 1 5F976058
P 7200 3850
F 0 "UBZ318" H 7200 4192 50  0000 C CNN
F 1 "NAND04" H 7200 4101 50  0000 C CNN
F 2 "" H 7200 3600 50  0001 C CNN
F 3 "" H 7200 3600 50  0001 C CNN
	1    7200 3850
	1    0    0    -1  
$EndComp
$Comp
L A5C:XNOR02 UCC319
U 1 1 5F9763B8
P 7750 4050
F 0 "UCC319" H 7775 4317 50  0000 C CNN
F 1 "XNOR02" H 7775 4226 50  0000 C CNN
F 2 "" H 7775 4050 50  0001 C CNN
F 3 "" H 7775 4050 50  0001 C CNN
	1    7750 4050
	1    0    0    -1  
$EndComp
Wire Wire Line
	7500 4000 7500 3850
Wire Wire Line
	6250 2800 6250 3350
Wire Wire Line
	6150 2600 6150 3150
Wire Wire Line
	6650 2700 6650 3250
Connection ~ 6350 3450
Wire Wire Line
	6350 1950 6350 3450
Connection ~ 6150 3150
Connection ~ 6250 3350
Connection ~ 6650 3250
Wire Wire Line
	6650 3250 6650 3700
Wire Wire Line
	6050 4100 7500 4100
Wire Wire Line
	6900 3800 6150 3800
Wire Wire Line
	6900 3900 6250 3900
Wire Wire Line
	6900 4000 6350 4000
Wire Wire Line
	6150 3150 6150 3800
Wire Wire Line
	6250 3350 6250 3900
Wire Wire Line
	6350 3450 6350 4000
Connection ~ 6150 3800
Connection ~ 6250 3900
Connection ~ 6350 4000
Wire Wire Line
	6900 3700 6650 3700
Connection ~ 6650 3700
Wire Wire Line
	6650 3700 6650 4400
Wire Wire Line
	8050 4050 8450 4050
Wire Wire Line
	8450 4050 8450 1300
Wire Wire Line
	8350 1400 8350 3400
Wire Wire Line
	6650 950  6650 2250
$Comp
L A5C:NAND05 UBZ329
U 1 1 5F9A3EB8
P 7200 4600
F 0 "UBZ329" H 7225 4990 50  0000 C CNN
F 1 "NAND05" H 7225 4899 50  0000 C CNN
F 2 "" H 7200 4300 50  0001 C CNN
F 3 "" H 7200 4300 50  0001 C CNN
	1    7200 4600
	1    0    0    -1  
$EndComp
Wire Wire Line
	6900 4400 6650 4400
Wire Wire Line
	6900 4500 6450 4500
Wire Wire Line
	6450 1950 6450 4500
Wire Wire Line
	6900 4600 6350 4600
Wire Wire Line
	6350 4000 6350 4600
Wire Wire Line
	6900 4700 6250 4700
Wire Wire Line
	6250 3900 6250 4700
Wire Wire Line
	6900 4800 6150 4800
Wire Wire Line
	6150 3800 6150 4800
$Comp
L A5C:INV01 UBZ328
U 1 1 5F9B00C2
P 7850 4600
F 0 "UBZ328" H 7850 4917 50  0000 C CNN
F 1 "INV01" H 7850 4826 50  0000 C CNN
F 2 "" H 7850 4400 50  0001 C CNN
F 3 "" H 7850 4400 50  0001 C CNN
	1    7850 4600
	1    0    0    -1  
$EndComp
$Comp
L A5C:BUF12 UCG328
U 1 1 5F9B0222
P 8450 4600
F 0 "UCG328" H 8450 4917 50  0000 C CNN
F 1 "BUF11" H 8450 4826 50  0000 C CNN
F 2 "" H 8450 4600 50  0001 C CNN
F 3 "" H 8450 4600 50  0001 C CNN
	1    8450 4600
	1    0    0    -1  
$EndComp
$Comp
L A5C:AOI41 UCG312
U 1 1 5F9BB2D6
P 2950 12550
F 0 "UCG312" H 2975 12942 50  0000 C CNN
F 1 "AOI41" H 2975 12851 50  0000 C CNN
F 2 "" H 3150 12550 50  0001 C CNN
F 3 "" H 3150 12550 50  0001 C CNN
	1    2950 12550
	1    0    0    1   
$EndComp
$Comp
L A5C:INV01 UCC?
U 1 1 5FA4C500
P 1900 12350
AR Path="/5FA4C500" Ref="UCC?"  Part="1" 
AR Path="/5F78A177/5FA4C500" Ref="UCC315"  Part="1" 
F 0 "UCC315" H 1900 12667 50  0000 C CNN
F 1 "INV01" H 1900 12576 50  0000 C CNN
F 2 "" H 1900 12150 50  0001 C CNN
F 3 "" H 1900 12150 50  0001 C CNN
	1    1900 12350
	1    0    0    -1  
$EndComp
Text Label 1600 12350 2    50   ~ 0
~MAIN-RESETI
Wire Wire Line
	2200 12350 2500 12350
$Comp
L A5C:DFFCOO UCO335
U 1 1 5FA6EABD
P 5800 6200
F 0 "UCO335" H 5800 6565 50  0000 C CNN
F 1 "DFFCOO" H 5800 6474 50  0000 C CNN
F 2 "" H 5800 6200 50  0001 C CNN
F 3 "" H 5800 6200 50  0001 C CNN
	1    5800 6200
	1    0    0    -1  
$EndComp
$Comp
L A5C:DFFCOO UCO339
U 1 1 5FA6EAC3
P 5800 6850
F 0 "UCO339" H 5800 7215 50  0000 C CNN
F 1 "DFFCOO" H 5800 7124 50  0000 C CNN
F 2 "" H 5800 6850 50  0001 C CNN
F 3 "" H 5800 6850 50  0001 C CNN
	1    5800 6850
	1    0    0    -1  
$EndComp
$Comp
L A5C:DFFCOO UCO343
U 1 1 5FA6EAC9
P 5800 7500
F 0 "UCO343" H 5800 7865 50  0000 C CNN
F 1 "DFFCOO" H 5800 7774 50  0000 C CNN
F 2 "" H 5800 7500 50  0001 C CNN
F 3 "" H 5800 7500 50  0001 C CNN
	1    5800 7500
	1    0    0    -1  
$EndComp
$Comp
L A5C:DFFCOO UCO347
U 1 1 5FA6EACF
P 5800 8150
F 0 "UCO347" H 5800 8515 50  0000 C CNN
F 1 "DFFCOO" H 5800 8424 50  0000 C CNN
F 2 "" H 5800 8150 50  0001 C CNN
F 3 "" H 5800 8150 50  0001 C CNN
	1    5800 8150
	1    0    0    -1  
$EndComp
Wire Wire Line
	5550 8250 5450 8250
Wire Wire Line
	5450 8250 5450 7600
Wire Wire Line
	5450 7600 5550 7600
Wire Wire Line
	5450 7600 5450 6950
Wire Wire Line
	5450 6950 5550 6950
Connection ~ 5450 7600
Wire Wire Line
	5450 6950 5450 6300
Wire Wire Line
	5450 6300 5550 6300
Connection ~ 5450 6950
$Comp
L A5C:NAND02 UCO315
U 1 1 5FA6EADE
P 5050 6100
F 0 "UCO315" H 5075 6367 50  0000 C CNN
F 1 "NAND02" H 5075 6276 50  0000 C CNN
F 2 "" H 5050 6100 50  0001 C CNN
F 3 "" H 5050 6100 50  0001 C CNN
	1    5050 6100
	1    0    0    -1  
$EndComp
$Comp
L A5C:NAND02 UCO317
U 1 1 5FA6EAE4
P 5050 6750
F 0 "UCO317" H 5075 7017 50  0000 C CNN
F 1 "NAND02" H 5075 6926 50  0000 C CNN
F 2 "" H 5050 6750 50  0001 C CNN
F 3 "" H 5050 6750 50  0001 C CNN
	1    5050 6750
	1    0    0    -1  
$EndComp
$Comp
L A5C:NAND02 UCO318
U 1 1 5FA6EAEA
P 5050 7400
F 0 "UCO318" H 5075 7667 50  0000 C CNN
F 1 "NAND02" H 5075 7576 50  0000 C CNN
F 2 "" H 5050 7400 50  0001 C CNN
F 3 "" H 5050 7400 50  0001 C CNN
	1    5050 7400
	1    0    0    -1  
$EndComp
$Comp
L A5C:NAND02 UCO320
U 1 1 5FA6EAF0
P 5050 8050
F 0 "UCO320" H 5075 8317 50  0000 C CNN
F 1 "NAND02" H 5075 8226 50  0000 C CNN
F 2 "" H 5050 8050 50  0001 C CNN
F 3 "" H 5050 8050 50  0001 C CNN
	1    5050 8050
	1    0    0    -1  
$EndComp
Wire Wire Line
	5350 6100 5550 6100
Wire Wire Line
	5550 6750 5350 6750
Wire Wire Line
	5350 7400 5550 7400
Wire Wire Line
	5550 8050 5350 8050
Wire Wire Line
	4800 8100 4700 8100
Wire Wire Line
	4700 8100 4700 7450
Wire Wire Line
	4700 6150 4800 6150
Wire Wire Line
	4800 6800 4700 6800
Connection ~ 4700 6800
Wire Wire Line
	4700 6800 4700 6150
Wire Wire Line
	4800 7450 4700 7450
Connection ~ 4700 7450
Wire Wire Line
	4700 7450 4700 6800
$Comp
L A5C:XOR02 UCL310
U 1 1 5FA6EB06
P 7150 6250
F 0 "UCL310" H 7175 6517 50  0000 C CNN
F 1 "XOR02" H 7175 6426 50  0000 C CNN
F 2 "" H 7150 6250 50  0001 C CNN
F 3 "" H 7150 6250 50  0001 C CNN
	1    7150 6250
	1    0    0    -1  
$EndComp
Wire Wire Line
	6900 6200 6150 6200
Connection ~ 6150 6200
Wire Wire Line
	6150 6200 6050 6200
Wire Wire Line
	6050 6850 6250 6850
Wire Wire Line
	6250 6850 6250 6000
Connection ~ 6250 6850
Wire Wire Line
	6150 6200 6150 6000
Wire Wire Line
	6650 6300 6900 6300
Connection ~ 6650 6300
Wire Wire Line
	7450 6250 8150 6250
Wire Wire Line
	8150 6250 8150 5650
Wire Wire Line
	8150 5650 4600 5650
Wire Wire Line
	4600 5650 4600 6050
Wire Wire Line
	4600 6050 4800 6050
$Comp
L A5C:NAND03 UCO269
U 1 1 5FA6EB1A
P 7150 7300
F 0 "UCO269" H 7175 7592 50  0000 C CNN
F 1 "NAND03" H 7175 7501 50  0000 C CNN
F 2 "" H 7150 7300 50  0001 C CNN
F 3 "" H 7150 7300 50  0001 C CNN
	1    7150 7300
	1    0    0    -1  
$EndComp
Wire Wire Line
	6900 7300 6650 7300
Wire Wire Line
	6900 7400 6250 7400
Wire Wire Line
	6900 7200 6150 7200
$Comp
L A5C:XNOR02 UCO272
U 1 1 5FA6EB23
P 7700 7450
F 0 "UCO272" H 7725 7717 50  0000 C CNN
F 1 "XNOR02" H 7725 7626 50  0000 C CNN
F 2 "" H 7725 7450 50  0001 C CNN
F 3 "" H 7725 7450 50  0001 C CNN
	1    7700 7450
	1    0    0    -1  
$EndComp
Wire Wire Line
	7450 7500 6350 7500
Wire Wire Line
	7450 7400 7450 7300
Wire Wire Line
	6650 6300 6650 6750
Wire Wire Line
	6150 6200 6150 6650
Wire Wire Line
	6350 7500 6050 7500
$Comp
L A5C:XNOR02 UCO279
U 1 1 5FA6EB2E
P 7700 6800
F 0 "UCO279" H 7725 7067 50  0000 C CNN
F 1 "XNOR02" H 7725 6976 50  0000 C CNN
F 2 "" H 7725 6800 50  0001 C CNN
F 3 "" H 7725 6800 50  0001 C CNN
	1    7700 6800
	1    0    0    -1  
$EndComp
$Comp
L A5C:NAND02 UCO277
U 1 1 5FA6EB34
P 7150 6700
F 0 "UCO277" H 7175 6967 50  0000 C CNN
F 1 "NAND02" H 7175 6876 50  0000 C CNN
F 2 "" H 7150 6700 50  0001 C CNN
F 3 "" H 7150 6700 50  0001 C CNN
	1    7150 6700
	1    0    0    -1  
$EndComp
Wire Wire Line
	7450 6750 7450 6700
Wire Wire Line
	6900 6650 6150 6650
Connection ~ 6150 6650
Wire Wire Line
	6900 6750 6650 6750
Connection ~ 6650 6750
Wire Wire Line
	7450 6850 6250 6850
Wire Wire Line
	8000 6800 8250 6800
Wire Wire Line
	8250 6800 8250 5550
Wire Wire Line
	8250 5550 4500 5550
Wire Wire Line
	4500 5550 4500 6700
Wire Wire Line
	4500 6700 4800 6700
Wire Wire Line
	8000 7450 8350 7450
Wire Wire Line
	8350 5450 4400 5450
Wire Wire Line
	4400 5450 4400 7350
Wire Wire Line
	4400 7350 4800 7350
Wire Wire Line
	4800 8000 4300 8000
Wire Wire Line
	4300 8000 4300 5350
Wire Wire Line
	4300 5350 8450 5350
$Comp
L A5C:NAND04 UCO274
U 1 1 5FA6EB4C
P 7200 7900
F 0 "UCO274" H 7200 8242 50  0000 C CNN
F 1 "NAND04" H 7200 8151 50  0000 C CNN
F 2 "" H 7200 7650 50  0001 C CNN
F 3 "" H 7200 7650 50  0001 C CNN
	1    7200 7900
	1    0    0    -1  
$EndComp
$Comp
L A5C:XNOR02 UCO329
U 1 1 5FA6EB52
P 7750 8100
F 0 "UCO329" H 7775 8367 50  0000 C CNN
F 1 "XNOR02" H 7775 8276 50  0000 C CNN
F 2 "" H 7775 8100 50  0001 C CNN
F 3 "" H 7775 8100 50  0001 C CNN
	1    7750 8100
	1    0    0    -1  
$EndComp
Wire Wire Line
	7500 8050 7500 7900
Wire Wire Line
	6250 6850 6250 7400
Wire Wire Line
	6150 6650 6150 7200
Wire Wire Line
	6650 6750 6650 7300
Connection ~ 6350 7500
Wire Wire Line
	6350 6000 6350 7500
Connection ~ 6150 7200
Connection ~ 6250 7400
Connection ~ 6650 7300
Wire Wire Line
	6650 7300 6650 7750
Wire Wire Line
	6050 8150 7500 8150
Wire Wire Line
	6900 7850 6150 7850
Wire Wire Line
	6900 7950 6250 7950
Wire Wire Line
	6900 8050 6350 8050
Wire Wire Line
	6150 7200 6150 7850
Wire Wire Line
	6250 7400 6250 7950
Wire Wire Line
	6350 7500 6350 8050
Connection ~ 6150 7850
Connection ~ 6250 7950
Connection ~ 6350 8050
Wire Wire Line
	6900 7750 6650 7750
Connection ~ 6650 7750
Wire Wire Line
	6650 7750 6650 8450
Wire Wire Line
	8050 8100 8450 8100
Wire Wire Line
	8450 8100 8450 5350
Wire Wire Line
	8350 5450 8350 7450
Wire Wire Line
	6650 5000 6650 6300
$Comp
L A5C:NAND05 UCG330
U 1 1 5FA6EB73
P 7200 8650
F 0 "UCG330" H 7225 9040 50  0000 C CNN
F 1 "NAND05" H 7225 8949 50  0000 C CNN
F 2 "" H 7200 8350 50  0001 C CNN
F 3 "" H 7200 8350 50  0001 C CNN
	1    7200 8650
	1    0    0    -1  
$EndComp
Wire Wire Line
	6900 8450 6650 8450
Wire Wire Line
	6900 8550 6450 8550
Wire Wire Line
	6450 6000 6450 8550
Wire Wire Line
	6900 8650 6350 8650
Wire Wire Line
	6350 8050 6350 8650
Wire Wire Line
	6900 8750 6250 8750
Wire Wire Line
	6250 7950 6250 8750
Wire Wire Line
	6900 8850 6150 8850
Wire Wire Line
	6150 7850 6150 8850
$Comp
L A5C:INV01 UCG329
U 1 1 5FA6EB82
P 7850 8650
F 0 "UCG329" H 7850 8967 50  0000 C CNN
F 1 "INV01" H 7850 8876 50  0000 C CNN
F 2 "" H 7850 8450 50  0001 C CNN
F 3 "" H 7850 8450 50  0001 C CNN
	1    7850 8650
	1    0    0    -1  
$EndComp
$Comp
L A5C:BUF12 UCG308
U 1 1 5FA6EB88
P 8450 8650
F 0 "UCG308" H 8450 8967 50  0000 C CNN
F 1 "BUF11" H 8450 8876 50  0000 C CNN
F 2 "" H 8450 8650 50  0001 C CNN
F 3 "" H 8450 8650 50  0001 C CNN
	1    8450 8650
	1    0    0    -1  
$EndComp
Wire Wire Line
	8750 5000 8750 4600
Wire Wire Line
	6650 5000 8750 5000
Wire Wire Line
	4100 9000 4700 9000
Wire Wire Line
	5450 6300 5450 4200
Connection ~ 5450 6300
Connection ~ 5450 4200
$Comp
L A5C:M258C UBZ299
U 1 1 5FACA1CB
P 4550 11350
F 0 "UBZ299" H 4550 12215 50  0000 C CNN
F 1 "M258C" H 4550 12124 50  0000 C CNN
F 2 "" H 4550 11350 50  0001 C CNN
F 3 "" H 4550 11350 50  0001 C CNN
	1    4550 11350
	1    0    0    -1  
$EndComp
$Comp
L A5C:DFFCOO UBW293
U 1 1 5FAD23CB
P 5800 10250
F 0 "UBW293" H 5800 10615 50  0000 C CNN
F 1 "DFFCOO" H 5800 10524 50  0000 C CNN
F 2 "" H 5800 10250 50  0001 C CNN
F 3 "" H 5800 10250 50  0001 C CNN
	1    5800 10250
	1    0    0    -1  
$EndComp
$Comp
L A5C:DFFCOO UBW296
U 1 1 5FAD23D1
P 5800 10900
F 0 "UBW296" H 5800 11265 50  0000 C CNN
F 1 "DFFCOO" H 5800 11174 50  0000 C CNN
F 2 "" H 5800 10900 50  0001 C CNN
F 3 "" H 5800 10900 50  0001 C CNN
	1    5800 10900
	1    0    0    -1  
$EndComp
$Comp
L A5C:DFFCOO UBW300
U 1 1 5FAD23D7
P 5800 11550
F 0 "UBW300" H 5800 11915 50  0000 C CNN
F 1 "DFFCOO" H 5800 11824 50  0000 C CNN
F 2 "" H 5800 11550 50  0001 C CNN
F 3 "" H 5800 11550 50  0001 C CNN
	1    5800 11550
	1    0    0    -1  
$EndComp
$Comp
L A5C:DFFCOO UBW304
U 1 1 5FAD23DD
P 5800 12200
F 0 "UBW304" H 5800 12565 50  0000 C CNN
F 1 "DFFCOO" H 5800 12474 50  0000 C CNN
F 2 "" H 5800 12200 50  0001 C CNN
F 3 "" H 5800 12200 50  0001 C CNN
	1    5800 12200
	1    0    0    -1  
$EndComp
Wire Wire Line
	5550 12300 5450 12300
Wire Wire Line
	5450 12300 5450 11650
Wire Wire Line
	5450 11650 5550 11650
Wire Wire Line
	5450 11650 5450 11000
Wire Wire Line
	5450 11000 5550 11000
Connection ~ 5450 11650
Wire Wire Line
	5450 11000 5450 10350
Wire Wire Line
	5450 10350 5550 10350
Connection ~ 5450 11000
$Comp
L A5C:XOR02 UBZ294
U 1 1 5FAD23F0
P 7150 10300
F 0 "UBZ294" H 7175 10567 50  0000 C CNN
F 1 "XOR02" H 7175 10476 50  0000 C CNN
F 2 "" H 7150 10300 50  0001 C CNN
F 3 "" H 7150 10300 50  0001 C CNN
	1    7150 10300
	1    0    0    -1  
$EndComp
Wire Wire Line
	6900 10250 6150 10250
Connection ~ 6150 10250
Wire Wire Line
	6150 10250 6050 10250
Wire Wire Line
	6050 10900 6250 10900
Wire Wire Line
	6250 10900 6250 10050
Connection ~ 6250 10900
Wire Wire Line
	6150 10250 6150 10050
Wire Wire Line
	6650 10350 6900 10350
Connection ~ 6650 10350
Wire Wire Line
	7450 10300 8150 10300
Wire Wire Line
	8150 10300 8150 9700
$Comp
L A5C:NAND03 UCC283
U 1 1 5FAD2402
P 7150 11350
F 0 "UCC283" H 7175 11642 50  0000 C CNN
F 1 "NAND03" H 7175 11551 50  0000 C CNN
F 2 "" H 7150 11350 50  0001 C CNN
F 3 "" H 7150 11350 50  0001 C CNN
	1    7150 11350
	1    0    0    -1  
$EndComp
Wire Wire Line
	6900 11350 6650 11350
Wire Wire Line
	6900 11450 6250 11450
Wire Wire Line
	6900 11250 6150 11250
$Comp
L A5C:XNOR02 UBZ292
U 1 1 5FAD240B
P 7700 11500
F 0 "UBZ292" H 7725 11767 50  0000 C CNN
F 1 "XNOR02" H 7725 11676 50  0000 C CNN
F 2 "" H 7725 11500 50  0001 C CNN
F 3 "" H 7725 11500 50  0001 C CNN
	1    7700 11500
	1    0    0    -1  
$EndComp
Wire Wire Line
	7450 11550 6350 11550
Wire Wire Line
	7450 11450 7450 11350
Wire Wire Line
	6650 10350 6650 10800
Wire Wire Line
	6150 10250 6150 10700
Wire Wire Line
	6350 11550 6050 11550
$Comp
L A5C:XNOR02 UCJ299
U 1 1 5FAD2416
P 7700 10850
F 0 "UCJ299" H 7725 11117 50  0000 C CNN
F 1 "XNOR02" H 7725 11026 50  0000 C CNN
F 2 "" H 7725 10850 50  0001 C CNN
F 3 "" H 7725 10850 50  0001 C CNN
	1    7700 10850
	1    0    0    -1  
$EndComp
$Comp
L A5C:NAND02 UCJ297
U 1 1 5FAD241C
P 7150 10750
F 0 "UCJ297" H 7175 11017 50  0000 C CNN
F 1 "NAND02" H 7175 10926 50  0000 C CNN
F 2 "" H 7150 10750 50  0001 C CNN
F 3 "" H 7150 10750 50  0001 C CNN
	1    7150 10750
	1    0    0    -1  
$EndComp
Wire Wire Line
	7450 10800 7450 10750
Wire Wire Line
	6900 10700 6150 10700
Connection ~ 6150 10700
Wire Wire Line
	6900 10800 6650 10800
Connection ~ 6650 10800
Wire Wire Line
	7450 10900 6250 10900
Wire Wire Line
	8000 10850 8250 10850
Wire Wire Line
	8250 10850 8250 9600
Wire Wire Line
	8000 11500 8350 11500
$Comp
L A5C:NAND04 UCG315
U 1 1 5FAD242E
P 7200 11950
F 0 "UCG315" H 7200 12292 50  0000 C CNN
F 1 "NAND04" H 7200 12201 50  0000 C CNN
F 2 "" H 7200 11700 50  0001 C CNN
F 3 "" H 7200 11700 50  0001 C CNN
	1    7200 11950
	1    0    0    -1  
$EndComp
$Comp
L A5C:XNOR02 UCG320
U 1 1 5FAD2434
P 7750 12150
F 0 "UCG320" H 7775 12417 50  0000 C CNN
F 1 "XNOR02" H 7775 12326 50  0000 C CNN
F 2 "" H 7775 12150 50  0001 C CNN
F 3 "" H 7775 12150 50  0001 C CNN
	1    7750 12150
	1    0    0    -1  
$EndComp
Wire Wire Line
	7500 12100 7500 11950
Wire Wire Line
	6250 10900 6250 11450
Wire Wire Line
	6150 10700 6150 11250
Wire Wire Line
	6650 10800 6650 11350
Connection ~ 6350 11550
Wire Wire Line
	6350 10050 6350 11550
Connection ~ 6150 11250
Connection ~ 6250 11450
Connection ~ 6650 11350
Wire Wire Line
	6650 11350 6650 11800
Wire Wire Line
	6050 12200 7500 12200
Wire Wire Line
	6900 11900 6150 11900
Wire Wire Line
	6900 12000 6250 12000
Wire Wire Line
	6900 12100 6350 12100
Wire Wire Line
	6150 11250 6150 11900
Wire Wire Line
	6250 11450 6250 12000
Wire Wire Line
	6350 11550 6350 12100
Connection ~ 6150 11900
Connection ~ 6250 12000
Wire Wire Line
	6900 11800 6650 11800
Connection ~ 6650 11800
Wire Wire Line
	8050 12150 8450 12150
Wire Wire Line
	8450 12150 8450 9400
Wire Wire Line
	8350 9500 8350 11500
Wire Wire Line
	6650 9050 6650 10350
Wire Wire Line
	5450 10350 5450 8250
Connection ~ 5450 8250
Connection ~ 5450 10350
Wire Wire Line
	6650 9050 8750 9050
Wire Wire Line
	8750 9050 8750 8650
Wire Wire Line
	5050 11300 5150 11300
Wire Wire Line
	5150 11300 5150 12100
Wire Wire Line
	5150 12100 5550 12100
Wire Wire Line
	5050 11200 5250 11200
Wire Wire Line
	5250 11200 5250 11450
Wire Wire Line
	5250 11450 5550 11450
Wire Wire Line
	5050 11100 5250 11100
Wire Wire Line
	5250 11100 5250 10800
Wire Wire Line
	5250 10800 5550 10800
Wire Wire Line
	5050 11000 5150 11000
Wire Wire Line
	5150 11000 5150 10150
Wire Wire Line
	5150 10150 5550 10150
Wire Wire Line
	3950 11250 4050 11250
Wire Wire Line
	3950 9700 8150 9700
Wire Wire Line
	4050 11350 3850 11350
Wire Wire Line
	3850 9600 8250 9600
Wire Wire Line
	3750 11450 4050 11450
Wire Wire Line
	3750 9500 8350 9500
Wire Wire Line
	4050 11550 3650 11550
Wire Wire Line
	3650 9400 8450 9400
Wire Wire Line
	3650 9400 3650 11550
Wire Wire Line
	3750 9500 3750 11450
Wire Wire Line
	3850 9600 3850 11350
Wire Wire Line
	3950 9700 3950 11250
Wire Wire Line
	4050 10850 2850 10850
Wire Wire Line
	4050 10950 2850 10950
Wire Wire Line
	4050 11050 2850 11050
$Comp
L A5C:INV01 UBZ298
U 1 1 5FC7A13E
P 3750 11900
F 0 "UBZ298" H 3750 11583 50  0000 C CNN
F 1 "INV01" H 3750 11674 50  0000 C CNN
F 2 "" H 3750 11700 50  0001 C CNN
F 3 "" H 3750 11700 50  0001 C CNN
	1    3750 11900
	1    0    0    -1  
$EndComp
Wire Wire Line
	2250 5100 2250 8950
Wire Wire Line
	2100 11650 2350 11650
Wire Wire Line
	4050 11750 3900 11750
Wire Wire Line
	3900 11750 3900 11650
Wire Wire Line
	3900 11650 2350 11650
Wire Wire Line
	2350 11650 2350 9050
Connection ~ 2350 11650
Wire Wire Line
	2250 11900 3450 11900
Wire Wire Line
	3450 12500 3450 11900
Connection ~ 3450 11900
Wire Wire Line
	6150 13450 2200 13450
Wire Wire Line
	2200 13450 2200 12450
Wire Wire Line
	2200 12450 2500 12450
Wire Wire Line
	2500 12550 2300 12550
Wire Wire Line
	2300 12550 2300 13350
Wire Wire Line
	2300 13350 6250 13350
Wire Wire Line
	6450 13250 2400 13250
Wire Wire Line
	2400 13250 2400 12650
Wire Wire Line
	2400 12650 2500 12650
Wire Wire Line
	2500 12750 2500 13150
Wire Wire Line
	2500 13150 6650 13150
$Comp
L power:GND #PWR?
U 1 1 5FEB5843
P 2600 10750
F 0 "#PWR?" H 2600 10500 50  0001 C CNN
F 1 "GND" H 2605 10577 50  0000 C CNN
F 2 "" H 2600 10750 50  0001 C CNN
F 3 "" H 2600 10750 50  0001 C CNN
	1    2600 10750
	1    0    0    -1  
$EndComp
Wire Wire Line
	2600 10750 4050 10750
Text Label 2950 10850 0    50   ~ 0
CG431
Text Label 2950 10950 0    50   ~ 0
CG442
Text Label 2950 11050 0    50   ~ 0
CG437
Wire Wire Line
	6650 11800 6650 13150
Wire Wire Line
	6450 10050 6450 13250
Wire Wire Line
	6250 12000 6250 13350
Wire Wire Line
	6150 11900 6150 13450
Wire Wire Line
	4700 8100 4700 9000
Connection ~ 4700 8100
Wire Wire Line
	2250 8950 3550 8950
Connection ~ 2250 8950
Wire Wire Line
	2250 8950 2250 11900
Wire Wire Line
	2350 9050 3550 9050
Connection ~ 2350 9050
Wire Wire Line
	2350 9050 2350 5200
Wire Wire Line
	2350 5200 3550 5200
Wire Wire Line
	4700 4050 4700 5150
Wire Wire Line
	2250 5100 3550 5100
$EndSCHEMATC
