EESchema Schematic File Version 4
EELAYER 30 0
EELAYER END
$Descr A4 11693 8268
encoding utf-8
Sheet 13 83
Title "CPS Reverse Engineering: DL-0311"
Date "2021-09-12"
Rev ""
Comp ""
Comment1 ""
Comment2 ""
Comment3 "Licence: CC-BY"
Comment4 "Author: Loïc *WydD* Petit"
$EndDescr
NoConn ~ 5500 2400
Entry Wire Line
	2700 2200 2800 2300
Entry Wire Line
	2700 2900 2800 3000
Entry Wire Line
	2700 3800 2800 3900
Entry Wire Line
	2700 3900 2800 4000
Entry Wire Line
	2700 4550 2800 4650
Entry Wire Line
	2700 5100 2800 5200
Entry Wire Line
	4200 2300 4300 2400
Entry Wire Line
	4200 2400 4300 2500
Entry Wire Line
	4200 3350 4300 3450
Entry Wire Line
	4200 3450 4300 3550
Entry Wire Line
	4200 4250 4300 4350
Entry Wire Line
	4200 4900 4300 5000
Entry Wire Line
	5750 2550 5850 2450
Entry Wire Line
	5750 2650 5850 2550
Entry Wire Line
	5750 3600 5850 3500
Entry Wire Line
	5750 3700 5850 3600
Entry Wire Line
	5750 4450 5850 4350
Entry Wire Line
	5750 5100 5850 5000
Entry Wire Line
	8100 2350 8200 2450
Entry Wire Line
	8100 2450 8200 2550
Entry Wire Line
	8100 3400 8200 3500
Entry Wire Line
	8100 3500 8200 3600
Entry Wire Line
	8100 4450 8200 4550
Entry Wire Line
	8100 4550 8200 4650
Entry Wire Line
	8100 5400 8200 5500
Entry Wire Line
	8100 6200 8200 6300
Entry Wire Line
	8300 800  8400 900 
Entry Wire Line
	8300 1350 8400 1450
Entry Wire Line
	8300 2050 8400 2150
Entry Wire Line
	8300 2150 8400 2250
Entry Wire Line
	8300 3100 8400 3200
Entry Wire Line
	8300 3200 8400 3300
Entry Wire Line
	8300 4150 8400 4250
Entry Wire Line
	8300 4250 8400 4350
Entry Wire Line
	8300 5200 8400 5300
Entry Wire Line
	8300 6000 8400 6100
Entry Wire Line
	9850 950  9950 850 
Entry Wire Line
	9850 1550 9950 1450
Entry Wire Line
	9850 2300 9950 2200
Entry Wire Line
	9850 2400 9950 2300
Entry Wire Line
	9850 3350 9950 3250
Entry Wire Line
	9850 3450 9950 3350
Entry Wire Line
	9850 4400 9950 4300
Entry Wire Line
	9850 4500 9950 4400
Entry Wire Line
	9850 5400 9950 5300
Entry Wire Line
	9850 6200 9950 6100
Wire Wire Line
	1850 3400 1750 3400
Wire Wire Line
	1850 3900 1750 3900
Wire Wire Line
	1850 4450 1750 4450
Wire Wire Line
	2450 3600 2450 3400
Wire Wire Line
	2450 3700 2450 3900
Wire Wire Line
	2450 3700 3300 3700
Wire Wire Line
	2450 4450 3300 4450
Wire Wire Line
	3200 2200 3200 2450
Wire Wire Line
	3200 2200 3300 2200
Wire Wire Line
	3200 2800 3200 3200
Wire Wire Line
	3200 3200 4100 3200
Wire Wire Line
	3300 2300 2800 2300
Wire Wire Line
	3300 2800 3200 2800
Wire Wire Line
	3300 3000 2800 3000
Wire Wire Line
	3300 3600 2450 3600
Wire Wire Line
	3300 3900 2800 3900
Wire Wire Line
	3300 4000 2800 4000
Wire Wire Line
	3300 4650 2800 4650
Wire Wire Line
	3850 2250 4000 2250
Wire Wire Line
	3900 2450 3200 2450
Wire Wire Line
	3900 2800 3900 2450
Wire Wire Line
	3900 2900 4000 2900
Wire Wire Line
	4000 2250 4000 2700
Wire Wire Line
	4000 2700 4700 2700
Wire Wire Line
	4000 2900 4000 2800
Wire Wire Line
	4100 3200 4100 3600
Wire Wire Line
	4100 4000 4100 4450
Wire Wire Line
	4100 4450 3900 4450
Wire Wire Line
	4700 2400 4300 2400
Wire Wire Line
	4700 2500 4300 2500
Wire Wire Line
	4700 2800 4000 2800
Wire Wire Line
	4700 3450 4300 3450
Wire Wire Line
	4700 3550 4300 3550
Wire Wire Line
	4700 3750 4100 3750
Wire Wire Line
	4700 3850 4100 3850
Wire Wire Line
	4700 4350 4300 4350
Wire Wire Line
	4700 4550 3900 4550
Wire Wire Line
	4700 5000 4300 5000
Wire Wire Line
	4700 5200 2800 5200
Wire Wire Line
	5300 4450 5750 4450
Wire Wire Line
	5300 4550 5500 4550
Wire Wire Line
	5300 5100 5750 5100
Wire Wire Line
	5500 2550 5750 2550
Wire Wire Line
	5500 2650 5750 2650
Wire Wire Line
	5500 2800 5500 3450
Wire Wire Line
	5500 3600 5750 3600
Wire Wire Line
	5500 3700 5750 3700
Wire Wire Line
	5500 3850 5500 4350
Wire Wire Line
	5500 4350 5300 4350
Wire Wire Line
	5500 4550 5500 5000
Wire Wire Line
	5500 5000 5300 5000
Wire Wire Line
	8200 2450 8800 2450
Wire Wire Line
	8200 2550 8800 2550
Wire Wire Line
	8200 3500 8800 3500
Wire Wire Line
	8200 3600 8800 3600
Wire Wire Line
	8200 4550 8800 4550
Wire Wire Line
	8200 4650 8800 4650
Wire Wire Line
	8200 5500 8800 5500
Wire Wire Line
	8200 6300 8800 6300
Wire Wire Line
	8800 900  8400 900 
Wire Wire Line
	8800 1100 8800 1000
Wire Wire Line
	8800 1450 8400 1450
Wire Wire Line
	8800 1800 8800 1650
Wire Wire Line
	8800 2150 8400 2150
Wire Wire Line
	8800 2250 8400 2250
Wire Wire Line
	8800 3200 8400 3200
Wire Wire Line
	8800 3300 8400 3300
Wire Wire Line
	8800 4250 8400 4250
Wire Wire Line
	8800 4350 8400 4350
Wire Wire Line
	8800 5300 8400 5300
Wire Wire Line
	8800 6100 8400 6100
Wire Wire Line
	9350 950  9850 950 
Wire Wire Line
	9400 1450 9500 1450
Wire Wire Line
	9400 1550 9850 1550
Wire Wire Line
	9400 5300 9600 5300
Wire Wire Line
	9400 5400 9850 5400
Wire Wire Line
	9400 6100 9600 6100
Wire Wire Line
	9400 6200 9850 6200
Wire Wire Line
	9500 1100 8800 1100
Wire Wire Line
	9500 1450 9500 1100
Wire Wire Line
	9600 2150 9700 2150
Wire Wire Line
	9600 2300 9850 2300
Wire Wire Line
	9600 2400 9850 2400
Wire Wire Line
	9600 2550 9600 3200
Wire Wire Line
	9600 3350 9850 3350
Wire Wire Line
	9600 3450 9850 3450
Wire Wire Line
	9600 3600 9600 4250
Wire Wire Line
	9600 4400 9850 4400
Wire Wire Line
	9600 4500 9850 4500
Wire Wire Line
	9600 5300 9600 4650
Wire Wire Line
	9600 5500 9400 5500
Wire Wire Line
	9600 6100 9600 5500
Wire Wire Line
	9700 1800 8800 1800
Wire Wire Line
	9700 1800 9700 2150
Wire Bus Line
	2700 1800 2550 1800
Wire Bus Line
	4200 1800 4050 1800
Wire Bus Line
	5850 2300 5950 2300
Wire Bus Line
	8100 2200 7950 2200
Wire Bus Line
	8300 650  8150 650 
Wire Bus Line
	9950 650  10150 650 
Text Label 2850 2300 0    50   ~ 0
CNT6
Text Label 2850 3000 0    50   ~ 0
CNT5
Text Label 2850 3900 0    50   ~ 0
CNT4
Text Label 2850 4000 0    50   ~ 0
CNT3
Text Label 2850 4650 0    50   ~ 0
CNT2
Text Label 2850 5200 0    50   ~ 0
CNT1
Text Label 4700 2400 2    50   ~ 0
BASE-X5
Text Label 4700 2500 2    50   ~ 0
BASE-X4
Text Label 4700 3450 2    50   ~ 0
BASE-X3
Text Label 4700 3550 2    50   ~ 0
BASE-X2
Text Label 4700 4350 2    50   ~ 0
BASE-X1
Text Label 4700 5000 2    50   ~ 0
BASE-X0
Text Label 5600 2550 0    50   ~ 0
X5
Text Label 5600 2650 0    50   ~ 0
X4
Text Label 5600 3600 0    50   ~ 0
X3
Text Label 5600 3700 0    50   ~ 0
X2
Text Label 5600 4450 0    50   ~ 0
X1
Text Label 5600 5100 0    50   ~ 0
X0
Text Label 8800 900  2    50   ~ 0
BASE-Y9
Text Label 8800 1450 2    50   ~ 0
BASE-Y8
Text Label 8800 2150 2    50   ~ 0
BASE-Y7
Text Label 8800 2250 2    50   ~ 0
BASE-Y6
Text Label 8800 2450 2    50   ~ 0
ROW7
Text Label 8800 2550 2    50   ~ 0
ROW6
Text Label 8800 3200 2    50   ~ 0
BASE-Y5
Text Label 8800 3300 2    50   ~ 0
BASE-Y4
Text Label 8800 3500 2    50   ~ 0
ROW5
Text Label 8800 3600 2    50   ~ 0
ROW4
Text Label 8800 4250 2    50   ~ 0
BASE-Y3
Text Label 8800 4350 2    50   ~ 0
BASE-Y2
Text Label 8800 4550 2    50   ~ 0
ROW3
Text Label 8800 4650 2    50   ~ 0
ROW2
Text Label 8800 5300 2    50   ~ 0
BASE-Y1
Text Label 8800 5500 2    50   ~ 0
ROW1
Text Label 8800 6100 2    50   ~ 0
BASE-Y0
Text Label 8800 6300 2    50   ~ 0
ROW0
Text Label 9350 950  0    50   ~ 0
Y9
Text Label 9400 1550 0    50   ~ 0
Y8
Text Label 9700 2300 0    50   ~ 0
Y7
Text Label 9700 2400 0    50   ~ 0
Y6
Text Label 9700 3350 0    50   ~ 0
Y5
Text Label 9700 3450 0    50   ~ 0
Y4
Text Label 9700 4400 0    50   ~ 0
Y3
Text Label 9700 4500 0    50   ~ 0
Y2
Text Label 9700 5400 0    50   ~ 0
Y1
Text Label 9700 6200 0    50   ~ 0
Y0
Text HLabel 1750 3400 0    50   Input ~ 0
~X+8
Text HLabel 1750 3900 0    50   Input ~ 0
~X+4
Text HLabel 1750 4450 0    50   Input ~ 0
~X+2
Text HLabel 2550 1800 0    50   Input ~ 0
CNT[1..6]
Text HLabel 4050 1800 0    50   Input ~ 0
BASE-X[0..5]
Text HLabel 5950 2300 2    50   Output ~ 0
X[0..5]
Text HLabel 7950 2200 0    50   Input ~ 0
ROW[0..7]
Text HLabel 8150 650  0    50   Input ~ 0
BASE-Y[0..9]
Text HLabel 10150 650  2    50   Output ~ 0
Y[0..9]
$Comp
L A5C:XOR02 UCB439
U 1 1 61118F31
P 3550 2250
F 0 "UCB439" H 3575 2517 50  0000 C CNN
F 1 "XOR02" H 3575 2426 50  0000 C CNN
F 2 "" H 3550 2250 50  0001 C CNN
F 3 "" H 3550 2250 50  0001 C CNN
	1    3550 2250
	1    0    0    -1  
$EndComp
$Comp
L A5C:XOR02 UEE284
U 1 1 60B27CC8
P 9050 950
F 0 "UEE284" H 9075 1217 50  0000 C CNN
F 1 "XOR02" H 9075 1126 50  0000 C CNN
F 2 "" H 9050 950 50  0001 C CNN
F 3 "" H 9050 950 50  0001 C CNN
	1    9050 950 
	1    0    0    -1  
$EndComp
$Comp
L A5C:INV01 UBJ127
U 1 1 657E8CCE
P 2150 3400
F 0 "UBJ127" H 2150 3717 50  0000 C CNN
F 1 "INV01" H 2150 3626 50  0000 C CNN
F 2 "" H 2150 3200 50  0001 C CNN
F 3 "" H 2150 3200 50  0001 C CNN
	1    2150 3400
	1    0    0    -1  
$EndComp
$Comp
L A5C:INV01 UCA445
U 1 1 64B41422
P 2150 3900
F 0 "UCA445" H 2150 4217 50  0000 C CNN
F 1 "INV01" H 2150 4126 50  0000 C CNN
F 2 "" H 2150 3700 50  0001 C CNN
F 3 "" H 2150 3700 50  0001 C CNN
	1    2150 3900
	1    0    0    -1  
$EndComp
$Comp
L A5C:INV01 UCC73
U 1 1 67A65C4C
P 2150 4450
F 0 "UCC73" H 2150 4767 50  0000 C CNN
F 1 "INV01" H 2150 4676 50  0000 C CNN
F 2 "" H 2150 4250 50  0001 C CNN
F 3 "" H 2150 4250 50  0001 C CNN
	1    2150 4450
	1    0    0    -1  
$EndComp
$Comp
L A5C:HA1 UBI85
U 1 1 61118F30
P 3600 2900
F 0 "UBI85" H 3600 3265 50  0000 C CNN
F 1 "HA1" H 3600 3174 50  0000 C CNN
F 2 "" H 3550 2900 50  0001 C CNN
F 3 "" H 3550 2900 50  0001 C CNN
	1    3600 2900
	1    0    0    -1  
$EndComp
$Comp
L A5C:HA1 UCA275
U 1 1 61118F2F
P 3600 4550
F 0 "UCA275" H 3600 4915 50  0000 C CNN
F 1 "HA1" H 3600 4824 50  0000 C CNN
F 2 "" H 3550 4550 50  0001 C CNN
F 3 "" H 3550 4550 50  0001 C CNN
	1    3600 4550
	1    0    0    -1  
$EndComp
$Comp
L A5C:FA1 UBJ118
U 1 1 63123B5A
P 5000 4500
F 0 "UBJ118" H 5000 4915 50  0000 C CNN
F 1 "FA1" H 5000 4824 50  0000 C CNN
F 2 "" H 4950 4550 50  0001 C CNN
F 3 "" H 4950 4550 50  0001 C CNN
	1    5000 4500
	1    0    0    -1  
$EndComp
$Comp
L A5C:HA1 UBJ130
U 1 1 6337D5C6
P 5000 5100
F 0 "UBJ130" H 5000 5465 50  0000 C CNN
F 1 "HA1" H 5000 5374 50  0000 C CNN
F 2 "" H 4950 5100 50  0001 C CNN
F 3 "" H 4950 5100 50  0001 C CNN
	1    5000 5100
	1    0    0    -1  
$EndComp
$Comp
L A5C:HA1 UEC277
U 1 1 606DC083
P 9100 1550
F 0 "UEC277" H 9100 1915 50  0000 C CNN
F 1 "HA1" H 9100 1824 50  0000 C CNN
F 2 "" H 9050 1550 50  0001 C CNN
F 3 "" H 9050 1550 50  0001 C CNN
	1    9100 1550
	1    0    0    -1  
$EndComp
$Comp
L A5C:FA1 UEB283
U 1 1 61F94CE5
P 9100 5450
F 0 "UEB283" H 9100 5865 50  0000 C CNN
F 1 "FA1" H 9100 5774 50  0000 C CNN
F 2 "" H 9050 5500 50  0001 C CNN
F 3 "" H 9050 5500 50  0001 C CNN
	1    9100 5450
	1    0    0    -1  
$EndComp
$Comp
L A5C:HA1 UEB270
U 1 1 62058D66
P 9100 6200
F 0 "UEB270" H 9100 6565 50  0000 C CNN
F 1 "HA1" H 9100 6474 50  0000 C CNN
F 2 "" H 9050 6200 50  0001 C CNN
F 3 "" H 9050 6200 50  0001 C CNN
	1    9100 6200
	1    0    0    -1  
$EndComp
$Comp
L A5C:FA2 UCC432
U 1 1 61118F2E
P 3700 3900
F 0 "UCC432" H 3700 4465 50  0000 C CNN
F 1 "FA2" H 3700 4374 50  0000 C CNN
F 2 "" H 3550 4100 50  0001 C CNN
F 3 "" H 3550 4100 50  0001 C CNN
	1    3700 3900
	1    0    0    -1  
$EndComp
$Comp
L A5C:FA2 UCB423
U 1 1 63839877
P 5100 2700
F 0 "UCB423" H 5100 3265 50  0000 C CNN
F 1 "FA2" H 5100 3174 50  0000 C CNN
F 2 "" H 4950 2900 50  0001 C CNN
F 3 "" H 4950 2900 50  0001 C CNN
	1    5100 2700
	1    0    0    -1  
$EndComp
$Comp
L A5C:FA2 UCC451
U 1 1 62D9D8A2
P 5100 3750
F 0 "UCC451" H 5100 4315 50  0000 C CNN
F 1 "FA2" H 5100 4224 50  0000 C CNN
F 2 "" H 4950 3950 50  0001 C CNN
F 3 "" H 4950 3950 50  0001 C CNN
	1    5100 3750
	1    0    0    -1  
$EndComp
$Comp
L A5C:FA2 UCB508
U 1 1 606DAEC3
P 9200 2450
F 0 "UCB508" H 9200 3015 50  0000 C CNN
F 1 "FA2" H 9200 2924 50  0000 C CNN
F 2 "" H 9050 2650 50  0001 C CNN
F 3 "" H 9050 2650 50  0001 C CNN
	1    9200 2450
	1    0    0    -1  
$EndComp
$Comp
L A5C:FA2 UCA485
U 1 1 61D572A4
P 9200 3500
F 0 "UCA485" H 9200 4065 50  0000 C CNN
F 1 "FA2" H 9200 3974 50  0000 C CNN
F 2 "" H 9050 3700 50  0001 C CNN
F 3 "" H 9050 3700 50  0001 C CNN
	1    9200 3500
	1    0    0    -1  
$EndComp
$Comp
L A5C:FA2 UCB489
U 1 1 61E17517
P 9200 4550
F 0 "UCB489" H 9200 5115 50  0000 C CNN
F 1 "FA2" H 9200 5024 50  0000 C CNN
F 2 "" H 9050 4750 50  0001 C CNN
F 3 "" H 9050 4750 50  0001 C CNN
	1    9200 4550
	1    0    0    -1  
$EndComp
Wire Bus Line
	2700 1800 2700 5100
Wire Bus Line
	4200 1800 4200 4900
Wire Bus Line
	5850 2300 5850 5000
Wire Bus Line
	8100 2200 8100 6200
Wire Bus Line
	8300 650  8300 6000
Wire Bus Line
	9950 650  9950 6100
$EndSCHEMATC
