EESchema Schematic File Version 4
EELAYER 30 0
EELAYER END
$Descr A4 11693 8268
encoding utf-8
Sheet 56 69
Title ""
Date "2020-11-26"
Rev ""
Comp ""
Comment1 "Licence: CC-BY"
Comment2 "Author: Loïc *WydD* Petit"
Comment3 ""
Comment4 ""
$EndDescr
Connection ~ 4050 4450
Connection ~ 1750 2700
Connection ~ 2350 3150
Connection ~ 4250 4250
Connection ~ 4350 4150
Connection ~ 3950 4550
Connection ~ 4250 5150
Connection ~ 4350 5050
Connection ~ 4150 4350
Connection ~ 4150 5250
Connection ~ 3950 5750
Connection ~ 4050 5650
Connection ~ 4150 3300
Connection ~ 4250 3200
Connection ~ 1750 2050
Connection ~ 1750 4000
Connection ~ 1750 3350
Connection ~ 4350 1200
Connection ~ 3950 3800
Connection ~ 3950 1300
Connection ~ 4050 3150
Connection ~ 4150 2500
Connection ~ 4250 1850
NoConn ~ 5850 6300
NoConn ~ 5850 6400
NoConn ~ 5850 6500
Entry Wire Line
	1300 1200 1200 1100
Entry Wire Line
	1300 1850 1200 1750
Entry Wire Line
	1300 2500 1200 2400
Entry Wire Line
	1300 3150 1200 3050
Entry Wire Line
	1300 3800 1200 3700
Entry Wire Line
	4700 600  4800 700 
Entry Wire Line
	4700 700  4800 800 
Entry Wire Line
	4700 800  4800 900 
Entry Wire Line
	4700 900  4800 1000
Entry Wire Line
	4700 1000 4800 1100
Wire Wire Line
	1300 1200 1850 1200
Wire Wire Line
	1300 1850 1850 1850
Wire Wire Line
	1300 2500 1850 2500
Wire Wire Line
	1300 3150 1850 3150
Wire Wire Line
	1300 3800 1850 3800
Wire Wire Line
	1550 4000 1750 4000
Wire Wire Line
	1750 1400 1750 2050
Wire Wire Line
	1750 2050 1750 2700
Wire Wire Line
	1750 2700 1750 3350
Wire Wire Line
	1750 3350 1750 4000
Wire Wire Line
	1750 4000 1850 4000
Wire Wire Line
	1850 1400 1750 1400
Wire Wire Line
	1850 2050 1750 2050
Wire Wire Line
	1850 2700 1750 2700
Wire Wire Line
	1850 3350 1750 3350
Wire Wire Line
	2350 3150 2350 3400
Wire Wire Line
	2950 1200 4350 1200
Wire Wire Line
	2950 1850 4250 1850
Wire Wire Line
	2950 2500 4150 2500
Wire Wire Line
	2950 3150 4050 3150
Wire Wire Line
	2950 3800 3950 3800
Wire Wire Line
	3150 3400 2350 3400
Wire Wire Line
	3750 3400 4900 3400
Wire Wire Line
	3950 600  3950 1300
Wire Wire Line
	3950 600  4700 600 
Wire Wire Line
	3950 1300 3950 3800
Wire Wire Line
	3950 3800 3950 4550
Wire Wire Line
	3950 4550 3950 5750
Wire Wire Line
	3950 5750 3950 6800
Wire Wire Line
	4050 700  4050 3150
Wire Wire Line
	4050 700  4700 700 
Wire Wire Line
	4050 3150 4050 4450
Wire Wire Line
	4050 4450 4050 5650
Wire Wire Line
	4050 5650 4050 7000
Wire Wire Line
	4050 5650 4850 5650
Wire Wire Line
	4050 7000 4850 7000
Wire Wire Line
	4150 800  4150 2500
Wire Wire Line
	4150 800  4700 800 
Wire Wire Line
	4150 2500 4150 3300
Wire Wire Line
	4150 3300 4150 4350
Wire Wire Line
	4150 4350 4150 5250
Wire Wire Line
	4150 5250 4150 6500
Wire Wire Line
	4150 5250 4850 5250
Wire Wire Line
	4150 6500 4850 6500
Wire Wire Line
	4250 900  4250 1850
Wire Wire Line
	4250 900  4700 900 
Wire Wire Line
	4250 1850 4250 3200
Wire Wire Line
	4250 3200 4250 4250
Wire Wire Line
	4250 3200 4900 3200
Wire Wire Line
	4250 4250 4250 5150
Wire Wire Line
	4250 5150 4250 6400
Wire Wire Line
	4350 1000 4350 1200
Wire Wire Line
	4350 1000 4700 1000
Wire Wire Line
	4350 1200 4350 4150
Wire Wire Line
	4350 4150 4350 5050
Wire Wire Line
	4350 5050 4350 6300
Wire Wire Line
	4700 5550 4850 5550
Wire Wire Line
	4850 4150 4350 4150
Wire Wire Line
	4850 4250 4250 4250
Wire Wire Line
	4850 4350 4150 4350
Wire Wire Line
	4850 4450 4050 4450
Wire Wire Line
	4850 4550 3950 4550
Wire Wire Line
	4850 5050 4350 5050
Wire Wire Line
	4850 5150 4250 5150
Wire Wire Line
	4850 5750 3950 5750
Wire Wire Line
	4850 6300 4350 6300
Wire Wire Line
	4850 6400 4250 6400
Wire Wire Line
	4850 6800 3950 6800
Wire Wire Line
	4850 6900 4700 6900
Wire Wire Line
	4900 3300 4150 3300
Wire Wire Line
	5850 1500 5850 3300
Wire Wire Line
	5850 3300 5500 3300
Wire Wire Line
	6100 1200 4350 1200
Wire Wire Line
	6100 1300 3950 1300
Wire Wire Line
	6100 1500 5850 1500
Wire Bus Line
	1050 900  1200 900 
Wire Bus Line
	4800 1100 5050 1100
Text Notes 4500 5000 0    50   ~ 0
0b00CBA0
Text Notes 4500 6250 0    50   ~ 0
0b10CBA0
Text Notes 4900 2700 0    50   ~ 0
CA4 & /CA3 & /CA2
Text Notes 6350 1750 0    50   ~ 0
0bB100A0
Text Notes 6500 4350 0    50   ~ 0
0x3E
Text Notes 6700 6350 0    50   ~ 0
0x20
Text Notes 6700 6450 0    50   ~ 0
0x22
Text Notes 6700 6550 0    50   ~ 0
0x24
Text Notes 6700 6650 0    50   ~ 0
0x26
Text Notes 6700 6750 0    50   ~ 0
0x28
Text Notes 6700 6850 0    50   ~ 0
0x2A
Text Notes 6700 6950 0    50   ~ 0
0x2C
Text Notes 6700 7050 0    50   ~ 0
0x2E
Text Notes 6850 5050 0    50   ~ 0
0x00
Text Notes 6850 5150 0    50   ~ 0
0x02
Text Notes 6850 5250 0    50   ~ 0
0x04
Text Notes 6850 5350 0    50   ~ 0
0x06
Text Notes 6850 5450 0    50   ~ 0
0x08
Text Notes 6850 5550 0    50   ~ 0
0x0A
Text Notes 6850 5650 0    50   ~ 0
0x0C
Text Notes 6850 5750 0    50   ~ 0
0x0E
Text Notes 7950 1200 0    50   ~ 0
0x10
Text Notes 7950 1300 0    50   ~ 0
0x12
Text Notes 7950 1400 0    50   ~ 0
0x30
Text Notes 7950 1500 0    50   ~ 0
0x32
Text Label 1600 1200 2    50   ~ 0
CA-IN1
Text Label 1600 1850 2    50   ~ 0
CA-IN2
Text Label 1600 2500 2    50   ~ 0
CA-IN3
Text Label 1600 3150 2    50   ~ 0
CA-IN4
Text Label 1600 3800 2    50   ~ 0
CA-IN5
Text Label 3000 1200 0    50   ~ 0
CA1
Text Label 3000 1850 0    50   ~ 0
CA2
Text Label 3000 2500 0    50   ~ 0
CA3
Text Label 3000 3150 0    50   ~ 0
CA4
Text Label 3000 3800 0    50   ~ 0
CA5
Text Label 4600 600  2    50   ~ 0
CA1
Text Label 4600 700  2    50   ~ 0
CA2
Text Label 4600 800  2    50   ~ 0
CA3
Text Label 4600 900  2    50   ~ 0
CA4
Text Label 4600 1000 2    50   ~ 0
CA5
Text Label 6000 4350 0    50   ~ 0
~BW391-Q
Text Label 6200 5050 0    50   ~ 0
~BW185-O0
Text Label 6200 5150 0    50   ~ 0
~BW185-O1
Text Label 6200 5250 0    50   ~ 0
~BW185-O2
Text Label 6200 5350 0    50   ~ 0
~BW185-O3
Text Label 6200 5450 0    50   ~ 0
~BW185-O4
Text Label 6200 5550 0    50   ~ 0
~BW185-O5
Text Label 6200 5650 0    50   ~ 0
~BW185-O6
Text Label 6200 5750 0    50   ~ 0
~BW185-O7
Text Label 6200 6650 0    50   ~ 0
~CR348-O3
Text Label 6200 6750 0    50   ~ 0
~CR348-O4
Text Label 6200 6850 0    50   ~ 0
~CR348-O5
Text Label 6200 6950 0    50   ~ 0
~CR348-O6
Text Label 6200 7050 0    50   ~ 0
~CR348-O7
Text Label 7300 1200 0    50   ~ 0
~BW247-O0
Text Label 7300 1300 0    50   ~ 0
~BW247-O1
Text Label 7300 1400 0    50   ~ 0
~BW247-O2
Text Label 7300 1500 0    50   ~ 0
~BW247-O3
Text HLabel 1050 900  0    50   Input ~ 0
CA-IN[1..5]
Text HLabel 1550 4000 0    50   Input ~ 0
LE
Text HLabel 5050 1100 2    50   Output ~ 0
CA[1..5]
Text HLabel 5500 4350 2    50   Output ~ 0
0x3E
Text HLabel 5850 5050 2    50   Output ~ 0
0x00
Text HLabel 5850 5150 2    50   Output ~ 0
0x02
Text HLabel 5850 5250 2    50   Output ~ 0
0x04
Text HLabel 5850 5350 2    50   Output ~ 0
0x06
Text HLabel 5850 5450 2    50   Output ~ 0
0x08
Text HLabel 5850 5550 2    50   Output ~ 0
0x0A
Text HLabel 5850 5650 2    50   Output ~ 0
0x0C
Text HLabel 5850 5750 2    50   Output ~ 0
0x0E
Text HLabel 5850 6600 2    50   Output ~ 0
0x26
Text HLabel 5850 6700 2    50   Output ~ 0
0x28
Text HLabel 5850 6800 2    50   Output ~ 0
0x2A
Text HLabel 5850 6900 2    50   Output ~ 0
0x2C
Text HLabel 5850 7000 2    50   Output ~ 0
0x2E
Text HLabel 6950 1200 2    50   Output ~ 0
0x10
Text HLabel 6950 1300 2    50   Output ~ 0
0x12
Text HLabel 6950 1400 2    50   Output ~ 0
0x30
Text HLabel 6950 1500 2    50   Output ~ 0
0x32
$Comp
L power:VCC #PWR?
U 1 1 62116D40
P 4700 5550
AR Path="/5F7A979F/62116D40" Ref="#PWR?"  Part="1" 
AR Path="/5FBF8EAD/5FBFA08D/62116D40" Ref="#PWR0203"  Part="1" 
F 0 "#PWR0203" H 4700 5400 50  0001 C CNN
F 1 "VCC" H 4715 5723 50  0000 C CNN
F 2 "" H 4700 5550 50  0001 C CNN
F 3 "" H 4700 5550 50  0001 C CNN
	1    4700 5550
	1    0    0    -1  
$EndComp
$Comp
L power:GND #PWR?
U 1 1 6E0021F2
P 4700 6900
AR Path="/5F7A979F/6E0021F2" Ref="#PWR?"  Part="1" 
AR Path="/5FBF8EAD/5FBFA08D/6E0021F2" Ref="#PWR0204"  Part="1" 
F 0 "#PWR0204" H 4700 6650 50  0001 C CNN
F 1 "GND" H 4705 6727 50  0000 C CNN
F 2 "" H 4700 6900 50  0001 C CNN
F 3 "" H 4700 6900 50  0001 C CNN
	1    4700 6900
	1    0    0    -1  
$EndComp
$Comp
L A5C:BUF12 UCC481
U 1 1 73F5C3C0
P 2650 1200
AR Path="/5F7A979F/73F5C3C0" Ref="UCC481"  Part="1" 
AR Path="/5FBF8EAD/5FBFA08D/73F5C3C0" Ref="UCC481"  Part="1" 
F 0 "UCC481" H 2650 1517 50  0000 C CNN
F 1 "BUF12" H 2650 1426 50  0000 C CNN
F 2 "" H 2650 1200 50  0001 C CNN
F 3 "" H 2650 1200 50  0001 C CNN
	1    2650 1200
	1    0    0    -1  
$EndComp
$Comp
L A5C:BUF12 UBZ434
U 1 1 73F5D99D
P 2650 1850
AR Path="/5F7A979F/73F5D99D" Ref="UBZ434"  Part="1" 
AR Path="/5FBF8EAD/5FBFA08D/73F5D99D" Ref="UBZ434"  Part="1" 
F 0 "UBZ434" H 2650 2167 50  0000 C CNN
F 1 "BUF12" H 2650 2076 50  0000 C CNN
F 2 "" H 2650 1850 50  0001 C CNN
F 3 "" H 2650 1850 50  0001 C CNN
	1    2650 1850
	1    0    0    -1  
$EndComp
$Comp
L A5C:BUF12 UBZ437
U 1 1 73F5DF91
P 2650 2500
AR Path="/5F7A979F/73F5DF91" Ref="UBZ437"  Part="1" 
AR Path="/5FBF8EAD/5FBFA08D/73F5DF91" Ref="UBZ437"  Part="1" 
F 0 "UBZ437" H 2650 2817 50  0000 C CNN
F 1 "BUF12" H 2650 2726 50  0000 C CNN
F 2 "" H 2650 2500 50  0001 C CNN
F 3 "" H 2650 2500 50  0001 C CNN
	1    2650 2500
	1    0    0    -1  
$EndComp
$Comp
L A5C:BUF12 UBW396
U 1 1 73F5E5A9
P 2650 3150
AR Path="/5F7A979F/73F5E5A9" Ref="UBW396"  Part="1" 
AR Path="/5FBF8EAD/5FBFA08D/73F5E5A9" Ref="UBW396"  Part="1" 
F 0 "UBW396" H 2650 3467 50  0000 C CNN
F 1 "BUF12" H 2650 3376 50  0000 C CNN
F 2 "" H 2650 3150 50  0001 C CNN
F 3 "" H 2650 3150 50  0001 C CNN
	1    2650 3150
	1    0    0    -1  
$EndComp
$Comp
L A5C:BUF12 UBW453
U 1 1 73F5F7B3
P 2650 3800
AR Path="/5F7A979F/73F5F7B3" Ref="UBW453"  Part="1" 
AR Path="/5FBF8EAD/5FBFA08D/73F5F7B3" Ref="UBW453"  Part="1" 
F 0 "UBW453" H 2650 4117 50  0000 C CNN
F 1 "BUF12" H 2650 4026 50  0000 C CNN
F 2 "" H 2650 3800 50  0001 C CNN
F 3 "" H 2650 3800 50  0001 C CNN
	1    2650 3800
	1    0    0    -1  
$EndComp
$Comp
L A5C:INV01 UBW395
U 1 1 73F6084C
P 3450 3400
AR Path="/5F7A979F/73F6084C" Ref="UBW395"  Part="1" 
AR Path="/5FBF8EAD/5FBFA08D/73F6084C" Ref="UBW395"  Part="1" 
F 0 "UBW395" H 3450 3717 50  0000 C CNN
F 1 "INV01" H 3450 3626 50  0000 C CNN
F 2 "" H 3450 3200 50  0001 C CNN
F 3 "" H 3450 3200 50  0001 C CNN
	1    3450 3400
	1    0    0    1   
$EndComp
$Comp
L A5C:OR03 UBW280
U 1 1 5F814FCD
P 5200 3300
AR Path="/5F7A979F/5F814FCD" Ref="UBW280"  Part="1" 
AR Path="/5FBF8EAD/5FBFA08D/5F814FCD" Ref="UBW280"  Part="1" 
F 0 "UBW280" H 5200 3617 50  0000 C CNN
F 1 "OR03" H 5200 3526 50  0000 C CNN
F 2 "" H 5200 3300 50  0001 C CNN
F 3 "" H 5200 3300 50  0001 C CNN
	1    5200 3300
	1    0    0    -1  
$EndComp
$Comp
L A5C:L UBZ482
U 1 1 72D15039
P 2100 1300
AR Path="/5F7A979F/72D15039" Ref="UBZ482"  Part="1" 
AR Path="/5FBF8EAD/5FBFA08D/72D15039" Ref="UBZ482"  Part="1" 
F 0 "UBZ482" H 2100 1665 50  0000 C CNN
F 1 "L" H 2100 1574 50  0000 C CNN
F 2 "" H 2100 1300 50  0001 C CNN
F 3 "" H 2100 1300 50  0001 C CNN
F 4 "UBZ481" H 2100 1300 50  0001 C CNN "MiscRef"
	1    2100 1300
	1    0    0    -1  
$EndComp
$Comp
L A5C:L UBZ485
U 1 1 72D15548
P 2100 1950
AR Path="/5F7A979F/72D15548" Ref="UBZ485"  Part="1" 
AR Path="/5FBF8EAD/5FBFA08D/72D15548" Ref="UBZ485"  Part="1" 
F 0 "UBZ485" H 2100 2315 50  0000 C CNN
F 1 "L" H 2100 2224 50  0000 C CNN
F 2 "" H 2100 1950 50  0001 C CNN
F 3 "" H 2100 1950 50  0001 C CNN
	1    2100 1950
	1    0    0    -1  
$EndComp
$Comp
L A5C:L UBZ488
U 1 1 72FAB637
P 2100 2600
AR Path="/5F7A979F/72FAB637" Ref="UBZ488"  Part="1" 
AR Path="/5FBF8EAD/5FBFA08D/72FAB637" Ref="UBZ488"  Part="1" 
F 0 "UBZ488" H 2100 2965 50  0000 C CNN
F 1 "L" H 2100 2874 50  0000 C CNN
F 2 "" H 2100 2600 50  0001 C CNN
F 3 "" H 2100 2600 50  0001 C CNN
	1    2100 2600
	1    0    0    -1  
$EndComp
$Comp
L A5C:L UBZ491
U 1 1 730F6B60
P 2100 3250
AR Path="/5F7A979F/730F6B60" Ref="UBZ491"  Part="1" 
AR Path="/5FBF8EAD/5FBFA08D/730F6B60" Ref="UBZ491"  Part="1" 
F 0 "UBZ491" H 2100 3615 50  0000 C CNN
F 1 "L" H 2100 3524 50  0000 C CNN
F 2 "" H 2100 3250 50  0001 C CNN
F 3 "" H 2100 3250 50  0001 C CNN
	1    2100 3250
	1    0    0    -1  
$EndComp
$Comp
L A5C:L UBZ493
U 1 1 73242F41
P 2100 3900
AR Path="/5F7A979F/73242F41" Ref="UBZ493"  Part="1" 
AR Path="/5FBF8EAD/5FBFA08D/73242F41" Ref="UBZ493"  Part="1" 
F 0 "UBZ493" H 2100 4265 50  0000 C CNN
F 1 "L" H 2100 4174 50  0000 C CNN
F 2 "" H 2100 3900 50  0001 C CNN
F 3 "" H 2100 3900 50  0001 C CNN
	1    2100 3900
	1    0    0    -1  
$EndComp
$Comp
L A5C:NAND05 UBW391
U 1 1 5EE98D59
P 5150 4350
AR Path="/5F7A979F/5EE98D59" Ref="UBW391"  Part="1" 
AR Path="/5FBF8EAD/5FBFA08D/5EE98D59" Ref="UBW391"  Part="1" 
F 0 "UBW391" H 5175 4740 50  0000 C CNN
F 1 "NAND05" H 5175 4649 50  0000 C CNN
F 2 "" H 5150 4050 50  0001 C CNN
F 3 "" H 5150 4050 50  0001 C CNN
	1    5150 4350
	1    0    0    -1  
$EndComp
$Comp
L A5C:D24GL UBW247
U 1 1 5F0A676D
P 6500 1350
AR Path="/5F7A979F/5F0A676D" Ref="UBW247"  Part="1" 
AR Path="/5FBF8EAD/5FBFA08D/5F0A676D" Ref="UBW247"  Part="1" 
F 0 "UBW247" H 6500 1740 50  0000 C CNN
F 1 "D24GL" H 6500 1650 50  0000 C CNN
F 2 "" H 6500 1625 50  0001 C CNN
F 3 "" H 6500 1625 50  0001 C CNN
	1    6500 1350
	1    0    0    -1  
$EndComp
$Comp
L A5C:D38GL UBW185
U 1 1 607578A3
P 5350 5400
AR Path="/5F7A979F/607578A3" Ref="UBW185"  Part="1" 
AR Path="/5FBF8EAD/5FBFA08D/607578A3" Ref="UBW185"  Part="1" 
F 0 "UBW185" H 5350 6017 50  0000 C CNN
F 1 "D38GL" H 5350 5926 50  0000 C CNN
F 2 "" H 5350 5925 50  0001 C CNN
F 3 "" H 5350 5925 50  0001 C CNN
	1    5350 5400
	1    0    0    -1  
$EndComp
$Comp
L A5C:D38GL UCR348
U 1 1 63D991CB
P 5350 6650
AR Path="/5F7A979F/63D991CB" Ref="UCR348"  Part="1" 
AR Path="/5FBF8EAD/5FBFA08D/63D991CB" Ref="UCR348"  Part="1" 
F 0 "UCR348" H 5350 7267 50  0000 C CNN
F 1 "D38GL" H 5350 7176 50  0000 C CNN
F 2 "" H 5350 7175 50  0001 C CNN
F 3 "" H 5350 7175 50  0001 C CNN
	1    5350 6650
	1    0    0    -1  
$EndComp
Wire Bus Line
	1200 900  1200 3700
Wire Bus Line
	4800 700  4800 1100
$EndSCHEMATC
