EESchema Schematic File Version 4
EELAYER 30 0
EELAYER END
$Descr A4 11693 8268
encoding utf-8
Sheet 36 83
Title "CPS Reverse Engineering: DL-0311"
Date "2021-09-12"
Rev ""
Comp ""
Comment1 ""
Comment2 ""
Comment3 "Licence: CC-BY"
Comment4 "Author: Loïc *WydD* Petit"
$EndDescr
Connection ~ 4950 4650
Connection ~ 6100 4750
Connection ~ 6100 5050
Connection ~ 4950 5450
Connection ~ 4200 2900
Connection ~ 4200 3700
Connection ~ 4200 4500
Connection ~ 4950 3850
Connection ~ 6300 3750
Connection ~ 6300 3450
Connection ~ 6300 3650
Connection ~ 6550 3950
Connection ~ 6400 3850
Connection ~ 6400 2850
Connection ~ 6550 3350
Connection ~ 6400 3250
Connection ~ 6200 4450
Connection ~ 6550 4650
Connection ~ 6300 4450
Connection ~ 6200 4050
Connection ~ 6400 4550
Connection ~ 6200 4350
Connection ~ 5950 1150
NoConn ~ 7400 5250
Entry Wire Line
	6500 5850 6600 5750
Entry Wire Line
	6500 5950 6600 5850
Entry Wire Line
	6500 6050 6600 5950
Entry Wire Line
	6500 6150 6600 6050
Wire Wire Line
	3800 2050 3800 5200
Wire Wire Line
	3800 2050 8350 2050
Wire Wire Line
	3800 5200 4300 5200
Wire Wire Line
	3900 2150 3900 4400
Wire Wire Line
	3900 2150 8250 2150
Wire Wire Line
	3900 4400 4300 4400
Wire Wire Line
	4000 2250 4000 3600
Wire Wire Line
	4000 2250 8150 2250
Wire Wire Line
	4000 3600 4300 3600
Wire Wire Line
	4100 2350 8050 2350
Wire Wire Line
	4100 2800 4100 2350
Wire Wire Line
	4100 2800 4300 2800
Wire Wire Line
	4200 2900 3700 2900
Wire Wire Line
	4200 2900 4200 3700
Wire Wire Line
	4200 3700 4200 4500
Wire Wire Line
	4200 4500 4200 5300
Wire Wire Line
	4200 5300 4300 5300
Wire Wire Line
	4300 2900 4200 2900
Wire Wire Line
	4300 3700 4200 3700
Wire Wire Line
	4300 4500 4200 4500
Wire Wire Line
	4850 2850 5050 2850
Wire Wire Line
	4850 3650 5050 3650
Wire Wire Line
	4850 4450 5050 4450
Wire Wire Line
	4850 5250 5050 5250
Wire Wire Line
	4950 3850 4950 3050
Wire Wire Line
	4950 4650 4950 3850
Wire Wire Line
	4950 4650 5050 4650
Wire Wire Line
	4950 5450 4950 4650
Wire Wire Line
	4950 5450 4950 5600
Wire Wire Line
	4950 5600 4800 5600
Wire Wire Line
	5050 3050 4950 3050
Wire Wire Line
	5050 3850 4950 3850
Wire Wire Line
	5050 5450 4950 5450
Wire Wire Line
	5550 2850 6400 2850
Wire Wire Line
	5550 2950 5950 2950
Wire Wire Line
	5550 3650 6300 3650
Wire Wire Line
	5550 3750 5850 3750
Wire Wire Line
	5550 4450 6200 4450
Wire Wire Line
	5550 5250 6100 5250
Wire Wire Line
	5550 5350 5650 5350
Wire Wire Line
	5650 5350 5650 6150
Wire Wire Line
	5650 6150 6500 6150
Wire Wire Line
	5750 4550 5550 4550
Wire Wire Line
	5750 6050 5750 4550
Wire Wire Line
	5850 3750 5850 5950
Wire Wire Line
	5850 5950 6500 5950
Wire Wire Line
	5950 1150 5750 1150
Wire Wire Line
	5950 1150 5950 1550
Wire Wire Line
	5950 2950 5950 5850
Wire Wire Line
	5950 5850 6500 5850
Wire Wire Line
	6100 2600 6100 4750
Wire Wire Line
	6100 4750 6100 5050
Wire Wire Line
	6100 4750 7400 4750
Wire Wire Line
	6100 5050 6100 5250
Wire Wire Line
	6200 2600 6200 4050
Wire Wire Line
	6200 4050 6200 4350
Wire Wire Line
	6200 4050 7400 4050
Wire Wire Line
	6200 4350 6200 4450
Wire Wire Line
	6200 4450 6200 5150
Wire Wire Line
	6300 2600 6300 3450
Wire Wire Line
	6300 3450 6300 3650
Wire Wire Line
	6300 3450 7400 3450
Wire Wire Line
	6300 3650 6300 3750
Wire Wire Line
	6300 3750 6300 4450
Wire Wire Line
	6300 4450 6300 5250
Wire Wire Line
	6400 2600 6400 2850
Wire Wire Line
	6400 2850 6400 3250
Wire Wire Line
	6400 3250 6400 3850
Wire Wire Line
	6400 3850 6400 4550
Wire Wire Line
	6400 4550 6400 5350
Wire Wire Line
	6500 6050 5750 6050
Wire Wire Line
	6550 1550 6550 3350
Wire Wire Line
	6550 3350 6550 3950
Wire Wire Line
	6550 3350 6650 3350
Wire Wire Line
	6550 3950 6550 4650
Wire Wire Line
	6550 3950 6650 3950
Wire Wire Line
	6550 4650 6550 5450
Wire Wire Line
	6550 4650 6650 4650
Wire Wire Line
	6550 5450 6650 5450
Wire Wire Line
	6650 1150 5950 1150
Wire Wire Line
	6650 1150 6650 2750
Wire Wire Line
	6650 2750 7400 2750
Wire Wire Line
	6650 3250 6400 3250
Wire Wire Line
	6650 3750 6300 3750
Wire Wire Line
	6650 3850 6400 3850
Wire Wire Line
	6650 4350 6200 4350
Wire Wire Line
	6650 4450 6300 4450
Wire Wire Line
	6650 4550 6400 4550
Wire Wire Line
	6650 5050 6100 5050
Wire Wire Line
	6650 5150 6200 5150
Wire Wire Line
	6650 5250 6300 5250
Wire Wire Line
	6650 5350 6400 5350
Wire Wire Line
	7200 3300 7200 3350
Wire Wire Line
	7200 3350 7400 3350
Wire Wire Line
	7250 3950 7250 3850
Wire Wire Line
	7250 4650 7250 4500
Wire Wire Line
	7400 2850 6400 2850
Wire Wire Line
	7400 3950 7250 3950
Wire Wire Line
	7400 4650 7250 4650
Wire Wire Line
	7950 3400 8150 3400
Wire Wire Line
	7950 4000 8250 4000
Wire Wire Line
	7950 4700 8350 4700
Wire Wire Line
	8050 2350 8050 2800
Wire Wire Line
	8050 2800 7950 2800
Wire Wire Line
	8150 3400 8150 2250
Wire Wire Line
	8250 4000 8250 2150
Wire Wire Line
	8350 2050 8350 4700
Wire Bus Line
	6600 5650 6750 5650
Text Notes 2200 3700 0    50   ~ 0
RESET:\nSYNC(SPRITE-X-READY & LI) + RESET\n\nINC:\nLI
Text Label 6500 5850 2    50   ~ 0
WX-C4
Text Label 6500 5950 2    50   ~ 0
WX-C5
Text Label 6500 6050 2    50   ~ 0
WX-C6
Text Label 6500 6150 2    50   ~ 0
WX-C7
Text HLabel 3150 2850 0    50   Input ~ 0
~ZERO
Text HLabel 3150 2950 0    50   Input ~ 0
~RESET
Text HLabel 4800 5600 0    50   Input ~ 0
~CLK8M4M
Text HLabel 5750 1150 0    50   Input ~ 0
INC
Text HLabel 6750 5650 2    50   Output ~ 0
WX-C[4..7]
$Comp
L A5C:AND02 UDG116
U 1 1 61118E86
P 3400 2900
F 0 "UDG116" H 3425 3167 50  0000 C CNN
F 1 "AND02" H 3425 3076 50  0000 C CNN
F 2 "" H 3400 2900 50  0001 C CNN
F 3 "" H 3400 2900 50  0001 C CNN
	1    3400 2900
	1    0    0    -1  
$EndComp
$Comp
L A5C:NAND02 UDD?
U 1 1 61118EA3
P 4550 2850
AR Path="/61118EA3" Ref="UDD?"  Part="1" 
AR Path="/613100A2/61118EA3" Ref="UDD140"  Part="1" 
AR Path="/613100A2/612D9CCD/61118EA3" Ref="UDD140"  Part="1" 
F 0 "UDD140" H 4575 3117 50  0000 C CNN
F 1 "NAND02" H 4575 3026 50  0000 C CNN
F 2 "" H 4550 2850 50  0001 C CNN
F 3 "" H 4550 2850 50  0001 C CNN
	1    4550 2850
	1    0    0    -1  
$EndComp
$Comp
L A5C:NAND02 UDH?
U 1 1 61118EA4
P 4550 3650
AR Path="/611F0159/61118EA4" Ref="UDH?"  Part="1" 
AR Path="/61118EA4" Ref="UDH?"  Part="1" 
AR Path="/613100A2/61118EA4" Ref="UDF140"  Part="1" 
AR Path="/613100A2/612D9CCD/61118EA4" Ref="UDF140"  Part="1" 
F 0 "UDF140" H 4575 3917 50  0000 C CNN
F 1 "NAND02" H 4575 3826 50  0000 C CNN
F 2 "" H 4550 3650 50  0001 C CNN
F 3 "" H 4550 3650 50  0001 C CNN
	1    4550 3650
	1    0    0    -1  
$EndComp
$Comp
L A5C:NAND02 UDE?
U 1 1 61118E9F
P 4550 4450
AR Path="/611F0159/61118E9F" Ref="UDE?"  Part="1" 
AR Path="/61118E9F" Ref="UDE?"  Part="1" 
AR Path="/613100A2/61118E9F" Ref="UDB139"  Part="1" 
AR Path="/613100A2/612D9CCD/61118E9F" Ref="UDB139"  Part="1" 
F 0 "UDB139" H 4575 4717 50  0000 C CNN
F 1 "NAND02" H 4575 4626 50  0000 C CNN
F 2 "" H 4550 4450 50  0001 C CNN
F 3 "" H 4550 4450 50  0001 C CNN
	1    4550 4450
	1    0    0    -1  
$EndComp
$Comp
L A5C:NAND02 UDD?
U 1 1 61118EA0
P 4550 5250
AR Path="/611F0159/61118EA0" Ref="UDD?"  Part="1" 
AR Path="/61118EA0" Ref="UDD?"  Part="1" 
AR Path="/613100A2/61118EA0" Ref="UDA135"  Part="1" 
AR Path="/613100A2/612D9CCD/61118EA0" Ref="UDA135"  Part="1" 
F 0 "UDA135" H 4575 5517 50  0000 C CNN
F 1 "NAND02" H 4575 5426 50  0000 C CNN
F 2 "" H 4550 5250 50  0001 C CNN
F 3 "" H 4550 5250 50  0001 C CNN
	1    4550 5250
	1    0    0    -1  
$EndComp
$Comp
L A5C:NOR02 UDE?
U 1 1 61118E8A
P 6900 3300
AR Path="/611F0159/61118E8A" Ref="UDE?"  Part="1" 
AR Path="/61118E8A" Ref="UDE?"  Part="1" 
AR Path="/613100A2/61118E8A" Ref="UDD142"  Part="1" 
AR Path="/613100A2/612D9CCD/61118E8A" Ref="UDD142"  Part="1" 
F 0 "UDD142" H 6925 3567 50  0000 C CNN
F 1 "NOR02" H 6925 3476 50  0000 C CNN
F 2 "" H 6900 3300 50  0001 C CNN
F 3 "" H 6900 3300 50  0001 C CNN
	1    6900 3300
	1    0    0    -1  
$EndComp
$Comp
L A5C:XNOR02 UDD?
U 1 1 61118EA1
P 7650 2800
AR Path="/61118EA1" Ref="UDD?"  Part="1" 
AR Path="/613100A2/61118EA1" Ref="UDD137"  Part="1" 
AR Path="/613100A2/612D9CCD/61118EA1" Ref="UDD137"  Part="1" 
F 0 "UDD137" H 7675 3067 50  0000 C CNN
F 1 "XNOR02" H 7675 2976 50  0000 C CNN
F 2 "" H 7675 2800 50  0001 C CNN
F 3 "" H 7675 2800 50  0001 C CNN
	1    7650 2800
	1    0    0    -1  
$EndComp
$Comp
L A5C:XNOR02 UDL?
U 1 1 61118EA8
P 7650 3400
AR Path="/611F0159/61118EA8" Ref="UDL?"  Part="1" 
AR Path="/61118EA8" Ref="UDL?"  Part="1" 
AR Path="/613100A2/61118EA8" Ref="UDF141"  Part="1" 
AR Path="/613100A2/612D9CCD/61118EA8" Ref="UDF141"  Part="1" 
F 0 "UDF141" H 7675 3667 50  0000 C CNN
F 1 "XNOR02" H 7675 3576 50  0000 C CNN
F 2 "" H 7675 3400 50  0001 C CNN
F 3 "" H 7675 3400 50  0001 C CNN
	1    7650 3400
	1    0    0    -1  
$EndComp
$Comp
L A5C:XNOR02 UDE?
U 1 1 61118EA7
P 7650 4000
AR Path="/611F0159/61118EA7" Ref="UDE?"  Part="1" 
AR Path="/61118EA7" Ref="UDE?"  Part="1" 
AR Path="/613100A2/61118EA7" Ref="UDC138"  Part="1" 
AR Path="/613100A2/612D9CCD/61118EA7" Ref="UDC138"  Part="1" 
F 0 "UDC138" H 7675 4267 50  0000 C CNN
F 1 "XNOR02" H 7675 4176 50  0000 C CNN
F 2 "" H 7675 4000 50  0001 C CNN
F 3 "" H 7675 4000 50  0001 C CNN
	1    7650 4000
	1    0    0    -1  
$EndComp
$Comp
L A5C:XNOR02 UDD?
U 1 1 61118EA9
P 7650 4700
AR Path="/611F0159/61118EA9" Ref="UDD?"  Part="1" 
AR Path="/61118EA9" Ref="UDD?"  Part="1" 
AR Path="/613100A2/61118EA9" Ref="UDA138"  Part="1" 
AR Path="/613100A2/612D9CCD/61118EA9" Ref="UDA138"  Part="1" 
F 0 "UDA138" H 7675 4967 50  0000 C CNN
F 1 "XNOR02" H 7675 4876 50  0000 C CNN
F 2 "" H 7675 4700 50  0001 C CNN
F 3 "" H 7675 4700 50  0001 C CNN
	1    7650 4700
	1    0    0    -1  
$EndComp
$Comp
L A5C:INV01 UDD?
U 1 1 61118E89
P 6250 1550
AR Path="/611F0159/61118E89" Ref="UDD?"  Part="1" 
AR Path="/61118E89" Ref="UDD?"  Part="1" 
AR Path="/613100A2/61118E89" Ref="UDD136"  Part="1" 
AR Path="/613100A2/612D9CCD/61118E89" Ref="UDD136"  Part="1" 
F 0 "UDD136" H 6250 1867 50  0000 C CNN
F 1 "INV01" H 6250 1776 50  0000 C CNN
F 2 "" H 6250 1350 50  0001 C CNN
F 3 "" H 6250 1350 50  0001 C CNN
	1    6250 1550
	1    0    0    -1  
$EndComp
$Comp
L A5C:NOR03 UDE?
U 1 1 61118EA5
P 6950 3850
AR Path="/611F0159/61118EA5" Ref="UDE?"  Part="1" 
AR Path="/61118EA5" Ref="UDE?"  Part="1" 
AR Path="/613100A2/61118EA5" Ref="UDC140"  Part="1" 
AR Path="/613100A2/612D9CCD/61118EA5" Ref="UDC140"  Part="1" 
F 0 "UDC140" H 6950 4167 50  0000 C CNN
F 1 "NOR03" H 6950 4076 50  0000 C CNN
F 2 "" H 6950 3850 50  0001 C CNN
F 3 "" H 6950 3850 50  0001 C CNN
	1    6950 3850
	1    0    0    -1  
$EndComp
$Comp
L A5C:DFFCOO UDD?
U 1 1 61118EA2
P 5300 2950
AR Path="/61118EA2" Ref="UDD?"  Part="1" 
AR Path="/613100A2/61118EA2" Ref="UDD132"  Part="1" 
AR Path="/613100A2/612D9CCD/61118EA2" Ref="UDD132"  Part="1" 
F 0 "UDD132" H 5300 3315 50  0000 C CNN
F 1 "DFFCOO" H 5300 3224 50  0000 C CNN
F 2 "" H 5300 2950 50  0001 C CNN
F 3 "" H 5300 2950 50  0001 C CNN
	1    5300 2950
	1    0    0    -1  
$EndComp
$Comp
L A5C:DFFCOO UDI?
U 1 1 61118E9E
P 5300 3750
AR Path="/611F0159/61118E9E" Ref="UDI?"  Part="1" 
AR Path="/61118E9E" Ref="UDI?"  Part="1" 
AR Path="/613100A2/61118E9E" Ref="UDF135"  Part="1" 
AR Path="/613100A2/612D9CCD/61118E9E" Ref="UDF135"  Part="1" 
F 0 "UDF135" H 5300 4115 50  0000 C CNN
F 1 "DFFCOO" H 5300 4024 50  0000 C CNN
F 2 "" H 5300 3750 50  0001 C CNN
F 3 "" H 5300 3750 50  0001 C CNN
	1    5300 3750
	1    0    0    -1  
$EndComp
$Comp
L A5C:DFFCOO UDE?
U 1 1 61118E9D
P 5300 4550
AR Path="/61118E9D" Ref="UDE?"  Part="1" 
AR Path="/613100A2/61118E9D" Ref="UDC134"  Part="1" 
AR Path="/613100A2/612D9CCD/61118E9D" Ref="UDC134"  Part="1" 
F 0 "UDC134" H 5300 4915 50  0000 C CNN
F 1 "DFFCOO" H 5300 4824 50  0000 C CNN
F 2 "" H 5300 4550 50  0001 C CNN
F 3 "" H 5300 4550 50  0001 C CNN
	1    5300 4550
	1    0    0    -1  
$EndComp
$Comp
L A5C:DFFCOO UDD?
U 1 1 61118EB3
P 5300 5350
AR Path="/611F0159/61118EB3" Ref="UDD?"  Part="1" 
AR Path="/61118EB3" Ref="UDD?"  Part="1" 
AR Path="/613100A2/61118EB3" Ref="UDB132"  Part="1" 
AR Path="/613100A2/612D9CCD/61118EB3" Ref="UDB132"  Part="1" 
F 0 "UDB132" H 5300 5715 50  0000 C CNN
F 1 "DFFCOO" H 5300 5624 50  0000 C CNN
F 2 "" H 5300 5350 50  0001 C CNN
F 3 "" H 5300 5350 50  0001 C CNN
	1    5300 5350
	1    0    0    -1  
$EndComp
$Comp
L A5C:NOR04 UDD?
U 1 1 61118EA6
P 6950 4500
AR Path="/611F0159/61118EA6" Ref="UDD?"  Part="1" 
AR Path="/61118EA6" Ref="UDD?"  Part="1" 
AR Path="/613100A2/61118EA6" Ref="UDA140"  Part="1" 
AR Path="/613100A2/612D9CCD/61118EA6" Ref="UDA140"  Part="1" 
F 0 "UDA140" H 6950 4842 50  0000 C CNN
F 1 "NOR04" H 6950 4751 50  0000 C CNN
F 2 "" H 6950 4500 50  0001 C CNN
F 3 "" H 6950 4500 50  0001 C CNN
	1    6950 4500
	1    0    0    -1  
$EndComp
$Comp
L A5C:NOR05 UDD?
U 1 1 61118EB4
P 6950 5250
AR Path="/611F0159/61118EB4" Ref="UDD?"  Part="1" 
AR Path="/61118EB4" Ref="UDD?"  Part="1" 
AR Path="/613100A2/61118EB4" Ref="UDB140"  Part="1" 
AR Path="/613100A2/612D9CCD/61118EB4" Ref="UDB140"  Part="1" 
F 0 "UDB140" H 7025 5665 50  0000 C CNN
F 1 "NOR05" H 7025 5574 50  0000 C CNN
F 2 "" H 6950 5300 50  0001 C CNN
F 3 "" H 6950 5300 50  0001 C CNN
	1    6950 5250
	1    0    0    -1  
$EndComp
Wire Bus Line
	6600 5650 6600 6050
$EndSCHEMATC
