EESchema Schematic File Version 4
EELAYER 30 0
EELAYER END
$Descr A3 16535 11693
encoding utf-8
Sheet 6 83
Title "CPS Reverse Engineering: DL-0311"
Date "2021-09-12"
Rev ""
Comp ""
Comment1 ""
Comment2 ""
Comment3 "Licence: CC-BY"
Comment4 "Author: Loïc *WydD* Petit"
$EndDescr
Connection ~ 2300 7900
Connection ~ 2300 9050
Connection ~ 2300 10150
Connection ~ 1900 6500
Connection ~ 10400 7150
Connection ~ 6100 7150
NoConn ~ 1450 6600
Entry Wire Line
	1650 7800 1750 7900
Entry Wire Line
	1650 8950 1750 9050
Entry Wire Line
	1650 10050 1750 10150
Entry Wire Line
	11150 1000 11250 1100
Entry Wire Line
	11150 1100 11250 1200
Entry Wire Line
	11150 1200 11250 1300
Wire Wire Line
	1450 4500 2150 4500
Wire Wire Line
	1450 4900 2400 4900
Wire Wire Line
	1450 5700 2150 5700
Wire Wire Line
	1450 6100 2400 6100
Wire Wire Line
	1450 6500 1900 6500
Wire Wire Line
	1900 4100 1450 4100
Wire Wire Line
	1900 5300 1450 5300
Wire Wire Line
	1900 6900 1900 6500
Wire Wire Line
	2150 6900 1900 6900
Wire Wire Line
	2300 7900 1750 7900
Wire Wire Line
	2300 7900 2300 8450
Wire Wire Line
	2300 9050 1750 9050
Wire Wire Line
	2300 9050 2300 9600
Wire Wire Line
	2300 10150 1750 10150
Wire Wire Line
	2300 10150 2300 10700
Wire Wire Line
	2400 7300 1450 7300
Wire Wire Line
	3000 4900 3450 4900
Wire Wire Line
	3000 6100 3450 6100
Wire Wire Line
	3400 850  2950 850 
Wire Wire Line
	3400 950  2950 950 
Wire Wire Line
	3400 1050 2950 1050
Wire Wire Line
	3400 1150 2950 1150
Wire Wire Line
	3400 1250 2950 1250
Wire Wire Line
	3400 1550 2950 1550
Wire Wire Line
	3400 1650 2950 1650
Wire Wire Line
	3400 1750 2950 1750
Wire Wire Line
	3400 1850 2950 1850
Wire Wire Line
	3400 1950 2950 1950
Wire Wire Line
	3400 2250 2950 2250
Wire Wire Line
	3400 2350 2950 2350
Wire Wire Line
	3400 2450 2950 2450
Wire Wire Line
	3400 2550 2950 2550
Wire Wire Line
	3400 2850 2950 2850
Wire Wire Line
	3400 2950 2950 2950
Wire Wire Line
	3400 3050 2950 3050
Wire Wire Line
	3400 3350 2950 3350
Wire Wire Line
	3400 3450 2950 3450
Wire Wire Line
	3400 3550 2950 3550
Wire Wire Line
	3450 4100 2500 4100
Wire Wire Line
	3450 4500 2750 4500
Wire Wire Line
	3450 5300 2500 5300
Wire Wire Line
	3450 5700 2750 5700
Wire Wire Line
	3450 6500 2500 6500
Wire Wire Line
	3450 6900 2750 6900
Wire Wire Line
	3450 7300 3000 7300
Wire Wire Line
	3450 7900 2900 7900
Wire Wire Line
	3450 8450 2900 8450
Wire Wire Line
	3450 9050 2900 9050
Wire Wire Line
	3450 9600 2900 9600
Wire Wire Line
	3450 10150 2900 10150
Wire Wire Line
	3450 10700 2900 10700
Wire Wire Line
	3950 2950 4100 2950
Wire Wire Line
	3950 3450 4200 3450
Wire Wire Line
	4050 1750 4100 1750
Wire Wire Line
	4100 2300 4100 1750
Wire Wire Line
	4100 2500 4300 2500
Wire Wire Line
	4100 2950 4100 2500
Wire Wire Line
	4200 1050 4050 1050
Wire Wire Line
	4200 2200 4200 1050
Wire Wire Line
	4200 2600 4200 3450
Wire Wire Line
	4300 2200 4200 2200
Wire Wire Line
	4300 2300 4100 2300
Wire Wire Line
	4300 2400 4000 2400
Wire Wire Line
	4300 2600 4200 2600
Wire Wire Line
	4450 3950 4900 3950
Wire Wire Line
	4450 4550 4900 4550
Wire Wire Line
	4450 5050 4900 5050
Wire Wire Line
	4450 5750 4900 5750
Wire Wire Line
	4450 6450 4900 6450
Wire Wire Line
	4450 7150 4900 7150
Wire Wire Line
	4450 7950 4900 7950
Wire Wire Line
	4450 8750 4900 8750
Wire Wire Line
	4450 9450 4900 9450
Wire Wire Line
	4450 10250 4900 10250
Wire Wire Line
	4900 3050 4450 3050
Wire Wire Line
	4900 3150 4450 3150
Wire Wire Line
	4900 3250 4450 3250
Wire Wire Line
	4900 3350 4450 3350
Wire Wire Line
	4900 3450 4450 3450
Wire Wire Line
	4900 3750 4450 3750
Wire Wire Line
	4900 3850 4450 3850
Wire Wire Line
	4900 4250 4450 4250
Wire Wire Line
	4900 4350 4450 4350
Wire Wire Line
	4900 4450 4450 4450
Wire Wire Line
	4900 4850 4450 4850
Wire Wire Line
	4900 4950 4450 4950
Wire Wire Line
	4900 5150 4450 5150
Wire Wire Line
	4900 5250 4450 5250
Wire Wire Line
	4900 5550 4450 5550
Wire Wire Line
	4900 5650 4450 5650
Wire Wire Line
	4900 5850 4450 5850
Wire Wire Line
	4900 5950 4450 5950
Wire Wire Line
	4900 6250 4450 6250
Wire Wire Line
	4900 6350 4450 6350
Wire Wire Line
	4900 6550 4450 6550
Wire Wire Line
	4900 6650 4450 6650
Wire Wire Line
	4900 6950 4450 6950
Wire Wire Line
	4900 7050 4450 7050
Wire Wire Line
	4900 7250 4450 7250
Wire Wire Line
	4900 7350 4450 7350
Wire Wire Line
	4900 7450 4450 7450
Wire Wire Line
	4900 7750 4450 7750
Wire Wire Line
	4900 7850 4450 7850
Wire Wire Line
	4900 8050 4450 8050
Wire Wire Line
	4900 8150 4450 8150
Wire Wire Line
	4900 8250 4450 8250
Wire Wire Line
	4900 8550 4450 8550
Wire Wire Line
	4900 8650 4450 8650
Wire Wire Line
	4900 8850 4450 8850
Wire Wire Line
	4900 8950 4450 8950
Wire Wire Line
	4900 9250 4450 9250
Wire Wire Line
	4900 9350 4450 9350
Wire Wire Line
	4900 9550 4450 9550
Wire Wire Line
	4900 9650 4450 9650
Wire Wire Line
	4900 9750 4450 9750
Wire Wire Line
	4900 10050 4450 10050
Wire Wire Line
	4900 10150 4450 10150
Wire Wire Line
	4900 10350 4450 10350
Wire Wire Line
	4900 10450 4450 10450
Wire Wire Line
	4900 10550 4450 10550
Wire Wire Line
	4950 2400 6700 2400
Wire Wire Line
	5450 3850 5900 3850
Wire Wire Line
	5500 8000 5700 8000
Wire Wire Line
	5500 9500 5900 9500
Wire Wire Line
	5550 5050 5700 5050
Wire Wire Line
	5550 6450 6100 6450
Wire Wire Line
	5600 5750 5550 5750
Wire Wire Line
	5600 5750 5600 6350
Wire Wire Line
	5600 6550 5600 7200
Wire Wire Line
	5600 7200 5500 7200
Wire Wire Line
	5700 5050 5700 6250
Wire Wire Line
	5700 6250 6100 6250
Wire Wire Line
	5700 6650 6100 6650
Wire Wire Line
	5700 8000 5700 6650
Wire Wire Line
	5800 4400 5500 4400
Wire Wire Line
	5800 4400 5800 6150
Wire Wire Line
	5800 6750 5800 8750
Wire Wire Line
	5800 8750 5550 8750
Wire Wire Line
	5900 3850 5900 6050
Wire Wire Line
	5900 6050 6100 6050
Wire Wire Line
	5900 6850 6100 6850
Wire Wire Line
	5900 9500 5900 6850
Wire Wire Line
	6000 3250 5550 3250
Wire Wire Line
	6000 3250 6000 5950
Wire Wire Line
	6000 6950 6000 10300
Wire Wire Line
	6000 10300 5500 10300
Wire Wire Line
	6100 5950 6000 5950
Wire Wire Line
	6100 6150 5800 6150
Wire Wire Line
	6100 6350 5600 6350
Wire Wire Line
	6100 6550 5600 6550
Wire Wire Line
	6100 6750 5800 6750
Wire Wire Line
	6100 6950 6000 6950
Wire Wire Line
	6100 7150 6100 7050
Wire Wire Line
	6100 7450 6100 7150
Wire Wire Line
	6300 7450 6100 7450
Wire Wire Line
	6700 2400 6700 5400
Wire Wire Line
	6700 5500 6700 6550
Wire Wire Line
	7300 1000 7750 1000
Wire Wire Line
	7300 1800 7750 1800
Wire Wire Line
	7300 2500 7750 2500
Wire Wire Line
	7300 3000 7750 3000
Wire Wire Line
	7300 3500 7750 3500
Wire Wire Line
	7750 800  7300 800 
Wire Wire Line
	7750 900  7300 900 
Wire Wire Line
	7750 1100 7300 1100
Wire Wire Line
	7750 1200 7300 1200
Wire Wire Line
	7750 1300 7300 1300
Wire Wire Line
	7750 1600 7300 1600
Wire Wire Line
	7750 1700 7300 1700
Wire Wire Line
	7750 1900 7300 1900
Wire Wire Line
	7750 2000 7300 2000
Wire Wire Line
	7750 2300 7300 2300
Wire Wire Line
	7750 2400 7300 2400
Wire Wire Line
	7750 2800 7300 2800
Wire Wire Line
	7750 2900 7300 2900
Wire Wire Line
	7750 3300 7300 3300
Wire Wire Line
	7750 3400 7300 3400
Wire Wire Line
	7800 5450 7250 5450
Wire Wire Line
	8300 3400 8550 3400
Wire Wire Line
	8400 1800 8450 1800
Wire Wire Line
	8450 1800 8450 2300
Wire Wire Line
	8450 2300 8650 2300
Wire Wire Line
	8450 2500 8450 2900
Wire Wire Line
	8450 2900 8300 2900
Wire Wire Line
	8550 1050 8350 1050
Wire Wire Line
	8550 2200 8550 1050
Wire Wire Line
	8550 2600 8650 2600
Wire Wire Line
	8550 3400 8550 2600
Wire Wire Line
	8650 2200 8550 2200
Wire Wire Line
	8650 2400 8300 2400
Wire Wire Line
	8650 2500 8450 2500
Wire Wire Line
	8750 4300 9200 4300
Wire Wire Line
	8750 5000 9200 5000
Wire Wire Line
	8750 5700 9200 5700
Wire Wire Line
	8750 6400 9200 6400
Wire Wire Line
	8750 7200 9200 7200
Wire Wire Line
	8750 7900 9200 7900
Wire Wire Line
	8750 8600 9200 8600
Wire Wire Line
	8750 9400 9200 9400
Wire Wire Line
	8750 10100 9200 10100
Wire Wire Line
	9050 10750 9200 10750
Wire Wire Line
	9200 2900 8750 2900
Wire Wire Line
	9200 3000 8750 3000
Wire Wire Line
	9200 3100 8750 3100
Wire Wire Line
	9200 3200 8750 3200
Wire Wire Line
	9200 3500 8750 3500
Wire Wire Line
	9200 3600 8750 3600
Wire Wire Line
	9200 3700 8750 3700
Wire Wire Line
	9200 3800 8750 3800
Wire Wire Line
	9200 4100 8750 4100
Wire Wire Line
	9200 4200 8750 4200
Wire Wire Line
	9200 4400 8750 4400
Wire Wire Line
	9200 4500 8750 4500
Wire Wire Line
	9200 4800 8750 4800
Wire Wire Line
	9200 4900 8750 4900
Wire Wire Line
	9200 5100 8750 5100
Wire Wire Line
	9200 5200 8750 5200
Wire Wire Line
	9200 5500 8750 5500
Wire Wire Line
	9200 5600 8750 5600
Wire Wire Line
	9200 5800 8750 5800
Wire Wire Line
	9200 5900 8750 5900
Wire Wire Line
	9200 6200 8750 6200
Wire Wire Line
	9200 6300 8750 6300
Wire Wire Line
	9200 6500 8750 6500
Wire Wire Line
	9200 6600 8750 6600
Wire Wire Line
	9200 6700 8750 6700
Wire Wire Line
	9200 7000 8750 7000
Wire Wire Line
	9200 7100 8750 7100
Wire Wire Line
	9200 7300 8750 7300
Wire Wire Line
	9200 7400 8750 7400
Wire Wire Line
	9200 7700 8750 7700
Wire Wire Line
	9200 7800 8750 7800
Wire Wire Line
	9200 8000 8750 8000
Wire Wire Line
	9200 8100 8750 8100
Wire Wire Line
	9200 8400 8750 8400
Wire Wire Line
	9200 8500 8750 8500
Wire Wire Line
	9200 8700 8750 8700
Wire Wire Line
	9200 8800 8750 8800
Wire Wire Line
	9200 8900 8750 8900
Wire Wire Line
	9200 9200 8750 9200
Wire Wire Line
	9200 9300 8750 9300
Wire Wire Line
	9200 9500 8750 9500
Wire Wire Line
	9200 9600 8750 9600
Wire Wire Line
	9200 9900 8750 9900
Wire Wire Line
	9200 10000 8750 10000
Wire Wire Line
	9200 10200 8750 10200
Wire Wire Line
	9200 10300 8750 10300
Wire Wire Line
	9200 10400 8750 10400
Wire Wire Line
	9200 10500 8750 10500
Wire Wire Line
	9200 10750 9200 10600
Wire Wire Line
	9300 2400 11000 2400
Wire Wire Line
	9800 3650 10200 3650
Wire Wire Line
	9850 5000 10000 5000
Wire Wire Line
	9850 7900 10000 7900
Wire Wire Line
	9850 9400 10200 9400
Wire Wire Line
	9900 5700 9850 5700
Wire Wire Line
	9900 5700 9900 6350
Wire Wire Line
	9900 6550 9900 7200
Wire Wire Line
	9900 7200 9850 7200
Wire Wire Line
	10000 5000 10000 6250
Wire Wire Line
	10000 6250 10400 6250
Wire Wire Line
	10000 6650 10400 6650
Wire Wire Line
	10000 7900 10000 6650
Wire Wire Line
	10100 4300 9850 4300
Wire Wire Line
	10100 4300 10100 6150
Wire Wire Line
	10100 6750 10100 8650
Wire Wire Line
	10100 8650 9800 8650
Wire Wire Line
	10200 3650 10200 6050
Wire Wire Line
	10200 6050 10400 6050
Wire Wire Line
	10200 6850 10400 6850
Wire Wire Line
	10200 9400 10200 6850
Wire Wire Line
	10300 3050 9800 3050
Wire Wire Line
	10300 3050 10300 5950
Wire Wire Line
	10300 6950 10300 10250
Wire Wire Line
	10300 10250 9800 10250
Wire Wire Line
	10400 5950 10300 5950
Wire Wire Line
	10400 6150 10100 6150
Wire Wire Line
	10400 6350 9900 6350
Wire Wire Line
	10400 6450 9800 6450
Wire Wire Line
	10400 6550 9900 6550
Wire Wire Line
	10400 6750 10100 6750
Wire Wire Line
	10400 6950 10300 6950
Wire Wire Line
	10400 7150 10400 7050
Wire Wire Line
	10400 7450 10400 7150
Wire Wire Line
	10600 7450 10400 7450
Wire Wire Line
	11000 2400 11000 5400
Wire Wire Line
	11000 5500 11000 6550
Wire Wire Line
	11150 1000 10600 1000
Wire Wire Line
	11150 1100 10600 1100
Wire Wire Line
	11150 1200 10600 1200
Wire Wire Line
	11200 1600 11800 1600
Wire Wire Line
	12100 5450 11550 5450
Wire Wire Line
	12700 2100 13150 2100
Wire Wire Line
	12700 3000 13150 3000
Wire Wire Line
	12700 3800 13150 3800
Wire Wire Line
	12700 4600 13150 4600
Wire Wire Line
	12700 5400 13150 5400
Wire Wire Line
	12700 6250 13150 6250
Wire Wire Line
	12700 6750 13150 6750
Wire Wire Line
	12700 7950 13150 7950
Wire Wire Line
	12700 8950 13150 8950
Wire Wire Line
	12700 9600 13150 9600
Wire Wire Line
	13150 2200 12700 2200
Wire Wire Line
	13150 2300 12700 2300
Wire Wire Line
	13150 2400 12700 2400
Wire Wire Line
	13150 2500 12700 2500
Wire Wire Line
	13150 2800 12700 2800
Wire Wire Line
	13150 2900 12700 2900
Wire Wire Line
	13150 3100 12700 3100
Wire Wire Line
	13150 3200 12700 3200
Wire Wire Line
	13150 3300 12700 3300
Wire Wire Line
	13150 3600 12700 3600
Wire Wire Line
	13150 3700 12700 3700
Wire Wire Line
	13150 3900 12700 3900
Wire Wire Line
	13150 4000 12700 4000
Wire Wire Line
	13150 4100 12700 4100
Wire Wire Line
	13150 4400 12700 4400
Wire Wire Line
	13150 4500 12700 4500
Wire Wire Line
	13150 4700 12700 4700
Wire Wire Line
	13150 4800 12700 4800
Wire Wire Line
	13150 4900 12700 4900
Wire Wire Line
	13150 5200 12700 5200
Wire Wire Line
	13150 5300 12700 5300
Wire Wire Line
	13150 5500 12700 5500
Wire Wire Line
	13150 5600 12700 5600
Wire Wire Line
	13150 5700 12700 5700
Wire Wire Line
	13150 6050 12700 6050
Wire Wire Line
	13150 6150 12700 6150
Wire Wire Line
	13150 6350 12700 6350
Wire Wire Line
	13150 6450 12700 6450
Wire Wire Line
	13150 6850 12700 6850
Wire Wire Line
	13150 6950 12700 6950
Wire Wire Line
	13150 7250 12700 7250
Wire Wire Line
	13150 7350 12700 7350
Wire Wire Line
	13150 7750 12700 7750
Wire Wire Line
	13150 7850 12700 7850
Wire Wire Line
	13150 8050 12700 8050
Wire Wire Line
	13150 8150 12700 8150
Wire Wire Line
	13150 8250 12700 8250
Wire Wire Line
	13150 8350 12700 8350
Wire Wire Line
	13150 8450 12700 8450
Wire Wire Line
	13150 8750 12700 8750
Wire Wire Line
	13150 8850 12700 8850
Wire Wire Line
	13150 9050 12700 9050
Wire Wire Line
	13150 9400 12700 9400
Wire Wire Line
	13150 9500 12700 9500
Wire Wire Line
	13750 3050 13850 3050
Wire Wire Line
	13750 5450 13950 5450
Wire Wire Line
	13850 3050 13850 3750
Wire Wire Line
	13850 3950 13850 4650
Wire Wire Line
	13850 3950 14050 3950
Wire Wire Line
	13850 4650 13750 4650
Wire Wire Line
	13900 6250 13800 6250
Wire Wire Line
	13900 6750 13900 6250
Wire Wire Line
	13900 6950 13900 7300
Wire Wire Line
	13900 7300 13700 7300
Wire Wire Line
	13900 8100 13750 8100
Wire Wire Line
	13900 8450 13900 8100
Wire Wire Line
	13900 8550 13900 8900
Wire Wire Line
	13900 8900 13750 8900
Wire Wire Line
	13950 2300 13800 2300
Wire Wire Line
	13950 2300 13950 3650
Wire Wire Line
	13950 4050 13950 5450
Wire Wire Line
	14050 3650 13950 3650
Wire Wire Line
	14050 3750 13850 3750
Wire Wire Line
	14050 3850 13750 3850
Wire Wire Line
	14050 4050 13950 4050
Wire Wire Line
	14100 6750 13900 6750
Wire Wire Line
	14100 6850 13700 6850
Wire Wire Line
	14100 6950 13900 6950
Wire Wire Line
	14650 6850 14700 6850
Wire Wire Line
	14700 5300 14700 3850
Wire Wire Line
	14700 5400 14700 6850
Wire Wire Line
	15800 5350 15250 5350
Wire Bus Line
	1650 7700 1550 7700
Wire Bus Line
	11250 1400 11350 1400
Text Label 1450 4100 0    50   ~ 0
ROWSCROLL
Text Label 1450 4500 0    50   ~ 0
SCROLL1
Text Label 1450 4900 0    50   ~ 0
SCROLL2
Text Label 1450 5300 0    50   ~ 0
SCROLL3
Text Label 1450 5700 0    50   ~ 0
WSTLUT
Text Label 1450 6100 0    50   ~ 0
WSTOBJ
Text Label 1450 6500 0    50   ~ 0
LI-SYNCED
Text Label 1450 7300 0    50   ~ 0
WSTROM
Text Label 1800 7900 0    50   ~ 0
BUS-STATE0
Text Label 1800 9050 0    50   ~ 0
BUS-STATE1
Text Label 1800 10150 0    50   ~ 0
BUS-STATE2
Text Label 2950 850  0    50   ~ 0
~SCROLL2
Text Label 2950 950  0    50   ~ 0
SCROLL3
Text Label 2950 1050 0    50   ~ 0
STATE0
Text Label 2950 1150 0    50   ~ 0
STATE1
Text Label 2950 1250 0    50   ~ 0
~LI-SYNC
Text Label 2950 1550 0    50   ~ 0
~SCROLL2
Text Label 2950 1650 0    50   ~ 0
~WSTLUT
Text Label 2950 1750 0    50   ~ 0
STATE0
Text Label 2950 1850 0    50   ~ 0
STATE1
Text Label 2950 1950 0    50   ~ 0
~LI-SYNC
Text Label 2950 2250 0    50   ~ 0
SCROLL3
Text Label 2950 2350 0    50   ~ 0
~STATE0
Text Label 2950 2450 0    50   ~ 0
STATE2
Text Label 2950 2550 0    50   ~ 0
~LI-SYNC
Text Label 2950 2850 0    50   ~ 0
~WSTLUT
Text Label 2950 2950 0    50   ~ 0
STATE2
Text Label 2950 3050 0    50   ~ 0
~LI-SYNC
Text Label 2950 3350 0    50   ~ 0
STATE1
Text Label 2950 3450 0    50   ~ 0
STATE2
Text Label 2950 3550 0    50   ~ 0
~LI-SYNC
Text Label 3450 4100 2    50   ~ 0
~ROWSCROLL
Text Label 3450 4500 2    50   ~ 0
~SCROLL1
Text Label 3450 4900 2    50   ~ 0
~SCROLL2
Text Label 3450 5300 2    50   ~ 0
~SCROLL3
Text Label 3450 5700 2    50   ~ 0
~WSTLUT
Text Label 3450 6100 2    50   ~ 0
~WSTOBJ
Text Label 3450 6500 2    50   ~ 0
~LI-SYNC
Text Label 3450 6900 2    50   ~ 0
LI-SYNC
Text Label 3450 7300 2    50   ~ 0
~WSTROM
Text Label 3450 7900 2    50   ~ 0
STATE0
Text Label 3450 8450 2    50   ~ 0
~STATE0
Text Label 3450 9050 2    50   ~ 0
STATE1
Text Label 3450 9600 2    50   ~ 0
~STATE1
Text Label 3450 10150 2    50   ~ 0
STATE2
Text Label 3450 10700 2    50   ~ 0
~STATE2
Text Label 4450 3050 0    50   ~ 0
~ROWSCROLL
Text Label 4450 3150 0    50   ~ 0
~SCROLL2
Text Label 4450 3250 0    50   ~ 0
~WSTLUT
Text Label 4450 3350 0    50   ~ 0
~WSTROM
Text Label 4450 3450 0    50   ~ 0
LI-SYNC
Text Label 4450 3750 0    50   ~ 0
WSTOBJ
Text Label 4450 3850 0    50   ~ 0
~WSTROM
Text Label 4450 3950 0    50   ~ 0
LI-SYNC
Text Label 4450 4250 0    50   ~ 0
~ROWSCROLL
Text Label 4450 4350 0    50   ~ 0
SCROLL1
Text Label 4450 4450 0    50   ~ 0
~WSTROM
Text Label 4450 4550 0    50   ~ 0
LI-SYNC
Text Label 4450 4850 0    50   ~ 0
~WSTOBJ
Text Label 4450 4950 0    50   ~ 0
~SCROLL2
Text Label 4450 5050 0    50   ~ 0
SCROLL3
Text Label 4450 5150 0    50   ~ 0
~WSTROM
Text Label 4450 5250 0    50   ~ 0
LI-SYNC
Text Label 4450 5550 0    50   ~ 0
WSTOBJ
Text Label 4450 5650 0    50   ~ 0
~STATE0
Text Label 4450 5750 0    50   ~ 0
~STATE1
Text Label 4450 5850 0    50   ~ 0
~STATE2
Text Label 4450 5950 0    50   ~ 0
~LI-SYNC
Text Label 4450 6250 0    50   ~ 0
~ROWSCROLL
Text Label 4450 6350 0    50   ~ 0
SCROLL1
Text Label 4450 6450 0    50   ~ 0
~STATE1
Text Label 4450 6550 0    50   ~ 0
~STATE2
Text Label 4450 6650 0    50   ~ 0
~LI-SYNC
Text Label 4450 6950 0    50   ~ 0
~ROWSCROLL
Text Label 4450 7050 0    50   ~ 0
~SCROLL2
Text Label 4450 7150 0    50   ~ 0
SCROLL3
Text Label 4450 7250 0    50   ~ 0
~STATE1
Text Label 4450 7350 0    50   ~ 0
~STATE2
Text Label 4450 7450 0    50   ~ 0
~LI-SYNC
Text Label 4450 7750 0    50   ~ 0
~ROWSCROLL
Text Label 4450 7850 0    50   ~ 0
~SCROLL2
Text Label 4450 7950 0    50   ~ 0
~WSTLUT
Text Label 4450 8050 0    50   ~ 0
~STATE1
Text Label 4450 8150 0    50   ~ 0
~STATE2
Text Label 4450 8250 0    50   ~ 0
~LI-SYNC
Text Label 4450 8550 0    50   ~ 0
SCROLL1
Text Label 4450 8650 0    50   ~ 0
~STATE0
Text Label 4450 8750 0    50   ~ 0
STATE1
Text Label 4450 8850 0    50   ~ 0
~STATE2
Text Label 4450 8950 0    50   ~ 0
~LI-SYNC
Text Label 4450 9250 0    50   ~ 0
~SCROLL2
Text Label 4450 9350 0    50   ~ 0
SCROLL3
Text Label 4450 9450 0    50   ~ 0
~STATE0
Text Label 4450 9550 0    50   ~ 0
STATE1
Text Label 4450 9650 0    50   ~ 0
~STATE2
Text Label 4450 9750 0    50   ~ 0
~LI-SYNC
Text Label 4450 10050 0    50   ~ 0
~SCROLL2
Text Label 4450 10150 0    50   ~ 0
~WSTLUT
Text Label 4450 10250 0    50   ~ 0
~STATE0
Text Label 4450 10350 0    50   ~ 0
STATE1
Text Label 4450 10450 0    50   ~ 0
~STATE2
Text Label 4450 10550 0    50   ~ 0
~LI-SYNC
Text Label 7300 800  0    50   ~ 0
~SCROLL1
Text Label 7300 900  0    50   ~ 0
~SCROLL2
Text Label 7300 1000 0    50   ~ 0
~SCROLL3
Text Label 7300 1100 0    50   ~ 0
~WSTLUT
Text Label 7300 1200 0    50   ~ 0
STATE1
Text Label 7300 1300 0    50   ~ 0
~LI-SYNC
Text Label 7300 1600 0    50   ~ 0
~SCROLL2
Text Label 7300 1700 0    50   ~ 0
~SCROLL3
Text Label 7300 1800 0    50   ~ 0
STATE0
Text Label 7300 1900 0    50   ~ 0
STATE1
Text Label 7300 2000 0    50   ~ 0
~LI-SYNC
Text Label 7300 2300 0    50   ~ 0
~SCROLL3
Text Label 7300 2400 0    50   ~ 0
STATE2
Text Label 7300 2500 0    50   ~ 0
~LI-SYNC
Text Label 7300 2800 0    50   ~ 0
STATE0
Text Label 7300 2900 0    50   ~ 0
STATE2
Text Label 7300 3000 0    50   ~ 0
~LI-SYNC
Text Label 7300 3300 0    50   ~ 0
STATE1
Text Label 7300 3400 0    50   ~ 0
STATE2
Text Label 7300 3500 0    50   ~ 0
~LI-SYNC
Text Label 7300 5450 0    50   ~ 0
NEW-STATE0
Text Label 8750 2900 0    50   ~ 0
ROWSCROLL
Text Label 8750 3000 0    50   ~ 0
~WSTOBJ
Text Label 8750 3100 0    50   ~ 0
~WSTROM
Text Label 8750 3200 0    50   ~ 0
LI-SYNC
Text Label 8750 3500 0    50   ~ 0
~WSTOBJ
Text Label 8750 3600 0    50   ~ 0
SCROLL1
Text Label 8750 3700 0    50   ~ 0
~WSTROM
Text Label 8750 3800 0    50   ~ 0
LI-SYNC
Text Label 8750 4100 0    50   ~ 0
~WSTOBJ
Text Label 8750 4200 0    50   ~ 0
~SCROLL2
Text Label 8750 4300 0    50   ~ 0
~SCROLL3
Text Label 8750 4400 0    50   ~ 0
~WSTROM
Text Label 8750 4500 0    50   ~ 0
LI-SYNC
Text Label 8750 4800 0    50   ~ 0
ROWSCROLL
Text Label 8750 4900 0    50   ~ 0
~WSTOBJ
Text Label 8750 5000 0    50   ~ 0
~STATE1
Text Label 8750 5100 0    50   ~ 0
~STATE2
Text Label 8750 5200 0    50   ~ 0
~LI-SYNC
Text Label 8750 5500 0    50   ~ 0
~WSTOBJ
Text Label 8750 5600 0    50   ~ 0
SCROLL1
Text Label 8750 5700 0    50   ~ 0
~STATE1
Text Label 8750 5800 0    50   ~ 0
~STATE2
Text Label 8750 5900 0    50   ~ 0
~LI-SYNC
Text Label 8750 6200 0    50   ~ 0
~WSTOBJ
Text Label 8750 6300 0    50   ~ 0
~SCROLL2
Text Label 8750 6400 0    50   ~ 0
~SCROLL3
Text Label 8750 6500 0    50   ~ 0
~STATE1
Text Label 8750 6600 0    50   ~ 0
~STATE2
Text Label 8750 6700 0    50   ~ 0
~LI-SYNC
Text Label 8750 7000 0    50   ~ 0
ROWSCROLL
Text Label 8750 7100 0    50   ~ 0
STATE0
Text Label 8750 7200 0    50   ~ 0
~STATE1
Text Label 8750 7300 0    50   ~ 0
~STATE2
Text Label 8750 7400 0    50   ~ 0
~LI-SYNC
Text Label 8750 7700 0    50   ~ 0
SCROLL1
Text Label 8750 7800 0    50   ~ 0
~STATE0
Text Label 8750 7900 0    50   ~ 0
~STATE1
Text Label 8750 8000 0    50   ~ 0
~STATE2
Text Label 8750 8100 0    50   ~ 0
~LI-SYNC
Text Label 8750 8400 0    50   ~ 0
~SCROLL2
Text Label 8750 8500 0    50   ~ 0
~SCROLL3
Text Label 8750 8600 0    50   ~ 0
STATE0
Text Label 8750 8700 0    50   ~ 0
~STATE1
Text Label 8750 8800 0    50   ~ 0
~STATE2
Text Label 8750 8900 0    50   ~ 0
~LI-SYNC
Text Label 8750 9200 0    50   ~ 0
SCROLL1
Text Label 8750 9300 0    50   ~ 0
~STATE0
Text Label 8750 9400 0    50   ~ 0
STATE1
Text Label 8750 9500 0    50   ~ 0
~STATE2
Text Label 8750 9600 0    50   ~ 0
~LI-SYNC
Text Label 8750 9900 0    50   ~ 0
~SCROLL2
Text Label 8750 10000 0    50   ~ 0
~SCROLL3
Text Label 8750 10100 0    50   ~ 0
WSTLUT
Text Label 8750 10200 0    50   ~ 0
~STATE0
Text Label 8750 10300 0    50   ~ 0
STATE1
Text Label 8750 10400 0    50   ~ 0
~STATE2
Text Label 8750 10500 0    50   ~ 0
~LI-SYNC
Text Label 10650 1000 0    50   ~ 0
NEW-STATE0
Text Label 10650 1100 0    50   ~ 0
NEW-STATE1
Text Label 10650 1200 0    50   ~ 0
NEW-STATE2
Text Label 11350 1600 0    50   ~ 0
LI-SYNCED
Text Label 11600 5450 0    50   ~ 0
NEW-STATE1
Text Label 12700 2100 0    50   ~ 0
~ROWSCROLL
Text Label 12700 2200 0    50   ~ 0
~WSTOBJ
Text Label 12700 2300 0    50   ~ 0
~SCROLL1
Text Label 12700 2400 0    50   ~ 0
~WSTROM
Text Label 12700 2500 0    50   ~ 0
LI-SYNC
Text Label 12700 2800 0    50   ~ 0
~ROWSCROLL
Text Label 12700 2900 0    50   ~ 0
~WSTOBJ
Text Label 12700 3000 0    50   ~ 0
~SCROLL1
Text Label 12700 3100 0    50   ~ 0
~STATE1
Text Label 12700 3200 0    50   ~ 0
~STATE2
Text Label 12700 3300 0    50   ~ 0
~LI-SYNC
Text Label 12700 3600 0    50   ~ 0
~ROWSCROLL
Text Label 12700 3700 0    50   ~ 0
~SCROLL1
Text Label 12700 3800 0    50   ~ 0
STATE0
Text Label 12700 3900 0    50   ~ 0
~STATE1
Text Label 12700 4000 0    50   ~ 0
~STATE2
Text Label 12700 4100 0    50   ~ 0
~LI-SYNC
Text Label 12700 4400 0    50   ~ 0
~SCROLL1
Text Label 12700 4500 0    50   ~ 0
SCROLL2
Text Label 12700 4600 0    50   ~ 0
~STATE0
Text Label 12700 4700 0    50   ~ 0
STATE1
Text Label 12700 4800 0    50   ~ 0
~STATE2
Text Label 12700 4900 0    50   ~ 0
~LI-SYNC
Text Label 12700 5200 0    50   ~ 0
~SCROLL1
Text Label 12700 5300 0    50   ~ 0
SCROLL3
Text Label 12700 5400 0    50   ~ 0
~STATE0
Text Label 12700 5500 0    50   ~ 0
STATE1
Text Label 12700 5600 0    50   ~ 0
~STATE2
Text Label 12700 5700 0    50   ~ 0
~LI-SYNC
Text Label 12700 6050 0    50   ~ 0
~SCROLL1
Text Label 12700 6150 0    50   ~ 0
~SCROLL2
Text Label 12700 6250 0    50   ~ 0
~SCROLL3
Text Label 12700 6350 0    50   ~ 0
STATE1
Text Label 12700 6450 0    50   ~ 0
~LI-SYNC
Text Label 12700 6750 0    50   ~ 0
STATE0
Text Label 12700 6850 0    50   ~ 0
STATE1
Text Label 12700 6950 0    50   ~ 0
~LI-SYNC
Text Label 12700 7250 0    50   ~ 0
STATE2
Text Label 12700 7350 0    50   ~ 0
~LI-SYNC
Text Label 12700 7750 0    50   ~ 0
~ROWSCROLL
Text Label 12700 7850 0    50   ~ 0
~WSTOBJ
Text Label 12700 7950 0    50   ~ 0
~SCROLL1
Text Label 12700 8050 0    50   ~ 0
~SCROLL2
Text Label 12700 8150 0    50   ~ 0
~SCROLL3
Text Label 12700 8250 0    50   ~ 0
~WSTLUT
Text Label 12700 8350 0    50   ~ 0
~WSTROM
Text Label 12700 8450 0    50   ~ 0
LI-SYNC
Text Label 12700 8750 0    50   ~ 0
STATE0
Text Label 12700 8850 0    50   ~ 0
STATE1
Text Label 12700 8950 0    50   ~ 0
STATE2
Text Label 12700 9050 0    50   ~ 0
~LI-SYNC
Text Label 12700 9400 0    50   ~ 0
~STATE0
Text Label 12700 9500 0    50   ~ 0
~STATE1
Text Label 12700 9600 0    50   ~ 0
~STATE2
Text Label 13650 1350 2    50   ~ 0
LI-SYNCED
Text Label 15300 5350 0    50   ~ 0
NEW-STATE2
Text HLabel 950  6500 0    50   Input ~ 0
LI
Text HLabel 950  6700 0    50   Input ~ 0
~CLK4M
Text HLabel 1450 4100 0    50   Input ~ 0
ROWSCROLL
Text HLabel 1450 4500 0    50   Input ~ 0
SCROLL1
Text HLabel 1450 4900 0    50   Input ~ 0
SCROLL2
Text HLabel 1450 5300 0    50   Input ~ 0
SCROLL3
Text HLabel 1450 5700 0    50   Input ~ 0
WSTLUT
Text HLabel 1450 6100 0    50   Input ~ 0
WSTOBJ
Text HLabel 1450 7300 0    50   Input ~ 0
WSTROM
Text HLabel 1550 7700 0    50   Input ~ 0
BUS-STATE[0..2]
Text HLabel 11350 1400 2    50   Output ~ 0
NEW-STATE[0..2]
Text HLabel 11800 1600 2    50   Output ~ 0
LI-SYNCED
Text HLabel 13650 1050 0    50   Input ~ 0
WSTOBJ-END
Text HLabel 13650 1150 0    50   Input ~ 0
WSTROM-END
Text HLabel 13650 1250 0    50   Input ~ 0
WSTLUT-END
Text HLabel 13650 1450 0    50   Input ~ 0
SCROLL-END
Text HLabel 13700 9500 2    50   Output ~ 0
~WSTROM-RESET
Text HLabel 14400 1250 2    50   Output ~ 0
~LOAD-STATE
Text HLabel 15050 8500 2    50   Output ~ 0
BR
$Comp
L power:VCC #PWR0224
U 1 1 61118F1D
P 6300 7450
F 0 "#PWR0224" H 6300 7300 50  0001 C CNN
F 1 "VCC" H 6315 7623 50  0000 C CNN
F 2 "" H 6300 7450 50  0001 C CNN
F 3 "" H 6300 7450 50  0001 C CNN
	1    6300 7450
	-1   0    0    -1  
$EndComp
$Comp
L power:VCC #PWR0223
U 1 1 781A6576
P 9050 10750
F 0 "#PWR0223" H 9050 10600 50  0001 C CNN
F 1 "VCC" H 9065 10923 50  0000 C CNN
F 2 "" H 9050 10750 50  0001 C CNN
F 3 "" H 9050 10750 50  0001 C CNN
	1    9050 10750
	-1   0    0    -1  
$EndComp
$Comp
L power:VCC #PWR0225
U 1 1 61118F1F
P 10600 7450
F 0 "#PWR0225" H 10600 7300 50  0001 C CNN
F 1 "VCC" H 10615 7623 50  0000 C CNN
F 2 "" H 10600 7450 50  0001 C CNN
F 3 "" H 10600 7450 50  0001 C CNN
	1    10600 7450
	-1   0    0    -1  
$EndComp
$Comp
L A5C:OR02 UAB147
U 1 1 61118F1E
P 6950 5450
F 0 "UAB147" H 6975 5717 50  0000 C CNN
F 1 "OR02" H 6975 5626 50  0000 C CNN
F 2 "" H 7000 5450 50  0001 C CNN
F 3 "" H 7000 5450 50  0001 C CNN
	1    6950 5450
	1    0    0    -1  
$EndComp
$Comp
L A5C:OR02 UAA214
U 1 1 61118F20
P 11250 5450
F 0 "UAA214" H 11275 5717 50  0000 C CNN
F 1 "OR02" H 11275 5626 50  0000 C CNN
F 2 "" H 11300 5450 50  0001 C CNN
F 3 "" H 11300 5450 50  0001 C CNN
	1    11250 5450
	1    0    0    -1  
$EndComp
$Comp
L A5C:NAND02 UAA195
U 1 1 68C94A58
P 13400 7300
F 0 "UAA195" H 13425 7567 50  0000 C CNN
F 1 "NAND02" H 13425 7476 50  0000 C CNN
F 2 "" H 13400 7300 50  0001 C CNN
F 3 "" H 13400 7300 50  0001 C CNN
	1    13400 7300
	1    0    0    -1  
$EndComp
$Comp
L A5C:NAND02 UAC147
U 1 1 61118F25
P 14150 8500
F 0 "UAC147" H 14175 8767 50  0000 C CNN
F 1 "NAND02" H 14175 8676 50  0000 C CNN
F 2 "" H 14150 8500 50  0001 C CNN
F 3 "" H 14150 8500 50  0001 C CNN
	1    14150 8500
	1    0    0    -1  
$EndComp
$Comp
L A5C:OR02 UAA228
U 1 1 61118F22
P 14950 5350
F 0 "UAA228" H 14975 5617 50  0000 C CNN
F 1 "OR02" H 14975 5526 50  0000 C CNN
F 2 "" H 15000 5350 50  0001 C CNN
F 3 "" H 15000 5350 50  0001 C CNN
	1    14950 5350
	1    0    0    -1  
$EndComp
$Comp
L A5C:NAND03 UAA103
U 1 1 6B785384
P 3650 2950
F 0 "UAA103" H 3675 3242 50  0000 C CNN
F 1 "NAND03" H 3675 3151 50  0000 C CNN
F 2 "" H 3650 2950 50  0001 C CNN
F 3 "" H 3650 2950 50  0001 C CNN
	1    3650 2950
	1    0    0    -1  
$EndComp
$Comp
L A5C:NAND03 UAB127
U 1 1 61118F1A
P 3650 3450
F 0 "UAB127" H 3675 3742 50  0000 C CNN
F 1 "NAND03" H 3675 3651 50  0000 C CNN
F 2 "" H 3650 3450 50  0001 C CNN
F 3 "" H 3650 3450 50  0001 C CNN
	1    3650 3450
	1    0    0    -1  
$EndComp
$Comp
L A5C:NAND03 UAA197
U 1 1 70C9DBBB
P 5150 3850
F 0 "UAA197" H 5175 4142 50  0000 C CNN
F 1 "NAND03" H 5175 4051 50  0000 C CNN
F 2 "" H 5150 3850 50  0001 C CNN
F 3 "" H 5150 3850 50  0001 C CNN
	1    5150 3850
	1    0    0    -1  
$EndComp
$Comp
L A5C:NAND03 UAC108
U 1 1 6AC9EE82
P 8000 2400
F 0 "UAC108" H 8025 2692 50  0000 C CNN
F 1 "NAND03" H 8025 2601 50  0000 C CNN
F 2 "" H 8000 2400 50  0001 C CNN
F 3 "" H 8000 2400 50  0001 C CNN
	1    8000 2400
	1    0    0    -1  
$EndComp
$Comp
L A5C:NAND03 UAC105
U 1 1 71157D71
P 8000 2900
F 0 "UAC105" H 8025 3192 50  0000 C CNN
F 1 "NAND03" H 8025 3101 50  0000 C CNN
F 2 "" H 8000 2900 50  0001 C CNN
F 3 "" H 8000 2900 50  0001 C CNN
	1    8000 2900
	1    0    0    -1  
$EndComp
$Comp
L A5C:NAND03 UAC154
U 1 1 684873C8
P 8000 3400
F 0 "UAC154" H 8025 3692 50  0000 C CNN
F 1 "NAND03" H 8025 3601 50  0000 C CNN
F 2 "" H 8000 3400 50  0001 C CNN
F 3 "" H 8000 3400 50  0001 C CNN
	1    8000 3400
	1    0    0    -1  
$EndComp
$Comp
L A5C:NAND03 UAA187
U 1 1 68C096A6
P 13400 6850
F 0 "UAA187" H 13425 7142 50  0000 C CNN
F 1 "NAND03" H 13425 7051 50  0000 C CNN
F 2 "" H 13400 6850 50  0001 C CNN
F 3 "" H 13400 6850 50  0001 C CNN
	1    13400 6850
	1    0    0    -1  
$EndComp
$Comp
L A5C:AND03 UAC?
U 1 1 734815DC
P 13400 9500
AR Path="/734815DC" Ref="UAC?"  Part="1" 
AR Path="/60A9F60C/734815DC" Ref="UAC230"  Part="1" 
AR Path="/60A9F60C/611CA9E7/734815DC" Ref="UAC230"  Part="1" 
F 0 "UAC230" H 13425 9792 50  0000 C CNN
F 1 "AND03" H 13425 9701 50  0000 C CNN
F 2 "" H 13400 9500 50  0001 C CNN
F 3 "" H 13400 9500 50  0001 C CNN
	1    13400 9500
	1    0    0    -1  
$EndComp
$Comp
L A5C:NAND03 UAA190
U 1 1 68E39779
P 14350 6850
F 0 "UAA190" H 14375 7142 50  0000 C CNN
F 1 "NAND03" H 14375 7051 50  0000 C CNN
F 2 "" H 14350 6850 50  0001 C CNN
F 3 "" H 14350 6850 50  0001 C CNN
	1    14350 6850
	1    0    0    -1  
$EndComp
$Comp
L A5C:INV01 UAB158
U 1 1 65389ADA
P 2200 4100
F 0 "UAB158" H 2200 4417 50  0000 C CNN
F 1 "INV02" H 2200 4326 50  0000 C CNN
F 2 "" H 2200 3900 50  0001 C CNN
F 3 "" H 2200 3900 50  0001 C CNN
	1    2200 4100
	1    0    0    -1  
$EndComp
$Comp
L A5C:INV01 UAC133
U 1 1 651092AC
P 2200 5300
F 0 "UAC133" H 2200 5617 50  0000 C CNN
F 1 "INV02" H 2200 5526 50  0000 C CNN
F 2 "" H 2200 5100 50  0001 C CNN
F 3 "" H 2200 5100 50  0001 C CNN
	1    2200 5300
	1    0    0    -1  
$EndComp
$Comp
L A5C:NBUF02 UAC176
U 1 1 79E27D90
P 2200 6500
F 0 "UAC176" H 2200 6817 50  0000 C CNN
F 1 "NBUF03" H 2200 6726 50  0000 C CNN
F 2 "" H 2200 6300 50  0001 C CNN
F 3 "" H 2200 6300 50  0001 C CNN
	1    2200 6500
	1    0    0    -1  
$EndComp
$Comp
L A5C:INV01 UAB141
U 1 1 65389AD4
P 2450 4500
F 0 "UAB141" H 2450 4817 50  0000 C CNN
F 1 "INV02" H 2450 4726 50  0000 C CNN
F 2 "" H 2450 4300 50  0001 C CNN
F 3 "" H 2450 4300 50  0001 C CNN
	1    2450 4500
	1    0    0    -1  
$EndComp
$Comp
L A5C:INV01 UAB236
U 1 1 65108FD6
P 2450 5700
F 0 "UAB236" H 2450 6017 50  0000 C CNN
F 1 "INV01" H 2450 5926 50  0000 C CNN
F 2 "" H 2450 5500 50  0001 C CNN
F 3 "" H 2450 5500 50  0001 C CNN
	1    2450 5700
	1    0    0    -1  
$EndComp
$Comp
L A5C:BUF12 UAB179
U 1 1 6753A631
P 2450 6900
F 0 "UAB179" H 2450 7217 50  0000 C CNN
F 1 "BUF11" H 2450 7126 50  0000 C CNN
F 2 "" H 2450 6900 50  0001 C CNN
F 3 "" H 2450 6900 50  0001 C CNN
	1    2450 6900
	1    0    0    -1  
$EndComp
$Comp
L A5C:BUF12 UAB?
U 1 1 68931418
P 2600 7900
AR Path="/68931418" Ref="UAB?"  Part="1" 
AR Path="/60A9F60C/68931418" Ref="UAB163"  Part="1" 
AR Path="/60A9F60C/611CA9E7/68931418" Ref="UAB163"  Part="1" 
F 0 "UAB163" H 2600 8217 50  0000 C CNN
F 1 "BUF11" H 2600 8126 50  0000 C CNN
F 2 "" H 2600 7900 50  0001 C CNN
F 3 "" H 2600 7900 50  0001 C CNN
	1    2600 7900
	1    0    0    -1  
$EndComp
$Comp
L A5C:INV01 UAB?
U 1 1 6893141E
P 2600 8450
AR Path="/6893141E" Ref="UAB?"  Part="1" 
AR Path="/60A9F60C/6893141E" Ref="UAB193"  Part="1" 
AR Path="/60A9F60C/611CA9E7/6893141E" Ref="UAB193"  Part="1" 
F 0 "UAB193" H 2600 8767 50  0000 C CNN
F 1 "INV02" H 2600 8676 50  0000 C CNN
F 2 "" H 2600 8250 50  0001 C CNN
F 3 "" H 2600 8250 50  0001 C CNN
	1    2600 8450
	1    0    0    -1  
$EndComp
$Comp
L A5C:BUF12 UAB?
U 1 1 692F01D5
P 2600 9050
AR Path="/692F01D5" Ref="UAB?"  Part="1" 
AR Path="/60A9F60C/692F01D5" Ref="UAB239"  Part="1" 
AR Path="/60A9F60C/611CA9E7/692F01D5" Ref="UAB239"  Part="1" 
F 0 "UAB239" H 2600 9367 50  0000 C CNN
F 1 "BUF11" H 2600 9276 50  0000 C CNN
F 2 "" H 2600 9050 50  0001 C CNN
F 3 "" H 2600 9050 50  0001 C CNN
	1    2600 9050
	1    0    0    -1  
$EndComp
$Comp
L A5C:INV01 UAB?
U 1 1 692F01DB
P 2600 9600
AR Path="/692F01DB" Ref="UAB?"  Part="1" 
AR Path="/60A9F60C/692F01DB" Ref="UAA227"  Part="1" 
AR Path="/60A9F60C/611CA9E7/692F01DB" Ref="UAA227"  Part="1" 
F 0 "UAA227" H 2600 9917 50  0000 C CNN
F 1 "INV02" H 2600 9826 50  0000 C CNN
F 2 "" H 2600 9400 50  0001 C CNN
F 3 "" H 2600 9400 50  0001 C CNN
	1    2600 9600
	1    0    0    -1  
$EndComp
$Comp
L A5C:BUF12 UAB?
U 1 1 6D486051
P 2600 10150
AR Path="/6D486051" Ref="UAB?"  Part="1" 
AR Path="/60A9F60C/6D486051" Ref="UAA165"  Part="1" 
AR Path="/60A9F60C/611CA9E7/6D486051" Ref="UAA165"  Part="1" 
F 0 "UAA165" H 2600 10467 50  0000 C CNN
F 1 "BUF11" H 2600 10376 50  0000 C CNN
F 2 "" H 2600 10150 50  0001 C CNN
F 3 "" H 2600 10150 50  0001 C CNN
	1    2600 10150
	1    0    0    -1  
$EndComp
$Comp
L A5C:INV01 UAA?
U 1 1 6D486057
P 2600 10700
AR Path="/6D486057" Ref="UAA?"  Part="1" 
AR Path="/60A9F60C/6D486057" Ref="UAA263"  Part="1" 
AR Path="/60A9F60C/611CA9E7/6D486057" Ref="UAA263"  Part="1" 
F 0 "UAA263" H 2600 11017 50  0000 C CNN
F 1 "INV02" H 2600 10926 50  0000 C CNN
F 2 "" H 2600 10500 50  0001 C CNN
F 3 "" H 2600 10500 50  0001 C CNN
	1    2600 10700
	1    0    0    -1  
$EndComp
$Comp
L A5C:INV01 UAD244
U 1 1 6514DE72
P 2700 4900
F 0 "UAD244" H 2700 5217 50  0000 C CNN
F 1 "INV02" H 2700 5126 50  0000 C CNN
F 2 "" H 2700 4700 50  0001 C CNN
F 3 "" H 2700 4700 50  0001 C CNN
	1    2700 4900
	1    0    0    -1  
$EndComp
$Comp
L A5C:INV01 UAA170
U 1 1 70BD2670
P 2700 6100
F 0 "UAA170" H 2700 6417 50  0000 C CNN
F 1 "INV02" H 2700 6326 50  0000 C CNN
F 2 "" H 2700 5900 50  0001 C CNN
F 3 "" H 2700 5900 50  0001 C CNN
	1    2700 6100
	1    0    0    -1  
$EndComp
$Comp
L A5C:INV01 UAD301
U 1 1 63CB0B8B
P 2700 7300
F 0 "UAD301" H 2700 7617 50  0000 C CNN
F 1 "INV02" H 2700 7526 50  0000 C CNN
F 2 "" H 2700 7100 50  0001 C CNN
F 3 "" H 2700 7100 50  0001 C CNN
	1    2700 7300
	1    0    0    -1  
$EndComp
$Comp
L A5C:INV01 UAC94
U 1 1 61118F24
P 14750 8500
F 0 "UAC94" H 14750 8817 50  0000 C CNN
F 1 "INV01" H 14750 8726 50  0000 C CNN
F 2 "" H 14750 8300 50  0001 C CNN
F 3 "" H 14750 8300 50  0001 C CNN
	1    14750 8500
	1    0    0    -1  
$EndComp
$Comp
L A5C:DFFCOO UBH40
U 1 1 790C8518
P 1200 6600
F 0 "UBH40" H 1200 6965 50  0000 C CNN
F 1 "DFFCOO" H 1200 6874 50  0000 C CNN
F 2 "" H 1200 6600 50  0001 C CNN
F 3 "" H 1200 6600 50  0001 C CNN
	1    1200 6600
	1    0    0    -1  
$EndComp
$Comp
L A5C:NAND04 UAB160
U 1 1 6A2FB156
P 3700 2400
F 0 "UAB160" H 3700 2742 50  0000 C CNN
F 1 "NAND04" H 3700 2651 50  0000 C CNN
F 2 "" H 3700 2150 50  0001 C CNN
F 3 "" H 3700 2150 50  0001 C CNN
	1    3700 2400
	1    0    0    -1  
$EndComp
$Comp
L A5C:NAND04 UAB190
U 1 1 65D24300
P 5200 4400
F 0 "UAB190" H 5200 4742 50  0000 C CNN
F 1 "NAND04" H 5200 4651 50  0000 C CNN
F 2 "" H 5200 4150 50  0001 C CNN
F 3 "" H 5200 4150 50  0001 C CNN
	1    5200 4400
	1    0    0    -1  
$EndComp
$Comp
L A5C:NAND04 UAB211
U 1 1 659F406C
P 9500 3050
F 0 "UAB211" H 9500 3392 50  0000 C CNN
F 1 "NAND04" H 9500 3301 50  0000 C CNN
F 2 "" H 9500 2800 50  0001 C CNN
F 3 "" H 9500 2800 50  0001 C CNN
	1    9500 3050
	1    0    0    -1  
$EndComp
$Comp
L A5C:NAND04 UAC206
U 1 1 66551887
P 9500 3650
F 0 "UAC206" H 9500 3992 50  0000 C CNN
F 1 "NAND04" H 9500 3901 50  0000 C CNN
F 2 "" H 9500 3400 50  0001 C CNN
F 3 "" H 9500 3400 50  0001 C CNN
	1    9500 3650
	1    0    0    -1  
$EndComp
$Comp
L A5C:NAND04 UAC149
U 1 1 6858F373
P 13450 8900
F 0 "UAC149" H 13450 9242 50  0000 C CNN
F 1 "NAND04" H 13450 9151 50  0000 C CNN
F 2 "" H 13450 8650 50  0001 C CNN
F 3 "" H 13450 8650 50  0001 C CNN
	1    13450 8900
	1    0    0    -1  
$EndComp
$Comp
L A5C:NAND05 UAB122
U 1 1 66CDE63D
P 3700 1050
F 0 "UAB122" H 3725 1440 50  0000 C CNN
F 1 "NAND05" H 3725 1349 50  0000 C CNN
F 2 "" H 3700 750 50  0001 C CNN
F 3 "" H 3700 750 50  0001 C CNN
	1    3700 1050
	1    0    0    -1  
$EndComp
$Comp
L A5C:NAND05 UAC170
U 1 1 677ED400
P 3700 1750
F 0 "UAC170" H 3725 2140 50  0000 C CNN
F 1 "NAND05" H 3725 2049 50  0000 C CNN
F 2 "" H 3700 1450 50  0001 C CNN
F 3 "" H 3700 1450 50  0001 C CNN
	1    3700 1750
	1    0    0    -1  
$EndComp
$Comp
L A5C:NAND05 UAB130
U 1 1 7D16948A
P 4600 2400
F 0 "UAB130" H 4625 2790 50  0000 C CNN
F 1 "NAND05" H 4625 2699 50  0000 C CNN
F 2 "" H 4600 2100 50  0001 C CNN
F 3 "" H 4600 2100 50  0001 C CNN
	1    4600 2400
	1    0    0    -1  
$EndComp
$Comp
L A5C:NAND05 UAB195
U 1 1 65DD0384
P 5200 3250
F 0 "UAB195" H 5225 3640 50  0000 C CNN
F 1 "NAND05" H 5225 3549 50  0000 C CNN
F 2 "" H 5200 2950 50  0001 C CNN
F 3 "" H 5200 2950 50  0001 C CNN
	1    5200 3250
	1    0    0    -1  
$EndComp
$Comp
L A5C:NAND05 UAC203
U 1 1 6712FF97
P 5200 5050
F 0 "UAC203" H 5225 5440 50  0000 C CNN
F 1 "NAND05" H 5225 5349 50  0000 C CNN
F 2 "" H 5200 4750 50  0001 C CNN
F 3 "" H 5200 4750 50  0001 C CNN
	1    5200 5050
	1    0    0    -1  
$EndComp
$Comp
L A5C:NAND05 UAA200
U 1 1 70D6AC9D
P 5200 5750
F 0 "UAA200" H 5225 6140 50  0000 C CNN
F 1 "NAND05" H 5225 6049 50  0000 C CNN
F 2 "" H 5200 5450 50  0001 C CNN
F 3 "" H 5200 5450 50  0001 C CNN
	1    5200 5750
	1    0    0    -1  
$EndComp
$Comp
L A5C:NAND05 UAB181
U 1 1 65CCD6B0
P 5200 6450
F 0 "UAB181" H 5225 6840 50  0000 C CNN
F 1 "NAND05" H 5225 6749 50  0000 C CNN
F 2 "" H 5200 6150 50  0001 C CNN
F 3 "" H 5200 6150 50  0001 C CNN
	1    5200 6450
	1    0    0    -1  
$EndComp
$Comp
L A5C:NAND05 UAB184
U 1 1 68619DD7
P 5200 8750
F 0 "UAB184" H 5225 9140 50  0000 C CNN
F 1 "NAND05" H 5225 9049 50  0000 C CNN
F 2 "" H 5200 8450 50  0001 C CNN
F 3 "" H 5200 8450 50  0001 C CNN
	1    5200 8750
	1    0    0    -1  
$EndComp
$Comp
L A5C:NAND05 UAC116
U 1 1 66B9C001
P 8050 1800
F 0 "UAC116" H 8075 2190 50  0000 C CNN
F 1 "NAND05" H 8075 2099 50  0000 C CNN
F 2 "" H 8050 1500 50  0001 C CNN
F 3 "" H 8050 1500 50  0001 C CNN
	1    8050 1800
	1    0    0    -1  
$EndComp
$Comp
L A5C:NAND05 UAC111
U 1 1 61118F1B
P 8950 2400
F 0 "UAC111" H 8975 2790 50  0000 C CNN
F 1 "NAND05" H 8975 2699 50  0000 C CNN
F 2 "" H 8950 2100 50  0001 C CNN
F 3 "" H 8950 2100 50  0001 C CNN
	1    8950 2400
	1    0    0    -1  
$EndComp
$Comp
L A5C:NAND05 UAA211
U 1 1 6AB5C722
P 9500 4300
F 0 "UAA211" H 9525 4690 50  0000 C CNN
F 1 "NAND05" H 9525 4599 50  0000 C CNN
F 2 "" H 9500 4000 50  0001 C CNN
F 3 "" H 9500 4000 50  0001 C CNN
	1    9500 4300
	1    0    0    -1  
$EndComp
$Comp
L A5C:NAND05 UAA203
U 1 1 65B30C95
P 9500 5000
F 0 "UAA203" H 9525 5390 50  0000 C CNN
F 1 "NAND05" H 9525 5299 50  0000 C CNN
F 2 "" H 9500 4700 50  0001 C CNN
F 3 "" H 9500 4700 50  0001 C CNN
	1    9500 5000
	1    0    0    -1  
$EndComp
$Comp
L A5C:NAND05 UAB227
U 1 1 663DCDCD
P 9500 5700
F 0 "UAB227" H 9525 6090 50  0000 C CNN
F 1 "NAND05" H 9525 5999 50  0000 C CNN
F 2 "" H 9500 5400 50  0001 C CNN
F 3 "" H 9500 5400 50  0001 C CNN
	1    9500 5700
	1    0    0    -1  
$EndComp
$Comp
L A5C:NAND05 UAB187
U 1 1 686A0720
P 9500 7200
F 0 "UAB187" H 9525 7590 50  0000 C CNN
F 1 "NAND05" H 9525 7499 50  0000 C CNN
F 2 "" H 9500 6900 50  0001 C CNN
F 3 "" H 9500 6900 50  0001 C CNN
	1    9500 7200
	1    0    0    -1  
$EndComp
$Comp
L A5C:NAND05 UAB168
U 1 1 66210A31
P 9500 7900
F 0 "UAB168" H 9525 8290 50  0000 C CNN
F 1 "NAND05" H 9525 8199 50  0000 C CNN
F 2 "" H 9500 7600 50  0001 C CNN
F 3 "" H 9500 7600 50  0001 C CNN
	1    9500 7900
	1    0    0    -1  
$EndComp
$Comp
L A5C:NAND05 UAB230
U 1 1 66439E92
P 9500 9400
F 0 "UAB230" H 9525 9790 50  0000 C CNN
F 1 "NAND05" H 9525 9699 50  0000 C CNN
F 2 "" H 9500 9100 50  0001 C CNN
F 3 "" H 9500 9100 50  0001 C CNN
	1    9500 9400
	1    0    0    -1  
$EndComp
$Comp
L A5C:NAND05 UAC189
U 1 1 65ED9C5A
P 13450 2300
F 0 "UAC189" H 13475 2690 50  0000 C CNN
F 1 "NAND05" H 13475 2599 50  0000 C CNN
F 2 "" H 13450 2000 50  0001 C CNN
F 3 "" H 13450 2000 50  0001 C CNN
	1    13450 2300
	1    0    0    -1  
$EndComp
$Comp
L A5C:NAND05 UAA179
U 1 1 666D0604
P 13450 6250
F 0 "UAA179" H 13475 6640 50  0000 C CNN
F 1 "NAND05" H 13475 6549 50  0000 C CNN
F 2 "" H 13450 5950 50  0001 C CNN
F 3 "" H 13450 5950 50  0001 C CNN
	1    13450 6250
	1    0    0    -1  
$EndComp
$Comp
L A5C:NAND05 UAC192
U 1 1 61118F21
P 14350 3850
F 0 "UAC192" H 14375 4240 50  0000 C CNN
F 1 "NAND05" H 14375 4149 50  0000 C CNN
F 2 "" H 14350 3550 50  0001 C CNN
F 3 "" H 14350 3550 50  0001 C CNN
	1    14350 3850
	1    0    0    -1  
$EndComp
$Comp
L A5C:NAND06 UAB174
U 1 1 65C25502
P 5200 7200
F 0 "UAB174" H 5200 7640 50  0000 C CNN
F 1 "NAND06" H 5200 7549 50  0000 C CNN
F 2 "" H 5150 7300 50  0001 C CNN
F 3 "" H 5150 7300 50  0001 C CNN
	1    5200 7200
	1    0    0    -1  
$EndComp
$Comp
L A5C:NAND06 UAB153
U 1 1 65BD12A5
P 5200 8000
F 0 "UAB153" H 5200 8440 50  0000 C CNN
F 1 "NAND06" H 5200 8349 50  0000 C CNN
F 2 "" H 5150 8100 50  0001 C CNN
F 3 "" H 5150 8100 50  0001 C CNN
	1    5200 8000
	1    0    0    -1  
$EndComp
$Comp
L A5C:NAND06 UAB198
U 1 1 670B771B
P 5200 9500
F 0 "UAB198" H 5200 9940 50  0000 C CNN
F 1 "NAND06" H 5200 9849 50  0000 C CNN
F 2 "" H 5150 9600 50  0001 C CNN
F 3 "" H 5150 9600 50  0001 C CNN
	1    5200 9500
	1    0    0    -1  
$EndComp
$Comp
L A5C:NAND06 UAA172
U 1 1 6736DFF8
P 5200 10300
F 0 "UAA172" H 5200 10740 50  0000 C CNN
F 1 "NAND06" H 5200 10649 50  0000 C CNN
F 2 "" H 5150 10400 50  0001 C CNN
F 3 "" H 5150 10400 50  0001 C CNN
	1    5200 10300
	1    0    0    -1  
$EndComp
$Comp
L A5C:NAND06 UAC119
U 1 1 6685EAE4
P 8050 1050
F 0 "UAC119" H 8050 1490 50  0000 C CNN
F 1 "NAND06" H 8050 1399 50  0000 C CNN
F 2 "" H 8000 1150 50  0001 C CNN
F 3 "" H 8000 1150 50  0001 C CNN
	1    8050 1050
	1    0    0    -1  
$EndComp
$Comp
L A5C:NAND06 UAB222
U 1 1 687B2D3E
P 9500 6450
F 0 "UAB222" H 9500 6890 50  0000 C CNN
F 1 "NAND06" H 9500 6799 50  0000 C CNN
F 2 "" H 9450 6550 50  0001 C CNN
F 3 "" H 9450 6550 50  0001 C CNN
	1    9500 6450
	1    0    0    -1  
$EndComp
$Comp
L A5C:NAND06 UAB143
U 1 1 66D4B25E
P 9500 8650
F 0 "UAB143" H 9500 9090 50  0000 C CNN
F 1 "NAND06" H 9500 8999 50  0000 C CNN
F 2 "" H 9450 8750 50  0001 C CNN
F 3 "" H 9450 8750 50  0001 C CNN
	1    9500 8650
	1    0    0    -1  
$EndComp
$Comp
L A5C:NAND06 UAC161
U 1 1 65E2CD8C
P 13450 3050
F 0 "UAC161" H 13450 3490 50  0000 C CNN
F 1 "NAND06" H 13450 3399 50  0000 C CNN
F 2 "" H 13400 3150 50  0001 C CNN
F 3 "" H 13400 3150 50  0001 C CNN
	1    13450 3050
	1    0    0    -1  
$EndComp
$Comp
L A5C:NAND06 UAC143
U 1 1 65E28B86
P 13450 3850
F 0 "UAC143" H 13450 4290 50  0000 C CNN
F 1 "NAND06" H 13450 4199 50  0000 C CNN
F 2 "" H 13400 3950 50  0001 C CNN
F 3 "" H 13400 3950 50  0001 C CNN
	1    13450 3850
	1    0    0    -1  
$EndComp
$Comp
L A5C:NAND06 UAD232
U 1 1 668C3E5F
P 13450 4650
F 0 "UAD232" H 13450 5090 50  0000 C CNN
F 1 "NAND06" H 13450 4999 50  0000 C CNN
F 2 "" H 13400 4750 50  0001 C CNN
F 3 "" H 13400 4750 50  0001 C CNN
	1    13450 4650
	1    0    0    -1  
$EndComp
$Comp
L A5C:NAND06 UAD185
U 1 1 6692972E
P 13450 5450
F 0 "UAD185" H 13450 5890 50  0000 C CNN
F 1 "NAND06" H 13450 5799 50  0000 C CNN
F 2 "" H 13400 5550 50  0001 C CNN
F 3 "" H 13400 5550 50  0001 C CNN
	1    13450 5450
	1    0    0    -1  
$EndComp
$Comp
L A5C:NOR05 UBE?
U 1 1 63DD5AC8
P 13950 1250
AR Path="/63DD5AC8" Ref="UBE?"  Part="1" 
AR Path="/60A9F60C/63DD5AC8" Ref="UBE?"  Part="1" 
AR Path="/60A9F60C/613FECF4/63DD5AC8" Ref="UBE?"  Part="1" 
AR Path="/60A9F60C/611CA9E7/63DD5AC8" Ref="UBE76"  Part="1" 
F 0 "UBE76" H 14025 1665 50  0000 C CNN
F 1 "NOR05" H 14025 1574 50  0000 C CNN
F 2 "" H 13950 1300 50  0001 C CNN
F 3 "" H 13950 1300 50  0001 C CNN
	1    13950 1250
	1    0    0    -1  
$EndComp
$Comp
L A5C:NAND08 UAC218
U 1 1 6719F242
P 9500 10250
F 0 "UAC218" H 9500 10790 50  0000 C CNN
F 1 "NAND08" H 9500 10699 50  0000 C CNN
F 2 "" H 9450 10450 50  0001 C CNN
F 3 "" H 9450 10450 50  0001 C CNN
	1    9500 10250
	1    0    0    -1  
$EndComp
$Comp
L A5C:NAND08 UAC196
U 1 1 66097091
P 13450 8100
F 0 "UAC196" H 13450 8640 50  0000 C CNN
F 1 "NAND08" H 13450 8549 50  0000 C CNN
F 2 "" H 13400 8300 50  0001 C CNN
F 3 "" H 13400 8300 50  0001 C CNN
	1    13450 8100
	1    0    0    -1  
$EndComp
$Comp
L A5C:NAND13 UAB203
U 1 1 61118F1C
P 6400 6550
F 0 "UAB203" H 6400 7340 50  0000 C CNN
F 1 "NAND13" H 6400 7249 50  0000 C CNN
F 2 "" H 6350 7000 50  0001 C CNN
F 3 "" H 6350 7000 50  0001 C CNN
	1    6400 6550
	1    0    0    -1  
$EndComp
$Comp
L A5C:NAND13 UAB215
U 1 1 61118F23
P 10700 6550
F 0 "UAB215" H 10700 7340 50  0000 C CNN
F 1 "NAND13" H 10700 7249 50  0000 C CNN
F 2 "" H 10650 7000 50  0001 C CNN
F 3 "" H 10650 7000 50  0001 C CNN
	1    10700 6550
	1    0    0    -1  
$EndComp
Wire Bus Line
	1650 7700 1650 10050
Wire Bus Line
	11250 1100 11250 1400
$EndSCHEMATC
