EESchema Schematic File Version 4
EELAYER 30 0
EELAYER END
$Descr A3 16535 11693
encoding utf-8
Sheet 29 83
Title "CPS Reverse Engineering: DL-0311"
Date "2021-09-12"
Rev ""
Comp ""
Comment1 ""
Comment2 ""
Comment3 "Licence: CC-BY"
Comment4 "Author: Loïc *WydD* Petit"
$EndDescr
Connection ~ 8450 2100
Connection ~ 12350 8550
Connection ~ 14550 8550
Connection ~ 5800 8600
Connection ~ 10950 8250
Connection ~ 13150 8250
Connection ~ 10950 8950
Connection ~ 9100 8950
Connection ~ 5700 5700
Connection ~ 5500 6250
Connection ~ 5400 6600
Connection ~ 4900 9850
Connection ~ 4250 3150
Connection ~ 10050 2150
Connection ~ 10150 2250
Connection ~ 5800 3150
Connection ~ 5800 8950
Connection ~ 7450 2000
Connection ~ 10050 1800
Connection ~ 10150 2050
Wire Wire Line
	3850 5350 4050 5350
Wire Wire Line
	4100 3600 4400 3600
Wire Wire Line
	4400 4750 5900 4750
Wire Wire Line
	4550 9750 4900 9750
Wire Wire Line
	4550 9850 4900 9850
Wire Wire Line
	4650 6250 5500 6250
Wire Wire Line
	4650 6600 5400 6600
Wire Wire Line
	4900 10400 4900 9850
Wire Wire Line
	5000 6350 5900 6350
Wire Wire Line
	5000 7950 5900 7950
Wire Wire Line
	5300 7500 5900 7500
Wire Wire Line
	5300 7600 5900 7600
Wire Wire Line
	5300 7700 5900 7700
Wire Wire Line
	5300 8350 5900 8350
Wire Wire Line
	5300 8450 5900 8450
Wire Wire Line
	5350 2900 5550 2900
Wire Wire Line
	5400 6600 5900 6600
Wire Wire Line
	5400 8200 5400 6600
Wire Wire Line
	5400 8200 5900 8200
Wire Wire Line
	5450 3950 5900 3950
Wire Wire Line
	5450 4050 5900 4050
Wire Wire Line
	5500 6250 5500 7850
Wire Wire Line
	5500 6250 5900 6250
Wire Wire Line
	5500 7850 5900 7850
Wire Wire Line
	5500 8950 5800 8950
Wire Wire Line
	5550 2900 5550 3800
Wire Wire Line
	5550 3800 5900 3800
Wire Wire Line
	5550 5900 5900 5900
Wire Wire Line
	5550 6000 5900 6000
Wire Wire Line
	5550 6100 5900 6100
Wire Wire Line
	5650 3400 5900 3400
Wire Wire Line
	5800 4900 5900 4900
Wire Wire Line
	5800 8600 5800 6750
Wire Wire Line
	5800 8600 5800 8950
Wire Wire Line
	5800 8950 9100 8950
Wire Wire Line
	5900 3500 5450 3500
Wire Wire Line
	5900 3600 5450 3600
Wire Wire Line
	5900 4300 5450 4300
Wire Wire Line
	5900 4400 5450 4400
Wire Wire Line
	5900 4550 5550 4550
Wire Wire Line
	5900 4650 5550 4650
Wire Wire Line
	5900 6750 5800 6750
Wire Wire Line
	5900 8600 5800 8600
Wire Wire Line
	6150 1600 5850 1600
Wire Wire Line
	6150 1700 5600 1700
Wire Wire Line
	6150 2200 5850 2200
Wire Wire Line
	6150 2350 5600 2350
Wire Wire Line
	6150 2450 5850 2450
Wire Wire Line
	6150 2550 5600 2550
Wire Wire Line
	7350 1750 8550 1750
Wire Wire Line
	7350 2000 7450 2000
Wire Wire Line
	7350 3400 8050 3400
Wire Wire Line
	7350 3500 8450 3500
Wire Wire Line
	7350 3600 7700 3600
Wire Wire Line
	7350 3800 8100 3800
Wire Wire Line
	7350 3950 8100 3950
Wire Wire Line
	7350 4300 8100 4300
Wire Wire Line
	7350 4500 8100 4500
Wire Wire Line
	7350 7700 7800 7700
Wire Wire Line
	7350 8350 7900 8350
Wire Wire Line
	7350 8450 8000 8450
Wire Wire Line
	7350 8600 9550 8600
Wire Wire Line
	7450 2000 8550 2000
Wire Wire Line
	7450 2150 7450 2000
Wire Wire Line
	7550 2150 7450 2150
Wire Wire Line
	7800 7700 7800 6950
Wire Wire Line
	8050 3050 8050 3400
Wire Wire Line
	8050 3050 10250 3050
Wire Wire Line
	8050 5100 8100 5100
Wire Wire Line
	8100 4050 7350 4050
Wire Wire Line
	8100 4150 7750 4150
Wire Wire Line
	8100 4400 7350 4400
Wire Wire Line
	8100 4650 7350 4650
Wire Wire Line
	8100 5250 7750 5250
Wire Wire Line
	8100 5350 7750 5350
Wire Wire Line
	8100 5450 7750 5450
Wire Wire Line
	7900 8350 7900 7150
Wire Wire Line
	8000 7250 8000 8450
Wire Wire Line
	8450 1850 8450 2100
Wire Wire Line
	8450 1850 8550 1850
Wire Wire Line
	8450 2100 8450 3500
Wire Wire Line
	8450 2100 8550 2100
Wire Wire Line
	9100 1800 10050 1800
Wire Wire Line
	9100 2050 10150 2050
Wire Wire Line
	9100 8000 9100 8950
Wire Wire Line
	9350 7700 9450 7700
Wire Wire Line
	9400 3950 10250 3950
Wire Wire Line
	9400 4050 10250 4050
Wire Wire Line
	9400 4150 10250 4150
Wire Wire Line
	9400 4400 10250 4400
Wire Wire Line
	9400 4500 10250 4500
Wire Wire Line
	9450 7350 9450 7700
Wire Wire Line
	9500 5450 9400 5450
Wire Wire Line
	9500 5450 9500 6500
Wire Wire Line
	9550 6500 9500 6500
Wire Wire Line
	9650 7600 9650 8700
Wire Wire Line
	9700 4850 9700 5750
Wire Wire Line
	9550 8600 9550 7700
Wire Wire Line
	9600 4650 9600 6100
Wire Wire Line
	9900 5100 10250 5100
Wire Wire Line
	10050 1550 10250 1550
Wire Wire Line
	10050 1800 10050 1550
Wire Wire Line
	10050 1800 10050 2150
Wire Wire Line
	10050 2150 10250 2150
Wire Wire Line
	10050 3700 10050 2150
Wire Wire Line
	10050 3700 10250 3700
Wire Wire Line
	10150 1650 10150 2050
Wire Wire Line
	10150 2050 10150 2250
Wire Wire Line
	10150 2250 10150 3800
Wire Wire Line
	10150 2250 10250 2250
Wire Wire Line
	10250 1650 10150 1650
Wire Wire Line
	10250 3800 10150 3800
Wire Wire Line
	10250 5000 9900 5000
Wire Wire Line
	10250 5250 9900 5250
Wire Wire Line
	10250 5350 9900 5350
Wire Wire Line
	10250 5500 9900 5500
Wire Wire Line
	10500 6500 10150 6500
Wire Wire Line
	10600 8850 11050 8850
Wire Wire Line
	10650 7850 11050 7850
Wire Wire Line
	10950 8250 10950 7950
Wire Wire Line
	10950 8250 13150 8250
Wire Wire Line
	10950 8950 9100 8950
Wire Wire Line
	10950 8950 10950 8250
Wire Wire Line
	11050 7950 10950 7950
Wire Wire Line
	11050 8550 10550 8550
Wire Wire Line
	11050 8650 10500 8650
Wire Wire Line
	11050 8950 10950 8950
Wire Wire Line
	11500 3900 11600 3900
Wire Wire Line
	11500 4000 11600 4000
Wire Wire Line
	11500 4500 11600 4500
Wire Wire Line
	11500 4600 11600 4600
Wire Wire Line
	12250 8950 12450 8950
Wire Wire Line
	12450 8550 13250 8550
Wire Wire Line
	12450 8950 12450 8550
Wire Wire Line
	12550 7350 9450 7350
Wire Wire Line
	12550 8650 12550 7350
Wire Wire Line
	12550 8650 13250 8650
Wire Wire Line
	12750 8800 13250 8800
Wire Wire Line
	12800 7850 13250 7850
Wire Wire Line
	13050 7700 13050 7250
Wire Wire Line
	13050 7700 13250 7700
Wire Wire Line
	13150 7150 13150 7600
Wire Wire Line
	13150 7600 13250 7600
Wire Wire Line
	13150 7950 13150 8250
Wire Wire Line
	13150 8250 13150 8900
Wire Wire Line
	13250 7950 13150 7950
Wire Wire Line
	13250 8900 13150 8900
Wire Bus Line
	4250 3150 4100 3150
Wire Bus Line
	4250 3150 5800 3150
Wire Bus Line
	4250 3500 4250 3150
Wire Bus Line
	4400 3500 4250 3500
Wire Bus Line
	5600 6500 5900 6500
Wire Bus Line
	5600 9250 5600 6500
Wire Bus Line
	5600 9250 12350 9250
Wire Bus Line
	5700 5700 5550 5700
Wire Bus Line
	5700 5700 5900 5700
Wire Bus Line
	5700 7300 5700 5700
Wire Bus Line
	5700 8100 5700 9350
Wire Bus Line
	5700 8100 5900 8100
Wire Bus Line
	5700 9350 14550 9350
Wire Bus Line
	5800 2050 5800 3150
Wire Bus Line
	5800 3150 5900 3150
Wire Bus Line
	5900 3250 5700 3250
Wire Bus Line
	5900 7300 5700 7300
Wire Bus Line
	6150 1350 5600 1350
Wire Bus Line
	6150 1950 5700 1950
Wire Bus Line
	6150 2050 5800 2050
Wire Bus Line
	7350 1350 10250 1350
Wire Bus Line
	7350 3150 7650 3150
Wire Bus Line
	7350 3250 7750 3250
Wire Bus Line
	7350 7300 7550 7300
Wire Bus Line
	7550 2550 7550 4900
Wire Bus Line
	7550 4900 7550 7300
Wire Bus Line
	7650 3150 7650 2750
Wire Bus Line
	7750 2850 7750 3250
Wire Bus Line
	10150 4750 10250 4750
Wire Bus Line
	10250 4300 9400 4300
Wire Bus Line
	11600 1350 11500 1350
Wire Bus Line
	11600 1450 11500 1450
Wire Bus Line
	11600 2150 11500 2150
Wire Bus Line
	11600 2250 11500 2250
Wire Bus Line
	11600 3700 11500 3700
Wire Bus Line
	11600 3800 11500 3800
Wire Bus Line
	11600 4300 11500 4300
Wire Bus Line
	11600 4400 11500 4400
Wire Bus Line
	12250 7600 12350 7600
Wire Bus Line
	12250 8550 12350 8550
Wire Bus Line
	12350 7600 12350 8550
Wire Bus Line
	12350 8550 12350 9250
Wire Bus Line
	14450 7600 14550 7600
Wire Bus Line
	14450 8550 14550 8550
Wire Bus Line
	14550 7600 14550 8550
Wire Bus Line
	14550 8550 14550 9350
Text Label 4050 5350 2    50   ~ 0
FLIP
Text Label 4400 4750 0    50   ~ 0
~CLK8M4M
Text Label 4650 5350 0    50   ~ 0
~FLIP
Text Label 4850 9750 2    50   ~ 0
CLK4M
Text Label 4850 9850 2    50   ~ 0
CLK8M
Text Label 5000 6350 0    50   ~ 0
~CLK8M4M
Text Label 5000 7950 0    50   ~ 0
~CLK8M4M
Text Label 5500 9850 0    50   ~ 0
~CLK8M1
Text Label 5500 10400 0    50   ~ 0
~CLK8M
Text Label 5550 4550 0    50   ~ 0
CLK4M
Text Label 5550 4650 0    50   ~ 0
~CLK8M
Text Label 5650 3400 0    50   ~ 0
~FLIP
Text Label 5750 9250 0    50   ~ 0
WY-C[0..7]
Text Label 5750 9350 0    50   ~ 0
WX-C[0..7]
Text Label 5850 1600 0    50   ~ 0
CLK4M
Text Label 5850 2200 0    50   ~ 0
OBJUP
Text Label 5850 2450 0    50   ~ 0
~CLK8M
Text Label 7600 1750 0    50   ~ 0
~FRAME
Text Label 7600 2000 0    50   ~ 0
FRAME
Text Label 7650 7700 2    50   ~ 0
OBJUP
Text Label 7750 4150 0    50   ~ 0
~FLIP
Text Label 7750 5250 0    50   ~ 0
CLK8M
Text Label 7750 5350 0    50   ~ 0
~CLK8M
Text Label 7750 5450 0    50   ~ 0
~CLK8M1
Text Label 8050 4650 2    50   ~ 0
_FWE
Text Label 8850 7800 2    50   ~ 0
~CLK8M4M
Text Label 9900 5000 0    50   ~ 0
~FRAME
Text Label 9900 5100 0    50   ~ 0
FRAME
Text Label 9900 5250 0    50   ~ 0
CLK4M
Text Label 9900 5350 0    50   ~ 0
CLK8M
Text Label 9900 5500 0    50   ~ 0
~FLIP
Text Label 9950 8600 2    50   ~ 0
CLK4M
Text Label 10550 8550 0    50   ~ 0
_FWE
Text Label 10600 8850 0    50   ~ 0
~CLK8M1
Text Label 10650 7850 0    50   ~ 0
~CLK8M4M
Text Label 12750 8800 0    50   ~ 0
~CLK8M4M
Text Label 12800 7850 0    50   ~ 0
~CLK8M1
Text HLabel 3850 4700 0    50   Input ~ 0
CLK4M
Text HLabel 3850 4800 0    50   Input ~ 0
CLK8M
Text HLabel 3850 5350 0    50   Input ~ 0
FLIP
Text HLabel 4050 6600 0    50   Input ~ 0
FLIP
Text HLabel 4100 3150 0    50   Input ~ 0
COL[1..8]
Text HLabel 4100 3600 0    50   Input ~ 0
CLK4M
Text HLabel 4100 6200 0    50   Input ~ 0
CLK4M
Text HLabel 4100 6300 0    50   Input ~ 0
LI
Text HLabel 4550 9750 0    50   Input ~ 0
CLK4M
Text HLabel 4550 9850 0    50   Input ~ 0
CLK8M
Text HLabel 4900 8950 0    50   Input ~ 0
MAIN-RESET
Text HLabel 5300 7500 0    50   Input ~ 0
~BUS-SPRITE-X
Text HLabel 5300 7600 0    50   Input ~ 0
CLK4M
Text HLabel 5300 7700 0    50   Input ~ 0
SPRITE-BLOCK-READY
Text HLabel 5300 8350 0    50   Input ~ 0
~SPRITE-X-READY-LI
Text HLabel 5300 8450 0    50   Input ~ 0
LI
Text HLabel 5350 2900 0    50   Input ~ 0
SCAN-240-245
Text HLabel 5550 5700 0    50   Input ~ 0
BUS-DATA[0..8]
Text HLabel 5550 5900 0    50   Input ~ 0
~BUS-SPRITE-Y
Text HLabel 5550 6000 0    50   Input ~ 0
CLK4M
Text HLabel 5550 6100 0    50   Input ~ 0
SPRITE-BLOCK-READY
Text HLabel 5600 1350 0    50   Input ~ 0
_CB[0..4]
Text HLabel 5600 1700 0    50   Input ~ 0
~SPRITE-T
Text HLabel 5600 2350 0    50   Input ~ 0
SCAN-243
Text HLabel 5600 2550 0    50   Input ~ 0
MAIN-RESET
Text HLabel 5800 4900 0    50   Input ~ 0
MAIN-RESET
Text HLabel 7550 2150 2    50   Output ~ 0
FRAME
Text HLabel 7700 3600 2    50   Output ~ 0
~FRAS
Text HLabel 8050 5100 0    50   Input ~ 0
~REWEN
Text HLabel 8850 7600 0    50   Input ~ 0
LI
Text HLabel 10150 4750 0    50   Input ~ 0
COL[1..8]
Text HLabel 10500 6100 2    50   Output ~ 0
~FWE
Text HLabel 10500 6500 2    50   Output ~ 0
OBJEO
Text HLabel 10500 6950 2    50   Output ~ 0
~OBJUP
Text HLabel 11600 1350 2    50   Output ~ 0
AD[4..12]
Text HLabel 11600 1450 2    50   Output ~ 0
BD[4..12]
Text HLabel 11600 2150 2    50   Output ~ 0
AA[0..7]
Text HLabel 11600 2250 2    50   Output ~ 0
BA[0..7]
Text HLabel 11600 3700 2    50   Output ~ 0
~ACAS[0..1]
Text HLabel 11600 3800 2    50   Output ~ 0
~ASOE[0..1]
Text HLabel 11600 3900 2    50   Output ~ 0
~ADTOE
Text HLabel 11600 4000 2    50   Output ~ 0
~ASCK
Text HLabel 11600 4300 2    50   Output ~ 0
~BCAS[0..1]
Text HLabel 11600 4400 2    50   Output ~ 0
~BSOE[0..1]
Text HLabel 11600 4500 2    50   Output ~ 0
~BDTOE
Text HLabel 11600 4600 2    50   Output ~ 0
~BSCK
$Comp
L A5C:NAND02 UDL57
U 1 1 61A972F1
P 4100 4750
F 0 "UDL57" H 4125 5017 50  0000 C CNN
F 1 "NAND02P" H 4125 4926 50  0000 C CNN
F 2 "" H 4100 4750 50  0001 C CNN
F 3 "" H 4100 4750 50  0001 C CNN
	1    4100 4750
	1    0    0    -1  
$EndComp
$Comp
L A5C:NAND02 UDB?
U 1 1 61955531
P 4350 6250
AR Path="/613100A2/612A04F5/61955531" Ref="UDB?"  Part="1" 
AR Path="/613100A2/61955531" Ref="UDB105"  Part="1" 
F 0 "UDB105" H 4375 6517 50  0000 C CNN
F 1 "NAND02" H 4375 6426 50  0000 C CNN
F 2 "" H 4350 6250 50  0001 C CNN
F 3 "" H 4350 6250 50  0001 C CNN
	1    4350 6250
	1    0    0    -1  
$EndComp
$Comp
L A5C:NOR02 UDJ85
U 1 1 61602049
P 8800 1800
F 0 "UDJ85" H 8825 2067 50  0000 C CNN
F 1 "NOR02P" H 8825 1976 50  0000 C CNN
F 2 "" H 8800 1800 50  0001 C CNN
F 3 "" H 8800 1800 50  0001 C CNN
	1    8800 1800
	1    0    0    -1  
$EndComp
$Comp
L A5C:NOR02 UDJ83
U 1 1 63B2E4D8
P 8800 2050
F 0 "UDJ83" H 8825 2317 50  0000 C CNN
F 1 "NOR02P" H 8825 2226 50  0000 C CNN
F 2 "" H 8800 2050 50  0001 C CNN
F 3 "" H 8800 2050 50  0001 C CNN
	1    8800 2050
	1    0    0    1   
$EndComp
$Comp
L A5C:NAND02 UDE?
U 1 1 62AFCDB3
P 10200 8650
AR Path="/613100A2/612BF9D1/62AFCDB3" Ref="UDE?"  Part="1" 
AR Path="/613100A2/62AFCDB3" Ref="UDE140"  Part="1" 
F 0 "UDE140" H 10225 8917 50  0000 C CNN
F 1 "NAND02" H 10225 8826 50  0000 C CNN
F 2 "" H 10200 8650 50  0001 C CNN
F 3 "" H 10200 8650 50  0001 C CNN
	1    10200 8650
	1    0    0    -1  
$EndComp
$Comp
L A5C:INV01 UDL86
U 1 1 61BD6763
P 4350 5350
F 0 "UDL86" H 4350 5667 50  0000 C CNN
F 1 "INV01" H 4350 5576 50  0000 C CNN
F 2 "" H 4350 5150 50  0001 C CNN
F 3 "" H 4350 5150 50  0001 C CNN
	1    4350 5350
	1    0    0    -1  
$EndComp
$Comp
L A5C:NBUF03 UDL90
U 1 1 6469D24C
P 4350 6600
F 0 "UDL90" H 4350 6917 50  0000 C CNN
F 1 "NBUF03" H 4350 6826 50  0000 C CNN
F 2 "" H 4350 6400 50  0001 C CNN
F 3 "" H 4350 6400 50  0001 C CNN
	1    4350 6600
	1    0    0    1   
$EndComp
$Comp
L A5C:NBUF03 UDB?
U 1 1 78774960
P 5200 8950
AR Path="/78774960" Ref="UDB?"  Part="1" 
AR Path="/613100A2/78774960" Ref="UDB103"  Part="1" 
F 0 "UDB103" H 5200 9267 50  0000 C CNN
F 1 "NBUF03" H 5200 9176 50  0000 C CNN
F 2 "" H 5200 8750 50  0001 C CNN
F 3 "" H 5200 8750 50  0001 C CNN
	1    5200 8950
	1    0    0    -1  
$EndComp
$Comp
L A5C:NBUF03 UDI36
U 1 1 61118E64
P 5200 9850
F 0 "UDI36" H 5200 10167 50  0000 C CNN
F 1 "NBUF03" H 5200 10076 50  0000 C CNN
F 2 "" H 5200 9650 50  0001 C CNN
F 3 "" H 5200 9650 50  0001 C CNN
	1    5200 9850
	1    0    0    -1  
$EndComp
$Comp
L A5C:NBUF02 UDE80
U 1 1 6141623B
P 5200 10400
F 0 "UDE80" H 5200 10717 50  0000 C CNN
F 1 "NBUF02" H 5200 10626 50  0000 C CNN
F 2 "" H 5200 10200 50  0001 C CNN
F 3 "" H 5200 10200 50  0001 C CNN
	1    5200 10400
	1    0    0    -1  
$EndComp
$Comp
L A5C:BUF12 UDL?
U 1 1 63290DA7
P 9850 6500
AR Path="/63290DA7" Ref="UDL?"  Part="1" 
AR Path="/613100A2/63290DA7" Ref="UDL126"  Part="1" 
F 0 "UDL126" H 9850 6817 50  0000 C CNN
F 1 "BUF12" H 9850 6726 50  0000 C CNN
F 2 "" H 9850 6500 50  0001 C CNN
F 3 "" H 9850 6500 50  0001 C CNN
	1    9850 6500
	1    0    0    -1  
$EndComp
$Comp
L A5C:NBUF03 UDI?
U 1 1 612CC33B
P 10200 6100
AR Path="/613100A2/613B471F/612CC33B" Ref="UDI?"  Part="1" 
AR Path="/613100A2/612CC33B" Ref="UDI2"  Part="1" 
F 0 "UDI2" H 10200 6417 50  0000 C CNN
F 1 "NBUF03" H 10200 6326 50  0000 C CNN
F 2 "" H 10200 5900 50  0001 C CNN
F 3 "" H 10200 5900 50  0001 C CNN
	1    10200 6100
	1    0    0    -1  
$EndComp
$Comp
L A5C:NBUF03 UDF80
U 1 1 62865101
P 10200 6950
AR Path="/613100A2/62865101" Ref="UDF80"  Part="1" 
AR Path="/62865101" Ref="UDF?"  Part="1" 
F 0 "UDF80" H 10200 7267 50  0000 C CNN
F 1 "NBUF03" H 10200 7176 50  0000 C CNN
F 2 "" H 10200 6750 50  0001 C CNN
F 3 "" H 10200 6750 50  0001 C CNN
	1    10200 6950
	1    0    0    -1  
$EndComp
$Comp
L A5C:DFFCOR UDB128
U 1 1 61118E87
P 9100 7700
F 0 "UDB128" H 9100 8065 50  0000 C CNN
F 1 "DFFCOR" H 9100 7974 50  0000 C CNN
F 2 "" H 9100 7700 50  0001 C CNN
F 3 "" H 9100 7700 50  0001 C CNN
	1    9100 7700
	1    0    0    -1  
$EndComp
$Sheet
S 10250 2000 1250 1200
U 612DDDDA
F0 "vram-addr" 50
F1 "vram-addr.sch" 50
F2 "BA[0..7]" O R 11500 2250 50 
F3 "AA[0..7]" O R 11500 2150 50 
F4 "A-WRITE" I L 10250 2150 50 
F5 "B-WRITE" I L 10250 2250 50 
F6 "ADDR-X~Y~" I L 10250 3050 50 
F7 "~RX-A[0..7]" I L 10250 2850 50 
F8 "~RY-A[0..7]" I L 10250 2750 50 
F9 "WX-A[1..8]" I L 10250 2550 50 
F10 "WY-A[0..7]" I L 10250 2450 50 
F11 "~CLK8M1" I R 11500 3050 50 
F12 "~CLK8M" I R 11500 2950 50 
$EndSheet
$Sheet
S 10250 3550 1250 2100
U 61292F37
F0 "vram-control-signals" 50
F1 "vram-control-signals.sch" 50
F2 "~ASCK" O R 11500 4000 50 
F3 "~BSCK" O R 11500 4600 50 
F4 "~ACAS[0..1]" O R 11500 3700 50 
F5 "~ASOE[0..1]" O R 11500 3800 50 
F6 "~BCAS[0..1]" O R 11500 4300 50 
F7 "~BSOE[0..1]" O R 11500 4400 50 
F8 "~ADTOE" O R 11500 3900 50 
F9 "~BDTOE" O R 11500 4500 50 
F10 "A-WRITE" I L 10250 3700 50 
F11 "B-WRITE" I L 10250 3800 50 
F12 "CLK4M" I L 10250 5250 50 
F13 "CLK8M" I L 10250 5350 50 
F14 "~FRAME" I L 10250 5000 50 
F15 "FRAME" I L 10250 5100 50 
F16 "~FLIP" I L 10250 5500 50 
F17 "FWE" I L 10250 4650 50 
F18 "SPRITE-X0" I L 10250 4850 50 
F19 "W-CAS[0..1]" I L 10250 4300 50 
F20 "W-SOE" I L 10250 4400 50 
F21 "R-SOE" I L 10250 4050 50 
F22 "R-CAS" I L 10250 3950 50 
F23 "COL[4..4]" I L 10250 4750 50 
F24 "R-OE" I L 10250 4150 50 
F25 "W-OE" I L 10250 4500 50 
$EndSheet
$Sheet
S 10250 1200 1250 600 
U 612C0134
F0 "vram-data" 50
F1 "vram-data.sch" 50
F2 "AD[4..12]" O R 11500 1350 50 
F3 "BD[4..12]" O R 11500 1450 50 
F4 "A-WRITE" I L 10250 1550 50 
F5 "B-WRITE" I L 10250 1650 50 
F6 "~D[4..12]" I L 10250 1350 50 
$EndSheet
$Sheet
S 4400 3350 1050 1200
U 61323623
F0 "vram-timings" 50
F1 "vram-timings.sch" 50
F2 "COL[1..8]" I L 4400 3500 50 
F3 "CLK4M" I L 4400 3600 50 
F4 "FRAS" O R 5450 3600 50 
F5 "~COL=3" O R 5450 3950 50 
F6 "~R-OE" O R 5450 4050 50 
F7 "~W-OE" O R 5450 4400 50 
F8 "WRITE-MODE" O R 5450 3500 50 
F9 "~W-CAS-E" O R 5450 4300 50 
$EndSheet
$Sheet
S 6150 1200 1200 1500
U 6125387A
F0 "vram-write-data" 50
F1 "vram-write-data.sch" 50
F2 "~SPRITE-T" I L 6150 1700 50 
F3 "SCAN-243" I L 6150 2350 50 
F4 "_CB[0..4]" I L 6150 1350 50 
F5 "FRAME" O R 7350 2000 50 
F6 "LINE[0..8]" I L 6150 1950 50 
F7 "OBJUP" I L 6150 2200 50 
F8 "MAIN-RESET" I L 6150 2550 50 
F9 "~CLK8M" I L 6150 2450 50 
F10 "CLK4M" I L 6150 1600 50 
F11 "COL[1..1]" I L 6150 2050 50 
F12 "~D[4..12]" O R 7350 1350 50 
F13 "~FRAME" O R 7350 1750 50 
$EndSheet
$Sheet
S 5900 7150 1450 1600
U 61290CE0
F0 "vram-write-x" 50
F1 "vram-write-x.sch" 50
F2 "BUS-DATA[0..8]" I L 5900 7300 50 
F3 "~BUS-SPRITE-X" I L 5900 7500 50 
F4 "SPRITE-BLOCK-READY" I L 5900 7700 50 
F5 "CLK4M" I L 5900 7600 50 
F6 "~RESET" I L 5900 8600 50 
F7 "~CLK4MLI" I L 5900 7850 50 
F8 "~CLK8M4M" I L 5900 7950 50 
F9 "LI" I L 5900 8450 50 
F10 "Y-HI-~ZERO" O R 7350 8450 50 
F11 "Y-HI-INC" O R 7350 8350 50 
F12 "X-HI-~ZERO" O R 7350 8600 50 
F13 "WX-C[0..7]" I L 5900 8100 50 
F14 "WX-A[0..8]" O R 7350 7300 50 
F15 "~FLIP" I L 5900 8200 50 
F16 "SPRITE-X0" O R 7350 7400 50 
F17 "OBJUP" O R 7350 7700 50 
F18 "~SPRITE-X-READY-LI" I L 5900 8350 50 
$EndSheet
$Sheet
S 11050 7450 1200 650 
U 612D9CCD
F0 "vram-write-x-cnt-hi" 50
F1 "vram-write-x-cnt-hi.sch" 50
F2 "~CLK8M4M" I L 11050 7850 50 
F3 "~RESET" I L 11050 7950 50 
F4 "WX-C[4..7]" O R 12250 7600 50 
F5 "INC" I L 11050 7600 50 
F6 "~ZERO" I L 11050 7700 50 
$EndSheet
$Sheet
S 11050 8400 1200 700 
U 612BF9D1
F0 "vram-write-x-cnt-lo" 50
F1 "vram-write-x-cnt-lo.sch" 50
F2 "~RESET" I L 11050 8950 50 
F3 "~ZERO" I L 11050 8650 50 
F4 "INC" I L 11050 8550 50 
F5 "C=14-15" O R 12250 8950 50 
F6 "WX-C[0..3]" O R 12250 8550 50 
F7 "~CLK8M" I L 11050 8850 50 
$EndSheet
$Sheet
S 5900 5550 1450 1350
U 612A04F5
F0 "vram-write-y" 50
F1 "vram-write-y.sch" 50
F2 "BUS-DATA[0..8]" I L 5900 5700 50 
F3 "~BUS-SPRITE-Y" I L 5900 5900 50 
F4 "SPRITE-BLOCK-READY" I L 5900 6100 50 
F5 "CLK4M" I L 5900 6000 50 
F6 "~RESET" I L 5900 6750 50 
F7 "~CLK4MLI" I L 5900 6250 50 
F8 "~CLK8M4M" I L 5900 6350 50 
F9 "WY-C[0..7]" I L 5900 6500 50 
F10 "WY-A[0..8]" O R 7350 5700 50 
F11 "~FLIP" I L 5900 6600 50 
$EndSheet
$Sheet
S 13250 7450 1200 650 
U 612E85AC
F0 "vram-write-y-cnt-hi" 50
F1 "vram-write-y-cnt-hi.sch" 50
F2 "~RESET" I L 13250 7950 50 
F3 "~ZERO" I L 13250 7700 50 
F4 "~CLK8M" I L 13250 7850 50 
F5 "INC" I L 13250 7600 50 
F6 "WY-C[4..7]" O R 14450 7600 50 
$EndSheet
$Sheet
S 13250 8400 1200 650 
U 612E8443
F0 "vram-write-y-cnt-lo" 50
F1 "vram-write-y-cnt-lo.sch" 50
F2 "WY-C[0..3]" O R 14450 8550 50 
F3 "~CLK8M4M" I L 13250 8800 50 
F4 "~RESET" I L 13250 8900 50 
F5 "~ZERO" I L 13250 8650 50 
F6 "INC" I L 13250 8550 50 
$EndSheet
Wire Wire Line
	11950 3050 11500 3050
Text Label 11950 3050 2    50   ~ 0
~CLK8M1
Wire Wire Line
	11950 2950 11500 2950
Text Label 11950 2950 2    50   ~ 0
~CLK8M
Wire Bus Line
	5700 1950 5700 3250
Text HLabel 4100 1950 0    50   Input ~ 0
LINE[0..8]
Wire Bus Line
	4100 1950 5700 1950
Connection ~ 5700 1950
$Sheet
S 5900 3000 1450 2000
U 6134DE5F
F0 "vram-read-addr" 50
F1 "vram-read-addr.sch" 50
F2 "MAIN-RESET" I L 5900 4900 50 
F3 "ADDR-X~Y~" O R 7350 3400 50 
F4 "LINE[0..7]" I L 5900 3250 50 
F5 "COL[1..8]" I L 5900 3150 50 
F6 "~RX-A[0..7]" O R 7350 3250 50 
F7 "~RY-A[0..7]" O R 7350 3150 50 
F8 "~CLK8M4M" I L 5900 4750 50 
F9 "~FLIP" I L 5900 3400 50 
F10 "~CLK8M" I L 5900 4650 50 
F11 "R-CAS" O R 7350 3950 50 
F12 "~COL=3" I L 5900 3950 50 
F13 "CLK4M" I L 5900 4550 50 
F14 "_FRAS" I L 5900 3600 50 
F15 "~FRAS" O R 7350 3600 50 
F16 "SCAN-240-245" I L 5900 3800 50 
F17 "~SCAN-240-245" O R 7350 3800 50 
F18 "_FWE" O R 7350 4650 50 
F19 "_~R-OE" I L 5900 4050 50 
F20 "_~W-OE" I L 5900 4400 50 
F21 "~R-OE" O R 7350 4050 50 
F22 "~W-OE" O R 7350 4500 50 
F23 "W-CAS" O R 7350 4400 50 
F24 "_WRITE-MODE" I L 5900 3500 50 
F25 "_~W-CAS-E" I L 5900 4300 50 
F26 "~W-CAS-E" O R 7350 4300 50 
F27 "~WRITE-MODE" O R 7350 3500 50 
$EndSheet
$Sheet
S 8100 3650 1300 1950
U 613B471F
F0 "vram-control" 50
F1 "vram-control.sch" 50
F2 "FWE" O R 9400 4650 50 
F3 "R-CAS" O R 9400 3950 50 
F4 "R-OE" O R 9400 4150 50 
F5 "W-OE" O R 9400 4500 50 
F6 "R-SOE" O R 9400 4050 50 
F7 "~FLIP" I L 8100 4150 50 
F8 "~CLK8M" I L 8100 5350 50 
F9 "_R-CAS" I L 8100 3950 50 
F10 "_FWE" I L 8100 4650 50 
F11 "CLK8M" I L 8100 5250 50 
F12 "~CLK8M1" I L 8100 5450 50 
F13 "~REWEN" I L 8100 5100 50 
F14 "W-SOE" O R 9400 4400 50 
F15 "SPRITE-X0" I L 8100 5000 50 
F16 "OBJEO" O R 9400 5450 50 
F17 "WY-A[8..8]" I L 8100 4800 50 
F18 "WX-A[0..0]" I L 8100 4900 50 
F19 "W-CAS[0..1]" O R 9400 4300 50 
F20 "~SCAN-240-245" I L 8100 3800 50 
F21 "_~R-OE" I L 8100 4050 50 
F22 "_~W-OE" I L 8100 4500 50 
F23 "_W-CAS" I L 8100 4400 50 
F24 "_~W-CAS-E" I L 8100 4300 50 
$EndSheet
Text Notes 12000 7250 0    50   ~ 0
~SPRITE-BLOCK-READY & LI
Text Notes 9900 7600 0    50   ~ 0
LI
Text Notes 10500 8650 0    50   ~ 0
~LI & CLK4M
Text Notes 10450 8400 0    50   ~ 0
SYNC(COL4)
Text Notes 12850 8650 0    50   ~ 0
~LI
Text Notes 12550 8550 0    50   ~ 0
X-CNT=14-15
Text Notes 12000 7150 0    50   ~ 0
SPRITE-X-READY-LI
Text Notes 9900 7700 0    50   ~ 0
~SPRITE-X-READY-LI
Text Notes 13800 7900 0    50   ~ 0
BLOCK-Y
Text Notes 11650 7900 0    50   ~ 0
BLOCK-X
Text Notes 11650 8800 0    50   ~ 0
PIXEL-X
Text Notes 13800 8800 0    50   ~ 0
ROW
Wire Wire Line
	9400 4650 9600 4650
Wire Wire Line
	9700 4850 10250 4850
Connection ~ 9600 4650
Wire Wire Line
	9600 4650 10250 4650
Wire Wire Line
	9600 6100 9900 6100
Wire Bus Line
	7450 5700 7350 5700
Wire Bus Line
	7450 2450 7450 4800
Connection ~ 7450 4800
Wire Bus Line
	7450 4800 7450 5700
Wire Bus Line
	7450 4800 8100 4800
Wire Bus Line
	7450 2450 10250 2450
Connection ~ 7550 4900
Wire Bus Line
	7550 4900 8100 4900
Wire Bus Line
	7550 2550 10250 2550
Wire Wire Line
	8100 5000 7650 5000
Wire Wire Line
	7650 5000 7650 5750
Wire Wire Line
	7350 7400 7650 7400
Wire Wire Line
	7650 5750 9700 5750
Connection ~ 7650 5750
Wire Wire Line
	7650 5750 7650 7400
Wire Bus Line
	7650 2750 10250 2750
Wire Bus Line
	7750 2850 10250 2850
Wire Wire Line
	7800 6950 9900 6950
Wire Wire Line
	9350 7600 9650 7600
Wire Wire Line
	9550 7700 11050 7700
Connection ~ 9650 7600
Wire Wire Line
	9650 7600 11050 7600
Wire Wire Line
	9650 8700 9950 8700
Wire Wire Line
	8000 7250 13050 7250
Wire Wire Line
	7900 7150 13150 7150
Text Notes 13250 9800 0    50   ~ 0
ROW counter is increased at pixel=14.\nIt works mainly due to the timings. Pixels are increased\nevery ~CLK8M~ cycle. And we need ROW to be ready for\nthe next RAS write.
$EndSCHEMATC
