EESchema Schematic File Version 4
EELAYER 30 0
EELAYER END
$Descr A2 23386 16535
encoding utf-8
Sheet 57 69
Title ""
Date "2020-11-26"
Rev ""
Comp ""
Comment1 "Licence: CC-BY"
Comment2 "Author: Loïc *WydD* Petit"
Comment3 ""
Comment4 ""
$EndDescr
Connection ~ 6700 3600
Connection ~ 6600 3050
Connection ~ 6500 2500
Connection ~ 6400 1950
Connection ~ 6400 4850
Connection ~ 6300 4300
Connection ~ 6500 5400
Connection ~ 6700 6500
Connection ~ 6600 5950
Connection ~ 6300 7200
Connection ~ 6400 7750
Connection ~ 6500 8300
Connection ~ 6600 8850
Connection ~ 6700 9400
Connection ~ 6300 10100
Connection ~ 6400 10650
Connection ~ 6500 11200
Connection ~ 6600 11750
Connection ~ 6700 12300
Connection ~ 9400 4850
Connection ~ 9300 4300
Connection ~ 9700 6500
Connection ~ 9400 7750
Connection ~ 9300 7200
Connection ~ 9700 9400
Connection ~ 9500 5400
Connection ~ 9600 5950
Connection ~ 9500 8300
Connection ~ 9600 8850
Connection ~ 12300 4850
Connection ~ 12200 4300
Connection ~ 12600 6500
Connection ~ 12300 7750
Connection ~ 12200 7200
Connection ~ 12600 9400
Connection ~ 12400 5400
Connection ~ 12500 5950
Connection ~ 12400 8300
Connection ~ 12500 8850
Connection ~ 15300 4850
Connection ~ 15200 4300
Connection ~ 15600 6500
Connection ~ 15300 7750
Connection ~ 15200 7200
Connection ~ 15600 9400
Connection ~ 15400 5400
Connection ~ 15500 5950
Connection ~ 15400 8300
Connection ~ 15500 8850
Connection ~ 15200 1400
Connection ~ 15300 1950
Connection ~ 15400 2500
Connection ~ 15500 3050
Connection ~ 15600 3600
Connection ~ 12200 1400
Connection ~ 12300 1950
Connection ~ 12400 2500
Connection ~ 12500 3050
Connection ~ 12600 3600
Connection ~ 9300 650 
Connection ~ 9300 1400
Connection ~ 9400 750 
Connection ~ 9400 1950
Connection ~ 9500 850 
Connection ~ 9500 2500
Connection ~ 9600 950 
Connection ~ 9600 3050
Connection ~ 9700 1050
Connection ~ 9700 3600
Connection ~ 12200 650 
Connection ~ 12300 750 
Connection ~ 12400 850 
Connection ~ 12500 950 
Connection ~ 12600 1050
Connection ~ 6400 750 
Connection ~ 6500 850 
Connection ~ 6600 950 
Connection ~ 6700 1050
Connection ~ 11750 12650
Connection ~ 8850 12650
Connection ~ 6300 1400
Connection ~ 6300 650 
Connection ~ 5850 15600
Entry Wire Line
	5650 750  5750 650 
Entry Wire Line
	5650 850  5750 750 
Entry Wire Line
	5650 950  5750 850 
Entry Wire Line
	5650 1050 5750 950 
Entry Wire Line
	5650 1150 5750 1050
Entry Wire Line
	5850 1600 5950 1500
Entry Wire Line
	5850 2150 5950 2050
Entry Wire Line
	5850 2700 5950 2600
Entry Wire Line
	5850 3250 5950 3150
Entry Wire Line
	5850 3800 5950 3700
Entry Wire Line
	5850 4500 5950 4400
Entry Wire Line
	5850 5050 5950 4950
Entry Wire Line
	5850 5600 5950 5500
Entry Wire Line
	5850 6150 5950 6050
Entry Wire Line
	5850 6700 5950 6600
Entry Wire Line
	5850 7400 5950 7300
Entry Wire Line
	5850 7950 5950 7850
Entry Wire Line
	5850 8500 5950 8400
Entry Wire Line
	5850 9050 5950 8950
Entry Wire Line
	5850 9600 5950 9500
Entry Wire Line
	5850 10300 5950 10200
Entry Wire Line
	5850 10850 5950 10750
Entry Wire Line
	5850 11400 5950 11300
Entry Wire Line
	5850 11950 5950 11850
Entry Wire Line
	5850 12500 5950 12400
Entry Wire Line
	5850 13000 5950 13100
Entry Wire Line
	5850 13550 5950 13650
Entry Wire Line
	5850 14100 5950 14200
Entry Wire Line
	5850 14650 5950 14750
Entry Wire Line
	5850 15200 5950 15300
Entry Wire Line
	8850 1600 8950 1500
Entry Wire Line
	8850 2150 8950 2050
Entry Wire Line
	8850 2700 8950 2600
Entry Wire Line
	8850 3250 8950 3150
Entry Wire Line
	8850 3800 8950 3700
Entry Wire Line
	8850 4500 8950 4400
Entry Wire Line
	8850 5050 8950 4950
Entry Wire Line
	8850 5600 8950 5500
Entry Wire Line
	8850 6150 8950 6050
Entry Wire Line
	8850 6700 8950 6600
Entry Wire Line
	8850 7400 8950 7300
Entry Wire Line
	8850 7950 8950 7850
Entry Wire Line
	8850 8500 8950 8400
Entry Wire Line
	8850 9050 8950 8950
Entry Wire Line
	8850 9600 8950 9500
Entry Wire Line
	8850 10300 8950 10200
Entry Wire Line
	8850 10850 8950 10750
Entry Wire Line
	8850 11400 8950 11300
Entry Wire Line
	8850 11950 8950 11850
Entry Wire Line
	8850 12500 8950 12400
Entry Wire Line
	11750 1600 11850 1500
Entry Wire Line
	11750 2150 11850 2050
Entry Wire Line
	11750 2700 11850 2600
Entry Wire Line
	11750 3250 11850 3150
Entry Wire Line
	11750 3800 11850 3700
Entry Wire Line
	11750 4500 11850 4400
Entry Wire Line
	11750 5050 11850 4950
Entry Wire Line
	11750 5600 11850 5500
Entry Wire Line
	11750 6150 11850 6050
Entry Wire Line
	11750 6700 11850 6600
Entry Wire Line
	11750 7400 11850 7300
Entry Wire Line
	11750 7950 11850 7850
Entry Wire Line
	11750 8500 11850 8400
Entry Wire Line
	11750 9050 11850 8950
Entry Wire Line
	11750 9600 11850 9500
Entry Wire Line
	11750 10300 11850 10200
Entry Wire Line
	11750 10850 11850 10750
Entry Wire Line
	11750 11400 11850 11300
Entry Wire Line
	11750 11950 11850 11850
Entry Wire Line
	11750 12500 11850 12400
Entry Wire Line
	14750 1600 14850 1500
Entry Wire Line
	14750 2150 14850 2050
Entry Wire Line
	14750 2700 14850 2600
Entry Wire Line
	14750 3250 14850 3150
Entry Wire Line
	14750 3800 14850 3700
Entry Wire Line
	14750 4500 14850 4400
Entry Wire Line
	14750 5050 14850 4950
Entry Wire Line
	14750 5600 14850 5500
Entry Wire Line
	14750 6150 14850 6050
Entry Wire Line
	14750 6700 14850 6600
Entry Wire Line
	14750 7400 14850 7300
Entry Wire Line
	14750 7950 14850 7850
Entry Wire Line
	14750 8500 14850 8400
Entry Wire Line
	14750 9050 14850 8950
Entry Wire Line
	14750 9600 14850 9500
Entry Wire Line
	14750 10300 14850 10200
Entry Wire Line
	14750 10850 14850 10750
Entry Wire Line
	14750 11400 14850 11300
Entry Wire Line
	14750 11950 14850 11850
Entry Wire Line
	14750 12500 14850 12400
Wire Wire Line
	5750 650  6300 650 
Wire Wire Line
	5750 750  6400 750 
Wire Wire Line
	5750 850  6500 850 
Wire Wire Line
	5750 950  6600 950 
Wire Wire Line
	5750 1050 6700 1050
Wire Wire Line
	5950 1500 6800 1500
Wire Wire Line
	5950 2050 6800 2050
Wire Wire Line
	5950 2600 6800 2600
Wire Wire Line
	5950 3150 6800 3150
Wire Wire Line
	5950 3700 6800 3700
Wire Wire Line
	5950 4400 6800 4400
Wire Wire Line
	5950 4950 6800 4950
Wire Wire Line
	5950 5500 6800 5500
Wire Wire Line
	5950 6050 6800 6050
Wire Wire Line
	5950 6600 6800 6600
Wire Wire Line
	5950 7300 6800 7300
Wire Wire Line
	5950 7850 6800 7850
Wire Wire Line
	5950 8400 6800 8400
Wire Wire Line
	5950 8950 6800 8950
Wire Wire Line
	5950 9500 6800 9500
Wire Wire Line
	5950 10200 6800 10200
Wire Wire Line
	5950 10750 6800 10750
Wire Wire Line
	5950 11300 6800 11300
Wire Wire Line
	5950 11850 6800 11850
Wire Wire Line
	5950 12400 6800 12400
Wire Wire Line
	5950 13100 6800 13100
Wire Wire Line
	5950 13650 6800 13650
Wire Wire Line
	5950 14200 6800 14200
Wire Wire Line
	5950 14750 6800 14750
Wire Wire Line
	5950 15300 6800 15300
Wire Wire Line
	6300 650  9300 650 
Wire Wire Line
	6300 1400 6300 650 
Wire Wire Line
	6300 4300 6300 1400
Wire Wire Line
	6300 7200 6300 4300
Wire Wire Line
	6300 10100 6300 7200
Wire Wire Line
	6300 13000 6300 10100
Wire Wire Line
	6400 750  6400 1950
Wire Wire Line
	6400 750  9400 750 
Wire Wire Line
	6400 1950 6800 1950
Wire Wire Line
	6400 4850 6400 1950
Wire Wire Line
	6400 7750 6400 4850
Wire Wire Line
	6400 10650 6400 7750
Wire Wire Line
	6400 13550 6400 10650
Wire Wire Line
	6500 850  6500 2500
Wire Wire Line
	6500 850  9500 850 
Wire Wire Line
	6500 5400 6500 2500
Wire Wire Line
	6500 8300 6500 5400
Wire Wire Line
	6500 11200 6500 8300
Wire Wire Line
	6500 14100 6500 11200
Wire Wire Line
	6600 950  6600 3050
Wire Wire Line
	6600 3050 6800 3050
Wire Wire Line
	6600 5950 6600 3050
Wire Wire Line
	6600 8850 6600 5950
Wire Wire Line
	6600 11750 6600 8850
Wire Wire Line
	6600 14650 6600 11750
Wire Wire Line
	6700 1050 6700 3600
Wire Wire Line
	6700 1050 9700 1050
Wire Wire Line
	6700 3600 6700 6500
Wire Wire Line
	6700 6500 6700 9400
Wire Wire Line
	6700 6500 6800 6500
Wire Wire Line
	6700 9400 6700 12300
Wire Wire Line
	6700 9400 6800 9400
Wire Wire Line
	6700 12300 6700 15200
Wire Wire Line
	6700 12300 6800 12300
Wire Wire Line
	6700 15200 6800 15200
Wire Wire Line
	6800 1400 6300 1400
Wire Wire Line
	6800 2500 6500 2500
Wire Wire Line
	6800 3600 6700 3600
Wire Wire Line
	6800 4300 6300 4300
Wire Wire Line
	6800 4850 6400 4850
Wire Wire Line
	6800 5400 6500 5400
Wire Wire Line
	6800 5950 6600 5950
Wire Wire Line
	6800 7200 6300 7200
Wire Wire Line
	6800 7750 6400 7750
Wire Wire Line
	6800 8300 6500 8300
Wire Wire Line
	6800 8850 6600 8850
Wire Wire Line
	6800 10100 6300 10100
Wire Wire Line
	6800 10650 6400 10650
Wire Wire Line
	6800 11200 6500 11200
Wire Wire Line
	6800 11750 6600 11750
Wire Wire Line
	6800 13000 6300 13000
Wire Wire Line
	6800 13550 6400 13550
Wire Wire Line
	6800 14100 6500 14100
Wire Wire Line
	6800 14650 6600 14650
Wire Wire Line
	7350 8350 7550 8350
Wire Wire Line
	7450 2000 7350 2000
Wire Wire Line
	7450 2450 7450 2000
Wire Wire Line
	7450 2650 7450 3100
Wire Wire Line
	7450 3100 7350 3100
Wire Wire Line
	7450 4900 7350 4900
Wire Wire Line
	7450 5350 7450 4900
Wire Wire Line
	7450 5550 7450 6000
Wire Wire Line
	7450 6000 7350 6000
Wire Wire Line
	7450 7800 7350 7800
Wire Wire Line
	7450 8250 7450 7800
Wire Wire Line
	7450 8250 7550 8250
Wire Wire Line
	7450 8450 7450 8900
Wire Wire Line
	7450 8450 7550 8450
Wire Wire Line
	7450 8900 7350 8900
Wire Wire Line
	7450 10700 7350 10700
Wire Wire Line
	7450 11150 7450 10700
Wire Wire Line
	7450 11350 7450 11800
Wire Wire Line
	7450 11800 7350 11800
Wire Wire Line
	7450 13600 7350 13600
Wire Wire Line
	7450 14050 7450 13600
Wire Wire Line
	7450 14250 7450 14700
Wire Wire Line
	7450 14700 7350 14700
Wire Wire Line
	7550 1450 7350 1450
Wire Wire Line
	7550 2350 7550 1450
Wire Wire Line
	7550 2450 7450 2450
Wire Wire Line
	7550 2550 7350 2550
Wire Wire Line
	7550 2650 7450 2650
Wire Wire Line
	7550 2750 7550 3650
Wire Wire Line
	7550 3650 7350 3650
Wire Wire Line
	7550 4350 7350 4350
Wire Wire Line
	7550 5250 7550 4350
Wire Wire Line
	7550 5350 7450 5350
Wire Wire Line
	7550 5450 7350 5450
Wire Wire Line
	7550 5550 7450 5550
Wire Wire Line
	7550 5650 7550 6550
Wire Wire Line
	7550 6550 7350 6550
Wire Wire Line
	7550 7250 7350 7250
Wire Wire Line
	7550 8150 7550 7250
Wire Wire Line
	7550 8550 7550 9450
Wire Wire Line
	7550 9450 7350 9450
Wire Wire Line
	7550 10150 7350 10150
Wire Wire Line
	7550 11050 7550 10150
Wire Wire Line
	7550 11150 7450 11150
Wire Wire Line
	7550 11250 7350 11250
Wire Wire Line
	7550 11350 7450 11350
Wire Wire Line
	7550 11450 7550 12350
Wire Wire Line
	7550 12350 7350 12350
Wire Wire Line
	7550 13050 7350 13050
Wire Wire Line
	7550 13950 7550 13050
Wire Wire Line
	7550 14050 7450 14050
Wire Wire Line
	7550 14150 7350 14150
Wire Wire Line
	7550 14250 7450 14250
Wire Wire Line
	7550 14350 7550 15250
Wire Wire Line
	7550 15250 7350 15250
Wire Wire Line
	8950 1500 9800 1500
Wire Wire Line
	8950 2050 9800 2050
Wire Wire Line
	8950 2600 9800 2600
Wire Wire Line
	8950 3150 9800 3150
Wire Wire Line
	8950 3700 9800 3700
Wire Wire Line
	8950 4400 9800 4400
Wire Wire Line
	8950 4950 9800 4950
Wire Wire Line
	8950 5500 9800 5500
Wire Wire Line
	8950 6050 9800 6050
Wire Wire Line
	8950 6600 9800 6600
Wire Wire Line
	8950 7300 9800 7300
Wire Wire Line
	8950 7850 9800 7850
Wire Wire Line
	8950 8400 9800 8400
Wire Wire Line
	8950 8950 9800 8950
Wire Wire Line
	8950 9500 9800 9500
Wire Wire Line
	8950 10200 9800 10200
Wire Wire Line
	8950 10750 9800 10750
Wire Wire Line
	8950 11300 9800 11300
Wire Wire Line
	8950 11850 9800 11850
Wire Wire Line
	8950 12400 9800 12400
Wire Wire Line
	9300 650  9300 1400
Wire Wire Line
	9300 650  12200 650 
Wire Wire Line
	9300 4300 9300 1400
Wire Wire Line
	9300 7200 9300 4300
Wire Wire Line
	9300 10100 9300 7200
Wire Wire Line
	9400 750  9400 1950
Wire Wire Line
	9400 750  12300 750 
Wire Wire Line
	9400 1950 9800 1950
Wire Wire Line
	9400 4850 9400 1950
Wire Wire Line
	9400 7750 9400 4850
Wire Wire Line
	9400 10650 9400 7750
Wire Wire Line
	9500 850  9500 2500
Wire Wire Line
	9500 850  12400 850 
Wire Wire Line
	9500 5400 9500 2500
Wire Wire Line
	9500 8300 9500 5400
Wire Wire Line
	9500 11200 9500 8300
Wire Wire Line
	9600 950  6600 950 
Wire Wire Line
	9600 950  9600 3050
Wire Wire Line
	9600 950  12500 950 
Wire Wire Line
	9600 3050 9800 3050
Wire Wire Line
	9600 5950 9600 3050
Wire Wire Line
	9600 8850 9600 5950
Wire Wire Line
	9600 11750 9600 8850
Wire Wire Line
	9700 1050 9700 3600
Wire Wire Line
	9700 1050 12600 1050
Wire Wire Line
	9700 3600 9700 6500
Wire Wire Line
	9700 6500 9700 9400
Wire Wire Line
	9700 6500 9800 6500
Wire Wire Line
	9700 9400 9700 12300
Wire Wire Line
	9700 9400 9800 9400
Wire Wire Line
	9700 12300 9800 12300
Wire Wire Line
	9800 1400 9300 1400
Wire Wire Line
	9800 2500 9500 2500
Wire Wire Line
	9800 3600 9700 3600
Wire Wire Line
	9800 4300 9300 4300
Wire Wire Line
	9800 4850 9400 4850
Wire Wire Line
	9800 5400 9500 5400
Wire Wire Line
	9800 5950 9600 5950
Wire Wire Line
	9800 7200 9300 7200
Wire Wire Line
	9800 7750 9400 7750
Wire Wire Line
	9800 8300 9500 8300
Wire Wire Line
	9800 8850 9600 8850
Wire Wire Line
	9800 10100 9300 10100
Wire Wire Line
	9800 10650 9400 10650
Wire Wire Line
	9800 11200 9500 11200
Wire Wire Line
	9800 11750 9600 11750
Wire Wire Line
	10450 2000 10350 2000
Wire Wire Line
	10450 2450 10450 2000
Wire Wire Line
	10450 2650 10450 3100
Wire Wire Line
	10450 3100 10350 3100
Wire Wire Line
	10450 4900 10350 4900
Wire Wire Line
	10450 5350 10450 4900
Wire Wire Line
	10450 5550 10450 6000
Wire Wire Line
	10450 6000 10350 6000
Wire Wire Line
	10450 7800 10350 7800
Wire Wire Line
	10450 8250 10450 7800
Wire Wire Line
	10450 8450 10450 8900
Wire Wire Line
	10450 8900 10350 8900
Wire Wire Line
	10450 10700 10350 10700
Wire Wire Line
	10450 11150 10450 10700
Wire Wire Line
	10450 11350 10450 11800
Wire Wire Line
	10450 11800 10350 11800
Wire Wire Line
	10550 1450 10350 1450
Wire Wire Line
	10550 2350 10550 1450
Wire Wire Line
	10550 2450 10450 2450
Wire Wire Line
	10550 2550 10350 2550
Wire Wire Line
	10550 2650 10450 2650
Wire Wire Line
	10550 2750 10550 3650
Wire Wire Line
	10550 3650 10350 3650
Wire Wire Line
	10550 4350 10350 4350
Wire Wire Line
	10550 5250 10550 4350
Wire Wire Line
	10550 5350 10450 5350
Wire Wire Line
	10550 5450 10350 5450
Wire Wire Line
	10550 5550 10450 5550
Wire Wire Line
	10550 5650 10550 6550
Wire Wire Line
	10550 6550 10350 6550
Wire Wire Line
	10550 7250 10350 7250
Wire Wire Line
	10550 8150 10550 7250
Wire Wire Line
	10550 8250 10450 8250
Wire Wire Line
	10550 8350 10350 8350
Wire Wire Line
	10550 8450 10450 8450
Wire Wire Line
	10550 8550 10550 9450
Wire Wire Line
	10550 9450 10350 9450
Wire Wire Line
	10550 10150 10350 10150
Wire Wire Line
	10550 11050 10550 10150
Wire Wire Line
	10550 11150 10450 11150
Wire Wire Line
	10550 11250 10350 11250
Wire Wire Line
	10550 11350 10450 11350
Wire Wire Line
	10550 11450 10550 12350
Wire Wire Line
	10550 12350 10350 12350
Wire Wire Line
	11850 1500 12700 1500
Wire Wire Line
	11850 2050 12700 2050
Wire Wire Line
	11850 2600 12700 2600
Wire Wire Line
	11850 3150 12700 3150
Wire Wire Line
	11850 3700 12700 3700
Wire Wire Line
	11850 4400 12700 4400
Wire Wire Line
	11850 4950 12700 4950
Wire Wire Line
	11850 5500 12700 5500
Wire Wire Line
	11850 6050 12700 6050
Wire Wire Line
	11850 6600 12700 6600
Wire Wire Line
	11850 7300 12700 7300
Wire Wire Line
	11850 7850 12700 7850
Wire Wire Line
	11850 8400 12700 8400
Wire Wire Line
	11850 8950 12700 8950
Wire Wire Line
	11850 9500 12700 9500
Wire Wire Line
	11850 10200 12700 10200
Wire Wire Line
	11850 10750 12700 10750
Wire Wire Line
	11850 11300 12700 11300
Wire Wire Line
	11850 11850 12700 11850
Wire Wire Line
	11850 12400 12700 12400
Wire Wire Line
	12200 650  12200 1400
Wire Wire Line
	12200 650  15200 650 
Wire Wire Line
	12200 4300 12200 1400
Wire Wire Line
	12200 7200 12200 4300
Wire Wire Line
	12200 10100 12200 7200
Wire Wire Line
	12300 750  12300 1950
Wire Wire Line
	12300 750  15300 750 
Wire Wire Line
	12300 1950 12700 1950
Wire Wire Line
	12300 4850 12300 1950
Wire Wire Line
	12300 7750 12300 4850
Wire Wire Line
	12300 10650 12300 7750
Wire Wire Line
	12400 850  12400 2500
Wire Wire Line
	12400 850  15400 850 
Wire Wire Line
	12400 5400 12400 2500
Wire Wire Line
	12400 8300 12400 5400
Wire Wire Line
	12400 11200 12400 8300
Wire Wire Line
	12500 950  12500 3050
Wire Wire Line
	12500 950  15500 950 
Wire Wire Line
	12500 3050 12700 3050
Wire Wire Line
	12500 5950 12500 3050
Wire Wire Line
	12500 8850 12500 5950
Wire Wire Line
	12500 11750 12500 8850
Wire Wire Line
	12600 1050 12600 3600
Wire Wire Line
	12600 1050 15600 1050
Wire Wire Line
	12600 3600 12600 6500
Wire Wire Line
	12600 6500 12600 9400
Wire Wire Line
	12600 6500 12700 6500
Wire Wire Line
	12600 9400 12600 12300
Wire Wire Line
	12600 9400 12700 9400
Wire Wire Line
	12600 12300 12700 12300
Wire Wire Line
	12700 1400 12200 1400
Wire Wire Line
	12700 2500 12400 2500
Wire Wire Line
	12700 3600 12600 3600
Wire Wire Line
	12700 4300 12200 4300
Wire Wire Line
	12700 4850 12300 4850
Wire Wire Line
	12700 5400 12400 5400
Wire Wire Line
	12700 5950 12500 5950
Wire Wire Line
	12700 7200 12200 7200
Wire Wire Line
	12700 7750 12300 7750
Wire Wire Line
	12700 8300 12400 8300
Wire Wire Line
	12700 8850 12500 8850
Wire Wire Line
	12700 10100 12200 10100
Wire Wire Line
	12700 10650 12300 10650
Wire Wire Line
	12700 11200 12400 11200
Wire Wire Line
	12700 11750 12500 11750
Wire Wire Line
	13350 2000 13250 2000
Wire Wire Line
	13350 2450 13350 2000
Wire Wire Line
	13350 2650 13350 3100
Wire Wire Line
	13350 3100 13250 3100
Wire Wire Line
	13350 4900 13250 4900
Wire Wire Line
	13350 5350 13350 4900
Wire Wire Line
	13350 5550 13350 6000
Wire Wire Line
	13350 6000 13250 6000
Wire Wire Line
	13350 7800 13250 7800
Wire Wire Line
	13350 8250 13350 7800
Wire Wire Line
	13350 8450 13350 8900
Wire Wire Line
	13350 8900 13250 8900
Wire Wire Line
	13350 10700 13250 10700
Wire Wire Line
	13350 11150 13350 10700
Wire Wire Line
	13350 11350 13350 11800
Wire Wire Line
	13350 11800 13250 11800
Wire Wire Line
	13450 1450 13250 1450
Wire Wire Line
	13450 2350 13450 1450
Wire Wire Line
	13450 2450 13350 2450
Wire Wire Line
	13450 2550 13250 2550
Wire Wire Line
	13450 2650 13350 2650
Wire Wire Line
	13450 2750 13450 3650
Wire Wire Line
	13450 3650 13250 3650
Wire Wire Line
	13450 4350 13250 4350
Wire Wire Line
	13450 5250 13450 4350
Wire Wire Line
	13450 5350 13350 5350
Wire Wire Line
	13450 5450 13250 5450
Wire Wire Line
	13450 5550 13350 5550
Wire Wire Line
	13450 5650 13450 6550
Wire Wire Line
	13450 6550 13250 6550
Wire Wire Line
	13450 7250 13250 7250
Wire Wire Line
	13450 8150 13450 7250
Wire Wire Line
	13450 8250 13350 8250
Wire Wire Line
	13450 8350 13250 8350
Wire Wire Line
	13450 8450 13350 8450
Wire Wire Line
	13450 8550 13450 9450
Wire Wire Line
	13450 9450 13250 9450
Wire Wire Line
	13450 10150 13250 10150
Wire Wire Line
	13450 11050 13450 10150
Wire Wire Line
	13450 11150 13350 11150
Wire Wire Line
	13450 11250 13250 11250
Wire Wire Line
	13450 11350 13350 11350
Wire Wire Line
	13450 11450 13450 12350
Wire Wire Line
	13450 12350 13250 12350
Wire Wire Line
	14850 1500 15700 1500
Wire Wire Line
	14850 2050 15700 2050
Wire Wire Line
	14850 2600 15700 2600
Wire Wire Line
	14850 3150 15700 3150
Wire Wire Line
	14850 3700 15700 3700
Wire Wire Line
	14850 4400 15700 4400
Wire Wire Line
	14850 4950 15700 4950
Wire Wire Line
	14850 5500 15700 5500
Wire Wire Line
	14850 6050 15700 6050
Wire Wire Line
	14850 6600 15700 6600
Wire Wire Line
	14850 7300 15700 7300
Wire Wire Line
	14850 7850 15700 7850
Wire Wire Line
	14850 8400 15700 8400
Wire Wire Line
	14850 8950 15700 8950
Wire Wire Line
	14850 9500 15700 9500
Wire Wire Line
	14850 10200 15700 10200
Wire Wire Line
	14850 10750 15700 10750
Wire Wire Line
	14850 11300 15700 11300
Wire Wire Line
	14850 11850 15700 11850
Wire Wire Line
	14850 12400 15700 12400
Wire Wire Line
	15200 650  15200 1400
Wire Wire Line
	15200 4300 15200 1400
Wire Wire Line
	15200 7200 15200 4300
Wire Wire Line
	15200 10100 15200 7200
Wire Wire Line
	15300 750  15300 1950
Wire Wire Line
	15300 1950 15700 1950
Wire Wire Line
	15300 4850 15300 1950
Wire Wire Line
	15300 7750 15300 4850
Wire Wire Line
	15300 10650 15300 7750
Wire Wire Line
	15400 850  15400 2500
Wire Wire Line
	15400 5400 15400 2500
Wire Wire Line
	15400 8300 15400 5400
Wire Wire Line
	15400 11200 15400 8300
Wire Wire Line
	15500 950  15500 3050
Wire Wire Line
	15500 3050 15700 3050
Wire Wire Line
	15500 5950 15500 3050
Wire Wire Line
	15500 8850 15500 5950
Wire Wire Line
	15500 11750 15500 8850
Wire Wire Line
	15600 1050 15600 3600
Wire Wire Line
	15600 3600 15600 6500
Wire Wire Line
	15600 6500 15600 9400
Wire Wire Line
	15600 6500 15700 6500
Wire Wire Line
	15600 9400 15600 12300
Wire Wire Line
	15600 9400 15700 9400
Wire Wire Line
	15600 12300 15700 12300
Wire Wire Line
	15700 1400 15200 1400
Wire Wire Line
	15700 2500 15400 2500
Wire Wire Line
	15700 3600 15600 3600
Wire Wire Line
	15700 4300 15200 4300
Wire Wire Line
	15700 4850 15300 4850
Wire Wire Line
	15700 5400 15400 5400
Wire Wire Line
	15700 5950 15500 5950
Wire Wire Line
	15700 7200 15200 7200
Wire Wire Line
	15700 7750 15300 7750
Wire Wire Line
	15700 8300 15400 8300
Wire Wire Line
	15700 8850 15500 8850
Wire Wire Line
	15700 10100 15200 10100
Wire Wire Line
	15700 10650 15300 10650
Wire Wire Line
	15700 11200 15400 11200
Wire Wire Line
	15700 11750 15500 11750
Wire Wire Line
	16350 2000 16250 2000
Wire Wire Line
	16350 2450 16350 2000
Wire Wire Line
	16350 2650 16350 3100
Wire Wire Line
	16350 3100 16250 3100
Wire Wire Line
	16350 4900 16250 4900
Wire Wire Line
	16350 5350 16350 4900
Wire Wire Line
	16350 5550 16350 6000
Wire Wire Line
	16350 6000 16250 6000
Wire Wire Line
	16350 7800 16250 7800
Wire Wire Line
	16350 8250 16350 7800
Wire Wire Line
	16350 8450 16350 8900
Wire Wire Line
	16350 8900 16250 8900
Wire Wire Line
	16350 10700 16250 10700
Wire Wire Line
	16350 11150 16350 10700
Wire Wire Line
	16350 11350 16350 11800
Wire Wire Line
	16350 11800 16250 11800
Wire Wire Line
	16450 1450 16250 1450
Wire Wire Line
	16450 2350 16450 1450
Wire Wire Line
	16450 2450 16350 2450
Wire Wire Line
	16450 2550 16250 2550
Wire Wire Line
	16450 2650 16350 2650
Wire Wire Line
	16450 2750 16450 3650
Wire Wire Line
	16450 3650 16250 3650
Wire Wire Line
	16450 4350 16250 4350
Wire Wire Line
	16450 5250 16450 4350
Wire Wire Line
	16450 5350 16350 5350
Wire Wire Line
	16450 5450 16250 5450
Wire Wire Line
	16450 5550 16350 5550
Wire Wire Line
	16450 5650 16450 6550
Wire Wire Line
	16450 6550 16250 6550
Wire Wire Line
	16450 7250 16250 7250
Wire Wire Line
	16450 8150 16450 7250
Wire Wire Line
	16450 8250 16350 8250
Wire Wire Line
	16450 8350 16250 8350
Wire Wire Line
	16450 8450 16350 8450
Wire Wire Line
	16450 8550 16450 9450
Wire Wire Line
	16450 9450 16250 9450
Wire Wire Line
	16450 10150 16250 10150
Wire Wire Line
	16450 11050 16450 10150
Wire Wire Line
	16450 11150 16350 11150
Wire Wire Line
	16450 11250 16250 11250
Wire Wire Line
	16450 11350 16350 11350
Wire Wire Line
	16450 11450 16450 12350
Wire Wire Line
	16450 12350 16250 12350
Wire Bus Line
	5500 1300 5650 1300
Wire Bus Line
	5500 15600 5850 15600
Wire Bus Line
	5850 15600 8850 15600
Wire Bus Line
	8850 15600 8850 12650
Wire Bus Line
	11750 12650 8850 12650
Wire Bus Line
	14750 12650 11750 12650
Text Label 5850 650  0    50   ~ 0
CA1
Text Label 5850 750  0    50   ~ 0
CA2
Text Label 5850 850  0    50   ~ 0
CA3
Text Label 5850 950  0    50   ~ 0
CA4
Text Label 5850 1050 0    50   ~ 0
CA5
Text Label 5950 1500 0    50   ~ 0
KEY134
Text Label 5950 2050 0    50   ~ 0
KEY133
Text Label 5950 2600 0    50   ~ 0
KEY132
Text Label 5950 3150 0    50   ~ 0
KEY131
Text Label 5950 3700 0    50   ~ 0
KEY130
Text Label 5950 4400 0    50   ~ 0
KEY129
Text Label 5950 4950 0    50   ~ 0
KEY128
Text Label 5950 5500 0    50   ~ 0
KEY127
Text Label 5950 6050 0    50   ~ 0
KEY126
Text Label 5950 6600 0    50   ~ 0
KEY125
Text Label 5950 7300 0    50   ~ 0
KEY124
Text Label 5950 7850 0    50   ~ 0
KEY123
Text Label 5950 8400 0    50   ~ 0
KEY122
Text Label 5950 8950 0    50   ~ 0
KEY121
Text Label 5950 9500 0    50   ~ 0
KEY120
Text Label 5950 10200 0    50   ~ 0
KEY119
Text Label 5950 10750 0    50   ~ 0
KEY118
Text Label 5950 11300 0    50   ~ 0
KEY117
Text Label 5950 11850 0    50   ~ 0
KEY116
Text Label 5950 12400 0    50   ~ 0
KEY115
Text Label 5950 13100 0    50   ~ 0
KEY111
Text Label 5950 13650 0    50   ~ 0
KEY110
Text Label 5950 14200 0    50   ~ 0
KEY109
Text Label 5950 14750 0    50   ~ 0
KEY108
Text Label 5950 15300 0    50   ~ 0
KEY107
Text Label 8950 1500 0    50   ~ 0
KEY90
Text Label 8950 2050 0    50   ~ 0
KEY89
Text Label 8950 2600 0    50   ~ 0
KEY88
Text Label 8950 3150 0    50   ~ 0
KEY87
Text Label 8950 3700 0    50   ~ 0
KEY86
Text Label 8950 4400 0    50   ~ 0
KEY85
Text Label 8950 4950 0    50   ~ 0
KEY84
Text Label 8950 5500 0    50   ~ 0
KEY83
Text Label 8950 6050 0    50   ~ 0
KEY82
Text Label 8950 6600 0    50   ~ 0
KEY81
Text Label 8950 7300 0    50   ~ 0
KEY61
Text Label 8950 7850 0    50   ~ 0
KEY60
Text Label 8950 8400 0    50   ~ 0
KEY59
Text Label 8950 8950 0    50   ~ 0
KEY58
Text Label 8950 9500 0    50   ~ 0
KEY57
Text Label 8950 10200 0    50   ~ 0
KEY56
Text Label 8950 10750 0    50   ~ 0
KEY55
Text Label 8950 11300 0    50   ~ 0
KEY54
Text Label 8950 11850 0    50   ~ 0
KEY53
Text Label 8950 12400 0    50   ~ 0
KEY52
Text Label 11850 1500 0    50   ~ 0
KEY51
Text Label 11850 2050 0    50   ~ 0
KEY50
Text Label 11850 2600 0    50   ~ 0
KEY49
Text Label 11850 3150 0    50   ~ 0
KEY48
Text Label 11850 3700 0    50   ~ 0
KEY47
Text Label 11850 4400 0    50   ~ 0
KEY46
Text Label 11850 4950 0    50   ~ 0
KEY45
Text Label 11850 5500 0    50   ~ 0
KEY44
Text Label 11850 6050 0    50   ~ 0
KEY43
Text Label 11850 6600 0    50   ~ 0
KEY42
Text Label 11850 7300 0    50   ~ 0
KEY38
Text Label 11850 7850 0    50   ~ 0
KEY37
Text Label 11850 8400 0    50   ~ 0
KEY36
Text Label 11850 8950 0    50   ~ 0
KEY35
Text Label 11850 9500 0    50   ~ 0
KEY34
Text Label 11850 10200 0    50   ~ 0
KEY33
Text Label 11850 10750 0    50   ~ 0
KEY32
Text Label 11850 11300 0    50   ~ 0
KEY31
Text Label 11850 11850 0    50   ~ 0
KEY30
Text Label 11850 12400 0    50   ~ 0
KEY29
Text Label 14850 1500 0    50   ~ 0
KEY28
Text Label 14850 2050 0    50   ~ 0
KEY27
Text Label 14850 2600 0    50   ~ 0
KEY26
Text Label 14850 3150 0    50   ~ 0
KEY25
Text Label 14850 3700 0    50   ~ 0
KEY24
Text Label 14850 4400 0    50   ~ 0
KEY23
Text Label 14850 4950 0    50   ~ 0
KEY22
Text Label 14850 5500 0    50   ~ 0
KEY21
Text Label 14850 6050 0    50   ~ 0
KEY20
Text Label 14850 6600 0    50   ~ 0
KEY19
Text Label 14850 7300 0    50   ~ 0
KEY18
Text Label 14850 7850 0    50   ~ 0
KEY17
Text Label 14850 8400 0    50   ~ 0
KEY16
Text Label 14850 8950 0    50   ~ 0
KEY15
Text Label 14850 9500 0    50   ~ 0
KEY14
Text Label 14850 10200 0    50   ~ 0
KEY10
Text Label 14850 10750 0    50   ~ 0
KEY9
Text Label 14850 11300 0    50   ~ 0
KEY8
Text Label 14850 11850 0    50   ~ 0
KEY7
Text Label 14850 12400 0    50   ~ 0
KEY6
Text HLabel 5500 1300 0    50   Input ~ 0
CA[1..5]
Text HLabel 5500 15600 0    50   Input ~ 0
KEY[6..134]
Text HLabel 8200 2550 2    50   Output ~ 0
~RASTER3
Text HLabel 8200 5450 2    50   Output ~ 0
~RASTER2
Text HLabel 8200 8350 2    50   Output ~ 0
~LAYER-CTRL
Text HLabel 8200 11250 2    50   Output ~ 0
~RASTER1
Text HLabel 8200 14150 2    50   Output ~ 0
~CHECK2
Text HLabel 11200 2550 2    50   Output ~ 0
~PRIORITY0
Text HLabel 11200 5450 2    50   Output ~ 0
~CHECK1
Text HLabel 11200 8350 2    50   Output ~ 0
~PRIORITY1
Text HLabel 11200 11250 2    50   Output ~ 0
~MULT-TC
Text HLabel 14100 2550 2    50   Output ~ 0
~PRIORITY2
Text HLabel 14100 5450 2    50   Output ~ 0
~MULT-MSB
Text HLabel 14100 8350 2    50   Output ~ 0
~PRIORITY3
Text HLabel 14100 11250 2    50   Output ~ 0
~MULT-LSB
Text HLabel 17100 2550 2    50   Output ~ 0
~PAL-CTRL
Text HLabel 17100 5450 2    50   Output ~ 0
~MULT-Y
Text HLabel 17100 8350 2    50   Output ~ 0
~CPS-ID
Text HLabel 17100 11250 2    50   Output ~ 0
~MULT-X
$Comp
L A5C:XNOR02 UCL96
U 1 1 62CEE0F1
P 7050 1450
AR Path="/5F9CE801/62CEE0F1" Ref="UCL96"  Part="1" 
AR Path="/5FBF8EAD/5FBFA07D/62CEE0F1" Ref="UCL96"  Part="1" 
F 0 "UCL96" H 7050 1767 50  0000 C CNN
F 1 "XNOR02" H 7050 1676 50  0000 C CNN
F 2 "" H 7050 1450 50  0001 C CNN
F 3 "" H 7050 1450 50  0001 C CNN
	1    7050 1450
	1    0    0    -1  
$EndComp
$Comp
L A5C:XNOR02 UCO98
U 1 1 646E6A6B
P 7050 2000
AR Path="/5F9CE801/646E6A6B" Ref="UCO98"  Part="1" 
AR Path="/5FBF8EAD/5FBFA07D/646E6A6B" Ref="UCO98"  Part="1" 
F 0 "UCO98" H 7050 2317 50  0000 C CNN
F 1 "XNOR02" H 7050 2226 50  0000 C CNN
F 2 "" H 7050 2000 50  0001 C CNN
F 3 "" H 7050 2000 50  0001 C CNN
	1    7050 2000
	1    0    0    -1  
$EndComp
$Comp
L A5C:XNOR02 UCL98
U 1 1 6B59962E
P 7050 2550
AR Path="/5F9CE801/6B59962E" Ref="UCL98"  Part="1" 
AR Path="/5FBF8EAD/5FBFA07D/6B59962E" Ref="UCL98"  Part="1" 
F 0 "UCL98" H 7050 2867 50  0000 C CNN
F 1 "XNOR02" H 7050 2776 50  0000 C CNN
F 2 "" H 7050 2550 50  0001 C CNN
F 3 "" H 7050 2550 50  0001 C CNN
	1    7050 2550
	1    0    0    -1  
$EndComp
$Comp
L A5C:XNOR02 UCO106
U 1 1 6B599634
P 7050 3100
AR Path="/5F9CE801/6B599634" Ref="UCO106"  Part="1" 
AR Path="/5FBF8EAD/5FBFA07D/6B599634" Ref="UCO106"  Part="1" 
F 0 "UCO106" H 7050 3417 50  0000 C CNN
F 1 "XNOR02" H 7050 3326 50  0000 C CNN
F 2 "" H 7050 3100 50  0001 C CNN
F 3 "" H 7050 3100 50  0001 C CNN
	1    7050 3100
	1    0    0    -1  
$EndComp
$Comp
L A5C:XNOR02 UCG92
U 1 1 6B59963A
P 7050 3650
AR Path="/5F9CE801/6B59963A" Ref="UCG92"  Part="1" 
AR Path="/5FBF8EAD/5FBFA07D/6B59963A" Ref="UCG92"  Part="1" 
F 0 "UCG92" H 7050 3967 50  0000 C CNN
F 1 "XNOR02" H 7050 3876 50  0000 C CNN
F 2 "" H 7050 3650 50  0001 C CNN
F 3 "" H 7050 3650 50  0001 C CNN
	1    7050 3650
	1    0    0    -1  
$EndComp
$Comp
L A5C:XNOR02 UCG124
U 1 1 6241A4EB
P 7050 4350
AR Path="/5F9CE801/6241A4EB" Ref="UCG124"  Part="1" 
AR Path="/5FBF8EAD/5FBFA07D/6241A4EB" Ref="UCG124"  Part="1" 
F 0 "UCG124" H 7050 4667 50  0000 C CNN
F 1 "XNOR02" H 7050 4576 50  0000 C CNN
F 2 "" H 7050 4350 50  0001 C CNN
F 3 "" H 7050 4350 50  0001 C CNN
	1    7050 4350
	1    0    0    -1  
$EndComp
$Comp
L A5C:XNOR02 UCG131
U 1 1 646E6A56
P 7050 4900
AR Path="/5F9CE801/646E6A56" Ref="UCG131"  Part="1" 
AR Path="/5FBF8EAD/5FBFA07D/646E6A56" Ref="UCG131"  Part="1" 
F 0 "UCG131" H 7050 5217 50  0000 C CNN
F 1 "XNOR02" H 7050 5126 50  0000 C CNN
F 2 "" H 7050 4900 50  0001 C CNN
F 3 "" H 7050 4900 50  0001 C CNN
	1    7050 4900
	1    0    0    -1  
$EndComp
$Comp
L A5C:XNOR02 UCG134
U 1 1 6B599543
P 7050 5450
AR Path="/5F9CE801/6B599543" Ref="UCG134"  Part="1" 
AR Path="/5FBF8EAD/5FBFA07D/6B599543" Ref="UCG134"  Part="1" 
F 0 "UCG134" H 7050 5767 50  0000 C CNN
F 1 "XNOR02" H 7050 5676 50  0000 C CNN
F 2 "" H 7050 5450 50  0001 C CNN
F 3 "" H 7050 5450 50  0001 C CNN
	1    7050 5450
	1    0    0    -1  
$EndComp
$Comp
L A5C:XNOR02 UCJ142
U 1 1 6B599549
P 7050 6000
AR Path="/5F9CE801/6B599549" Ref="UCJ142"  Part="1" 
AR Path="/5FBF8EAD/5FBFA07D/6B599549" Ref="UCJ142"  Part="1" 
F 0 "UCJ142" H 7050 6317 50  0000 C CNN
F 1 "XNOR02" H 7050 6226 50  0000 C CNN
F 2 "" H 7050 6000 50  0001 C CNN
F 3 "" H 7050 6000 50  0001 C CNN
	1    7050 6000
	1    0    0    -1  
$EndComp
$Comp
L A5C:XNOR02 UCG148
U 1 1 6B59954F
P 7050 6550
AR Path="/5F9CE801/6B59954F" Ref="UCG148"  Part="1" 
AR Path="/5FBF8EAD/5FBFA07D/6B59954F" Ref="UCG148"  Part="1" 
F 0 "UCG148" H 7050 6867 50  0000 C CNN
F 1 "XNOR02" H 7050 6776 50  0000 C CNN
F 2 "" H 7050 6550 50  0001 C CNN
F 3 "" H 7050 6550 50  0001 C CNN
	1    7050 6550
	1    0    0    -1  
$EndComp
$Comp
L A5C:XNOR02 UCC136
U 1 1 62590921
P 7050 7250
AR Path="/5F9CE801/62590921" Ref="UCC136"  Part="1" 
AR Path="/5FBF8EAD/5FBFA07D/62590921" Ref="UCC136"  Part="1" 
F 0 "UCC136" H 7050 7567 50  0000 C CNN
F 1 "XNOR02" H 7050 7476 50  0000 C CNN
F 2 "" H 7050 7250 50  0001 C CNN
F 3 "" H 7050 7250 50  0001 C CNN
	1    7050 7250
	1    0    0    -1  
$EndComp
$Comp
L A5C:XNOR02 UBZ144
U 1 1 646E6A41
P 7050 7800
AR Path="/5F9CE801/646E6A41" Ref="UBZ144"  Part="1" 
AR Path="/5FBF8EAD/5FBFA07D/646E6A41" Ref="UBZ144"  Part="1" 
F 0 "UBZ144" H 7050 8117 50  0000 C CNN
F 1 "XNOR02" H 7050 8026 50  0000 C CNN
F 2 "" H 7050 7800 50  0001 C CNN
F 3 "" H 7050 7800 50  0001 C CNN
	1    7050 7800
	1    0    0    -1  
$EndComp
$Comp
L A5C:XNOR02 UCJ145
U 1 1 69A81E2C
P 7050 8350
AR Path="/5F9CE801/69A81E2C" Ref="UCJ145"  Part="1" 
AR Path="/5FBF8EAD/5FBFA07D/69A81E2C" Ref="UCJ145"  Part="1" 
F 0 "UCJ145" H 7050 8667 50  0000 C CNN
F 1 "XNOR02" H 7050 8576 50  0000 C CNN
F 2 "" H 7050 8350 50  0001 C CNN
F 3 "" H 7050 8350 50  0001 C CNN
	1    7050 8350
	1    0    0    -1  
$EndComp
$Comp
L A5C:XNOR02 UCG150
U 1 1 69A81E32
P 7050 8900
AR Path="/5F9CE801/69A81E32" Ref="UCG150"  Part="1" 
AR Path="/5FBF8EAD/5FBFA07D/69A81E32" Ref="UCG150"  Part="1" 
F 0 "UCG150" H 7050 9217 50  0000 C CNN
F 1 "XNOR02" H 7050 9126 50  0000 C CNN
F 2 "" H 7050 8900 50  0001 C CNN
F 3 "" H 7050 8900 50  0001 C CNN
	1    7050 8900
	1    0    0    -1  
$EndComp
$Comp
L A5C:XNOR02 UCG153
U 1 1 69A81E38
P 7050 9450
AR Path="/5F9CE801/69A81E38" Ref="UCG153"  Part="1" 
AR Path="/5FBF8EAD/5FBFA07D/69A81E38" Ref="UCG153"  Part="1" 
F 0 "UCG153" H 7050 9767 50  0000 C CNN
F 1 "XNOR02" H 7050 9676 50  0000 C CNN
F 2 "" H 7050 9450 50  0001 C CNN
F 3 "" H 7050 9450 50  0001 C CNN
	1    7050 9450
	1    0    0    -1  
$EndComp
$Comp
L A5C:XNOR02 UCC124
U 1 1 62707DD7
P 7050 10150
AR Path="/5F9CE801/62707DD7" Ref="UCC124"  Part="1" 
AR Path="/5FBF8EAD/5FBFA07D/62707DD7" Ref="UCC124"  Part="1" 
F 0 "UCC124" H 7050 10467 50  0000 C CNN
F 1 "XNOR02" H 7050 10376 50  0000 C CNN
F 2 "" H 7050 10150 50  0001 C CNN
F 3 "" H 7050 10150 50  0001 C CNN
	1    7050 10150
	1    0    0    -1  
$EndComp
$Comp
L A5C:XNOR02 UCC112
U 1 1 646E6A48
P 7050 10700
AR Path="/5F9CE801/646E6A48" Ref="UCC112"  Part="1" 
AR Path="/5FBF8EAD/5FBFA07D/646E6A48" Ref="UCC112"  Part="1" 
F 0 "UCC112" H 7050 11017 50  0000 C CNN
F 1 "XNOR02" H 7050 10926 50  0000 C CNN
F 2 "" H 7050 10700 50  0001 C CNN
F 3 "" H 7050 10700 50  0001 C CNN
	1    7050 10700
	1    0    0    -1  
$EndComp
$Comp
L A5C:XNOR02 UCJ75
U 1 1 6A26E401
P 7050 11250
AR Path="/5F9CE801/6A26E401" Ref="UCJ75"  Part="1" 
AR Path="/5FBF8EAD/5FBFA07D/6A26E401" Ref="UCJ75"  Part="1" 
F 0 "UCJ75" H 7050 11567 50  0000 C CNN
F 1 "XNOR02" H 7050 11476 50  0000 C CNN
F 2 "" H 7050 11250 50  0001 C CNN
F 3 "" H 7050 11250 50  0001 C CNN
	1    7050 11250
	1    0    0    -1  
$EndComp
$Comp
L A5C:XNOR02 UCC107
U 1 1 6A26E407
P 7050 11800
AR Path="/5F9CE801/6A26E407" Ref="UCC107"  Part="1" 
AR Path="/5FBF8EAD/5FBFA07D/6A26E407" Ref="UCC107"  Part="1" 
F 0 "UCC107" H 7050 12117 50  0000 C CNN
F 1 "XNOR02" H 7050 12026 50  0000 C CNN
F 2 "" H 7050 11800 50  0001 C CNN
F 3 "" H 7050 11800 50  0001 C CNN
	1    7050 11800
	1    0    0    -1  
$EndComp
$Comp
L A5C:XNOR02 UCC82
U 1 1 6A26E40D
P 7050 12350
AR Path="/5F9CE801/6A26E40D" Ref="UCC82"  Part="1" 
AR Path="/5FBF8EAD/5FBFA07D/6A26E40D" Ref="UCC82"  Part="1" 
F 0 "UCC82" H 7050 12667 50  0000 C CNN
F 1 "XNOR02" H 7050 12576 50  0000 C CNN
F 2 "" H 7050 12350 50  0001 C CNN
F 3 "" H 7050 12350 50  0001 C CNN
	1    7050 12350
	1    0    0    -1  
$EndComp
$Comp
L A5C:XNOR02 UCG140
U 1 1 6212EB84
P 7050 13050
AR Path="/5F9CE801/6212EB84" Ref="UCG140"  Part="1" 
AR Path="/5FBF8EAD/5FBFA07D/6212EB84" Ref="UCG140"  Part="1" 
F 0 "UCG140" H 7050 13367 50  0000 C CNN
F 1 "XNOR02" H 7050 13276 50  0000 C CNN
F 2 "" H 7050 13050 50  0001 C CNN
F 3 "" H 7050 13050 50  0001 C CNN
	1    7050 13050
	1    0    0    -1  
$EndComp
$Comp
L A5C:XNOR02 UCJ116
U 1 1 646E6A5D
P 7050 13600
AR Path="/5F9CE801/646E6A5D" Ref="UCJ116"  Part="1" 
AR Path="/5FBF8EAD/5FBFA07D/646E6A5D" Ref="UCJ116"  Part="1" 
F 0 "UCJ116" H 7050 13917 50  0000 C CNN
F 1 "XNOR02" H 7050 13826 50  0000 C CNN
F 2 "" H 7050 13600 50  0001 C CNN
F 3 "" H 7050 13600 50  0001 C CNN
	1    7050 13600
	1    0    0    -1  
$EndComp
$Comp
L A5C:XNOR02 UCG106
U 1 1 6B599572
P 7050 14150
AR Path="/5F9CE801/6B599572" Ref="UCG106"  Part="1" 
AR Path="/5FBF8EAD/5FBFA07D/6B599572" Ref="UCG106"  Part="1" 
F 0 "UCG106" H 7050 14467 50  0000 C CNN
F 1 "XNOR02" H 7050 14376 50  0000 C CNN
F 2 "" H 7050 14150 50  0001 C CNN
F 3 "" H 7050 14150 50  0001 C CNN
	1    7050 14150
	1    0    0    -1  
$EndComp
$Comp
L A5C:XNOR02 UCG121
U 1 1 6B599578
P 7050 14700
AR Path="/5F9CE801/6B599578" Ref="UCG121"  Part="1" 
AR Path="/5FBF8EAD/5FBFA07D/6B599578" Ref="UCG121"  Part="1" 
F 0 "UCG121" H 7050 15017 50  0000 C CNN
F 1 "XNOR02" H 7050 14926 50  0000 C CNN
F 2 "" H 7050 14700 50  0001 C CNN
F 3 "" H 7050 14700 50  0001 C CNN
	1    7050 14700
	1    0    0    -1  
$EndComp
$Comp
L A5C:XNOR02 UCG118
U 1 1 6B59957E
P 7050 15250
AR Path="/5F9CE801/6B59957E" Ref="UCG118"  Part="1" 
AR Path="/5FBF8EAD/5FBFA07D/6B59957E" Ref="UCG118"  Part="1" 
F 0 "UCG118" H 7050 15567 50  0000 C CNN
F 1 "XNOR02" H 7050 15476 50  0000 C CNN
F 2 "" H 7050 15250 50  0001 C CNN
F 3 "" H 7050 15250 50  0001 C CNN
	1    7050 15250
	1    0    0    -1  
$EndComp
$Comp
L A5C:XNOR02 UCG86
U 1 1 62E68B13
P 10050 1450
AR Path="/5F9CE801/62E68B13" Ref="UCG86"  Part="1" 
AR Path="/5FBF8EAD/5FBFA07D/62E68B13" Ref="UCG86"  Part="1" 
F 0 "UCG86" H 10050 1767 50  0000 C CNN
F 1 "XNOR02" H 10050 1676 50  0000 C CNN
F 2 "" H 10050 1450 50  0001 C CNN
F 3 "" H 10050 1450 50  0001 C CNN
	1    10050 1450
	1    0    0    -1  
$EndComp
$Comp
L A5C:XNOR02 UCC85
U 1 1 646E6A4F
P 10050 2000
AR Path="/5F9CE801/646E6A4F" Ref="UCC85"  Part="1" 
AR Path="/5FBF8EAD/5FBFA07D/646E6A4F" Ref="UCC85"  Part="1" 
F 0 "UCC85" H 10050 2317 50  0000 C CNN
F 1 "XNOR02" H 10050 2226 50  0000 C CNN
F 2 "" H 10050 2000 50  0001 C CNN
F 3 "" H 10050 2000 50  0001 C CNN
	1    10050 2000
	1    0    0    -1  
$EndComp
$Comp
L A5C:XNOR02 UCG90
U 1 1 6A26E430
P 10050 2550
AR Path="/5F9CE801/6A26E430" Ref="UCG90"  Part="1" 
AR Path="/5FBF8EAD/5FBFA07D/6A26E430" Ref="UCG90"  Part="1" 
F 0 "UCG90" H 10050 2867 50  0000 C CNN
F 1 "XNOR02" H 10050 2776 50  0000 C CNN
F 2 "" H 10050 2550 50  0001 C CNN
F 3 "" H 10050 2550 50  0001 C CNN
	1    10050 2550
	1    0    0    -1  
$EndComp
$Comp
L A5C:XNOR02 UCG95
U 1 1 6A26E436
P 10050 3100
AR Path="/5F9CE801/6A26E436" Ref="UCG95"  Part="1" 
AR Path="/5FBF8EAD/5FBFA07D/6A26E436" Ref="UCG95"  Part="1" 
F 0 "UCG95" H 10050 3417 50  0000 C CNN
F 1 "XNOR02" H 10050 3326 50  0000 C CNN
F 2 "" H 10050 3100 50  0001 C CNN
F 3 "" H 10050 3100 50  0001 C CNN
	1    10050 3100
	1    0    0    -1  
$EndComp
$Comp
L A5C:XNOR02 UCC98
U 1 1 6A26E43C
P 10050 3650
AR Path="/5F9CE801/6A26E43C" Ref="UCC98"  Part="1" 
AR Path="/5FBF8EAD/5FBFA07D/6A26E43C" Ref="UCC98"  Part="1" 
F 0 "UCC98" H 10050 3967 50  0000 C CNN
F 1 "XNOR02" H 10050 3876 50  0000 C CNN
F 2 "" H 10050 3650 50  0001 C CNN
F 3 "" H 10050 3650 50  0001 C CNN
	1    10050 3650
	1    0    0    -1  
$EndComp
$Comp
L A5C:XNOR02 UCG112
U 1 1 62FE41E7
P 10050 4350
AR Path="/5F9CE801/62FE41E7" Ref="UCG112"  Part="1" 
AR Path="/5FBF8EAD/5FBFA07D/62FE41E7" Ref="UCG112"  Part="1" 
F 0 "UCG112" H 10050 4667 50  0000 C CNN
F 1 "XNOR02" H 10050 4576 50  0000 C CNN
F 2 "" H 10050 4350 50  0001 C CNN
F 3 "" H 10050 4350 50  0001 C CNN
	1    10050 4350
	1    0    0    -1  
$EndComp
$Comp
L A5C:XNOR02 UCJ110
U 1 1 646E6A72
P 10050 4900
AR Path="/5F9CE801/646E6A72" Ref="UCJ110"  Part="1" 
AR Path="/5FBF8EAD/5FBFA07D/646E6A72" Ref="UCJ110"  Part="1" 
F 0 "UCJ110" H 10050 5217 50  0000 C CNN
F 1 "XNOR02" H 10050 5126 50  0000 C CNN
F 2 "" H 10050 4900 50  0001 C CNN
F 3 "" H 10050 4900 50  0001 C CNN
	1    10050 4900
	1    0    0    -1  
$EndComp
$Comp
L A5C:XNOR02 UCJ113
U 1 1 6B5995FF
P 10050 5450
AR Path="/5F9CE801/6B5995FF" Ref="UCJ113"  Part="1" 
AR Path="/5FBF8EAD/5FBFA07D/6B5995FF" Ref="UCJ113"  Part="1" 
F 0 "UCJ113" H 10050 5767 50  0000 C CNN
F 1 "XNOR02" H 10050 5676 50  0000 C CNN
F 2 "" H 10050 5450 50  0001 C CNN
F 3 "" H 10050 5450 50  0001 C CNN
	1    10050 5450
	1    0    0    -1  
$EndComp
$Comp
L A5C:XNOR02 UCG109
U 1 1 6B599605
P 10050 6000
AR Path="/5F9CE801/6B599605" Ref="UCG109"  Part="1" 
AR Path="/5FBF8EAD/5FBFA07D/6B599605" Ref="UCG109"  Part="1" 
F 0 "UCG109" H 10050 6317 50  0000 C CNN
F 1 "XNOR02" H 10050 6226 50  0000 C CNN
F 2 "" H 10050 6000 50  0001 C CNN
F 3 "" H 10050 6000 50  0001 C CNN
	1    10050 6000
	1    0    0    -1  
$EndComp
$Comp
L A5C:XNOR02 UCG98
U 1 1 6B59960B
P 10050 6550
AR Path="/5F9CE801/6B59960B" Ref="UCG98"  Part="1" 
AR Path="/5FBF8EAD/5FBFA07D/6B59960B" Ref="UCG98"  Part="1" 
F 0 "UCG98" H 10050 6867 50  0000 C CNN
F 1 "XNOR02" H 10050 6776 50  0000 C CNN
F 2 "" H 10050 6550 50  0001 C CNN
F 3 "" H 10050 6550 50  0001 C CNN
	1    10050 6550
	1    0    0    -1  
$EndComp
$Comp
L A5C:XNOR02 UCO90
U 1 1 635E1135
P 10050 7250
AR Path="/5F9CE801/635E1135" Ref="UCO90"  Part="1" 
AR Path="/5FBF8EAD/5FBFA07D/635E1135" Ref="UCO90"  Part="1" 
F 0 "UCO90" H 10050 7567 50  0000 C CNN
F 1 "XNOR02" H 10050 7476 50  0000 C CNN
F 2 "" H 10050 7250 50  0001 C CNN
F 3 "" H 10050 7250 50  0001 C CNN
	1    10050 7250
	1    0    0    -1  
$EndComp
$Comp
L A5C:XNOR02 UCO85
U 1 1 646E6A64
P 10050 7800
AR Path="/5F9CE801/646E6A64" Ref="UCO85"  Part="1" 
AR Path="/5FBF8EAD/5FBFA07D/646E6A64" Ref="UCO85"  Part="1" 
F 0 "UCO85" H 10050 8117 50  0000 C CNN
F 1 "XNOR02" H 10050 8026 50  0000 C CNN
F 2 "" H 10050 7800 50  0001 C CNN
F 3 "" H 10050 7800 50  0001 C CNN
	1    10050 7800
	1    0    0    -1  
$EndComp
$Comp
L A5C:XNOR02 UCO79
U 1 1 69C6BE11
P 10050 8350
AR Path="/5F9CE801/69C6BE11" Ref="UCO79"  Part="1" 
AR Path="/5FBF8EAD/5FBFA07D/69C6BE11" Ref="UCO79"  Part="1" 
F 0 "UCO79" H 10050 8667 50  0000 C CNN
F 1 "XNOR02" H 10050 8576 50  0000 C CNN
F 2 "" H 10050 8350 50  0001 C CNN
F 3 "" H 10050 8350 50  0001 C CNN
	1    10050 8350
	1    0    0    -1  
$EndComp
$Comp
L A5C:XNOR02 UCO96
U 1 1 69C6BE17
P 10050 8900
AR Path="/5F9CE801/69C6BE17" Ref="UCO96"  Part="1" 
AR Path="/5FBF8EAD/5FBFA07D/69C6BE17" Ref="UCO96"  Part="1" 
F 0 "UCO96" H 10050 9217 50  0000 C CNN
F 1 "XNOR02" H 10050 9126 50  0000 C CNN
F 2 "" H 10050 8900 50  0001 C CNN
F 3 "" H 10050 8900 50  0001 C CNN
	1    10050 8900
	1    0    0    -1  
$EndComp
$Comp
L A5C:XNOR02 UCO82
U 1 1 69C6BE1D
P 10050 9450
AR Path="/5F9CE801/69C6BE1D" Ref="UCO82"  Part="1" 
AR Path="/5FBF8EAD/5FBFA07D/69C6BE1D" Ref="UCO82"  Part="1" 
F 0 "UCO82" H 10050 9767 50  0000 C CNN
F 1 "XNOR02" H 10050 9676 50  0000 C CNN
F 2 "" H 10050 9450 50  0001 C CNN
F 3 "" H 10050 9450 50  0001 C CNN
	1    10050 9450
	1    0    0    -1  
$EndComp
$Comp
L A5C:XNOR02 UCC209
U 1 1 60FDDEFD
P 10050 10150
AR Path="/5F9CE801/60FDDEFD" Ref="UCC209"  Part="1" 
AR Path="/5FBF8EAD/5FBFA07D/60FDDEFD" Ref="UCC209"  Part="1" 
F 0 "UCC209" H 10050 10467 50  0000 C CNN
F 1 "XNOR02" H 10050 10376 50  0000 C CNN
F 2 "" H 10050 10150 50  0001 C CNN
F 3 "" H 10050 10150 50  0001 C CNN
	1    10050 10150
	1    0    0    -1  
$EndComp
$Comp
L A5C:XNOR02 UCG217
U 1 1 646E6A79
P 10050 10700
AR Path="/5F9CE801/646E6A79" Ref="UCG217"  Part="1" 
AR Path="/5FBF8EAD/5FBFA07D/646E6A79" Ref="UCG217"  Part="1" 
F 0 "UCG217" H 10050 11017 50  0000 C CNN
F 1 "XNOR02" H 10050 10926 50  0000 C CNN
F 2 "" H 10050 10700 50  0001 C CNN
F 3 "" H 10050 10700 50  0001 C CNN
	1    10050 10700
	1    0    0    -1  
$EndComp
$Comp
L A5C:XNOR02 UCJ226
U 1 1 6B59965D
P 10050 11250
AR Path="/5F9CE801/6B59965D" Ref="UCJ226"  Part="1" 
AR Path="/5FBF8EAD/5FBFA07D/6B59965D" Ref="UCJ226"  Part="1" 
F 0 "UCJ226" H 10050 11567 50  0000 C CNN
F 1 "XNOR02" H 10050 11476 50  0000 C CNN
F 2 "" H 10050 11250 50  0001 C CNN
F 3 "" H 10050 11250 50  0001 C CNN
	1    10050 11250
	1    0    0    -1  
$EndComp
$Comp
L A5C:XNOR02 UCG235
U 1 1 6B599663
P 10050 11800
AR Path="/5F9CE801/6B599663" Ref="UCG235"  Part="1" 
AR Path="/5FBF8EAD/5FBFA07D/6B599663" Ref="UCG235"  Part="1" 
F 0 "UCG235" H 10050 12117 50  0000 C CNN
F 1 "XNOR02" H 10050 12026 50  0000 C CNN
F 2 "" H 10050 11800 50  0001 C CNN
F 3 "" H 10050 11800 50  0001 C CNN
	1    10050 11800
	1    0    0    -1  
$EndComp
$Comp
L A5C:XNOR02 UCJ229
U 1 1 6B599669
P 10050 12350
AR Path="/5F9CE801/6B599669" Ref="UCJ229"  Part="1" 
AR Path="/5FBF8EAD/5FBFA07D/6B599669" Ref="UCJ229"  Part="1" 
F 0 "UCJ229" H 10050 12667 50  0000 C CNN
F 1 "XNOR02" H 10050 12576 50  0000 C CNN
F 2 "" H 10050 12350 50  0001 C CNN
F 3 "" H 10050 12350 50  0001 C CNN
	1    10050 12350
	1    0    0    -1  
$EndComp
$Comp
L A5C:XNOR02 UCO243
U 1 1 635E1143
P 12950 1450
AR Path="/5F9CE801/635E1143" Ref="UCO243"  Part="1" 
AR Path="/5FBF8EAD/5FBFA07D/635E1143" Ref="UCO243"  Part="1" 
F 0 "UCO243" H 12950 1767 50  0000 C CNN
F 1 "XNOR02" H 12950 1676 50  0000 C CNN
F 2 "" H 12950 1450 50  0001 C CNN
F 3 "" H 12950 1450 50  0001 C CNN
	1    12950 1450
	1    0    0    -1  
$EndComp
$Comp
L A5C:XNOR02 UCO256
U 1 1 646E6A9C
P 12950 2000
AR Path="/5F9CE801/646E6A9C" Ref="UCO256"  Part="1" 
AR Path="/5FBF8EAD/5FBFA07D/646E6A9C" Ref="UCO256"  Part="1" 
F 0 "UCO256" H 12950 2317 50  0000 C CNN
F 1 "XNOR02" H 12950 2226 50  0000 C CNN
F 2 "" H 12950 2000 50  0001 C CNN
F 3 "" H 12950 2000 50  0001 C CNN
	1    12950 2000
	1    0    0    -1  
$EndComp
$Comp
L A5C:XNOR02 UCO259
U 1 1 6B59968C
P 12950 2550
AR Path="/5F9CE801/6B59968C" Ref="UCO259"  Part="1" 
AR Path="/5FBF8EAD/5FBFA07D/6B59968C" Ref="UCO259"  Part="1" 
F 0 "UCO259" H 12950 2867 50  0000 C CNN
F 1 "XNOR02" H 12950 2776 50  0000 C CNN
F 2 "" H 12950 2550 50  0001 C CNN
F 3 "" H 12950 2550 50  0001 C CNN
	1    12950 2550
	1    0    0    -1  
$EndComp
$Comp
L A5C:XNOR02 UCO262
U 1 1 6B599692
P 12950 3100
AR Path="/5F9CE801/6B599692" Ref="UCO262"  Part="1" 
AR Path="/5FBF8EAD/5FBFA07D/6B599692" Ref="UCO262"  Part="1" 
F 0 "UCO262" H 12950 3417 50  0000 C CNN
F 1 "XNOR02" H 12950 3326 50  0000 C CNN
F 2 "" H 12950 3100 50  0001 C CNN
F 3 "" H 12950 3100 50  0001 C CNN
	1    12950 3100
	1    0    0    -1  
$EndComp
$Comp
L A5C:XNOR02 UCO209
U 1 1 6B599698
P 12950 3650
AR Path="/5F9CE801/6B599698" Ref="UCO209"  Part="1" 
AR Path="/5FBF8EAD/5FBFA07D/6B599698" Ref="UCO209"  Part="1" 
F 0 "UCO209" H 12950 3967 50  0000 C CNN
F 1 "XNOR02" H 12950 3876 50  0000 C CNN
F 2 "" H 12950 3650 50  0001 C CNN
F 3 "" H 12950 3650 50  0001 C CNN
	1    12950 3650
	1    0    0    -1  
$EndComp
$Comp
L A5C:XNOR02 UCO179
U 1 1 635E112E
P 12950 4350
AR Path="/5F9CE801/635E112E" Ref="UCO179"  Part="1" 
AR Path="/5FBF8EAD/5FBFA07D/635E112E" Ref="UCO179"  Part="1" 
F 0 "UCO179" H 12950 4667 50  0000 C CNN
F 1 "XNOR02" H 12950 4576 50  0000 C CNN
F 2 "" H 12950 4350 50  0001 C CNN
F 3 "" H 12950 4350 50  0001 C CNN
	1    12950 4350
	1    0    0    -1  
$EndComp
$Comp
L A5C:XNOR02 UCO182
U 1 1 646E6AAA
P 12950 4900
AR Path="/5F9CE801/646E6AAA" Ref="UCO182"  Part="1" 
AR Path="/5FBF8EAD/5FBFA07D/646E6AAA" Ref="UCO182"  Part="1" 
F 0 "UCO182" H 12950 5217 50  0000 C CNN
F 1 "XNOR02" H 12950 5126 50  0000 C CNN
F 2 "" H 12950 4900 50  0001 C CNN
F 3 "" H 12950 4900 50  0001 C CNN
	1    12950 4900
	1    0    0    -1  
$EndComp
$Comp
L A5C:XNOR02 UCL195
U 1 1 6A26E48E
P 12950 5450
AR Path="/5F9CE801/6A26E48E" Ref="UCL195"  Part="1" 
AR Path="/5FBF8EAD/5FBFA07D/6A26E48E" Ref="UCL195"  Part="1" 
F 0 "UCL195" H 12950 5767 50  0000 C CNN
F 1 "XNOR02" H 12950 5676 50  0000 C CNN
F 2 "" H 12950 5450 50  0001 C CNN
F 3 "" H 12950 5450 50  0001 C CNN
	1    12950 5450
	1    0    0    -1  
$EndComp
$Comp
L A5C:XNOR02 UCL192
U 1 1 6A26E494
P 12950 6000
AR Path="/5F9CE801/6A26E494" Ref="UCL192"  Part="1" 
AR Path="/5FBF8EAD/5FBFA07D/6A26E494" Ref="UCL192"  Part="1" 
F 0 "UCL192" H 12950 6317 50  0000 C CNN
F 1 "XNOR02" H 12950 6226 50  0000 C CNN
F 2 "" H 12950 6000 50  0001 C CNN
F 3 "" H 12950 6000 50  0001 C CNN
	1    12950 6000
	1    0    0    -1  
$EndComp
$Comp
L A5C:XNOR02 UCO204
U 1 1 6A26E49A
P 12950 6550
AR Path="/5F9CE801/6A26E49A" Ref="UCO204"  Part="1" 
AR Path="/5FBF8EAD/5FBFA07D/6A26E49A" Ref="UCO204"  Part="1" 
F 0 "UCO204" H 12950 6867 50  0000 C CNN
F 1 "XNOR02" H 12950 6776 50  0000 C CNN
F 2 "" H 12950 6550 50  0001 C CNN
F 3 "" H 12950 6550 50  0001 C CNN
	1    12950 6550
	1    0    0    -1  
$EndComp
$Comp
L A5C:XNOR02 UCC159
U 1 1 61E464EE
P 12950 7250
AR Path="/5F9CE801/61E464EE" Ref="UCC159"  Part="1" 
AR Path="/5FBF8EAD/5FBFA07D/61E464EE" Ref="UCC159"  Part="1" 
F 0 "UCC159" H 12950 7567 50  0000 C CNN
F 1 "XNOR02" H 12950 7476 50  0000 C CNN
F 2 "" H 12950 7250 50  0001 C CNN
F 3 "" H 12950 7250 50  0001 C CNN
	1    12950 7250
	1    0    0    -1  
$EndComp
$Comp
L A5C:XNOR02 UCG159
U 1 1 646E6A87
P 12950 7800
AR Path="/5F9CE801/646E6A87" Ref="UCG159"  Part="1" 
AR Path="/5FBF8EAD/5FBFA07D/646E6A87" Ref="UCG159"  Part="1" 
F 0 "UCG159" H 12950 8117 50  0000 C CNN
F 1 "XNOR02" H 12950 8026 50  0000 C CNN
F 2 "" H 12950 7800 50  0001 C CNN
F 3 "" H 12950 7800 50  0001 C CNN
	1    12950 7800
	1    0    0    -1  
$EndComp
$Comp
L A5C:XNOR02 UCJ190
U 1 1 6A26E45F
P 12950 8350
AR Path="/5F9CE801/6A26E45F" Ref="UCJ190"  Part="1" 
AR Path="/5FBF8EAD/5FBFA07D/6A26E45F" Ref="UCJ190"  Part="1" 
F 0 "UCJ190" H 12950 8667 50  0000 C CNN
F 1 "XNOR02" H 12950 8576 50  0000 C CNN
F 2 "" H 12950 8350 50  0001 C CNN
F 3 "" H 12950 8350 50  0001 C CNN
	1    12950 8350
	1    0    0    -1  
$EndComp
$Comp
L A5C:XNOR02 UCC188
U 1 1 6A26E465
P 12950 8900
AR Path="/5F9CE801/6A26E465" Ref="UCC188"  Part="1" 
AR Path="/5FBF8EAD/5FBFA07D/6A26E465" Ref="UCC188"  Part="1" 
F 0 "UCC188" H 12950 9217 50  0000 C CNN
F 1 "XNOR02" H 12950 9126 50  0000 C CNN
F 2 "" H 12950 8900 50  0001 C CNN
F 3 "" H 12950 8900 50  0001 C CNN
	1    12950 8900
	1    0    0    -1  
$EndComp
$Comp
L A5C:XNOR02 UCC200
U 1 1 6A26E46B
P 12950 9450
AR Path="/5F9CE801/6A26E46B" Ref="UCC200"  Part="1" 
AR Path="/5FBF8EAD/5FBFA07D/6A26E46B" Ref="UCC200"  Part="1" 
F 0 "UCC200" H 12950 9767 50  0000 C CNN
F 1 "XNOR02" H 12950 9676 50  0000 C CNN
F 2 "" H 12950 9450 50  0001 C CNN
F 3 "" H 12950 9450 50  0001 C CNN
	1    12950 9450
	1    0    0    -1  
$EndComp
$Comp
L A5C:XNOR02 UCJ219
U 1 1 6187E112
P 12950 10150
AR Path="/5F9CE801/6187E112" Ref="UCJ219"  Part="1" 
AR Path="/5FBF8EAD/5FBFA07D/6187E112" Ref="UCJ219"  Part="1" 
F 0 "UCJ219" H 12950 10467 50  0000 C CNN
F 1 "XNOR02" H 12950 10376 50  0000 C CNN
F 2 "" H 12950 10150 50  0001 C CNN
F 3 "" H 12950 10150 50  0001 C CNN
	1    12950 10150
	1    0    0    -1  
$EndComp
$Comp
L A5C:XNOR02 UCL221
U 1 1 646E6A95
P 12950 10700
AR Path="/5F9CE801/646E6A95" Ref="UCL221"  Part="1" 
AR Path="/5FBF8EAD/5FBFA07D/646E6A95" Ref="UCL221"  Part="1" 
F 0 "UCL221" H 12950 11017 50  0000 C CNN
F 1 "XNOR02" H 12950 10926 50  0000 C CNN
F 2 "" H 12950 10700 50  0001 C CNN
F 3 "" H 12950 10700 50  0001 C CNN
	1    12950 10700
	1    0    0    -1  
$EndComp
$Comp
L A5C:XNOR02 UCL219
U 1 1 69E735D3
P 12950 11250
AR Path="/5F9CE801/69E735D3" Ref="UCL219"  Part="1" 
AR Path="/5FBF8EAD/5FBFA07D/69E735D3" Ref="UCL219"  Part="1" 
F 0 "UCL219" H 12950 11567 50  0000 C CNN
F 1 "XNOR02" H 12950 11476 50  0000 C CNN
F 2 "" H 12950 11250 50  0001 C CNN
F 3 "" H 12950 11250 50  0001 C CNN
	1    12950 11250
	1    0    0    -1  
$EndComp
$Comp
L A5C:XNOR02 UCO282
U 1 1 69E735D9
P 12950 11800
AR Path="/5F9CE801/69E735D9" Ref="UCO282"  Part="1" 
AR Path="/5FBF8EAD/5FBFA07D/69E735D9" Ref="UCO282"  Part="1" 
F 0 "UCO282" H 12950 12117 50  0000 C CNN
F 1 "XNOR02" H 12950 12026 50  0000 C CNN
F 2 "" H 12950 11800 50  0001 C CNN
F 3 "" H 12950 11800 50  0001 C CNN
	1    12950 11800
	1    0    0    -1  
$EndComp
$Comp
L A5C:XNOR02 UCL228
U 1 1 69E735DF
P 12950 12350
AR Path="/5F9CE801/69E735DF" Ref="UCL228"  Part="1" 
AR Path="/5FBF8EAD/5FBFA07D/69E735DF" Ref="UCL228"  Part="1" 
F 0 "UCL228" H 12950 12667 50  0000 C CNN
F 1 "XNOR02" H 12950 12576 50  0000 C CNN
F 2 "" H 12950 12350 50  0001 C CNN
F 3 "" H 12950 12350 50  0001 C CNN
	1    12950 12350
	1    0    0    -1  
$EndComp
$Comp
L A5C:XNOR02 UCC260
U 1 1 612BF94E
P 15950 1450
AR Path="/5F9CE801/612BF94E" Ref="UCC260"  Part="1" 
AR Path="/5FBF8EAD/5FBFA07D/612BF94E" Ref="UCC260"  Part="1" 
F 0 "UCC260" H 15950 1767 50  0000 C CNN
F 1 "XNOR02" H 15950 1676 50  0000 C CNN
F 2 "" H 15950 1450 50  0001 C CNN
F 3 "" H 15950 1450 50  0001 C CNN
	1    15950 1450
	1    0    0    -1  
$EndComp
$Comp
L A5C:XNOR02 UBW244
U 1 1 646E6A3A
P 15950 2000
AR Path="/5F9CE801/646E6A3A" Ref="UBW244"  Part="1" 
AR Path="/5FBF8EAD/5FBFA07D/646E6A3A" Ref="UBW244"  Part="1" 
F 0 "UBW244" H 15950 2317 50  0000 C CNN
F 1 "XNOR02" H 15950 2226 50  0000 C CNN
F 2 "" H 15950 2000 50  0001 C CNN
F 3 "" H 15950 2000 50  0001 C CNN
	1    15950 2000
	1    0    0    -1  
$EndComp
$Comp
L A5C:XNOR02 UBW262
U 1 1 684B27E5
P 15950 2550
AR Path="/5F9CE801/684B27E5" Ref="UBW262"  Part="1" 
AR Path="/5FBF8EAD/5FBFA07D/684B27E5" Ref="UBW262"  Part="1" 
F 0 "UBW262" H 15950 2867 50  0000 C CNN
F 1 "XNOR02" H 15950 2776 50  0000 C CNN
F 2 "" H 15950 2550 50  0001 C CNN
F 3 "" H 15950 2550 50  0001 C CNN
	1    15950 2550
	1    0    0    -1  
$EndComp
$Comp
L A5C:XNOR02 UBW265
U 1 1 684B4325
P 15950 3100
AR Path="/5F9CE801/684B4325" Ref="UBW265"  Part="1" 
AR Path="/5FBF8EAD/5FBFA07D/684B4325" Ref="UBW265"  Part="1" 
F 0 "UBW265" H 15950 3417 50  0000 C CNN
F 1 "XNOR02" H 15950 3326 50  0000 C CNN
F 2 "" H 15950 3100 50  0001 C CNN
F 3 "" H 15950 3100 50  0001 C CNN
	1    15950 3100
	1    0    0    -1  
$EndComp
$Comp
L A5C:XNOR02 UCG273
U 1 1 684B432B
P 15950 3650
AR Path="/5F9CE801/684B432B" Ref="UCG273"  Part="1" 
AR Path="/5FBF8EAD/5FBFA07D/684B432B" Ref="UCG273"  Part="1" 
F 0 "UCG273" H 15950 3967 50  0000 C CNN
F 1 "XNOR02" H 15950 3876 50  0000 C CNN
F 2 "" H 15950 3650 50  0001 C CNN
F 3 "" H 15950 3650 50  0001 C CNN
	1    15950 3650
	1    0    0    -1  
$EndComp
$Comp
L A5C:XNOR02 UCJ170
U 1 1 61B60265
P 15950 4350
AR Path="/5F9CE801/61B60265" Ref="UCJ170"  Part="1" 
AR Path="/5FBF8EAD/5FBFA07D/61B60265" Ref="UCJ170"  Part="1" 
F 0 "UCJ170" H 15950 4667 50  0000 C CNN
F 1 "XNOR02" H 15950 4576 50  0000 C CNN
F 2 "" H 15950 4350 50  0001 C CNN
F 3 "" H 15950 4350 50  0001 C CNN
	1    15950 4350
	1    0    0    -1  
$EndComp
$Comp
L A5C:XNOR02 UCG171
U 1 1 646E6A80
P 15950 4900
AR Path="/5F9CE801/646E6A80" Ref="UCG171"  Part="1" 
AR Path="/5FBF8EAD/5FBFA07D/646E6A80" Ref="UCG171"  Part="1" 
F 0 "UCG171" H 15950 5217 50  0000 C CNN
F 1 "XNOR02" H 15950 5126 50  0000 C CNN
F 2 "" H 15950 4900 50  0001 C CNN
F 3 "" H 15950 4900 50  0001 C CNN
	1    15950 4900
	1    0    0    -1  
$EndComp
$Comp
L A5C:XNOR02 UCJ177
U 1 1 6B5995A1
P 15950 5450
AR Path="/5F9CE801/6B5995A1" Ref="UCJ177"  Part="1" 
AR Path="/5FBF8EAD/5FBFA07D/6B5995A1" Ref="UCJ177"  Part="1" 
F 0 "UCJ177" H 15950 5767 50  0000 C CNN
F 1 "XNOR02" H 15950 5676 50  0000 C CNN
F 2 "" H 15950 5450 50  0001 C CNN
F 3 "" H 15950 5450 50  0001 C CNN
	1    15950 5450
	1    0    0    -1  
$EndComp
$Comp
L A5C:XNOR02 UCG197
U 1 1 6B5995A7
P 15950 6000
AR Path="/5F9CE801/6B5995A7" Ref="UCG197"  Part="1" 
AR Path="/5FBF8EAD/5FBFA07D/6B5995A7" Ref="UCG197"  Part="1" 
F 0 "UCG197" H 15950 6317 50  0000 C CNN
F 1 "XNOR02" H 15950 6226 50  0000 C CNN
F 2 "" H 15950 6000 50  0001 C CNN
F 3 "" H 15950 6000 50  0001 C CNN
	1    15950 6000
	1    0    0    -1  
$EndComp
$Comp
L A5C:XNOR02 UCG194
U 1 1 6B5995AD
P 15950 6550
AR Path="/5F9CE801/6B5995AD" Ref="UCG194"  Part="1" 
AR Path="/5FBF8EAD/5FBFA07D/6B5995AD" Ref="UCG194"  Part="1" 
F 0 "UCG194" H 15950 6867 50  0000 C CNN
F 1 "XNOR02" H 15950 6776 50  0000 C CNN
F 2 "" H 15950 6550 50  0001 C CNN
F 3 "" H 15950 6550 50  0001 C CNN
	1    15950 6550
	1    0    0    -1  
$EndComp
$Comp
L A5C:XNOR02 UCO206
U 1 1 635E1151
P 15950 7250
AR Path="/5F9CE801/635E1151" Ref="UCO206"  Part="1" 
AR Path="/5FBF8EAD/5FBFA07D/635E1151" Ref="UCO206"  Part="1" 
F 0 "UCO206" H 15950 7567 50  0000 C CNN
F 1 "XNOR02" H 15950 7476 50  0000 C CNN
F 2 "" H 15950 7250 50  0001 C CNN
F 3 "" H 15950 7250 50  0001 C CNN
	1    15950 7250
	1    0    0    -1  
$EndComp
$Comp
L A5C:XNOR02 UCO220
U 1 1 646E6A8E
P 15950 7800
AR Path="/5F9CE801/646E6A8E" Ref="UCO220"  Part="1" 
AR Path="/5FBF8EAD/5FBFA07D/646E6A8E" Ref="UCO220"  Part="1" 
F 0 "UCO220" H 15950 8117 50  0000 C CNN
F 1 "XNOR02" H 15950 8026 50  0000 C CNN
F 2 "" H 15950 7800 50  0001 C CNN
F 3 "" H 15950 7800 50  0001 C CNN
	1    15950 7800
	1    0    0    -1  
$EndComp
$Comp
L A5C:XNOR02 UCO223
U 1 1 6B5995D0
P 15950 8350
AR Path="/5F9CE801/6B5995D0" Ref="UCO223"  Part="1" 
AR Path="/5FBF8EAD/5FBFA07D/6B5995D0" Ref="UCO223"  Part="1" 
F 0 "UCO223" H 15950 8667 50  0000 C CNN
F 1 "XNOR02" H 15950 8576 50  0000 C CNN
F 2 "" H 15950 8350 50  0001 C CNN
F 3 "" H 15950 8350 50  0001 C CNN
	1    15950 8350
	1    0    0    -1  
$EndComp
$Comp
L A5C:XNOR02 UCO217
U 1 1 6B5995D6
P 15950 8900
AR Path="/5F9CE801/6B5995D6" Ref="UCO217"  Part="1" 
AR Path="/5FBF8EAD/5FBFA07D/6B5995D6" Ref="UCO217"  Part="1" 
F 0 "UCO217" H 15950 9217 50  0000 C CNN
F 1 "XNOR02" H 15950 9126 50  0000 C CNN
F 2 "" H 15950 8900 50  0001 C CNN
F 3 "" H 15950 8900 50  0001 C CNN
	1    15950 8900
	1    0    0    -1  
$EndComp
$Comp
L A5C:XNOR02 UCO229
U 1 1 6B5995DC
P 15950 9450
AR Path="/5F9CE801/6B5995DC" Ref="UCO229"  Part="1" 
AR Path="/5FBF8EAD/5FBFA07D/6B5995DC" Ref="UCO229"  Part="1" 
F 0 "UCO229" H 15950 9767 50  0000 C CNN
F 1 "XNOR02" H 15950 9676 50  0000 C CNN
F 2 "" H 15950 9450 50  0001 C CNN
F 3 "" H 15950 9450 50  0001 C CNN
	1    15950 9450
	1    0    0    -1  
$EndComp
$Comp
L A5C:XNOR02 UCO234
U 1 1 635E114A
P 15950 10150
AR Path="/5F9CE801/635E114A" Ref="UCO234"  Part="1" 
AR Path="/5FBF8EAD/5FBFA07D/635E114A" Ref="UCO234"  Part="1" 
F 0 "UCO234" H 15950 10467 50  0000 C CNN
F 1 "XNOR02" H 15950 10376 50  0000 C CNN
F 2 "" H 15950 10150 50  0001 C CNN
F 3 "" H 15950 10150 50  0001 C CNN
	1    15950 10150
	1    0    0    -1  
$EndComp
$Comp
L A5C:XNOR02 UCO237
U 1 1 646E6AA3
P 15950 10700
AR Path="/5F9CE801/646E6AA3" Ref="UCO237"  Part="1" 
AR Path="/5FBF8EAD/5FBFA07D/646E6AA3" Ref="UCO237"  Part="1" 
F 0 "UCO237" H 15950 11017 50  0000 C CNN
F 1 "XNOR02" H 15950 10926 50  0000 C CNN
F 2 "" H 15950 10700 50  0001 C CNN
F 3 "" H 15950 10700 50  0001 C CNN
	1    15950 10700
	1    0    0    -1  
$EndComp
$Comp
L A5C:XNOR02 UCL231
U 1 1 6B9D3488
P 15950 11250
AR Path="/5F9CE801/6B9D3488" Ref="UCL231"  Part="1" 
AR Path="/5FBF8EAD/5FBFA07D/6B9D3488" Ref="UCL231"  Part="1" 
F 0 "UCL231" H 15950 11567 50  0000 C CNN
F 1 "XNOR02" H 15950 11476 50  0000 C CNN
F 2 "" H 15950 11250 50  0001 C CNN
F 3 "" H 15950 11250 50  0001 C CNN
	1    15950 11250
	1    0    0    -1  
$EndComp
$Comp
L A5C:XNOR02 UCO250
U 1 1 6B9D348E
P 15950 11800
AR Path="/5F9CE801/6B9D348E" Ref="UCO250"  Part="1" 
AR Path="/5FBF8EAD/5FBFA07D/6B9D348E" Ref="UCO250"  Part="1" 
F 0 "UCO250" H 15950 12117 50  0000 C CNN
F 1 "XNOR02" H 15950 12026 50  0000 C CNN
F 2 "" H 15950 11800 50  0001 C CNN
F 3 "" H 15950 11800 50  0001 C CNN
	1    15950 11800
	1    0    0    -1  
$EndComp
$Comp
L A5C:XNOR02 UCO246
U 1 1 6B9D3494
P 15950 12350
AR Path="/5F9CE801/6B9D3494" Ref="UCO246"  Part="1" 
AR Path="/5FBF8EAD/5FBFA07D/6B9D3494" Ref="UCO246"  Part="1" 
F 0 "UCO246" H 15950 12667 50  0000 C CNN
F 1 "XNOR02" H 15950 12576 50  0000 C CNN
F 2 "" H 15950 12350 50  0001 C CNN
F 3 "" H 15950 12350 50  0001 C CNN
	1    15950 12350
	1    0    0    -1  
$EndComp
$Comp
L A5C:NAND05 UCJ107
U 1 1 665BFD1F
P 7850 2550
AR Path="/5F9CE801/665BFD1F" Ref="UCJ107"  Part="1" 
AR Path="/5FBF8EAD/5FBFA07D/665BFD1F" Ref="UCJ107"  Part="1" 
F 0 "UCJ107" H 7875 2940 50  0000 C CNN
F 1 "NAND05" H 7875 2849 50  0000 C CNN
F 2 "" H 7850 2250 50  0001 C CNN
F 3 "" H 7850 2250 50  0001 C CNN
	1    7850 2550
	1    0    0    -1  
$EndComp
$Comp
L A5C:NAND05 UCG143
U 1 1 66DDD489
P 7850 5450
AR Path="/5F9CE801/66DDD489" Ref="UCG143"  Part="1" 
AR Path="/5FBF8EAD/5FBFA07D/66DDD489" Ref="UCG143"  Part="1" 
F 0 "UCG143" H 7875 5840 50  0000 C CNN
F 1 "NAND05" H 7875 5749 50  0000 C CNN
F 2 "" H 7850 5150 50  0001 C CNN
F 3 "" H 7850 5150 50  0001 C CNN
	1    7850 5450
	1    0    0    -1  
$EndComp
$Comp
L A5C:NAND05 UBZ147
U 1 1 675FC304
P 7850 8350
AR Path="/5F9CE801/675FC304" Ref="UBZ147"  Part="1" 
AR Path="/5FBF8EAD/5FBFA07D/675FC304" Ref="UBZ147"  Part="1" 
F 0 "UBZ147" H 7875 8740 50  0000 C CNN
F 1 "NAND05" H 7875 8649 50  0000 C CNN
F 2 "" H 7850 8050 50  0001 C CNN
F 3 "" H 7850 8050 50  0001 C CNN
	1    7850 8350
	1    0    0    -1  
$EndComp
$Comp
L A5C:NAND05 UCC115
U 1 1 675FC30A
P 7850 11250
AR Path="/5F9CE801/675FC30A" Ref="UCC115"  Part="1" 
AR Path="/5FBF8EAD/5FBFA07D/675FC30A" Ref="UCC115"  Part="1" 
F 0 "UCC115" H 7875 11640 50  0000 C CNN
F 1 "NAND05" H 7875 11549 50  0000 C CNN
F 2 "" H 7850 10950 50  0001 C CNN
F 3 "" H 7850 10950 50  0001 C CNN
	1    7850 11250
	1    0    0    -1  
$EndComp
$Comp
L A5C:NAND05 UCG127
U 1 1 66DDD48F
P 7850 14150
AR Path="/5F9CE801/66DDD48F" Ref="UCG127"  Part="1" 
AR Path="/5FBF8EAD/5FBFA07D/66DDD48F" Ref="UCG127"  Part="1" 
F 0 "UCG127" H 7875 14540 50  0000 C CNN
F 1 "NAND05" H 7875 14449 50  0000 C CNN
F 2 "" H 7850 13850 50  0001 C CNN
F 3 "" H 7850 13850 50  0001 C CNN
	1    7850 14150
	1    0    0    -1  
$EndComp
$Comp
L A5C:NAND05 UCC93
U 1 1 66DDD483
P 10850 2550
AR Path="/5F9CE801/66DDD483" Ref="UCC93"  Part="1" 
AR Path="/5FBF8EAD/5FBFA07D/66DDD483" Ref="UCC93"  Part="1" 
F 0 "UCC93" H 10875 2940 50  0000 C CNN
F 1 "NAND05" H 10875 2849 50  0000 C CNN
F 2 "" H 10850 2250 50  0001 C CNN
F 3 "" H 10850 2250 50  0001 C CNN
	1    10850 2550
	1    0    0    -1  
$EndComp
$Comp
L A5C:NAND05 UCG114
U 1 1 665BFD19
P 10850 5450
AR Path="/5F9CE801/665BFD19" Ref="UCG114"  Part="1" 
AR Path="/5FBF8EAD/5FBFA07D/665BFD19" Ref="UCG114"  Part="1" 
F 0 "UCG114" H 10875 5840 50  0000 C CNN
F 1 "NAND05" H 10875 5749 50  0000 C CNN
F 2 "" H 10850 5150 50  0001 C CNN
F 3 "" H 10850 5150 50  0001 C CNN
	1    10850 5450
	1    0    0    -1  
$EndComp
$Comp
L A5C:NAND05 UCO92
U 1 1 665BFD25
P 10850 8350
AR Path="/5F9CE801/665BFD25" Ref="UCO92"  Part="1" 
AR Path="/5FBF8EAD/5FBFA07D/665BFD25" Ref="UCO92"  Part="1" 
F 0 "UCO92" H 10875 8740 50  0000 C CNN
F 1 "NAND05" H 10875 8649 50  0000 C CNN
F 2 "" H 10850 8050 50  0001 C CNN
F 3 "" H 10850 8050 50  0001 C CNN
	1    10850 8350
	1    0    0    -1  
$EndComp
$Comp
L A5C:NAND05 UCC218
U 1 1 66411A6C
P 10850 11250
AR Path="/5F9CE801/66411A6C" Ref="UCC218"  Part="1" 
AR Path="/5FBF8EAD/5FBFA07D/66411A6C" Ref="UCC218"  Part="1" 
F 0 "UCC218" H 10875 11640 50  0000 C CNN
F 1 "NAND05" H 10875 11549 50  0000 C CNN
F 2 "" H 10850 10950 50  0001 C CNN
F 3 "" H 10850 10950 50  0001 C CNN
	1    10850 11250
	1    0    0    -1  
$EndComp
$Comp
L A5C:NAND05 UCO252
U 1 1 66413FFB
P 13750 2550
AR Path="/5F9CE801/66413FFB" Ref="UCO252"  Part="1" 
AR Path="/5FBF8EAD/5FBFA07D/66413FFB" Ref="UCO252"  Part="1" 
F 0 "UCO252" H 13775 2940 50  0000 C CNN
F 1 "NAND05" H 13775 2849 50  0000 C CNN
F 2 "" H 13750 2250 50  0001 C CNN
F 3 "" H 13750 2250 50  0001 C CNN
	1    13750 2550
	1    0    0    -1  
$EndComp
$Comp
L A5C:NAND05 UCL197
U 1 1 66412C74
P 13750 5450
AR Path="/5F9CE801/66412C74" Ref="UCL197"  Part="1" 
AR Path="/5FBF8EAD/5FBFA07D/66412C74" Ref="UCL197"  Part="1" 
F 0 "UCL197" H 13775 5840 50  0000 C CNN
F 1 "NAND05" H 13775 5749 50  0000 C CNN
F 2 "" H 13750 5150 50  0001 C CNN
F 3 "" H 13750 5150 50  0001 C CNN
	1    13750 5450
	1    0    0    -1  
$EndComp
$Comp
L A5C:NAND05 UCC194
U 1 1 65F3C865
P 13750 8350
AR Path="/5F9CE801/65F3C865" Ref="UCC194"  Part="1" 
AR Path="/5FBF8EAD/5FBFA07D/65F3C865" Ref="UCC194"  Part="1" 
F 0 "UCC194" H 13775 8740 50  0000 C CNN
F 1 "NAND05" H 13775 8649 50  0000 C CNN
F 2 "" H 13750 8050 50  0001 C CNN
F 3 "" H 13750 8050 50  0001 C CNN
	1    13750 8350
	1    0    0    -1  
$EndComp
$Comp
L A5C:NAND05 UCL224
U 1 1 664124BA
P 13750 11250
AR Path="/5F9CE801/664124BA" Ref="UCL224"  Part="1" 
AR Path="/5FBF8EAD/5FBFA07D/664124BA" Ref="UCL224"  Part="1" 
F 0 "UCL224" H 13775 11640 50  0000 C CNN
F 1 "NAND05" H 13775 11549 50  0000 C CNN
F 2 "" H 13750 10950 50  0001 C CNN
F 3 "" H 13750 10950 50  0001 C CNN
	1    13750 11250
	1    0    0    -1  
$EndComp
$Comp
L A5C:NAND05 UBZ272
U 1 1 675FC2FE
P 16750 2550
AR Path="/5F9CE801/675FC2FE" Ref="UBZ272"  Part="1" 
AR Path="/5FBF8EAD/5FBFA07D/675FC2FE" Ref="UBZ272"  Part="1" 
F 0 "UBZ272" H 16775 2940 50  0000 C CNN
F 1 "NAND05" H 16775 2849 50  0000 C CNN
F 2 "" H 16750 2250 50  0001 C CNN
F 3 "" H 16750 2250 50  0001 C CNN
	1    16750 2550
	1    0    0    -1  
$EndComp
$Comp
L A5C:NAND05 UCG191
U 1 1 662759E7
P 16750 5450
AR Path="/5F9CE801/662759E7" Ref="UCG191"  Part="1" 
AR Path="/5FBF8EAD/5FBFA07D/662759E7" Ref="UCG191"  Part="1" 
F 0 "UCG191" H 16775 5840 50  0000 C CNN
F 1 "NAND05" H 16775 5749 50  0000 C CNN
F 2 "" H 16750 5150 50  0001 C CNN
F 3 "" H 16750 5150 50  0001 C CNN
	1    16750 5450
	1    0    0    -1  
$EndComp
$Comp
L A5C:NAND05 UCO225
U 1 1 6641330A
P 16750 8350
AR Path="/5F9CE801/6641330A" Ref="UCO225"  Part="1" 
AR Path="/5FBF8EAD/5FBFA07D/6641330A" Ref="UCO225"  Part="1" 
F 0 "UCO225" H 16775 8740 50  0000 C CNN
F 1 "NAND05" H 16775 8649 50  0000 C CNN
F 2 "" H 16750 8050 50  0001 C CNN
F 3 "" H 16750 8050 50  0001 C CNN
	1    16750 8350
	1    0    0    -1  
$EndComp
$Comp
L A5C:NAND05 UCO240
U 1 1 6641390E
P 16750 11250
AR Path="/5F9CE801/6641390E" Ref="UCO240"  Part="1" 
AR Path="/5FBF8EAD/5FBFA07D/6641390E" Ref="UCO240"  Part="1" 
F 0 "UCO240" H 16775 11640 50  0000 C CNN
F 1 "NAND05" H 16775 11549 50  0000 C CNN
F 2 "" H 16750 10950 50  0001 C CNN
F 3 "" H 16750 10950 50  0001 C CNN
	1    16750 11250
	1    0    0    -1  
$EndComp
Wire Bus Line
	5650 750  5650 1300
Wire Bus Line
	8850 1600 8850 12650
Wire Bus Line
	11750 1600 11750 12650
Wire Bus Line
	14750 1550 14750 12650
Wire Bus Line
	5850 1600 5850 15600
$EndSCHEMATC
