EESchema Schematic File Version 4
EELAYER 30 0
EELAYER END
$Descr A4 11693 8268
encoding utf-8
Sheet 60 83
Title "CPS Reverse Engineering: DL-0311"
Date "2021-09-12"
Rev ""
Comp ""
Comment1 ""
Comment2 ""
Comment3 "Licence: CC-BY"
Comment4 "Author: Loïc *WydD* Petit"
$EndDescr
Connection ~ 3750 4750
Connection ~ 1500 4750
Wire Wire Line
	1400 4750 1500 4750
Wire Wire Line
	1500 2900 1600 2900
Wire Wire Line
	1500 3000 1600 3000
Wire Wire Line
	1500 4050 1600 4050
Wire Wire Line
	1500 4150 1600 4150
Wire Wire Line
	1500 4250 1600 4250
Wire Wire Line
	1500 4450 1500 4750
Wire Wire Line
	1600 4450 1500 4450
Wire Wire Line
	2950 4150 5300 4150
Wire Wire Line
	3750 3500 3850 3500
Wire Wire Line
	3750 4750 1500 4750
Wire Wire Line
	3750 4750 3750 3500
Wire Wire Line
	5200 3550 5200 4050
Wire Wire Line
	5200 4050 2950 4050
Wire Wire Line
	5300 3650 5300 4150
Wire Wire Line
	5300 3650 6150 3650
Wire Wire Line
	5400 3750 5400 4250
Wire Wire Line
	5400 4250 2950 4250
Wire Wire Line
	5550 3900 5550 4750
Wire Wire Line
	5550 3900 6150 3900
Wire Wire Line
	5550 4750 3750 4750
Wire Wire Line
	6050 4000 6150 4000
Wire Wire Line
	6050 4100 6150 4100
Wire Wire Line
	6050 4250 6150 4250
Wire Wire Line
	6050 4550 6150 4550
Wire Wire Line
	6050 4650 6150 4650
Wire Wire Line
	6150 3550 5200 3550
Wire Wire Line
	6150 3750 5400 3750
Wire Wire Line
	10250 3500 10350 3500
Wire Wire Line
	10250 3800 10350 3800
Wire Wire Line
	10350 3600 10250 3600
Wire Bus Line
	1500 2500 1600 2500
Wire Bus Line
	1500 2600 1600 2600
Wire Bus Line
	1500 2700 1600 2700
Wire Bus Line
	1500 3150 1600 3150
Wire Bus Line
	1500 3650 1600 3650
Wire Bus Line
	1500 3800 1600 3800
Wire Bus Line
	1600 3950 1500 3950
Wire Bus Line
	3150 2500 2950 2500
Wire Bus Line
	3150 3250 3150 2500
Wire Bus Line
	3150 3350 3150 3650
Wire Bus Line
	3150 3650 2950 3650
Wire Bus Line
	3850 3250 3150 3250
Wire Bus Line
	3850 3350 3150 3350
Wire Bus Line
	3850 3650 3650 3650
Wire Bus Line
	5050 3250 6150 3250
Wire Bus Line
	6050 3400 6150 3400
Wire Bus Line
	10350 3250 10250 3250
Wire Bus Line
	10350 3400 10250 3400
Wire Bus Line
	10350 3700 10250 3700
Text Notes 6900 2800 2    197  ~ 0
SRAM
Text HLabel 800  4750 0    50   Input ~ 0
CLK4M
Text HLabel 1500 2500 0    50   Input ~ 0
SCROLL1-X[0..5]
Text HLabel 1500 2600 0    50   Input ~ 0
SCROLL2-X[0..5]
Text HLabel 1500 2700 0    50   Input ~ 0
SCROLL3-X[0..3]
Text HLabel 1500 2900 0    50   Input ~ 0
~SCROLL1-T
Text HLabel 1500 3000 0    50   Input ~ 0
~SCROLL3-T
Text HLabel 1500 3150 0    50   Input ~ 0
Y-OUT[3..5]
Text HLabel 1500 3650 0    50   Input ~ 0
SCROLL-CNT[0..6]
Text HLabel 1500 3800 0    50   Input ~ 0
LINE[3..5]
Text HLabel 1500 3950 0    50   Input ~ 0
BUS-STATE[0..1]
Text HLabel 1500 4050 0    50   Input ~ 0
~BUS-SCROLL1
Text HLabel 1500 4150 0    50   Input ~ 0
~BUS-SCROLL2
Text HLabel 1500 4250 0    50   Input ~ 0
~BUS-SCROLL3
Text HLabel 3650 3650 0    50   Input ~ 0
CA[10..17]
Text HLabel 6050 3400 0    50   Input ~ 0
BUS-DATA[0..15]
Text HLabel 6050 4000 0    50   Input ~ 0
CLK4M
Text HLabel 6050 4100 0    50   Input ~ 0
CLK8M
Text HLabel 6050 4250 0    50   Input ~ 0
~DEBUG-WR
Text HLabel 6050 4550 0    50   Input ~ 0
FLIP
Text HLabel 6050 4650 0    50   Input ~ 0
~SCROLL3-T
Text HLabel 8200 3700 0    50   Input ~ 0
~SCROLL1-T
Text HLabel 8200 3800 0    50   Input ~ 0
~SCROLL2-T
Text HLabel 8200 3900 0    50   Input ~ 0
~SCROLL3-T
Text HLabel 10350 3250 2    50   3State ~ 0
GFX-ADDR[4..19]
Text HLabel 10350 3400 2    50   3State ~ 0
_CB[0..4]
Text HLabel 10350 3500 2    50   3State ~ 0
_XFLIP
Text HLabel 10350 3600 2    50   3State ~ 0
_YFLIP
Text HLabel 10350 3700 2    50   3State ~ 0
_CPC[0..1]
Text HLabel 10350 3800 2    50   3State ~ 0
_CDEN
$Comp
L A5C:AND03 UAD?
U 1 1 644FBFE1
P 8450 3800
AR Path="/611C5306/644FBFE1" Ref="UAD?"  Part="1" 
AR Path="/644FBFE1" Ref="UAD217"  Part="1" 
AR Path="/612E497E/644FBFE1" Ref="UAD217"  Part="1" 
F 0 "UAD217" H 8475 4092 50  0000 C CNN
F 1 "AND03" H 8475 4001 50  0000 C CNN
F 2 "" H 8450 3800 50  0001 C CNN
F 3 "" H 8450 3800 50  0001 C CNN
	1    8450 3800
	1    0    0    -1  
$EndComp
$Comp
L A5C:NBUF02 UAD255
U 1 1 61118D60
P 1100 4750
F 0 "UAD255" H 1100 5067 50  0000 C CNN
F 1 "NBUF02" H 1100 4976 50  0000 C CNN
F 2 "" H 1100 4550 50  0001 C CNN
F 3 "" H 1100 4550 50  0001 C CNN
	1    1100 4750
	1    0    0    -1  
$EndComp
$Sheet
S 8750 3100 1500 850 
U 612E4E14
F0 "scroll-roma" 50
F1 "scroll-roma.sch" 50
F2 "~RAM-TILE[0..15]" I L 8750 3250 50 
F3 "~RAM-ATTR[0..9]" I L 8750 3350 50 
F4 "_CB[0..4]" T R 10250 3400 50 
F5 "_XFLIP" T R 10250 3500 50 
F6 "_YFLIP" T R 10250 3600 50 
F7 "_CDEN" T R 10250 3800 50 
F8 "~SCROLL-T" I L 8750 3800 50 
F9 "GFX-ADDR[4..19]" T R 10250 3250 50 
F10 "_CPC[0..1]" T R 10250 3700 50 
$EndSheet
$Sheet
S 3850 3100 1200 800 
U 612E4DF0
F0 "sram-addr-mux" 50
F1 "sram-addr-mux.sch" 50
F2 "ADDR[0..7]" O R 5050 3250 50 
F3 "CA[10..17]" I L 3850 3650 50 
F4 "~W~R" I L 3850 3500 50 
F5 "RD-ADDR[0..7]" I L 3850 3250 50 
F6 "WR-ADDR[0..7]" I L 3850 3350 50 
F7 "~DEBUG3" I L 3850 3750 50 
$EndSheet
$Sheet
S 1600 2350 1350 950 
U 612E4DF5
F0 "sram-addr-read" 50
F1 "sram-addr-read.sch" 50
F2 "Y-OUT[3..5]" I L 1600 3150 50 
F3 "SCROLL1-X[0..5]" I L 1600 2500 50 
F4 "~SCROLL3-T" I L 1600 3000 50 
F5 "~SCROLL1-T" I L 1600 2900 50 
F6 "ADDR[0..7]" O R 2950 2500 50 
F7 "SCROLL2-X[0..5]" I L 1600 2600 50 
F8 "SCROLL3-X[0..3]" I L 1600 2700 50 
$EndSheet
$Sheet
S 1600 3500 1350 1100
U 612E4DCB
F0 "sram-addr-write" 50
F1 "sram-addr-write.sch" 50
F2 "SCROLL-CNT[0..6]" I L 1600 3650 50 
F3 "~BUS-SCROLL3" I L 1600 4250 50 
F4 "~BUS-SCROLL1" I L 1600 4050 50 
F5 "~CLK4M" I L 1600 4450 50 
F6 "LINE[3..5]" I L 1600 3800 50 
F7 "BUS-STATE[0..1]" I L 1600 3950 50 
F8 "ADDR[0..7]" O R 2950 3650 50 
F9 "~BUS-SCROLL2" I L 1600 4150 50 
F10 "WR-ATTR" O R 2950 4250 50 
F11 "WR-TILE" O R 2950 4150 50 
F12 "WR" O R 2950 4050 50 
$EndSheet
$Sheet
S 6150 3100 1500 1700
U 612E4DFA
F0 "sram1" 50
F1 "sram1.sch" 50
F2 "ADDR[0..7]" I L 6150 3250 50 
F3 "BUS-DATA[0..15]" I L 6150 3400 50 
F4 "CLK8M" I L 6150 4100 50 
F5 "~RAM-TILE[0..15]" O R 7650 3250 50 
F6 "~RAM-ATTR[0..9]" O R 7650 3350 50 
F7 "~CLK4M" I L 6150 3900 50 
F8 "CLK4M" I L 6150 4000 50 
F9 "~DEBUG3" I L 6150 4350 50 
F10 "~DEBUG-WR" I L 6150 4250 50 
F11 "FLIP" I L 6150 4550 50 
F12 "~SCROLL3-T" I L 6150 4650 50 
F13 "WR" I L 6150 3550 50 
F14 "WR-ATTR" I L 6150 3750 50 
F15 "WR-TILE" I L 6150 3650 50 
$EndSheet
Text HLabel 4500 4450 0    50   Input ~ 0
~DEBUG[3..3]
Wire Bus Line
	4500 4450 4600 4450
Entry Wire Line
	4600 4450 4700 4350
Wire Wire Line
	3650 4350 3650 3750
Wire Wire Line
	3650 3750 3850 3750
Text Label 4800 4350 0    50   ~ 0
~DEBUG3
Text HLabel 7950 3050 2    50   Output ~ 0
~RAM-TILE[0..15]
Text HLabel 7950 3150 2    50   Output ~ 0
~RAM-ATTR[0..15]
Wire Bus Line
	7950 3150 7850 3150
Wire Bus Line
	7850 3150 7850 3350
Wire Bus Line
	7950 3050 7750 3050
Wire Bus Line
	7750 3050 7750 3250
Connection ~ 7750 3250
Wire Bus Line
	7750 3250 8750 3250
Connection ~ 7850 3350
Wire Bus Line
	7850 3350 8750 3350
Wire Bus Line
	7650 3250 7750 3250
Wire Bus Line
	7650 3350 7850 3350
Wire Wire Line
	3650 4350 6150 4350
$EndSCHEMATC
