EESchema Schematic File Version 4
EELAYER 30 0
EELAYER END
$Descr A4 11693 8268
encoding utf-8
Sheet 52 83
Title "CPS Reverse Engineering: DL-0311"
Date "2021-09-12"
Rev ""
Comp ""
Comment1 ""
Comment2 ""
Comment3 "Licence: CC-BY"
Comment4 "Author: Loïc *WydD* Petit"
$EndDescr
Connection ~ 5050 6350
Connection ~ 5850 6400
Connection ~ 5950 5950
Connection ~ 7200 5400
Connection ~ 4450 3400
Connection ~ 4450 3600
Connection ~ 4700 3300
Connection ~ 2350 2850
Connection ~ 4550 3200
Connection ~ 4550 2800
Connection ~ 4100 1100
Connection ~ 2350 3650
Connection ~ 3100 4600
Connection ~ 2350 4450
Connection ~ 3100 5400
Connection ~ 4700 3900
Connection ~ 4250 5000
Connection ~ 4550 4500
Connection ~ 4250 4700
Connection ~ 4350 4000
Connection ~ 4350 4300
Connection ~ 4450 4400
Connection ~ 4700 4600
Connection ~ 5050 6000
Connection ~ 4550 3800
Connection ~ 4450 3700
Connection ~ 4350 4400
Connection ~ 3100 3800
Connection ~ 6850 900 
Connection ~ 6700 6400
Connection ~ 7100 5500
NoConn ~ 5550 5200
NoConn ~ 3700 5300
NoConn ~ 8300 6000
NoConn ~ 8300 6100
NoConn ~ 8300 5900
Entry Wire Line
	7850 4850 7950 4750
Entry Wire Line
	7850 4950 7950 4850
Wire Wire Line
	1300 1800 1300 2800
Wire Wire Line
	1900 1800 6700 1800
Wire Wire Line
	1950 2000 1950 5150
Wire Wire Line
	1950 2000 6500 2000
Wire Wire Line
	1950 5150 2450 5150
Wire Wire Line
	2050 2100 2050 4350
Wire Wire Line
	2050 2100 6400 2100
Wire Wire Line
	2050 4350 2450 4350
Wire Wire Line
	2150 2200 2150 3550
Wire Wire Line
	2150 2200 6300 2200
Wire Wire Line
	2150 3550 2450 3550
Wire Wire Line
	2250 2300 6200 2300
Wire Wire Line
	2250 2750 2250 2300
Wire Wire Line
	2250 2750 2450 2750
Wire Wire Line
	2350 2850 1850 2850
Wire Wire Line
	2350 2850 2350 3650
Wire Wire Line
	2350 3650 2350 4450
Wire Wire Line
	2350 4450 2350 5250
Wire Wire Line
	2350 5250 2450 5250
Wire Wire Line
	2450 2850 2350 2850
Wire Wire Line
	2450 3650 2350 3650
Wire Wire Line
	2450 4450 2350 4450
Wire Wire Line
	2900 900  6850 900 
Wire Wire Line
	2900 1100 4100 1100
Wire Wire Line
	3000 2800 3200 2800
Wire Wire Line
	3000 3600 3200 3600
Wire Wire Line
	3000 4400 3200 4400
Wire Wire Line
	3000 5200 3200 5200
Wire Wire Line
	3100 3800 3100 3000
Wire Wire Line
	3100 4600 3100 3800
Wire Wire Line
	3100 4600 3200 4600
Wire Wire Line
	3100 5400 3100 4600
Wire Wire Line
	3100 5400 3100 5500
Wire Wire Line
	3100 5500 2750 5500
Wire Wire Line
	3200 3000 3100 3000
Wire Wire Line
	3200 3800 3100 3800
Wire Wire Line
	3200 5400 3100 5400
Wire Wire Line
	3700 2800 4550 2800
Wire Wire Line
	3700 2900 4100 2900
Wire Wire Line
	3700 3600 4450 3600
Wire Wire Line
	3700 3700 4000 3700
Wire Wire Line
	3700 4400 4350 4400
Wire Wire Line
	3700 5200 4250 5200
Wire Wire Line
	3900 4500 3700 4500
Wire Wire Line
	3900 6000 3900 4500
Wire Wire Line
	3900 6000 5050 6000
Wire Wire Line
	4000 3700 4000 5900
Wire Wire Line
	4000 5900 5200 5900
Wire Wire Line
	4100 1100 4100 1500
Wire Wire Line
	4100 2900 4100 6450
Wire Wire Line
	4250 2550 4250 4700
Wire Wire Line
	4250 4700 4250 5000
Wire Wire Line
	4250 4700 5550 4700
Wire Wire Line
	4250 5000 4250 5200
Wire Wire Line
	4350 2550 4350 4000
Wire Wire Line
	4350 4000 4350 4300
Wire Wire Line
	4350 4000 5550 4000
Wire Wire Line
	4350 4300 4350 4400
Wire Wire Line
	4350 4400 4350 5100
Wire Wire Line
	4450 2550 4450 3400
Wire Wire Line
	4450 3400 4450 3600
Wire Wire Line
	4450 3400 5550 3400
Wire Wire Line
	4450 3600 4450 3700
Wire Wire Line
	4450 3700 4450 4400
Wire Wire Line
	4450 4400 4450 5200
Wire Wire Line
	4550 2550 4550 2800
Wire Wire Line
	4550 2800 4550 3200
Wire Wire Line
	4550 3200 4550 3800
Wire Wire Line
	4550 3800 4550 4500
Wire Wire Line
	4550 4500 4550 5300
Wire Wire Line
	4700 1500 4700 3300
Wire Wire Line
	4700 3300 4700 3900
Wire Wire Line
	4700 3300 4800 3300
Wire Wire Line
	4700 3900 4700 4600
Wire Wire Line
	4700 3900 4800 3900
Wire Wire Line
	4700 4600 4700 5400
Wire Wire Line
	4700 4600 4800 4600
Wire Wire Line
	4700 5400 4800 5400
Wire Wire Line
	4800 1100 4100 1100
Wire Wire Line
	4800 1100 4800 2700
Wire Wire Line
	4800 2700 5550 2700
Wire Wire Line
	4800 3200 4550 3200
Wire Wire Line
	4800 3700 4450 3700
Wire Wire Line
	4800 3800 4550 3800
Wire Wire Line
	4800 4300 4350 4300
Wire Wire Line
	4800 4400 4450 4400
Wire Wire Line
	4800 4500 4550 4500
Wire Wire Line
	4800 5000 4250 5000
Wire Wire Line
	4800 5100 4350 5100
Wire Wire Line
	4800 5200 4450 5200
Wire Wire Line
	4800 5300 4550 5300
Wire Wire Line
	5050 5600 7300 5600
Wire Wire Line
	5050 6000 5050 5600
Wire Wire Line
	5050 6000 5200 6000
Wire Wire Line
	5050 6350 5050 6000
Wire Wire Line
	5050 6350 5200 6350
Wire Wire Line
	5050 6950 5050 6350
Wire Wire Line
	5050 6950 5150 6950
Wire Wire Line
	5200 6450 4100 6450
Wire Wire Line
	5350 3250 5350 3300
Wire Wire Line
	5350 3300 5550 3300
Wire Wire Line
	5400 3900 5400 3800
Wire Wire Line
	5400 4600 5400 4450
Wire Wire Line
	5550 2800 4550 2800
Wire Wire Line
	5550 3900 5400 3900
Wire Wire Line
	5550 4600 5400 4600
Wire Wire Line
	5750 6400 5850 6400
Wire Wire Line
	5750 6950 5950 6950
Wire Wire Line
	5850 5400 5850 6400
Wire Wire Line
	5850 5400 7200 5400
Wire Wire Line
	5850 6400 6100 6400
Wire Wire Line
	5950 5500 5950 5950
Wire Wire Line
	5950 5500 7100 5500
Wire Wire Line
	5950 5950 5750 5950
Wire Wire Line
	5950 5950 5950 6300
Wire Wire Line
	5950 6500 5950 6950
Wire Wire Line
	5950 6500 6100 6500
Wire Wire Line
	6100 3350 6300 3350
Wire Wire Line
	6100 3950 6400 3950
Wire Wire Line
	6100 4650 6500 4650
Wire Wire Line
	6100 6300 5950 6300
Wire Wire Line
	6200 2300 6200 2750
Wire Wire Line
	6200 2750 6100 2750
Wire Wire Line
	6300 3350 6300 2200
Wire Wire Line
	6400 3950 6400 2100
Wire Wire Line
	6500 2000 6500 4650
Wire Wire Line
	6700 1800 6700 6400
Wire Wire Line
	6800 6400 6700 6400
Wire Wire Line
	6850 900  7000 900 
Wire Wire Line
	6850 6000 6850 900 
Wire Wire Line
	6850 6000 7300 6000
Wire Wire Line
	7100 4850 7850 4850
Wire Wire Line
	7100 5500 7100 4850
Wire Wire Line
	7100 5500 7300 5500
Wire Wire Line
	7200 5400 7200 4950
Wire Wire Line
	7200 5400 7300 5400
Wire Wire Line
	7850 4950 7200 4950
Wire Wire Line
	8300 5400 8850 5400
Wire Wire Line
	8300 5500 8850 5500
Wire Wire Line
	8300 5600 8850 5600
Wire Wire Line
	8300 5700 8850 5700
Wire Wire Line
	8300 5800 8450 5800
Wire Wire Line
	8450 5800 8450 6300
Wire Wire Line
	8450 6300 9650 6300
Wire Wire Line
	8700 6200 8850 6200
Wire Wire Line
	8850 6200 8850 6000
Wire Bus Line
	7950 4600 8050 4600
Text Notes 900  3450 0    50   ~ 0
RESET WHEN SCAN-243
Text Notes 4400 6100 0    50   ~ 0
x >= 4
Text Notes 6000 5800 0    50   ~ 0
x = ~2-6~
Text Notes 6300 6700 0    50   ~ 0
x = 4
Text Notes 7100 4450 0    50   ~ 0
Order of operations\n3 > 2 > 1 > 0 > 4
Text Label 7250 4850 0    50   ~ 0
STATE1
Text Label 7250 4950 0    50   ~ 0
STATE0
Text HLabel 1300 2900 0    50   Input ~ 0
~RESET
Text HLabel 2200 900  0    50   Input ~ 0
~BUS-WSTOBJ
Text HLabel 2750 5500 0    50   Input ~ 0
~CLK4M
Text HLabel 6800 6400 2    50   Output ~ 0
WSTOBJ-END
Text HLabel 7000 900  2    50   Output ~ 0
_~BUS-WSTOBJ
Text HLabel 8050 4600 2    50   Output ~ 0
STATE[0..1]
Text HLabel 8850 5900 0    50   Input ~ 0
~CLK4M
Text HLabel 9650 5400 2    50   Output ~ 0
~BUS-SPRITE-X
Text HLabel 9650 5500 2    50   Output ~ 0
~BUS-SPRITE-Y
Text HLabel 9650 5600 2    50   Output ~ 0
~BUS-SPRITE-TILE
Text HLabel 9650 5700 2    50   Output ~ 0
~BUS-SPRITE-ATTR
Text HLabel 9650 6300 2    50   Output ~ 0
~BUS-SPRITE-LOOKUP
$Comp
L power:VCC #PWR0103
U 1 1 66D0BB29
P 7300 5900
F 0 "#PWR0103" H 7300 5750 50  0001 C CNN
F 1 "VCC" H 7315 6073 50  0000 C CNN
F 2 "" H 7300 5900 50  0001 C CNN
F 3 "" H 7300 5900 50  0001 C CNN
	1    7300 5900
	1    0    0    -1  
$EndComp
$Comp
L power:VCC #PWR0104
U 1 1 73D4EDA1
P 8700 6200
F 0 "#PWR0104" H 8700 6050 50  0001 C CNN
F 1 "VCC" H 8715 6373 50  0000 C CNN
F 2 "" H 8700 6200 50  0001 C CNN
F 3 "" H 8700 6200 50  0001 C CNN
	1    8700 6200
	1    0    0    -1  
$EndComp
$Comp
L power:GND #PWR0143
U 1 1 6233B420
P 7300 6100
F 0 "#PWR0143" H 7300 5850 50  0001 C CNN
F 1 "GND" H 7305 5927 50  0001 C CNN
F 2 "" H 7300 6100 50  0001 C CNN
F 3 "" H 7300 6100 50  0001 C CNN
	1    7300 6100
	1    0    0    -1  
$EndComp
$Comp
L A5C:AND02 UAC?
U 1 1 6125BCA5
P 1550 2850
AR Path="/611F0159/6125BCA5" Ref="UAC?"  Part="1" 
AR Path="/6125BCA5" Ref="UBA29"  Part="1" 
AR Path="/611BD068/6125BCA5" Ref="UBA29"  Part="1" 
AR Path="/612CA5FA/612CADB2/6125BCA5" Ref="UBA29"  Part="1" 
F 0 "UBA29" H 1575 3117 50  0000 C CNN
F 1 "AND02" H 1575 3026 50  0000 C CNN
F 2 "" H 1550 2850 50  0001 C CNN
F 3 "" H 1550 2850 50  0001 C CNN
	1    1550 2850
	1    0    0    -1  
$EndComp
$Comp
L A5C:NAND02 UAD366
U 1 1 6B734401
P 2700 2800
F 0 "UAD366" H 2725 3067 50  0000 C CNN
F 1 "NAND02" H 2725 2976 50  0000 C CNN
F 2 "" H 2700 2800 50  0001 C CNN
F 3 "" H 2700 2800 50  0001 C CNN
	1    2700 2800
	1    0    0    -1  
$EndComp
$Comp
L A5C:NAND02 UAB?
U 1 1 6125BCB7
P 2700 3600
AR Path="/611F0159/6125BCB7" Ref="UAB?"  Part="1" 
AR Path="/6125BCB7" Ref="UBA14"  Part="1" 
AR Path="/611BD068/6125BCB7" Ref="UBA14"  Part="1" 
AR Path="/612CA5FA/612CADB2/6125BCB7" Ref="UBA14"  Part="1" 
F 0 "UBA14" H 2725 3867 50  0000 C CNN
F 1 "NAND02" H 2725 3776 50  0000 C CNN
F 2 "" H 2700 3600 50  0001 C CNN
F 3 "" H 2700 3600 50  0001 C CNN
	1    2700 3600
	1    0    0    -1  
$EndComp
$Comp
L A5C:NAND02 UAC?
U 1 1 6125BCBD
P 2700 4400
AR Path="/611F0159/6125BCBD" Ref="UAC?"  Part="1" 
AR Path="/6125BCBD" Ref="UBA35"  Part="1" 
AR Path="/611BD068/6125BCBD" Ref="UBA35"  Part="1" 
AR Path="/612CA5FA/612CADB2/6125BCBD" Ref="UBA35"  Part="1" 
F 0 "UBA35" H 2725 4667 50  0000 C CNN
F 1 "NAND02" H 2725 4576 50  0000 C CNN
F 2 "" H 2700 4400 50  0001 C CNN
F 3 "" H 2700 4400 50  0001 C CNN
	1    2700 4400
	1    0    0    -1  
$EndComp
$Comp
L A5C:NAND02 UAB?
U 1 1 6125BCC3
P 2700 5200
AR Path="/611F0159/6125BCC3" Ref="UAB?"  Part="1" 
AR Path="/6125BCC3" Ref="UBD44"  Part="1" 
AR Path="/611BD068/6125BCC3" Ref="UBD44"  Part="1" 
AR Path="/612CA5FA/612CADB2/6125BCC3" Ref="UBD44"  Part="1" 
F 0 "UBD44" H 2725 5467 50  0000 C CNN
F 1 "NAND02" H 2725 5376 50  0000 C CNN
F 2 "" H 2700 5200 50  0001 C CNN
F 3 "" H 2700 5200 50  0001 C CNN
	1    2700 5200
	1    0    0    -1  
$EndComp
$Comp
L A5C:NOR02 UAB?
U 1 1 6125BCC9
P 5050 3250
AR Path="/611F0159/6125BCC9" Ref="UAB?"  Part="1" 
AR Path="/6125BCC9" Ref="UBA8"  Part="1" 
AR Path="/611BD068/6125BCC9" Ref="UBA8"  Part="1" 
AR Path="/612CA5FA/612CADB2/6125BCC9" Ref="UBA8"  Part="1" 
F 0 "UBA8" H 5075 3517 50  0000 C CNN
F 1 "NOR02" H 5075 3426 50  0000 C CNN
F 2 "" H 5050 3250 50  0001 C CNN
F 3 "" H 5050 3250 50  0001 C CNN
	1    5050 3250
	1    0    0    -1  
$EndComp
$Comp
L A5C:XNOR02 UBE21
U 1 1 65AD31E9
P 5450 5950
F 0 "UBE21" H 5475 6217 50  0000 C CNN
F 1 "XNOR02" H 5475 6126 50  0000 C CNN
F 2 "" H 5475 5950 50  0001 C CNN
F 3 "" H 5475 5950 50  0001 C CNN
	1    5450 5950
	1    0    0    -1  
$EndComp
$Comp
L A5C:XNOR02 UAD332
U 1 1 69826D7C
P 5450 6400
F 0 "UAD332" H 5475 6667 50  0000 C CNN
F 1 "XNOR02" H 5475 6576 50  0000 C CNN
F 2 "" H 5475 6400 50  0001 C CNN
F 3 "" H 5475 6400 50  0001 C CNN
	1    5450 6400
	1    0    0    -1  
$EndComp
$Comp
L A5C:XNOR02 UAD362
U 1 1 6BD72053
P 5800 2750
F 0 "UAD362" H 5825 3017 50  0000 C CNN
F 1 "XNOR02" H 5825 2926 50  0000 C CNN
F 2 "" H 5825 2750 50  0001 C CNN
F 3 "" H 5825 2750 50  0001 C CNN
	1    5800 2750
	1    0    0    -1  
$EndComp
$Comp
L A5C:XNOR02 UAB?
U 1 1 6125BCD5
P 5800 3350
AR Path="/611F0159/6125BCD5" Ref="UAB?"  Part="1" 
AR Path="/6125BCD5" Ref="UBA11"  Part="1" 
AR Path="/611BD068/6125BCD5" Ref="UBA11"  Part="1" 
AR Path="/612CA5FA/612CADB2/6125BCD5" Ref="UBA11"  Part="1" 
F 0 "UBA11" H 5825 3617 50  0000 C CNN
F 1 "XNOR02" H 5825 3526 50  0000 C CNN
F 2 "" H 5825 3350 50  0001 C CNN
F 3 "" H 5825 3350 50  0001 C CNN
	1    5800 3350
	1    0    0    -1  
$EndComp
$Comp
L A5C:XNOR02 UAB?
U 1 1 6125BCDB
P 5800 3950
AR Path="/611F0159/6125BCDB" Ref="UAB?"  Part="1" 
AR Path="/6125BCDB" Ref="UBA40"  Part="1" 
AR Path="/611BD068/6125BCDB" Ref="UBA40"  Part="1" 
AR Path="/612CA5FA/612CADB2/6125BCDB" Ref="UBA40"  Part="1" 
F 0 "UBA40" H 5825 4217 50  0000 C CNN
F 1 "XNOR02" H 5825 4126 50  0000 C CNN
F 2 "" H 5825 3950 50  0001 C CNN
F 3 "" H 5825 3950 50  0001 C CNN
	1    5800 3950
	1    0    0    -1  
$EndComp
$Comp
L A5C:XNOR02 UAB?
U 1 1 6125BCE1
P 5800 4650
AR Path="/611F0159/6125BCE1" Ref="UAB?"  Part="1" 
AR Path="/6125BCE1" Ref="UBD49"  Part="1" 
AR Path="/611BD068/6125BCE1" Ref="UBD49"  Part="1" 
AR Path="/612CA5FA/612CADB2/6125BCE1" Ref="UBD49"  Part="1" 
F 0 "UBD49" H 5825 4917 50  0000 C CNN
F 1 "XNOR02" H 5825 4826 50  0000 C CNN
F 2 "" H 5825 4650 50  0001 C CNN
F 3 "" H 5825 4650 50  0001 C CNN
	1    5800 4650
	1    0    0    -1  
$EndComp
$Comp
L A5C:INV01 UBA18
U 1 1 616EA609
P 1600 1800
F 0 "UBA18" H 1600 2117 50  0000 C CNN
F 1 "INV01" H 1600 2026 50  0000 C CNN
F 2 "" H 1600 1600 50  0001 C CNN
F 3 "" H 1600 1600 50  0001 C CNN
	1    1600 1800
	-1   0    0    -1  
$EndComp
$Comp
L A5C:INV01 UAB?
U 1 1 6125BCE7
P 4400 1500
AR Path="/611F0159/6125BCE7" Ref="UAB?"  Part="1" 
AR Path="/6125BCE7" Ref="UAD351"  Part="1" 
AR Path="/611BD068/6125BCE7" Ref="UAD351"  Part="1" 
AR Path="/612CA5FA/612CADB2/6125BCE7" Ref="UAD351"  Part="1" 
F 0 "UAD351" H 4400 1817 50  0000 C CNN
F 1 "INV01" H 4400 1726 50  0000 C CNN
F 2 "" H 4400 1300 50  0001 C CNN
F 3 "" H 4400 1300 50  0001 C CNN
	1    4400 1500
	1    0    0    -1  
$EndComp
$Comp
L A5C:NOR03 UAB?
U 1 1 6125BCED
P 5100 3800
AR Path="/611F0159/6125BCED" Ref="UAB?"  Part="1" 
AR Path="/6125BCED" Ref="UBA37"  Part="1" 
AR Path="/611BD068/6125BCED" Ref="UBA37"  Part="1" 
AR Path="/612CA5FA/612CADB2/6125BCED" Ref="UBA37"  Part="1" 
F 0 "UBA37" H 5100 4117 50  0000 C CNN
F 1 "NOR03" H 5100 4026 50  0000 C CNN
F 2 "" H 5100 3800 50  0001 C CNN
F 3 "" H 5100 3800 50  0001 C CNN
	1    5100 3800
	1    0    0    -1  
$EndComp
$Comp
L A5C:INV01 UAD287
U 1 1 616F2048
P 5450 6950
F 0 "UAD287" H 5450 7267 50  0000 C CNN
F 1 "INV01" H 5450 7176 50  0000 C CNN
F 2 "" H 5450 6750 50  0001 C CNN
F 3 "" H 5450 6750 50  0001 C CNN
	1    5450 6950
	1    0    0    -1  
$EndComp
$Comp
L A5C:NOR03 UAD293
U 1 1 616EE5ED
P 6400 6400
F 0 "UAD293" H 6400 6717 50  0000 C CNN
F 1 "NOR03" H 6400 6626 50  0000 C CNN
F 2 "" H 6400 6400 50  0001 C CNN
F 3 "" H 6400 6400 50  0001 C CNN
	1    6400 6400
	1    0    0    -1  
$EndComp
$Comp
L A5C:DFFCOO UAD380
U 1 1 6B0F8EB8
P 3450 2900
F 0 "UAD380" H 3450 3265 50  0000 C CNN
F 1 "DFFCOO" H 3450 3174 50  0000 C CNN
F 2 "" H 3450 2900 50  0001 C CNN
F 3 "" H 3450 2900 50  0001 C CNN
	1    3450 2900
	1    0    0    -1  
$EndComp
$Comp
L A5C:DFFCOO UAB?
U 1 1 6125BCF9
P 3450 3700
AR Path="/611F0159/6125BCF9" Ref="UAB?"  Part="1" 
AR Path="/6125BCF9" Ref="UBE16"  Part="1" 
AR Path="/611BD068/6125BCF9" Ref="UBE16"  Part="1" 
AR Path="/612CA5FA/612CADB2/6125BCF9" Ref="UBE16"  Part="1" 
F 0 "UBE16" H 3450 4065 50  0000 C CNN
F 1 "DFFCOO" H 3450 3974 50  0000 C CNN
F 2 "" H 3450 3700 50  0001 C CNN
F 3 "" H 3450 3700 50  0001 C CNN
	1    3450 3700
	1    0    0    -1  
$EndComp
$Comp
L A5C:DFFCOO UBC164
U 1 1 66D13C57
P 3450 4500
F 0 "UBC164" H 3450 4865 50  0000 C CNN
F 1 "DFFCOO" H 3450 4774 50  0000 C CNN
F 2 "" H 3450 4500 50  0001 C CNN
F 3 "" H 3450 4500 50  0001 C CNN
	1    3450 4500
	1    0    0    -1  
$EndComp
$Comp
L A5C:DFFCOO UAB?
U 1 1 6125BD05
P 3450 5300
AR Path="/611F0159/6125BD05" Ref="UAB?"  Part="1" 
AR Path="/6125BD05" Ref="UBF45"  Part="1" 
AR Path="/611BD068/6125BD05" Ref="UBF45"  Part="1" 
AR Path="/612CA5FA/612CADB2/6125BD05" Ref="UBF45"  Part="1" 
F 0 "UBF45" H 3450 5665 50  0000 C CNN
F 1 "DFFCOO" H 3450 5574 50  0000 C CNN
F 2 "" H 3450 5300 50  0001 C CNN
F 3 "" H 3450 5300 50  0001 C CNN
	1    3450 5300
	1    0    0    -1  
$EndComp
$Comp
L A5C:NOR04 UAB?
U 1 1 6125BD0B
P 5100 4450
AR Path="/611F0159/6125BD0B" Ref="UAB?"  Part="1" 
AR Path="/6125BD0B" Ref="UBD46"  Part="1" 
AR Path="/611BD068/6125BD0B" Ref="UBD46"  Part="1" 
AR Path="/612CA5FA/612CADB2/6125BD0B" Ref="UBD46"  Part="1" 
F 0 "UBD46" H 5100 4792 50  0000 C CNN
F 1 "NOR04" H 5100 4701 50  0000 C CNN
F 2 "" H 5100 4450 50  0001 C CNN
F 3 "" H 5100 4450 50  0001 C CNN
	1    5100 4450
	1    0    0    -1  
$EndComp
$Comp
L A5C:DBUF UAC364
U 1 1 61F79F84
P 2550 900
F 0 "UAC364" H 2550 635 50  0000 C CNN
F 1 "DBUF" H 2550 726 50  0000 C CNN
F 2 "" H 2275 975 50  0001 C CNN
F 3 "" H 2275 975 50  0001 C CNN
	1    2550 900 
	1    0    0    1   
$EndComp
$Comp
L A5C:NOR05 UAB?
U 1 1 6125BD11
P 5100 5200
AR Path="/611F0159/6125BD11" Ref="UAB?"  Part="1" 
AR Path="/6125BD11" Ref="UBD41"  Part="1" 
AR Path="/611BD068/6125BD11" Ref="UBD41"  Part="1" 
AR Path="/612CA5FA/612CADB2/6125BD11" Ref="UBD41"  Part="1" 
F 0 "UBD41" H 5175 5615 50  0000 C CNN
F 1 "NOR05" H 5175 5524 50  0000 C CNN
F 2 "" H 5100 5250 50  0001 C CNN
F 3 "" H 5100 5250 50  0001 C CNN
	1    5100 5200
	1    0    0    -1  
$EndComp
$Comp
L A5C:M175C UCC0
U 1 1 73D4A14E
P 9250 5700
F 0 "UCC0" H 9250 6265 50  0000 C CNN
F 1 "M175C" H 9250 6174 50  0000 C CNN
F 2 "" H 9250 5500 50  0001 C CNN
F 3 "" H 9250 5500 50  0001 C CNN
	1    9250 5700
	1    0    0    -1  
$EndComp
$Comp
L A5C:D38GL UCB0
U 1 1 6233B426
P 7800 5750
F 0 "UCB0" H 7800 6367 50  0000 C CNN
F 1 "D38GL" H 7800 6276 50  0000 C CNN
F 2 "" H 7800 6275 50  0001 C CNN
F 3 "" H 7800 6275 50  0001 C CNN
	1    7800 5750
	1    0    0    -1  
$EndComp
Wire Bus Line
	7950 4600 7950 4850
$EndSCHEMATC
