EESchema Schematic File Version 4
EELAYER 30 0
EELAYER END
$Descr A4 11693 8268
encoding utf-8
Sheet 62 69
Title ""
Date "2020-11-26"
Rev ""
Comp ""
Comment1 "Licence: CC-BY"
Comment2 "Author: Loïc *WydD* Petit"
Comment3 ""
Comment4 ""
$EndDescr
Connection ~ 3000 6050
Connection ~ 3000 5300
Connection ~ 3000 4550
Connection ~ 3000 3800
Connection ~ 2900 4000
Connection ~ 2900 4750
Connection ~ 2900 5500
Connection ~ 2900 6250
Connection ~ 2900 7000
Connection ~ 3850 2950
Connection ~ 3950 3700
Connection ~ 4050 4450
Connection ~ 4150 5200
Connection ~ 4250 5950
Connection ~ 4350 6700
Connection ~ 7350 3350
Connection ~ 6000 6700
Connection ~ 5900 5950
Connection ~ 5800 5200
Connection ~ 5700 4450
Connection ~ 7000 4450
Connection ~ 7100 4550
Connection ~ 6600 4450
Connection ~ 6700 4550
Connection ~ 7350 3450
Connection ~ 5600 2650
Connection ~ 6600 2750
Connection ~ 7350 2850
Connection ~ 6800 2850
Connection ~ 3850 1600
Connection ~ 3000 6800
Connection ~ 2400 4700
Connection ~ 1400 6900
Connection ~ 1400 2750
Connection ~ 1500 2150
Connection ~ 1400 2250
Connection ~ 5500 2950
Connection ~ 5500 4350
Connection ~ 5600 3700
Connection ~ 5600 5100
Connection ~ 5700 4000
Connection ~ 5800 2950
Connection ~ 5800 4100
Connection ~ 6000 3250
Connection ~ 8250 5300
Connection ~ 5900 5400
Connection ~ 8350 5400
Connection ~ 6000 5500
Connection ~ 1500 2950
Connection ~ 6400 2250
Connection ~ 6500 2050
Connection ~ 6600 1850
Connection ~ 6700 1400
Connection ~ 6800 1200
Connection ~ 6900 1000
NoConn ~ 5000 1500
NoConn ~ 5000 1600
NoConn ~ 1400 1850
NoConn ~ 2100 1850
NoConn ~ 2100 2650
Entry Wire Line
	2400 2950 2500 2850
Entry Wire Line
	2400 3700 2500 3600
Entry Wire Line
	2400 4450 2500 4350
Entry Wire Line
	2400 5000 2500 5100
Entry Wire Line
	2400 5750 2500 5850
Entry Wire Line
	2400 6500 2500 6600
Entry Wire Line
	3450 800  3550 900 
Entry Wire Line
	3450 900  3550 1000
Entry Wire Line
	3450 1000 3550 1100
Entry Wire Line
	10150 4500 10250 4600
Entry Wire Line
	10150 4600 10250 4700
Entry Wire Line
	10150 4700 10250 4800
Wire Wire Line
	900  1950 900  2250
Wire Wire Line
	900  2550 1600 2550
Wire Wire Line
	1300 2950 1500 2950
Wire Wire Line
	1400 1750 1600 1750
Wire Wire Line
	1400 1950 1600 1950
Wire Wire Line
	1400 2250 900  2250
Wire Wire Line
	1400 2250 1400 1950
Wire Wire Line
	1400 2750 1400 2250
Wire Wire Line
	1400 2750 1600 2750
Wire Wire Line
	1400 6900 1400 2750
Wire Wire Line
	1400 6900 1850 6900
Wire Wire Line
	1400 7000 1400 6900
Wire Wire Line
	1500 2150 1150 2150
Wire Wire Line
	1500 2150 1500 2950
Wire Wire Line
	1550 7000 1400 7000
Wire Wire Line
	1850 2150 1500 2150
Wire Wire Line
	1850 2950 1500 2950
Wire Wire Line
	2400 2550 2100 2550
Wire Wire Line
	2450 6800 3000 6800
Wire Wire Line
	2500 2850 3100 2850
Wire Wire Line
	2500 3600 3100 3600
Wire Wire Line
	2500 4350 3100 4350
Wire Wire Line
	2500 5100 3100 5100
Wire Wire Line
	2500 5850 3100 5850
Wire Wire Line
	2500 6600 3100 6600
Wire Wire Line
	2750 7000 2900 7000
Wire Wire Line
	2900 3250 3350 3250
Wire Wire Line
	2900 4000 2900 3250
Wire Wire Line
	2900 4000 3350 4000
Wire Wire Line
	2900 4750 2900 4000
Wire Wire Line
	2900 4750 2900 5500
Wire Wire Line
	2900 4750 3350 4750
Wire Wire Line
	2900 5500 2900 6250
Wire Wire Line
	2900 6250 2900 7000
Wire Wire Line
	2900 6250 3350 6250
Wire Wire Line
	2900 7000 3350 7000
Wire Wire Line
	3000 3050 3000 3800
Wire Wire Line
	3000 3800 3000 4550
Wire Wire Line
	3000 3800 3100 3800
Wire Wire Line
	3000 4550 3000 5300
Wire Wire Line
	3000 4550 3100 4550
Wire Wire Line
	3000 5300 3000 6050
Wire Wire Line
	3000 5300 3100 5300
Wire Wire Line
	3000 6050 3000 6800
Wire Wire Line
	3000 6050 3100 6050
Wire Wire Line
	3000 6800 3100 6800
Wire Wire Line
	3100 3050 3000 3050
Wire Wire Line
	3350 5500 2900 5500
Wire Wire Line
	3550 900  4000 900 
Wire Wire Line
	3550 1000 4000 1000
Wire Wire Line
	3550 1100 4000 1100
Wire Wire Line
	3600 3700 3950 3700
Wire Wire Line
	3600 4450 4050 4450
Wire Wire Line
	3600 5200 4150 5200
Wire Wire Line
	3600 5950 4250 5950
Wire Wire Line
	3600 6700 4350 6700
Wire Wire Line
	3850 1400 4000 1400
Wire Wire Line
	3850 1500 3850 1600
Wire Wire Line
	3850 2950 3600 2950
Wire Wire Line
	3850 2950 3850 7150
Wire Wire Line
	3950 3700 3950 7250
Wire Wire Line
	3950 3700 4450 3700
Wire Wire Line
	3950 7250 6500 7250
Wire Wire Line
	4000 1500 3850 1500
Wire Wire Line
	4000 1600 3850 1600
Wire Wire Line
	4050 4450 4050 7350
Wire Wire Line
	4050 4450 4450 4450
Wire Wire Line
	4150 5200 4150 7450
Wire Wire Line
	4150 5200 4450 5200
Wire Wire Line
	4150 7450 6700 7450
Wire Wire Line
	4250 5950 4250 7550
Wire Wire Line
	4250 5950 4450 5950
Wire Wire Line
	4350 6700 4350 7650
Wire Wire Line
	4350 6700 4450 6700
Wire Wire Line
	4350 7650 6900 7650
Wire Wire Line
	4450 2950 3850 2950
Wire Wire Line
	5000 1000 6200 1000
Wire Wire Line
	5000 1200 6000 1200
Wire Wire Line
	5000 1400 5800 1400
Wire Wire Line
	5050 2950 5500 2950
Wire Wire Line
	5050 3700 5600 3700
Wire Wire Line
	5050 4450 5700 4450
Wire Wire Line
	5050 5200 5800 5200
Wire Wire Line
	5050 5950 5900 5950
Wire Wire Line
	5050 6700 6000 6700
Wire Wire Line
	5500 2950 5500 2300
Wire Wire Line
	5500 2950 5500 4350
Wire Wire Line
	5500 4350 5500 7100
Wire Wire Line
	5600 2300 5600 2650
Wire Wire Line
	5600 2650 5600 3700
Wire Wire Line
	5600 3700 5600 5100
Wire Wire Line
	5600 5100 5600 7100
Wire Wire Line
	5700 2300 5700 4000
Wire Wire Line
	5700 4000 5700 4450
Wire Wire Line
	5700 7100 5700 4450
Wire Wire Line
	5800 1400 5800 2150
Wire Wire Line
	5800 2150 7500 2150
Wire Wire Line
	5800 2300 5800 2950
Wire Wire Line
	5800 2950 5800 4100
Wire Wire Line
	5800 4100 5800 5200
Wire Wire Line
	5800 5200 5800 7100
Wire Wire Line
	5900 1300 5000 1300
Wire Wire Line
	5900 1950 5900 1300
Wire Wire Line
	5900 1950 7500 1950
Wire Wire Line
	5900 2300 5900 5400
Wire Wire Line
	5900 5400 5900 5950
Wire Wire Line
	5900 7100 5900 5950
Wire Wire Line
	6000 1200 6000 1750
Wire Wire Line
	6000 1750 7500 1750
Wire Wire Line
	6000 2300 6000 3250
Wire Wire Line
	6000 3250 6000 5500
Wire Wire Line
	6000 5500 6000 6700
Wire Wire Line
	6000 6700 6000 7100
Wire Wire Line
	6100 1100 5000 1100
Wire Wire Line
	6100 1300 6100 1100
Wire Wire Line
	6200 1000 6200 1100
Wire Wire Line
	6200 1100 7500 1100
Wire Wire Line
	6400 650  6400 2250
Wire Wire Line
	6400 2250 6400 7150
Wire Wire Line
	6400 2250 7500 2250
Wire Wire Line
	6400 7150 3850 7150
Wire Wire Line
	6500 650  6500 2050
Wire Wire Line
	6500 2050 6500 7250
Wire Wire Line
	6600 650  6600 1850
Wire Wire Line
	6600 1850 6600 2750
Wire Wire Line
	6600 2750 6600 4450
Wire Wire Line
	6600 4450 6600 7350
Wire Wire Line
	6600 7350 4050 7350
Wire Wire Line
	6700 650  6700 1400
Wire Wire Line
	6700 1400 6700 4550
Wire Wire Line
	6700 4550 6700 7450
Wire Wire Line
	6800 650  6800 1200
Wire Wire Line
	6800 1200 6800 2850
Wire Wire Line
	6800 2850 6800 7550
Wire Wire Line
	6800 7550 4250 7550
Wire Wire Line
	6900 650  6900 1000
Wire Wire Line
	6900 1000 6900 7650
Wire Wire Line
	7000 4450 6600 4450
Wire Wire Line
	7000 4450 7000 5200
Wire Wire Line
	7100 4550 6700 4550
Wire Wire Line
	7100 4550 7100 5300
Wire Wire Line
	7100 5300 7200 5300
Wire Wire Line
	7200 3600 7350 3600
Wire Wire Line
	7200 4350 5500 4350
Wire Wire Line
	7200 4450 7000 4450
Wire Wire Line
	7200 4550 7100 4550
Wire Wire Line
	7200 5100 5600 5100
Wire Wire Line
	7200 5200 7000 5200
Wire Wire Line
	7350 2850 6800 2850
Wire Wire Line
	7350 2850 7450 2850
Wire Wire Line
	7350 3050 7350 2850
Wire Wire Line
	7350 3150 7450 3150
Wire Wire Line
	7350 3350 7350 3150
Wire Wire Line
	7350 3350 7450 3350
Wire Wire Line
	7350 3450 7350 3350
Wire Wire Line
	7350 3600 7350 3450
Wire Wire Line
	7450 2650 5600 2650
Wire Wire Line
	7450 2750 6600 2750
Wire Wire Line
	7450 2950 5800 2950
Wire Wire Line
	7450 3050 7350 3050
Wire Wire Line
	7450 3250 6000 3250
Wire Wire Line
	7450 3450 7350 3450
Wire Wire Line
	7500 900  5000 900 
Wire Wire Line
	7500 1000 6900 1000
Wire Wire Line
	7500 1200 6800 1200
Wire Wire Line
	7500 1300 6100 1300
Wire Wire Line
	7500 1400 6700 1400
Wire Wire Line
	7500 1850 6600 1850
Wire Wire Line
	7500 2050 6500 2050
Wire Wire Line
	7750 4450 7850 4450
Wire Wire Line
	7750 5200 8450 5200
Wire Wire Line
	7850 4450 7850 5100
Wire Wire Line
	7850 5100 8450 5100
Wire Wire Line
	8250 4100 5800 4100
Wire Wire Line
	8250 4550 8250 4100
Wire Wire Line
	8250 4650 8450 4650
Wire Wire Line
	8250 5300 8250 4650
Wire Wire Line
	8250 5300 8250 5400
Wire Wire Line
	8250 5400 5900 5400
Wire Wire Line
	8350 2000 8450 2000
Wire Wire Line
	8350 4000 5700 4000
Wire Wire Line
	8350 4450 8350 4000
Wire Wire Line
	8350 4750 8450 4750
Wire Wire Line
	8350 5400 8350 4750
Wire Wire Line
	8350 5400 8350 5500
Wire Wire Line
	8350 5500 6000 5500
Wire Wire Line
	8450 1150 8350 1150
Wire Wire Line
	8450 1550 8450 1150
Wire Wire Line
	8450 1650 9150 1650
Wire Wire Line
	8450 2000 8450 1650
Wire Wire Line
	8450 4450 8350 4450
Wire Wire Line
	8450 4550 8250 4550
Wire Wire Line
	8450 5300 8250 5300
Wire Wire Line
	8450 5400 8350 5400
Wire Wire Line
	9050 4600 10150 4600
Wire Wire Line
	9150 1550 8450 1550
Wire Wire Line
	9500 3050 8350 3050
Wire Wire Line
	9500 4500 9500 3050
Wire Wire Line
	9500 4700 9500 5250
Wire Wire Line
	9500 5250 9050 5250
Wire Wire Line
	10150 4500 9500 4500
Wire Wire Line
	10150 4700 9500 4700
Wire Bus Line
	2400 4700 2200 4700
Wire Bus Line
	3450 650  3300 650 
Wire Bus Line
	10250 4950 10400 4950
Text Notes 950  7400 0    50   ~ 0
This register contains bits about the COPY phase\nEach bit is a page of memory 1 = copy this page
Text Notes 5450 3800 0    50   ~ 0
5
Text Notes 5550 3800 0    50   ~ 0
4
Text Notes 5650 3800 0    50   ~ 0
3
Text Notes 5750 3800 0    50   ~ 0
2
Text Notes 5850 3800 0    50   ~ 0
1
Text Notes 5950 3800 0    50   ~ 0
0
Text Notes 6400 3800 2    50   ~ 0
~5
Text Notes 6500 3800 2    50   ~ 0
~4
Text Notes 6600 3800 2    50   ~ 0
~3
Text Notes 6700 3800 2    50   ~ 0
~2
Text Notes 6800 3800 2    50   ~ 0
~1
Text Notes 6900 3800 2    50   ~ 0
~0
Text Notes 7750 4400 0    50   ~ 0
5 & ~3~ & ~2~
Text Notes 7750 5300 0    50   ~ 0
4 & ~3~ & ~2~
Text Notes 8500 3000 0    50   ~ 0
/(4 & ~3~ & ~1~ + 2 & ~1~ & 0 + 0)
Text Notes 8600 4150 0    50   ~ 0
/(3 + 2 + 1 + 0)
Text Notes 8700 6050 0    50   ~ 0
BASE is the base address for the copy cycle\nExample:\n- If only 1 must be copied BASE[9..11] is 0b001\n- If 3, 4 and 5 must be copied BASE[9..11] is 0b011\n- If 4 and 5 must be copied BASE[9..11] is 0b100
Text Notes 9100 5400 0    50   ~ 0
/((4+5) & ~3~ & ~2~ + 1 + 0)
Text Notes 9500 1150 0    50   ~ 0
WR = (LUT page is currently active) &\n          WSTLUT &\n          ~CLM4M~
Text Label 2100 2550 0    50   ~ 0
WSTLUT
Text Label 2600 2850 0    50   ~ 0
BUS5
Text Label 2600 3600 0    50   ~ 0
BUS4
Text Label 2600 4350 0    50   ~ 0
BUS3
Text Label 2600 5100 0    50   ~ 0
BUS2
Text Label 2600 5850 0    50   ~ 0
BUS1
Text Label 2600 6600 0    50   ~ 0
BUS0
Text Label 3650 900  0    50   ~ 0
LUT9
Text Label 3650 1000 0    50   ~ 0
LUT10
Text Label 3650 1100 0    50   ~ 0
LUT11
Text Label 9150 1750 2    50   ~ 0
WSTLUT
Text Label 9600 4500 0    50   ~ 0
BASE9
Text Label 9600 4600 0    50   ~ 0
BASE11
Text Label 9600 4700 0    50   ~ 0
BASE10
Text HLabel 800  6900 0    50   Input ~ 0
~CLK4M
Text HLabel 900  1750 0    50   Input ~ 0
LUTPRO
Text HLabel 900  2550 0    50   Input ~ 0
WSTLUT
Text HLabel 1300 2950 0    50   Input ~ 0
~RESET
Text HLabel 1550 7000 2    50   Output ~ 0
CLK4M
Text HLabel 1850 6700 0    50   Input ~ 0
WR
Text HLabel 1850 6800 0    50   Input ~ 0
~E
Text HLabel 2200 4700 0    50   Input ~ 0
BUS[0..5]
Text HLabel 2400 2550 2    50   Output ~ 0
CPY-LUT
Text HLabel 2700 1750 2    50   Output ~ 0
~LUT-OE
Text HLabel 2750 7000 0    50   Input ~ 0
~LUT-RESET
Text HLabel 3300 650  0    50   Input ~ 0
LUT[9..11]
Text HLabel 9150 1850 0    50   Input ~ 0
~CLK4M
Text HLabel 10400 4950 2    50   Output ~ 0
BASE[9..11]
Text HLabel 10600 1700 2    50   Output ~ 0
~LUT-WR
$Comp
L power:VCC #PWR?
U 1 1 5FF5CF37
P 3850 1400
AR Path="/5F7A979F/5FF5CF37" Ref="#PWR?"  Part="1" 
AR Path="/5FBBEA1C/5FF5CF37" Ref="#PWR0215"  Part="1" 
F 0 "#PWR0215" H 3850 1250 50  0001 C CNN
F 1 "VCC" H 3865 1573 50  0000 C CNN
F 2 "" H 3850 1400 50  0001 C CNN
F 3 "" H 3850 1400 50  0001 C CNN
	1    3850 1400
	1    0    0    -1  
$EndComp
$Comp
L power:VCC #PWR?
U 1 1 5FEC2C1D
P 7200 3600
AR Path="/5F7A979F/5FEC2C1D" Ref="#PWR?"  Part="1" 
AR Path="/5FBBEA1C/5FEC2C1D" Ref="#PWR0216"  Part="1" 
F 0 "#PWR0216" H 7200 3450 50  0001 C CNN
F 1 "VCC" H 7215 3773 50  0000 C CNN
F 2 "" H 7200 3600 50  0001 C CNN
F 3 "" H 7200 3600 50  0001 C CNN
	1    7200 3600
	1    0    0    -1  
$EndComp
$Comp
L power:GND #PWR?
U 1 1 5FFF65AE
P 3850 1600
AR Path="/5FFF65AE" Ref="#PWR?"  Part="1" 
AR Path="/5FBBEA1C/5FFF65AE" Ref="#PWR0217"  Part="1" 
F 0 "#PWR0217" H 3850 1350 50  0001 C CNN
F 1 "GND" H 3855 1430 50  0000 C CNN
F 2 "" H 3850 1600 50  0001 C CNN
F 3 "" H 3850 1600 50  0001 C CNN
	1    3850 1600
	1    0    0    -1  
$EndComp
$Comp
L A5C:AND03 UCG454
U 1 1 5FE534DF
P 7450 4450
F 0 "UCG454" H 7475 4742 50  0000 C CNN
F 1 "AND03" H 7475 4651 50  0000 C CNN
F 2 "" H 7450 4450 50  0001 C CNN
F 3 "" H 7450 4450 50  0001 C CNN
	1    7450 4450
	1    0    0    -1  
$EndComp
$Comp
L A5C:AND03 UCG447
U 1 1 5FE537AC
P 7450 5200
F 0 "UCG447" H 7475 5492 50  0000 C CNN
F 1 "AND03" H 7475 5401 50  0000 C CNN
F 2 "" H 7450 5200 50  0001 C CNN
F 3 "" H 7450 5200 50  0001 C CNN
	1    7450 5200
	1    0    0    -1  
$EndComp
$Comp
L A5C:NBUF02 UBW?
U 1 1 619F4BCC
P 1100 6900
AR Path="/619F4BCC" Ref="UBW?"  Part="1" 
AR Path="/5FBBEA1C/619F4BCC" Ref="UBW436"  Part="1" 
F 0 "UBW436" H 1100 7217 50  0000 C CNN
F 1 "NBUF02" H 1100 7126 50  0000 C CNN
F 2 "" H 1100 6700 50  0001 C CNN
F 3 "" H 1100 6700 50  0001 C CNN
	1    1100 6900
	1    0    0    -1  
$EndComp
$Comp
L A5C:OR03 UBZ465
U 1 1 60236FD3
P 2150 6800
F 0 "UBZ465" H 2150 7117 50  0000 C CNN
F 1 "OR03" H 2150 7026 50  0000 C CNN
F 2 "" H 2150 6800 50  0001 C CNN
F 3 "" H 2150 6800 50  0001 C CNN
	1    2150 6800
	1    0    0    -1  
$EndComp
$Comp
L A5C:BUF12 UCG?
U 1 1 619F4BD2
P 2400 1750
AR Path="/619F4BD2" Ref="UCG?"  Part="1" 
AR Path="/5FBBEA1C/619F4BD2" Ref="UCG452"  Part="1" 
F 0 "UCG452" H 2400 2067 50  0000 C CNN
F 1 "BUF12" H 2400 1976 50  0000 C CNN
F 2 "" H 2400 1750 50  0001 C CNN
F 3 "" H 2400 1750 50  0001 C CNN
	1    2400 1750
	1    0    0    -1  
$EndComp
$Comp
L A5C:INV01 UCG451
U 1 1 5FCE0C1F
P 4750 2950
F 0 "UCG451" H 4750 3267 50  0000 C CNN
F 1 "INV01" H 4750 3176 50  0000 C CNN
F 2 "" H 4750 2750 50  0001 C CNN
F 3 "" H 4750 2750 50  0001 C CNN
	1    4750 2950
	1    0    0    -1  
$EndComp
$Comp
L A5C:INV01 UCG459
U 1 1 5FDF952A
P 4750 3700
F 0 "UCG459" H 4750 4017 50  0000 C CNN
F 1 "INV01" H 4750 3926 50  0000 C CNN
F 2 "" H 4750 3500 50  0001 C CNN
F 3 "" H 4750 3500 50  0001 C CNN
	1    4750 3700
	1    0    0    -1  
$EndComp
$Comp
L A5C:INV01 UCG430
U 1 1 5FDFD9ED
P 4750 4450
F 0 "UCG430" H 4750 4133 50  0000 C CNN
F 1 "INV01" H 4750 4224 50  0000 C CNN
F 2 "" H 4750 4250 50  0001 C CNN
F 3 "" H 4750 4250 50  0001 C CNN
	1    4750 4450
	1    0    0    1   
$EndComp
$Comp
L A5C:INV01 UCG446
U 1 1 5FE031CD
P 4750 5200
F 0 "UCG446" H 4750 5517 50  0000 C CNN
F 1 "INV01" H 4750 5426 50  0000 C CNN
F 2 "" H 4750 5000 50  0001 C CNN
F 3 "" H 4750 5000 50  0001 C CNN
	1    4750 5200
	1    0    0    -1  
$EndComp
$Comp
L A5C:INV01 UCG441
U 1 1 5FE07DC1
P 4750 5950
F 0 "UCG441" H 4750 6267 50  0000 C CNN
F 1 "INV01" H 4750 6176 50  0000 C CNN
F 2 "" H 4750 5750 50  0001 C CNN
F 3 "" H 4750 5750 50  0001 C CNN
	1    4750 5950
	1    0    0    -1  
$EndComp
$Comp
L A5C:INV01 UCG445
U 1 1 5FE08643
P 4750 6700
F 0 "UCG445" H 4750 7017 50  0000 C CNN
F 1 "INV01" H 4750 6926 50  0000 C CNN
F 2 "" H 4750 6500 50  0001 C CNN
F 3 "" H 4750 6500 50  0001 C CNN
	1    4750 6700
	1    0    0    -1  
$EndComp
$Comp
L A5C:BUF12 UBR491
U 1 1 6021D851
P 10300 1700
F 0 "UBR491" H 10300 2017 50  0000 C CNN
F 1 "BUF12" H 10300 1926 50  0000 C CNN
F 2 "" H 10300 1700 50  0001 C CNN
F 3 "" H 10300 1700 50  0001 C CNN
	1    10300 1700
	1    0    0    -1  
$EndComp
$Comp
L A5C:NOR04 UCG437
U 1 1 5FE32D5F
P 8750 4600
F 0 "UCG437" H 8750 4942 50  0000 C CNN
F 1 "NOR04" H 8750 4851 50  0000 C CNN
F 2 "" H 8750 4600 50  0001 C CNN
F 3 "" H 8750 4600 50  0001 C CNN
	1    8750 4600
	1    0    0    -1  
$EndComp
$Comp
L A5C:NOR04 UCG442
U 1 1 5FE50F84
P 8750 5250
F 0 "UCG442" H 8750 5592 50  0000 C CNN
F 1 "NOR04" H 8750 5501 50  0000 C CNN
F 2 "" H 8750 5250 50  0001 C CNN
F 3 "" H 8750 5250 50  0001 C CNN
	1    8750 5250
	1    0    0    -1  
$EndComp
$Comp
L A5C:DFFCOR UCG?
U 1 1 619F4BD9
P 1150 1850
AR Path="/619F4BD9" Ref="UCG?"  Part="1" 
AR Path="/5FBBEA1C/619F4BD9" Ref="UCG471"  Part="1" 
F 0 "UCG471" H 1150 2215 50  0000 C CNN
F 1 "DFFCOR" H 1150 2124 50  0000 C CNN
F 2 "" H 1150 1850 50  0001 C CNN
F 3 "" H 1150 1850 50  0001 C CNN
F 4 "UCG469;UCG484" H 1150 1850 50  0001 C CNN "MiscRef"
	1    1150 1850
	1    0    0    -1  
$EndComp
$Comp
L A5C:DFFCOR UCG?
U 1 1 619F4BDF
P 1850 1850
AR Path="/619F4BDF" Ref="UCG?"  Part="1" 
AR Path="/5FBBEA1C/619F4BDF" Ref="UCG475"  Part="1" 
F 0 "UCG475" H 1850 2215 50  0000 C CNN
F 1 "DFFCOR" H 1850 2124 50  0000 C CNN
F 2 "" H 1850 1850 50  0001 C CNN
F 3 "" H 1850 1850 50  0001 C CNN
	1    1850 1850
	1    0    0    -1  
$EndComp
$Comp
L A5C:DFFCOR UCG?
U 1 1 619F4BE5
P 1850 2650
AR Path="/619F4BE5" Ref="UCG?"  Part="1" 
AR Path="/5FBBEA1C/619F4BE5" Ref="UCG480"  Part="1" 
F 0 "UCG480" H 1850 3015 50  0000 C CNN
F 1 "DFFCOR" H 1850 2924 50  0000 C CNN
F 2 "" H 1850 2650 50  0001 C CNN
F 3 "" H 1850 2650 50  0001 C CNN
	1    1850 2650
	1    0    0    -1  
$EndComp
$Comp
L A5C:DFFCOR U?
U 1 1 5FCD687E
P 3350 2950
AR Path="/5FCD687E" Ref="U?"  Part="1" 
AR Path="/5FBBEA1C/5FCD687E" Ref="UCJ446"  Part="1" 
F 0 "UCJ446" H 3350 3311 50  0000 C CNN
F 1 "DFFCOR" H 3350 3220 50  0000 C CNN
F 2 "" H 3350 2950 50  0001 C CNN
F 3 "" H 3350 2950 50  0001 C CNN
F 4 "UCJ443;UCJ472" H 3350 2950 50  0001 C CNN "MiscRef"
	1    3350 2950
	1    0    0    -1  
$EndComp
$Comp
L A5C:DFFCOR U?
U 1 1 5FCD6884
P 3350 3700
AR Path="/5FCD6884" Ref="U?"  Part="1" 
AR Path="/5FBBEA1C/5FCD6884" Ref="UCJ450"  Part="1" 
F 0 "UCJ450" H 3350 4061 50  0000 C CNN
F 1 "DFFCOR" H 3350 3970 50  0000 C CNN
F 2 "" H 3350 3700 50  0001 C CNN
F 3 "" H 3350 3700 50  0001 C CNN
	1    3350 3700
	1    0    0    -1  
$EndComp
$Comp
L A5C:DFFCOR U?
U 1 1 5FCD688A
P 3350 4450
AR Path="/5FCD688A" Ref="U?"  Part="1" 
AR Path="/5FBBEA1C/5FCD688A" Ref="UCJ455"  Part="1" 
F 0 "UCJ455" H 3350 4811 50  0000 C CNN
F 1 "DFFCOR" H 3350 4720 50  0000 C CNN
F 2 "" H 3350 4450 50  0001 C CNN
F 3 "" H 3350 4450 50  0001 C CNN
	1    3350 4450
	1    0    0    -1  
$EndComp
$Comp
L A5C:DFFCOR U?
U 1 1 5FCD6890
P 3350 5200
AR Path="/5FCD6890" Ref="U?"  Part="1" 
AR Path="/5FBBEA1C/5FCD6890" Ref="UCJ459"  Part="1" 
F 0 "UCJ459" H 3350 5561 50  0000 C CNN
F 1 "DFFCOR" H 3350 5470 50  0000 C CNN
F 2 "" H 3350 5200 50  0001 C CNN
F 3 "" H 3350 5200 50  0001 C CNN
	1    3350 5200
	1    0    0    -1  
$EndComp
$Comp
L A5C:DFFCOR U?
U 1 1 5FCD6896
P 3350 5950
AR Path="/5FCD6896" Ref="U?"  Part="1" 
AR Path="/5FBBEA1C/5FCD6896" Ref="UCJ463"  Part="1" 
F 0 "UCJ463" H 3350 6311 50  0000 C CNN
F 1 "DFFCOR" H 3350 6220 50  0000 C CNN
F 2 "" H 3350 5950 50  0001 C CNN
F 3 "" H 3350 5950 50  0001 C CNN
	1    3350 5950
	1    0    0    -1  
$EndComp
$Comp
L A5C:DFFCOR U?
U 1 1 5FCD689C
P 3350 6700
AR Path="/5FCD689C" Ref="U?"  Part="1" 
AR Path="/5FBBEA1C/5FCD689C" Ref="UCJ468"  Part="1" 
F 0 "UCJ468" H 3350 7061 50  0000 C CNN
F 1 "DFFCOR" H 3350 6970 50  0000 C CNN
F 2 "" H 3350 6700 50  0001 C CNN
F 3 "" H 3350 6700 50  0001 C CNN
	1    3350 6700
	1    0    0    -1  
$EndComp
$Comp
L A5C:OAI211 UBZ473
U 1 1 602011EE
P 9550 1700
F 0 "UBZ473" H 9575 2067 50  0000 C CNN
F 1 "OAI211" H 9575 1976 50  0000 C CNN
F 2 "" H 9650 1550 50  0001 C CNN
F 3 "" H 9650 1550 50  0001 C CNN
	1    9550 1700
	1    0    0    -1  
$EndComp
$Comp
L A5C:OAI23 UCC430
U 1 1 5FF0B47D
P 7900 1150
F 0 "UCC430" H 7925 1617 50  0000 C CNN
F 1 "OAI23" H 7925 1526 50  0000 C CNN
F 2 "" H 7950 1150 50  0001 C CNN
F 3 "" H 7950 1150 50  0001 C CNN
	1    7900 1150
	1    0    0    -1  
$EndComp
$Comp
L A5C:OAI23 UCG462
U 1 1 5FDF15EF
P 7900 2000
F 0 "UCG462" H 7925 2467 50  0000 C CNN
F 1 "OAI23" H 7925 2376 50  0000 C CNN
F 2 "" H 7950 2000 50  0001 C CNN
F 3 "" H 7950 2000 50  0001 C CNN
	1    7900 2000
	1    0    0    -1  
$EndComp
$Comp
L A5C:AOI33 UCG432
U 1 1 5FE1E5ED
P 7900 2900
F 0 "UCG432" H 7900 3342 50  0000 C CNN
F 1 "AOI33" H 7900 3251 50  0000 C CNN
F 2 "" H 8050 2900 50  0001 C CNN
F 3 "" H 8050 2900 50  0001 C CNN
	1    7900 2900
	1    0    0    -1  
$EndComp
$Comp
L A5C:D38GL UCC434
U 1 1 5FF5C79C
P 4500 1250
F 0 "UCC434" H 4500 1867 50  0000 C CNN
F 1 "D38GL" H 4500 1776 50  0000 C CNN
F 2 "" H 4500 1775 50  0001 C CNN
F 3 "" H 4500 1775 50  0001 C CNN
	1    4500 1250
	1    0    0    -1  
$EndComp
NoConn ~ 3600 2850
NoConn ~ 3600 3600
NoConn ~ 3600 4350
NoConn ~ 3600 5100
NoConn ~ 3600 5850
NoConn ~ 3600 6600
Wire Bus Line
	2400 2950 2400 4700
Wire Bus Line
	2400 4700 2400 6500
Wire Bus Line
	3450 650  3450 1000
Wire Bus Line
	10250 4600 10250 4950
$EndSCHEMATC
