EESchema Schematic File Version 4
EELAYER 30 0
EELAYER END
$Descr A4 11693 8268
encoding utf-8
Sheet 3 69
Title ""
Date "2020-11-26"
Rev ""
Comp ""
Comment1 "Licence: CC-BY"
Comment2 "Author: Loïc *WydD* Petit"
Comment3 ""
Comment4 ""
$EndDescr
Connection ~ 5350 5100
Connection ~ 3700 3200
Connection ~ 4650 3200
Connection ~ 3700 4050
Connection ~ 5350 6000
Connection ~ 5950 6100
Connection ~ 5350 6500
Connection ~ 5000 4250
Connection ~ 4650 4050
Connection ~ 4650 4900
Connection ~ 5000 5100
Connection ~ 2600 6600
Connection ~ 2700 5750
Connection ~ 2800 5650
Connection ~ 3500 7250
Connection ~ 5350 4250
Connection ~ 5950 5700
Connection ~ 4100 7250
NoConn ~ 5250 5600
Entry Wire Line
	6350 950  6450 1050
Entry Wire Line
	6350 1050 6450 1150
Entry Wire Line
	6350 1150 6450 1250
Entry Wire Line
	6350 1250 6450 1350
Entry Wire Line
	6350 1350 6450 1450
Entry Wire Line
	6350 1450 6450 1550
Entry Wire Line
	6350 1550 6450 1650
Entry Wire Line
	6350 1650 6450 1750
Entry Wire Line
	6350 1850 6450 1950
Entry Wire Line
	6350 1950 6450 2050
Entry Wire Line
	6350 2050 6450 2150
Entry Wire Line
	6350 2150 6450 2250
Entry Wire Line
	6350 2250 6450 2350
Entry Wire Line
	6350 2350 6450 2450
Entry Wire Line
	6350 2450 6450 2550
Entry Wire Line
	6350 2550 6450 2650
Entry Wire Line
	9500 1500 9600 1600
Entry Wire Line
	9500 1600 9600 1700
Entry Wire Line
	9500 1700 9600 1800
Entry Wire Line
	9500 1800 9600 1900
Entry Wire Line
	9500 1900 9600 2000
Entry Wire Line
	9500 2000 9600 2100
Entry Wire Line
	9500 2100 9600 2200
Entry Wire Line
	9500 2200 9600 2300
Wire Wire Line
	1750 5950 2900 5950
Wire Wire Line
	1750 6600 2600 6600
Wire Wire Line
	1750 7400 2900 7400
Wire Wire Line
	2600 5850 2600 6600
Wire Wire Line
	2600 5850 2900 5850
Wire Wire Line
	2600 6600 2600 7300
Wire Wire Line
	2700 5750 2150 5750
Wire Wire Line
	2700 5750 2700 7200
Wire Wire Line
	2700 7200 2900 7200
Wire Wire Line
	2800 4350 2800 5650
Wire Wire Line
	2800 5650 2800 7100
Wire Wire Line
	2800 5650 2900 5650
Wire Wire Line
	2900 5750 2700 5750
Wire Wire Line
	2900 7100 2800 7100
Wire Wire Line
	2900 7300 2600 7300
Wire Wire Line
	3500 7000 3500 7250
Wire Wire Line
	3500 7250 3500 7500
Wire Wire Line
	3600 4700 3800 4700
Wire Wire Line
	3700 3200 3700 4050
Wire Wire Line
	3700 4900 3700 4050
Wire Wire Line
	3800 3850 3600 3850
Wire Wire Line
	3800 4050 3700 4050
Wire Wire Line
	3800 4900 3700 4900
Wire Wire Line
	3800 5800 3500 5800
Wire Wire Line
	4050 5100 5000 5100
Wire Wire Line
	4050 6000 4050 6450
Wire Wire Line
	4100 7000 4100 7250
Wire Wire Line
	4100 7250 4100 7500
Wire Wire Line
	4250 7250 4100 7250
Wire Wire Line
	4300 3850 4750 3850
Wire Wire Line
	4300 3950 4400 3950
Wire Wire Line
	4300 4700 4500 4700
Wire Wire Line
	4300 5700 4550 5700
Wire Wire Line
	4400 3950 4400 4350
Wire Wire Line
	4400 4350 2800 4350
Wire Wire Line
	4550 5700 4550 6200
Wire Wire Line
	4550 6200 7150 6200
Wire Wire Line
	4600 6400 5950 6400
Wire Wire Line
	4650 3200 3700 3200
Wire Wire Line
	4650 3200 4650 4050
Wire Wire Line
	4650 3200 7950 3200
Wire Wire Line
	4650 4050 4650 4900
Wire Wire Line
	4650 4900 4650 5800
Wire Wire Line
	4650 4900 4750 4900
Wire Wire Line
	4650 5800 4750 5800
Wire Wire Line
	4750 4050 4650 4050
Wire Wire Line
	4750 5600 4300 5600
Wire Wire Line
	5000 4250 4050 4250
Wire Wire Line
	5000 4250 5350 4250
Wire Wire Line
	5000 5100 5350 5100
Wire Wire Line
	5000 6000 5350 6000
Wire Wire Line
	5250 3850 5700 3850
Wire Wire Line
	5250 5700 5950 5700
Wire Wire Line
	5350 3400 5350 4250
Wire Wire Line
	5350 3400 8050 3400
Wire Wire Line
	5350 4250 5350 5100
Wire Wire Line
	5350 5100 5350 6000
Wire Wire Line
	5350 6000 5350 6500
Wire Wire Line
	5350 6500 4600 6500
Wire Wire Line
	5350 6500 5950 6500
Wire Wire Line
	5950 5200 5950 5700
Wire Wire Line
	5950 6100 5950 5700
Wire Wire Line
	5950 6100 7150 6100
Wire Wire Line
	5950 6400 5950 6100
Wire Wire Line
	7050 1050 6450 1050
Wire Wire Line
	7050 1150 6450 1150
Wire Wire Line
	7050 1250 6450 1250
Wire Wire Line
	7050 1350 6450 1350
Wire Wire Line
	7050 1450 6450 1450
Wire Wire Line
	7050 1550 6450 1550
Wire Wire Line
	7050 1650 6450 1650
Wire Wire Line
	7050 1750 6450 1750
Wire Wire Line
	7050 1950 6450 1950
Wire Wire Line
	7050 2050 6450 2050
Wire Wire Line
	7050 2150 6450 2150
Wire Wire Line
	7050 2250 6450 2250
Wire Wire Line
	7050 2350 6450 2350
Wire Wire Line
	7050 2450 6450 2450
Wire Wire Line
	7050 2550 6450 2550
Wire Wire Line
	7050 2650 6450 2650
Wire Wire Line
	7150 6000 7150 5700
Wire Wire Line
	7700 6100 8150 6100
Wire Wire Line
	7950 2400 7950 3200
Wire Wire Line
	8050 2400 7950 2400
Wire Wire Line
	8050 2500 8050 3400
Wire Wire Line
	9050 1500 9500 1500
Wire Wire Line
	9050 1600 9500 1600
Wire Wire Line
	9050 1700 9500 1700
Wire Wire Line
	9050 1800 9500 1800
Wire Wire Line
	9050 1900 9500 1900
Wire Wire Line
	9050 2000 9500 2000
Wire Wire Line
	9050 2100 9500 2100
Wire Wire Line
	9050 2200 9500 2200
Wire Bus Line
	6350 800  6200 800 
Wire Bus Line
	9600 2400 9700 2400
Text Notes 2850 5250 0    50   ~ 0
= ~[WR & CS & LUT-OE & WSTROM@CLK4M]
Text Notes 9150 1300 0    50   ~ 0
GFX-OUT\nXPD[0..7]
Text Label 7000 1050 2    50   ~ 0
BUS-DATA0
Text Label 7000 1150 2    50   ~ 0
BUS-DATA1
Text Label 7000 1250 2    50   ~ 0
BUS-DATA2
Text Label 7000 1350 2    50   ~ 0
BUS-DATA3
Text Label 7000 1450 2    50   ~ 0
BUS-DATA4
Text Label 7000 1550 2    50   ~ 0
BUS-DATA5
Text Label 7000 1650 2    50   ~ 0
BUS-DATA6
Text Label 7000 1750 2    50   ~ 0
BUS-DATA7
Text Label 7000 1950 2    50   ~ 0
BUS-DATA8
Text Label 7000 2050 2    50   ~ 0
BUS-DATA9
Text Label 7000 2150 2    50   ~ 0
BUS-DATA10
Text Label 7000 2250 2    50   ~ 0
BUS-DATA11
Text Label 7000 2350 2    50   ~ 0
BUS-DATA12
Text Label 7000 2450 2    50   ~ 0
BUS-DATA13
Text Label 7000 2550 2    50   ~ 0
BUS-DATA14
Text Label 7000 2650 2    50   ~ 0
BUS-DATA15
Text Label 9050 1500 0    50   ~ 0
XPD-OUT0
Text Label 9050 1600 0    50   ~ 0
XPD-OUT1
Text Label 9050 1700 0    50   ~ 0
XPD-OUT2
Text Label 9050 1800 0    50   ~ 0
XPD-OUT3
Text Label 9050 1900 0    50   ~ 0
XPD-OUT4
Text Label 9050 2000 0    50   ~ 0
XPD-OUT5
Text Label 9050 2100 0    50   ~ 0
XPD-OUT6
Text Label 9050 2200 0    50   ~ 0
XPD-OUT7
Text HLabel 1750 5950 0    50   Input ~ 0
~WR
Text HLabel 1750 6600 0    50   Input ~ 0
~CS
Text HLabel 1750 7400 0    50   Input ~ 0
~RD
Text HLabel 2150 5750 0    50   Input ~ 0
~LUT-OE
Text HLabel 3100 2050 0    50   Input ~ 0
GFX-CHNL
Text HLabel 3100 3200 0    50   Input ~ 0
~CLK4M
Text HLabel 3600 3850 0    50   Input ~ 0
~WSTROM
Text HLabel 3600 4700 0    50   Input ~ 0
GFX-OUT-LMSB
Text HLabel 3700 2050 2    50   Output ~ 0
~CK500
Text HLabel 4250 7250 2    50   Output ~ 0
~BUS-RD
Text HLabel 5700 3850 2    50   Output ~ 0
~XPD-OE
Text HLabel 5950 6500 2    50   Input ~ 0
~RESETI
Text HLabel 6200 800  0    50   Input ~ 0
BUS-DATA[0..15]
Text HLabel 6550 5200 2    50   Output ~ 0
~BUS-WR
Text HLabel 8150 6100 2    50   Output ~ 0
~IO-READ
Text HLabel 8600 4700 2    50   Output ~ 0
~CK10
Text HLabel 9700 2400 2    50   Output ~ 0
XPD-OUT[0..7]
$Comp
L power:VCC #PWR0103
U 1 1 615551B6
P 3800 5600
F 0 "#PWR0103" H 3800 5450 50  0001 C CNN
F 1 "VCC" H 3817 5773 50  0000 C CNN
F 2 "" H 3800 5600 50  0001 C CNN
F 3 "" H 3800 5600 50  0001 C CNN
	1    3800 5600
	1    0    0    -1  
$EndComp
$Comp
L A5C:AND02 UBN439
U 1 1 652E4BEB
P 4350 6450
F 0 "UBN439" H 4375 6717 50  0000 C CNN
F 1 "AND02" H 4375 6626 50  0000 C CNN
F 2 "" H 4350 6450 50  0001 C CNN
F 3 "" H 4350 6450 50  0001 C CNN
	1    4350 6450
	-1   0    0    -1  
$EndComp
$Comp
L A5C:AND03 UBN431
U 1 1 61D0824C
P 7400 6100
F 0 "UBN431" H 7425 6392 50  0000 C CNN
F 1 "AND03" H 7425 6301 50  0000 C CNN
F 2 "" H 7400 6100 50  0001 C CNN
F 3 "" H 7400 6100 50  0001 C CNN
	1    7400 6100
	1    0    0    -1  
$EndComp
$Comp
L A5C:BUF12 UBD471
U 1 1 5F790347
P 3400 2050
F 0 "UBD471" H 3400 2366 50  0000 C CNN
F 1 "BUF12" H 3400 2275 50  0000 C CNN
F 2 "" H 3400 2050 50  0001 C CNN
F 3 "" H 3400 2050 50  0001 C CNN
	1    3400 2050
	1    0    0    -1  
$EndComp
$Comp
L A5C:NBUF02 UBW417
U 1 1 601E0AB1
P 3400 3200
F 0 "UBW417" H 3400 3517 50  0000 C CNN
F 1 "NBUF02" H 3400 3426 50  0000 C CNN
F 2 "" H 3400 3000 50  0001 C CNN
F 3 "" H 3400 3000 50  0001 C CNN
	1    3400 3200
	1    0    0    -1  
$EndComp
$Comp
L A5C:NBUF03 UBN376
U 1 1 601E0AAD
P 3800 7000
F 0 "UBN376" H 3800 7317 50  0000 C CNN
F 1 "NBUF03" H 3800 7226 50  0000 C CNN
F 2 "" H 3800 6800 50  0001 C CNN
F 3 "" H 3800 6800 50  0001 C CNN
	1    3800 7000
	1    0    0    -1  
$EndComp
$Comp
L A5C:NBUF03 UBR376
U 1 1 601E0AAF
P 3800 7500
F 0 "UBR376" H 3800 7817 50  0000 C CNN
F 1 "NBUF03" H 3800 7726 50  0000 C CNN
F 2 "" H 3800 7300 50  0001 C CNN
F 3 "" H 3800 7300 50  0001 C CNN
	1    3800 7500
	1    0    0    -1  
$EndComp
$Comp
L A5C:BUF12 UBN383
U 1 1 7BE39C33
P 6250 5200
F 0 "UBN383" H 6250 5517 50  0000 C CNN
F 1 "BUF12" H 6250 5426 50  0000 C CNN
F 2 "" H 6250 5200 50  0001 C CNN
F 3 "" H 6250 5200 50  0001 C CNN
	1    6250 5200
	1    0    0    -1  
$EndComp
$Comp
L A5C:BUF12 UBN391
U 1 1 6C6B5484
P 6250 5700
F 0 "UBN391" H 6250 6017 50  0000 C CNN
F 1 "DELAY8" H 6250 5926 50  0000 C CNN
F 2 "" H 6250 5700 50  0001 C CNN
F 3 "" H 6250 5700 50  0001 C CNN
F 4 "UBN392;UBN394;UBN396;UBN397;UBN399;UBN401;UBN402" H 6250 5700 50  0001 C CNN "MiscRef"
	1    6250 5700
	1    0    0    -1  
$EndComp
$Comp
L A5C:BUF12 UBN418
U 1 1 6C6B547E
P 6850 5700
F 0 "UBN418" H 6850 6017 50  0000 C CNN
F 1 "DELAY8" H 6850 5926 50  0000 C CNN
F 2 "" H 6850 5700 50  0001 C CNN
F 3 "" H 6850 5700 50  0001 C CNN
F 4 "UBN420;UBN421;UBN423;UBN425;UBN426;UBN428;UBN430" H 6850 5700 50  0001 C CNN "MiscRef"
	1    6850 5700
	1    0    0    -1  
$EndComp
$Comp
L A5C:BUF12 UBD474
U 1 1 601E0A87
P 7700 4700
F 0 "UBD474" H 7700 5017 50  0000 C CNN
F 1 "BUF12" H 7700 4926 50  0000 C CNN
F 2 "" H 7700 4700 50  0001 C CNN
F 3 "" H 7700 4700 50  0001 C CNN
	1    7700 4700
	1    0    0    -1  
$EndComp
$Comp
L A5C:BUF12 UBD521
U 1 1 601E0A8B
P 8300 4700
F 0 "UBD521" H 8300 5017 50  0000 C CNN
F 1 "BUF12" H 8300 4926 50  0000 C CNN
F 2 "" H 8300 4700 50  0001 C CNN
F 3 "" H 8300 4700 50  0001 C CNN
	1    8300 4700
	1    0    0    -1  
$EndComp
$Comp
L A5C:OR04 UBN479
U 1 1 7BE308F9
P 3200 5800
F 0 "UBN479" H 3200 6142 50  0000 C CNN
F 1 "OR04" H 3200 6051 50  0000 C CNN
F 2 "" H 3200 5800 50  0001 C CNN
F 3 "" H 3200 5800 50  0001 C CNN
	1    3200 5800
	1    0    0    -1  
$EndComp
$Comp
L A5C:NOR04 UBN474
U 1 1 601E0A8D
P 3200 7250
F 0 "UBN474" H 3200 7592 50  0000 C CNN
F 1 "NOR04" H 3200 7501 50  0000 C CNN
F 2 "" H 3200 7250 50  0001 C CNN
F 3 "" H 3200 7250 50  0001 C CNN
	1    3200 7250
	1    0    0    -1  
$EndComp
$Comp
L A5C:DFFCOR UBD451
U 1 1 7E51A2B2
P 4050 3950
F 0 "UBD451" H 4050 4315 50  0000 C CNN
F 1 "DFFCOR" H 4050 4224 50  0000 C CNN
F 2 "" H 4050 3950 50  0001 C CNN
F 3 "" H 4050 3950 50  0001 C CNN
F 4 "UBD449;UBD469" H 4050 3950 50  0001 C CNN "MiscRef"
	1    4050 3950
	1    0    0    -1  
$EndComp
$Comp
L A5C:DFFCOR UBD460
U 1 1 7E51A2A6
P 4050 4800
F 0 "UBD460" H 4050 5165 50  0000 C CNN
F 1 "DFFCOR" H 4050 5074 50  0000 C CNN
F 2 "" H 4050 4800 50  0001 C CNN
F 3 "" H 4050 4800 50  0001 C CNN
	1    4050 4800
	1    0    0    -1  
$EndComp
$Comp
L A5C:DFFCOR UBN434
U 1 1 60600376
P 4050 5700
F 0 "UBN434" H 4050 6065 50  0000 C CNN
F 1 "DFFCOR" H 4050 5974 50  0000 C CNN
F 2 "" H 4050 5700 50  0001 C CNN
F 3 "" H 4050 5700 50  0001 C CNN
	1    4050 5700
	1    0    0    -1  
$EndComp
$Comp
L A5C:DFFCOR UBD456
U 1 1 7E51A2AC
P 5000 3950
F 0 "UBD456" H 5000 4315 50  0000 C CNN
F 1 "DFFCOR" H 5000 4224 50  0000 C CNN
F 2 "" H 5000 3950 50  0001 C CNN
F 3 "" H 5000 3950 50  0001 C CNN
	1    5000 3950
	1    0    0    -1  
$EndComp
$Comp
L A5C:DFFCOR UBD464
U 1 1 7E51A2A0
P 5000 4800
F 0 "UBD464" H 5000 5165 50  0000 C CNN
F 1 "DFFCOR" H 5000 5074 50  0000 C CNN
F 2 "" H 5000 4800 50  0001 C CNN
F 3 "" H 5000 4800 50  0001 C CNN
	1    5000 4800
	1    0    0    -1  
$EndComp
$Comp
L A5C:DFFCOR UBK439
U 1 1 6155A2B7
P 5000 5700
F 0 "UBK439" H 5000 6065 50  0000 C CNN
F 1 "DFFCOR" H 5000 5974 50  0000 C CNN
F 2 "" H 5000 5700 50  0001 C CNN
F 3 "" H 5000 5700 50  0001 C CNN
F 4 "UBK437;UBK444" H 5000 5700 50  0001 C CNN "MiscRef"
	1    5000 5700
	1    0    0    -1  
$EndComp
$Comp
L A5C:M273C UAA423
U 1 1 7DD4F7C0
P 8550 2000
F 0 "UAA423" H 8550 2767 50  0000 C CNN
F 1 "M273C" H 8550 2676 50  0000 C CNN
F 2 "" H 8550 2000 50  0001 C CNN
F 3 "" H 8550 2000 50  0001 C CNN
F 4 "UAA421;UAA428;UAA432;UAA437;UAA441;UAA446;UAA450;UAA454;UAA459" H 8550 2000 50  0001 C CNN "MiscRef"
	1    8550 2000
	1    0    0    -1  
$EndComp
$Comp
L A5C:MUX28H UBD415
U 1 1 64A6F18E
P 7550 1550
F 0 "UBD415" H 7550 2315 50  0000 C CNN
F 1 "MUX28H" H 7550 2224 50  0000 C CNN
F 2 "" H 7600 1600 50  0001 C CNN
F 3 "" H 7600 1600 50  0001 C CNN
F 4 "UBD418;UBD421;UBD425;UBD428;UBD431;UBD435;UBD438;UBD441" H 7550 1550 50  0001 C CNN "MiscRef"
	1    7550 1550
	1    0    0    -1  
$EndComp
NoConn ~ 5250 3950
NoConn ~ 5250 4800
NoConn ~ 4300 4800
Text Notes 4700 7300 0    50   ~ 0
= ~[RD & CS & LUT-OE & WSTROM@CLK4M]
Wire Wire Line
	5250 4700 7400 4700
Wire Wire Line
	4500 4700 4500 2850
Wire Wire Line
	4500 2850 7050 2850
Wire Bus Line
	9600 1600 9600 2400
Wire Bus Line
	6350 800  6350 2550
Connection ~ 4500 4700
Wire Wire Line
	4500 4700 4750 4700
$EndSCHEMATC
