EESchema Schematic File Version 4
EELAYER 30 0
EELAYER END
$Descr A4 11693 8268
encoding utf-8
Sheet 49 83
Title "CPS Reverse Engineering: DL-0311"
Date "2021-09-12"
Rev ""
Comp ""
Comment1 ""
Comment2 ""
Comment3 "Licence: CC-BY"
Comment4 "Author: Loïc *WydD* Petit"
$EndDescr
Connection ~ 2400 2850
Connection ~ 4000 3600
Connection ~ 4100 3700
Connection ~ 3250 6150
Wire Wire Line
	1750 3950 2350 3950
Wire Wire Line
	2350 3950 2350 4250
Wire Wire Line
	2350 4250 2850 4250
Wire Wire Line
	2350 4350 2850 4350
Wire Wire Line
	2350 4850 2850 4850
Wire Wire Line
	2400 2650 2400 2850
Wire Wire Line
	2400 2850 2900 2850
Wire Wire Line
	2500 2650 2400 2650
Wire Wire Line
	2750 6150 3250 6150
Wire Wire Line
	2850 3500 2350 3500
Wire Wire Line
	2850 4850 2850 4450
Wire Wire Line
	3250 6150 3250 5950
Wire Wire Line
	3250 6350 3250 6150
Wire Wire Line
	3650 3600 4000 3600
Wire Wire Line
	3700 4350 4100 4350
Wire Wire Line
	4000 3100 4200 3100
Wire Wire Line
	4000 3600 4000 3100
Wire Wire Line
	4000 3600 4800 3600
Wire Wire Line
	4100 3200 4200 3200
Wire Wire Line
	4100 3700 4100 3200
Wire Wire Line
	4100 3700 4100 4350
Wire Wire Line
	4100 3700 4800 3700
Wire Wire Line
	5650 3600 5750 3600
Wire Wire Line
	5650 3800 5850 3800
Wire Wire Line
	5650 3900 5750 3900
Wire Wire Line
	5650 5950 6000 5950
Wire Wire Line
	5750 2950 5950 2950
Wire Wire Line
	5750 3600 5750 2950
Wire Wire Line
	5750 3900 5750 4600
Wire Wire Line
	5750 4600 5950 4600
Wire Wire Line
	5850 3500 5850 3700
Wire Wire Line
	5850 3700 5650 3700
Wire Wire Line
	5850 3800 5850 4050
Wire Wire Line
	5850 4050 5950 4050
Wire Wire Line
	5950 3500 5850 3500
Wire Wire Line
	6000 5950 6000 5900
Text Notes 2950 3200 0    50   ~ 0
~[ SCROLL1-T + STARS-T ]
Text Notes 3050 4650 0    50   ~ 0
SCROLL3-T + STARS-T
Text Notes 7700 3600 0    50   ~ 0
~SCROLL1~ & ~SCROLL3~ & ~STARS~\n(so it's SPRITE + SCROLL2 + WSTROM)
Text Label 2400 4350 0    50   ~ 0
~STARS-T
Text Label 2750 6150 0    50   ~ 0
GFX-CHNL
Text Label 3250 5850 2    50   ~ 0
~CLK4M
Text Label 3250 6450 2    50   ~ 0
CLK4M
Text Label 4800 3600 2    50   ~ 0
~SCROLL1-STARS
Text Label 4800 3700 2    50   ~ 0
SCROLL3-STARS
Text Label 4800 3900 2    50   ~ 0
~GFX-CHNL
Text Label 5650 5950 0    50   ~ 0
~STARS-T
Text HLabel 1750 3500 0    50   Input ~ 0
~SCROLL1-T
Text HLabel 1750 3950 0    50   Input ~ 0
~SCROLL3-T
Text HLabel 1750 4350 0    50   Input ~ 0
STARS-T
Text HLabel 1750 4850 0    50   Input ~ 0
~WSTROM
Text HLabel 1800 2850 0    50   Input ~ 0
COL1
Text HLabel 2500 2650 2    50   Output ~ 0
GFX-CHNL
Text HLabel 2850 3600 0    50   Input ~ 0
STARS-T
Text HLabel 2850 3700 0    50   Input ~ 0
~WSTROM
Text HLabel 3500 2850 2    50   Output ~ 0
~GFX-CHNL
Text HLabel 3800 5900 2    50   Output ~ 0
CLK-~CHNL
Text HLabel 3800 6400 2    50   Output ~ 0
CLK-CHNL
Text HLabel 4200 3100 2    50   Output ~ 0
~SCROLL1-STARS
Text HLabel 4200 3200 2    50   Output ~ 0
SCROLL3-STARS
Text HLabel 4650 2150 0    50   Input ~ 0
CLK4M
Text HLabel 5250 2150 2    50   Output ~ 0
~CLK4M
Text HLabel 6000 5250 0    50   Input ~ 0
~SCROLL3-T
Text HLabel 6000 5700 0    50   Input ~ 0
_YFLIP
Text HLabel 6000 5800 0    50   Input ~ 0
~WSTROM
Text HLabel 6550 2950 2    50   Output ~ 0
SCROLL1.GFX-CHNL
Text HLabel 6550 3500 2    50   Output ~ 0
ELSE.GFX-CHNL
Text HLabel 6550 4050 2    50   Output ~ 0
STARS.GFX-CHNL
Text HLabel 6550 4600 2    50   Output ~ 0
SCROLL3.GFX-CHNL
Text HLabel 6550 5800 2    50   Output ~ 0
~YFLIP
Text HLabel 6600 5250 2    50   Output ~ 0
SCROLL3-T
$Comp
L A5C:OR02 UEA59
U 1 1 61118E3E
P 3500 5900
F 0 "UEA59" H 3525 6167 50  0000 C CNN
F 1 "OR02" H 3525 6076 50  0000 C CNN
F 2 "" H 3550 5900 50  0001 C CNN
F 3 "" H 3550 5900 50  0001 C CNN
	1    3500 5900
	1    0    0    -1  
$EndComp
$Comp
L A5C:NAND02 UEH68
U 1 1 71499897
P 3500 6400
F 0 "UEH68" H 3525 6667 50  0000 C CNN
F 1 "NAND02P" H 3525 6576 50  0000 C CNN
F 2 "" H 3500 6400 50  0001 C CNN
F 3 "" H 3500 6400 50  0001 C CNN
	1    3500 6400
	1    0    0    -1  
$EndComp
$Comp
L A5C:NAND03 UEK108
U 1 1 6E7755C0
P 6250 5800
F 0 "UEK108" H 6275 6092 50  0000 C CNN
F 1 "NAND03" H 6275 6001 50  0000 C CNN
F 2 "" H 6250 5800 50  0001 C CNN
F 3 "" H 6250 5800 50  0001 C CNN
	1    6250 5800
	1    0    0    -1  
$EndComp
$Comp
L A5C:INV01 UEE130
U 1 1 6DCBA625
P 2050 3500
F 0 "UEE130" H 2050 3817 50  0000 C CNN
F 1 "INV01" H 2050 3726 50  0000 C CNN
F 2 "" H 2050 3300 50  0001 C CNN
F 3 "" H 2050 3300 50  0001 C CNN
	1    2050 3500
	1    0    0    -1  
$EndComp
$Comp
L A5C:INV01 UED130
U 1 1 65B5E460
P 2050 4350
F 0 "UED130" H 2050 4667 50  0000 C CNN
F 1 "INV01" H 2050 4576 50  0000 C CNN
F 2 "" H 2050 4150 50  0001 C CNN
F 3 "" H 2050 4150 50  0001 C CNN
	1    2050 4350
	1    0    0    -1  
$EndComp
$Comp
L A5C:INV01 UED98
U 1 1 6135BC0B
P 2050 4850
F 0 "UED98" H 2050 5167 50  0000 C CNN
F 1 "INV01" H 2050 5076 50  0000 C CNN
F 2 "" H 2050 4650 50  0001 C CNN
F 3 "" H 2050 4650 50  0001 C CNN
	1    2050 4850
	1    0    0    -1  
$EndComp
$Comp
L A5C:BUF12 UEA168
U 1 1 7374C49E
P 2100 2850
F 0 "UEA168" H 2100 3167 50  0000 C CNN
F 1 "BUF12" H 2100 3076 50  0000 C CNN
F 2 "" H 2100 2850 50  0001 C CNN
F 3 "" H 2100 2850 50  0001 C CNN
	1    2100 2850
	1    0    0    -1  
$EndComp
$Comp
L A5C:NBUF03 UEH20
U 1 1 6AE80ACD
P 3200 2850
F 0 "UEH20" H 3200 3167 50  0000 C CNN
F 1 "NBUF03" H 3200 3076 50  0000 C CNN
F 2 "" H 3200 2650 50  0001 C CNN
F 3 "" H 3200 2650 50  0001 C CNN
	1    3200 2850
	1    0    0    -1  
$EndComp
$Comp
L A5C:NBUF02 UEH?
U 1 1 61336607
P 4950 2150
AR Path="/61336607" Ref="UEH?"  Part="1" 
AR Path="/6767F143/61336607" Ref="UEH85"  Part="1" 
AR Path="/6767F143/611BF701/61336607" Ref="UEH85"  Part="1" 
F 0 "UEH85" H 4950 2467 50  0000 C CNN
F 1 "NBUF03" H 4950 2376 50  0000 C CNN
F 2 "" H 4950 1950 50  0001 C CNN
F 3 "" H 4950 1950 50  0001 C CNN
	1    4950 2150
	1    0    0    1   
$EndComp
$Comp
L A5C:NBUF03 UEJ169
U 1 1 71DACDAF
P 6250 2950
F 0 "UEJ169" H 6250 3267 50  0000 C CNN
F 1 "NBUF03" H 6250 3176 50  0000 C CNN
F 2 "" H 6250 2750 50  0001 C CNN
F 3 "" H 6250 2750 50  0001 C CNN
	1    6250 2950
	1    0    0    -1  
$EndComp
$Comp
L A5C:NBUF03 UEJ175
U 1 1 71DB662D
P 6250 3500
F 0 "UEJ175" H 6250 3817 50  0000 C CNN
F 1 "NBUF03" H 6250 3726 50  0000 C CNN
F 2 "" H 6250 3300 50  0001 C CNN
F 3 "" H 6250 3300 50  0001 C CNN
	1    6250 3500
	1    0    0    -1  
$EndComp
$Comp
L A5C:NBUF03 UEK179
U 1 1 71DB715E
P 6250 4050
F 0 "UEK179" H 6250 4367 50  0000 C CNN
F 1 "NBUF03" H 6250 4276 50  0000 C CNN
F 2 "" H 6250 3850 50  0001 C CNN
F 3 "" H 6250 3850 50  0001 C CNN
	1    6250 4050
	1    0    0    -1  
$EndComp
$Comp
L A5C:NBUF03 UEJ185
U 1 1 71DB7D62
P 6250 4600
F 0 "UEJ185" H 6250 4917 50  0000 C CNN
F 1 "NBUF03" H 6250 4826 50  0000 C CNN
F 2 "" H 6250 4400 50  0001 C CNN
F 3 "" H 6250 4400 50  0001 C CNN
	1    6250 4600
	1    0    0    -1  
$EndComp
$Comp
L A5C:INV01 UEE160
U 1 1 6F7155EF
P 6300 5250
F 0 "UEE160" H 6300 5567 50  0000 C CNN
F 1 "INV01" H 6300 5476 50  0000 C CNN
F 2 "" H 6300 5050 50  0001 C CNN
F 3 "" H 6300 5050 50  0001 C CNN
	1    6300 5250
	1    0    0    -1  
$EndComp
$Comp
L A5C:OAI21 UEE155
U 1 1 6CA3380E
P 3250 3600
F 0 "UEE155" H 3250 3917 50  0000 C CNN
F 1 "OAI21" H 3250 3826 50  0000 C CNN
F 2 "" H 3300 3450 50  0001 C CNN
F 3 "" H 3300 3450 50  0001 C CNN
	1    3250 3600
	1    0    0    -1  
$EndComp
$Comp
L A5C:AOI21 UED108
U 1 1 61354D15
P 3250 4350
F 0 "UED108" H 3275 4667 50  0000 C CNN
F 1 "AOI21" H 3275 4576 50  0000 C CNN
F 2 "" H 3400 4350 50  0001 C CNN
F 3 "" H 3400 4350 50  0001 C CNN
	1    3250 4350
	1    0    0    -1  
$EndComp
$Comp
L A5C:D24GL UEK166
U 1 1 613509AB
P 5200 3750
F 0 "UEK166" H 5225 4140 50  0000 C CNN
F 1 "D24GL" H 5225 4049 50  0000 C CNN
F 2 "" H 5200 4025 50  0001 C CNN
F 3 "" H 5200 4025 50  0001 C CNN
	1    5200 3750
	1    0    0    -1  
$EndComp
$EndSCHEMATC
