EESchema Schematic File Version 4
EELAYER 30 0
EELAYER END
$Descr A2 23386 16535
encoding utf-8
Sheet 46 69
Title ""
Date "2020-11-26"
Rev ""
Comp ""
Comment1 "Licence: CC-BY"
Comment2 "Author: Loïc *WydD* Petit"
Comment3 ""
Comment4 ""
$EndDescr
Connection ~ 3950 4700
Connection ~ 5400 10400
Connection ~ 5400 11050
Connection ~ 5400 11700
Connection ~ 6650 7850
Connection ~ 6650 7200
Connection ~ 5400 7800
Connection ~ 4750 14550
Connection ~ 6650 11100
Connection ~ 6650 11750
Connection ~ 5400 12350
Connection ~ 6650 10450
Connection ~ 6650 8500
Connection ~ 6550 8050
Connection ~ 6550 7400
Connection ~ 6550 11950
Connection ~ 6550 11300
Connection ~ 9850 6300
Connection ~ 10050 6850
Connection ~ 9850 6750
Connection ~ 9750 6950
Connection ~ 10050 7500
Connection ~ 9850 7400
Connection ~ 9750 7300
Connection ~ 9650 7600
Connection ~ 9550 8250
Connection ~ 9650 7850
Connection ~ 9750 7950
Connection ~ 9850 8050
Connection ~ 10050 6200
Connection ~ 9850 10200
Connection ~ 10050 10750
Connection ~ 9850 10650
Connection ~ 9750 10850
Connection ~ 10050 11400
Connection ~ 9850 11300
Connection ~ 9750 11200
Connection ~ 9650 11500
Connection ~ 9550 12150
Connection ~ 9650 11750
Connection ~ 9750 11850
Connection ~ 9850 11950
Connection ~ 10050 10100
Connection ~ 10900 9100
Connection ~ 5400 8450
Connection ~ 10900 8750
Connection ~ 2950 11200
Connection ~ 12650 5800
Connection ~ 7700 7450
Connection ~ 7700 8100
Connection ~ 7700 8750
Connection ~ 7700 10700
Connection ~ 7700 11350
Connection ~ 7700 12000
Connection ~ 7700 12650
Connection ~ 6550 8700
Connection ~ 6550 10650
Connection ~ 3650 9850
Connection ~ 3650 9350
Connection ~ 3650 10350
Connection ~ 2950 9250
Connection ~ 2950 9750
Connection ~ 3650 11300
Connection ~ 5400 13300
Connection ~ 2950 10250
Connection ~ 1900 11250
Connection ~ 15500 10400
Connection ~ 15500 11050
Connection ~ 15500 11700
Connection ~ 16750 7850
Connection ~ 16750 7200
Connection ~ 15500 7800
Connection ~ 16750 11100
Connection ~ 16750 11750
Connection ~ 15500 12350
Connection ~ 16750 10450
Connection ~ 16750 8500
Connection ~ 16650 8050
Connection ~ 16650 7400
Connection ~ 16650 11950
Connection ~ 16650 11300
Connection ~ 19950 6300
Connection ~ 20150 6850
Connection ~ 19950 6750
Connection ~ 20150 7500
Connection ~ 19950 7400
Connection ~ 19850 7300
Connection ~ 19750 7850
Connection ~ 19850 7950
Connection ~ 19950 8050
Connection ~ 20150 6200
Connection ~ 19950 10200
Connection ~ 20150 10750
Connection ~ 19950 10650
Connection ~ 20150 11400
Connection ~ 19950 11300
Connection ~ 19850 11200
Connection ~ 19750 11750
Connection ~ 19850 11850
Connection ~ 19950 11950
Connection ~ 20150 10100
Connection ~ 21000 9100
Connection ~ 15500 8450
Connection ~ 21000 8750
Connection ~ 14850 5450
Connection ~ 14850 5800
Connection ~ 17800 7450
Connection ~ 17800 8100
Connection ~ 17800 8750
Connection ~ 17800 10700
Connection ~ 17800 11350
Connection ~ 17800 12000
Connection ~ 16650 8700
Connection ~ 16650 10650
Connection ~ 15500 7150
Connection ~ 13750 9850
Connection ~ 13750 9350
Connection ~ 13050 9250
Connection ~ 13050 9750
Connection ~ 13050 8750
Connection ~ 4050 4800
Connection ~ 7700 9250
Connection ~ 17800 9250
Connection ~ 13750 10350
Connection ~ 3650 11900
Connection ~ 5450 14550
Connection ~ 13550 5400
Connection ~ 12650 5450
Connection ~ 13050 7100
Connection ~ 13550 6750
NoConn ~ 2400 11350
NoConn ~ 21150 12650
NoConn ~ 13550 7200
Entry Wire Line
	2450 2250 2550 2350
Entry Wire Line
	2450 2350 2550 2450
Entry Wire Line
	2450 2450 2550 2550
Entry Wire Line
	2450 2550 2550 2650
Entry Wire Line
	2450 2650 2550 2750
Entry Wire Line
	2450 2750 2550 2850
Entry Wire Line
	2450 2850 2550 2950
Entry Wire Line
	2450 2950 2550 3050
Entry Wire Line
	2450 3700 2550 3800
Entry Wire Line
	2450 3800 2550 3900
Entry Wire Line
	2450 3900 2550 4000
Entry Wire Line
	2450 4000 2550 4100
Entry Wire Line
	2450 4100 2550 4200
Entry Wire Line
	2450 4200 2550 4300
Entry Wire Line
	2450 4300 2550 4400
Entry Wire Line
	2450 4400 2550 4500
Entry Wire Line
	9300 6800 9200 6700
Entry Wire Line
	9300 7450 9200 7350
Entry Wire Line
	9300 8100 9200 8000
Entry Wire Line
	9300 8750 9200 8650
Entry Wire Line
	9300 10500 9200 10600
Entry Wire Line
	9300 11150 9200 11250
Entry Wire Line
	9300 11800 9200 11900
Entry Wire Line
	9300 12450 9200 12550
Entry Wire Line
	9300 13450 9200 13550
Entry Wire Line
	19400 6800 19300 6700
Entry Wire Line
	19400 7450 19300 7350
Entry Wire Line
	19400 8100 19300 8000
Entry Wire Line
	19400 8750 19300 8650
Entry Wire Line
	19400 10500 19300 10600
Entry Wire Line
	19400 11150 19300 11250
Entry Wire Line
	19400 11800 19300 11900
Entry Wire Line
	19400 12450 19300 12550
Wire Wire Line
	1900 10900 2400 10900
Wire Wire Line
	1900 11250 1900 10900
Wire Wire Line
	2250 5000 2750 5000
Wire Wire Line
	2400 10900 2400 11150
Wire Wire Line
	2550 2350 4150 2350
Wire Wire Line
	2550 2450 4150 2450
Wire Wire Line
	2550 2550 4150 2550
Wire Wire Line
	2550 2650 4150 2650
Wire Wire Line
	2550 2750 4150 2750
Wire Wire Line
	2550 2850 4150 2850
Wire Wire Line
	2550 2950 4150 2950
Wire Wire Line
	2550 3050 4150 3050
Wire Wire Line
	2550 3800 4150 3800
Wire Wire Line
	2550 3900 4150 3900
Wire Wire Line
	2550 4000 4150 4000
Wire Wire Line
	2550 4100 4150 4100
Wire Wire Line
	2550 4200 4150 4200
Wire Wire Line
	2550 4300 4150 4300
Wire Wire Line
	2550 4400 4150 4400
Wire Wire Line
	2550 4500 4150 4500
Wire Wire Line
	2950 9250 2950 8750
Wire Wire Line
	2950 9250 2950 9750
Wire Wire Line
	2950 9750 2950 10250
Wire Wire Line
	2950 9750 3700 9750
Wire Wire Line
	2950 10250 3700 10250
Wire Wire Line
	2950 11200 2950 10250
Wire Wire Line
	2950 11800 2950 11200
Wire Wire Line
	2950 11800 3700 11800
Wire Wire Line
	3350 4900 3450 4900
Wire Wire Line
	3450 4700 3950 4700
Wire Wire Line
	3450 4900 3450 4700
Wire Wire Line
	3500 12200 3650 12200
Wire Wire Line
	3550 8750 3700 8750
Wire Wire Line
	3550 9250 3700 9250
Wire Wire Line
	3550 11200 3700 11200
Wire Wire Line
	3650 8850 3700 8850
Wire Wire Line
	3650 9350 3650 8850
Wire Wire Line
	3650 9350 3700 9350
Wire Wire Line
	3650 9850 3650 9350
Wire Wire Line
	3650 9850 3700 9850
Wire Wire Line
	3650 10350 3650 9850
Wire Wire Line
	3650 10350 3650 11300
Wire Wire Line
	3650 11300 3700 11300
Wire Wire Line
	3650 11900 3650 11300
Wire Wire Line
	3650 12200 3650 11900
Wire Wire Line
	3700 10350 3650 10350
Wire Wire Line
	3700 11900 3650 11900
Wire Wire Line
	3900 5100 4050 5100
Wire Wire Line
	3950 3250 4150 3250
Wire Wire Line
	3950 4700 3950 3250
Wire Wire Line
	3950 4700 4150 4700
Wire Wire Line
	4050 3350 4050 4800
Wire Wire Line
	4050 4800 4150 4800
Wire Wire Line
	4050 5100 4050 4800
Wire Wire Line
	4150 3350 4050 3350
Wire Wire Line
	4250 8800 6650 8800
Wire Wire Line
	4250 9800 4400 9800
Wire Wire Line
	4250 11250 4700 11250
Wire Wire Line
	4250 14550 4750 14550
Wire Wire Line
	4300 8900 4300 9300
Wire Wire Line
	4300 9300 4250 9300
Wire Wire Line
	4400 9000 6550 9000
Wire Wire Line
	4400 9800 4400 9000
Wire Wire Line
	4500 9100 4500 10300
Wire Wire Line
	4500 10300 4250 10300
Wire Wire Line
	4600 11850 4250 11850
Wire Wire Line
	4600 11850 4600 13600
Wire Wire Line
	4600 13600 6750 13600
Wire Wire Line
	4700 13400 4700 11250
Wire Wire Line
	4750 14150 4750 14550
Wire Wire Line
	4750 14150 5400 14150
Wire Wire Line
	4850 7050 5500 7050
Wire Wire Line
	4850 14550 4750 14550
Wire Wire Line
	5150 2350 5500 2350
Wire Wire Line
	5150 2450 5500 2450
Wire Wire Line
	5150 2550 5500 2550
Wire Wire Line
	5150 2650 5500 2650
Wire Wire Line
	5150 2750 5500 2750
Wire Wire Line
	5150 2850 5500 2850
Wire Wire Line
	5150 2950 5500 2950
Wire Wire Line
	5150 3050 5500 3050
Wire Wire Line
	5150 3800 5500 3800
Wire Wire Line
	5150 3900 5500 3900
Wire Wire Line
	5150 4000 5500 4000
Wire Wire Line
	5150 4100 5500 4100
Wire Wire Line
	5150 4200 5500 4200
Wire Wire Line
	5150 4300 5500 4300
Wire Wire Line
	5150 4400 5500 4400
Wire Wire Line
	5150 4500 5500 4500
Wire Wire Line
	5400 6500 5500 6500
Wire Wire Line
	5400 7800 5400 6500
Wire Wire Line
	5400 7800 5400 8450
Wire Wire Line
	5400 8450 5400 10400
Wire Wire Line
	5400 10400 5400 11050
Wire Wire Line
	5400 11050 5400 11700
Wire Wire Line
	5400 11700 5400 12350
Wire Wire Line
	5400 12350 5400 13300
Wire Wire Line
	5400 13300 5400 14150
Wire Wire Line
	5450 7150 5450 14550
Wire Wire Line
	5450 14550 15500 14550
Wire Wire Line
	5500 6400 4850 6400
Wire Wire Line
	5500 7150 5450 7150
Wire Wire Line
	5500 7700 4850 7700
Wire Wire Line
	5500 7800 5400 7800
Wire Wire Line
	5500 8350 4850 8350
Wire Wire Line
	5500 8450 5400 8450
Wire Wire Line
	5500 10300 4850 10300
Wire Wire Line
	5500 10400 5400 10400
Wire Wire Line
	5500 10950 4850 10950
Wire Wire Line
	5500 11050 5400 11050
Wire Wire Line
	5500 11600 4850 11600
Wire Wire Line
	5500 11700 5400 11700
Wire Wire Line
	5500 12250 4850 12250
Wire Wire Line
	5500 12350 5400 12350
Wire Wire Line
	6050 6450 6750 6450
Wire Wire Line
	6050 8400 6750 8400
Wire Wire Line
	6050 11000 6750 11000
Wire Wire Line
	6050 12300 6750 12300
Wire Wire Line
	6150 5600 6150 8600
Wire Wire Line
	6150 5600 11650 5600
Wire Wire Line
	6150 8600 6750 8600
Wire Wire Line
	6150 9500 6150 12500
Wire Wire Line
	6150 9500 11650 9500
Wire Wire Line
	6150 12500 6750 12500
Wire Wire Line
	6250 5700 6250 7950
Wire Wire Line
	6250 5700 11550 5700
Wire Wire Line
	6250 7950 6750 7950
Wire Wire Line
	6250 9600 6250 11850
Wire Wire Line
	6250 9600 11550 9600
Wire Wire Line
	6250 11850 6750 11850
Wire Wire Line
	6350 5800 6350 7300
Wire Wire Line
	6350 5800 11450 5800
Wire Wire Line
	6350 7300 6750 7300
Wire Wire Line
	6350 9700 6350 11200
Wire Wire Line
	6350 9700 11450 9700
Wire Wire Line
	6350 11200 6750 11200
Wire Wire Line
	6450 5900 6450 6650
Wire Wire Line
	6450 5900 11350 5900
Wire Wire Line
	6450 6650 6750 6650
Wire Wire Line
	6450 9800 6450 10550
Wire Wire Line
	6450 9800 11350 9800
Wire Wire Line
	6450 10550 6750 10550
Wire Wire Line
	6550 6750 6550 7400
Wire Wire Line
	6550 7400 6550 8050
Wire Wire Line
	6550 8050 6550 8700
Wire Wire Line
	6550 8700 6750 8700
Wire Wire Line
	6550 9000 6550 8700
Wire Wire Line
	6550 9100 4500 9100
Wire Wire Line
	6550 10650 6550 9100
Wire Wire Line
	6550 10650 6550 11300
Wire Wire Line
	6550 11300 6550 11950
Wire Wire Line
	6550 11950 6550 12600
Wire Wire Line
	6550 12600 6750 12600
Wire Wire Line
	6650 6550 6650 7200
Wire Wire Line
	6650 7200 6650 7850
Wire Wire Line
	6650 7850 6650 8500
Wire Wire Line
	6650 8500 6750 8500
Wire Wire Line
	6650 8800 6650 8500
Wire Wire Line
	6650 8900 4300 8900
Wire Wire Line
	6650 8900 6650 10450
Wire Wire Line
	6650 10450 6750 10450
Wire Wire Line
	6650 11100 6650 10450
Wire Wire Line
	6650 11750 6650 11100
Wire Wire Line
	6650 12400 6650 11750
Wire Wire Line
	6650 13850 6650 13500
Wire Wire Line
	6650 13850 11600 13850
Wire Wire Line
	6750 6550 6650 6550
Wire Wire Line
	6750 6750 6550 6750
Wire Wire Line
	6750 7100 6050 7100
Wire Wire Line
	6750 7200 6650 7200
Wire Wire Line
	6750 7400 6550 7400
Wire Wire Line
	6750 7750 6050 7750
Wire Wire Line
	6750 7850 6650 7850
Wire Wire Line
	6750 8050 6550 8050
Wire Wire Line
	6750 10350 6050 10350
Wire Wire Line
	6750 10650 6550 10650
Wire Wire Line
	6750 11100 6650 11100
Wire Wire Line
	6750 11300 6550 11300
Wire Wire Line
	6750 11650 6050 11650
Wire Wire Line
	6750 11750 6650 11750
Wire Wire Line
	6750 11950 6550 11950
Wire Wire Line
	6750 12400 6650 12400
Wire Wire Line
	6750 13300 5400 13300
Wire Wire Line
	6750 13400 4700 13400
Wire Wire Line
	6750 13500 6650 13500
Wire Wire Line
	7550 9250 7700 9250
Wire Wire Line
	7600 13450 7800 13450
Wire Wire Line
	7700 6800 7800 6800
Wire Wire Line
	7700 7450 7700 6800
Wire Wire Line
	7700 8100 7700 7450
Wire Wire Line
	7700 8750 7700 8100
Wire Wire Line
	7700 9250 7700 8750
Wire Wire Line
	7700 10700 7700 9250
Wire Wire Line
	7700 11350 7700 10700
Wire Wire Line
	7700 12000 7700 11350
Wire Wire Line
	7700 12650 7700 12000
Wire Wire Line
	7700 12650 7700 13650
Wire Wire Line
	7800 6600 7600 6600
Wire Wire Line
	7800 7250 7600 7250
Wire Wire Line
	7800 7450 7700 7450
Wire Wire Line
	7800 7900 7600 7900
Wire Wire Line
	7800 8100 7700 8100
Wire Wire Line
	7800 8550 7600 8550
Wire Wire Line
	7800 8750 7700 8750
Wire Wire Line
	7800 10500 7600 10500
Wire Wire Line
	7800 10700 7700 10700
Wire Wire Line
	7800 11150 7600 11150
Wire Wire Line
	7800 11350 7700 11350
Wire Wire Line
	7800 11800 7600 11800
Wire Wire Line
	7800 12000 7700 12000
Wire Wire Line
	7800 12450 7600 12450
Wire Wire Line
	7800 12650 7700 12650
Wire Wire Line
	7800 13650 7700 13650
Wire Wire Line
	8300 6300 8300 6600
Wire Wire Line
	8300 6300 9850 6300
Wire Wire Line
	8300 6950 8300 7250
Wire Wire Line
	8300 6950 9750 6950
Wire Wire Line
	8300 7600 8300 7900
Wire Wire Line
	8300 7600 9650 7600
Wire Wire Line
	8300 8250 8300 8550
Wire Wire Line
	8300 8250 9550 8250
Wire Wire Line
	8300 10200 8300 10500
Wire Wire Line
	8300 10200 9850 10200
Wire Wire Line
	8300 10850 9750 10850
Wire Wire Line
	8300 11150 8300 10850
Wire Wire Line
	8300 11500 9650 11500
Wire Wire Line
	8300 11800 8300 11500
Wire Wire Line
	8300 12150 9550 12150
Wire Wire Line
	8300 12450 8300 12150
Wire Wire Line
	8300 13150 11050 13150
Wire Wire Line
	8300 13450 8300 13150
Wire Wire Line
	8900 6700 9200 6700
Wire Wire Line
	8900 7350 9200 7350
Wire Wire Line
	8900 8000 9200 8000
Wire Wire Line
	8900 8650 9200 8650
Wire Wire Line
	8900 10600 9200 10600
Wire Wire Line
	8900 11250 9200 11250
Wire Wire Line
	8900 11900 9200 11900
Wire Wire Line
	8900 12550 9200 12550
Wire Wire Line
	8900 13550 9200 13550
Wire Wire Line
	9550 8250 10800 8250
Wire Wire Line
	9550 8550 9550 8250
Wire Wire Line
	9550 12150 10800 12150
Wire Wire Line
	9550 12450 9550 12150
Wire Wire Line
	9650 7600 10800 7600
Wire Wire Line
	9650 7850 9650 7600
Wire Wire Line
	9650 7850 9650 8650
Wire Wire Line
	9650 8650 10150 8650
Wire Wire Line
	9650 11500 10800 11500
Wire Wire Line
	9650 11750 9650 11500
Wire Wire Line
	9650 11750 9650 12550
Wire Wire Line
	9650 12550 10150 12550
Wire Wire Line
	9750 6950 10800 6950
Wire Wire Line
	9750 7300 9750 6950
Wire Wire Line
	9750 7950 9750 7300
Wire Wire Line
	9750 8750 9750 7950
Wire Wire Line
	9750 10850 10800 10850
Wire Wire Line
	9750 11200 9750 10850
Wire Wire Line
	9750 11850 9750 11200
Wire Wire Line
	9750 12650 9750 11850
Wire Wire Line
	9850 6300 9850 6750
Wire Wire Line
	9850 6300 10800 6300
Wire Wire Line
	9850 6750 9850 7400
Wire Wire Line
	9850 6750 10150 6750
Wire Wire Line
	9850 8050 9850 7400
Wire Wire Line
	9850 8050 9850 8850
Wire Wire Line
	9850 8850 10150 8850
Wire Wire Line
	9850 10200 9850 10650
Wire Wire Line
	9850 10200 10800 10200
Wire Wire Line
	9850 10650 9850 11300
Wire Wire Line
	9850 10650 10150 10650
Wire Wire Line
	9850 11950 9850 11300
Wire Wire Line
	9850 11950 9850 12750
Wire Wire Line
	9850 12750 10150 12750
Wire Wire Line
	10000 5450 10000 8950
Wire Wire Line
	10000 5450 12050 5450
Wire Wire Line
	10000 8950 10150 8950
Wire Wire Line
	10000 9300 10000 12850
Wire Wire Line
	10000 12850 10150 12850
Wire Wire Line
	10050 5500 10050 6200
Wire Wire Line
	10050 6200 10800 6200
Wire Wire Line
	10050 6850 10050 6200
Wire Wire Line
	10050 7500 10050 6850
Wire Wire Line
	10050 8150 10050 7500
Wire Wire Line
	10050 9350 10050 10100
Wire Wire Line
	10050 9350 11650 9350
Wire Wire Line
	10050 10100 10800 10100
Wire Wire Line
	10050 10750 10050 10100
Wire Wire Line
	10050 11400 10050 10750
Wire Wire Line
	10050 12050 10050 11400
Wire Wire Line
	10150 6850 10050 6850
Wire Wire Line
	10150 7300 9750 7300
Wire Wire Line
	10150 7400 9850 7400
Wire Wire Line
	10150 7500 10050 7500
Wire Wire Line
	10150 7850 9650 7850
Wire Wire Line
	10150 7950 9750 7950
Wire Wire Line
	10150 8050 9850 8050
Wire Wire Line
	10150 8150 10050 8150
Wire Wire Line
	10150 8550 9550 8550
Wire Wire Line
	10150 8750 9750 8750
Wire Wire Line
	10150 10750 10050 10750
Wire Wire Line
	10150 11200 9750 11200
Wire Wire Line
	10150 11300 9850 11300
Wire Wire Line
	10150 11400 10050 11400
Wire Wire Line
	10150 11750 9650 11750
Wire Wire Line
	10150 11850 9750 11850
Wire Wire Line
	10150 11950 9850 11950
Wire Wire Line
	10150 12050 10050 12050
Wire Wire Line
	10150 12450 9550 12450
Wire Wire Line
	10150 12650 9750 12650
Wire Wire Line
	10700 6800 10750 6800
Wire Wire Line
	10700 10700 10750 10700
Wire Wire Line
	10750 6800 10750 6850
Wire Wire Line
	10750 6850 10800 6850
Wire Wire Line
	10750 7400 10800 7400
Wire Wire Line
	10750 10700 10750 10750
Wire Wire Line
	10750 10750 10800 10750
Wire Wire Line
	10750 11300 10800 11300
Wire Wire Line
	10800 7400 10800 7500
Wire Wire Line
	10800 8000 10750 8000
Wire Wire Line
	10800 8150 10800 8000
Wire Wire Line
	10800 11300 10800 11400
Wire Wire Line
	10800 11900 10750 11900
Wire Wire Line
	10800 12050 10800 11900
Wire Wire Line
	10900 8750 10900 9100
Wire Wire Line
	10900 9200 10900 9100
Wire Wire Line
	10900 12650 11050 12650
Wire Wire Line
	11050 13050 11050 12650
Wire Wire Line
	11100 9100 10900 9100
Wire Wire Line
	11100 9200 10900 9200
Wire Wire Line
	11350 6250 11350 5900
Wire Wire Line
	11350 6900 11450 6900
Wire Wire Line
	11350 8200 11650 8200
Wire Wire Line
	11350 10150 11350 9800
Wire Wire Line
	11350 10800 11450 10800
Wire Wire Line
	11350 11450 11550 11450
Wire Wire Line
	11450 6900 11450 5800
Wire Wire Line
	11450 10800 11450 9700
Wire Wire Line
	11500 8750 11700 8750
Wire Wire Line
	11550 5700 11550 7550
Wire Wire Line
	11550 7550 11350 7550
Wire Wire Line
	11550 11450 11550 9600
Wire Wire Line
	11600 13100 11600 13850
Wire Wire Line
	11650 5600 11650 8200
Wire Wire Line
	11650 9350 11650 9150
Wire Wire Line
	11650 9500 11650 12100
Wire Wire Line
	11650 12100 11350 12100
Wire Wire Line
	11700 8750 11700 9300
Wire Wire Line
	11700 9300 10000 9300
Wire Wire Line
	11750 5500 10050 5500
Wire Wire Line
	11750 5850 11750 5500
Wire Wire Line
	11900 5850 11750 5850
Wire Wire Line
	12450 5800 12650 5800
Wire Wire Line
	12450 5900 12650 5900
Wire Wire Line
	12650 5450 12650 5800
Wire Wire Line
	12650 5450 12900 5450
Wire Wire Line
	12650 5900 12650 5800
Wire Wire Line
	13050 6750 13050 7100
Wire Wire Line
	13050 7800 13050 8750
Wire Wire Line
	13050 9250 13050 8750
Wire Wire Line
	13050 9250 13050 9750
Wire Wire Line
	13050 9750 13050 10250
Wire Wire Line
	13050 9750 13800 9750
Wire Wire Line
	13050 10250 13800 10250
Wire Wire Line
	13100 5000 13550 5000
Wire Wire Line
	13450 5400 13550 5400
Wire Wire Line
	13550 5000 13550 5400
Wire Wire Line
	13550 5400 14850 5400
Wire Wire Line
	13550 5500 13450 5500
Wire Wire Line
	13550 6750 13050 6750
Wire Wire Line
	13550 6750 13550 5500
Wire Wire Line
	13550 7000 13550 6750
Wire Wire Line
	13600 10650 13750 10650
Wire Wire Line
	13650 8750 13800 8750
Wire Wire Line
	13650 9250 13800 9250
Wire Wire Line
	13750 8850 13800 8850
Wire Wire Line
	13750 9350 13750 8850
Wire Wire Line
	13750 9350 13800 9350
Wire Wire Line
	13750 9850 13750 9350
Wire Wire Line
	13750 9850 13800 9850
Wire Wire Line
	13750 10350 13750 9850
Wire Wire Line
	13750 10650 13750 10350
Wire Wire Line
	13800 10350 13750 10350
Wire Wire Line
	14100 7050 14100 7800
Wire Wire Line
	14100 7800 13050 7800
Wire Wire Line
	14350 8800 16750 8800
Wire Wire Line
	14350 9800 14500 9800
Wire Wire Line
	14400 8900 14400 9300
Wire Wire Line
	14400 8900 16750 8900
Wire Wire Line
	14400 9300 14350 9300
Wire Wire Line
	14500 9000 16650 9000
Wire Wire Line
	14500 9800 14500 9000
Wire Wire Line
	14600 9100 14600 10300
Wire Wire Line
	14600 9100 16650 9100
Wire Wire Line
	14600 10300 14350 10300
Wire Wire Line
	14850 5400 14850 5450
Wire Wire Line
	14850 5450 14850 5800
Wire Wire Line
	14850 5900 14850 5800
Wire Wire Line
	15050 5800 14850 5800
Wire Wire Line
	15050 5900 14850 5900
Wire Wire Line
	15450 5450 20100 5450
Wire Wire Line
	15500 6500 15600 6500
Wire Wire Line
	15500 7150 15500 6500
Wire Wire Line
	15500 7150 15600 7150
Wire Wire Line
	15500 7800 15500 7150
Wire Wire Line
	15500 7800 15500 8450
Wire Wire Line
	15500 8450 15500 10400
Wire Wire Line
	15500 10400 15500 11050
Wire Wire Line
	15500 11050 15500 11700
Wire Wire Line
	15500 11700 15500 12350
Wire Wire Line
	15500 12350 15500 14550
Wire Wire Line
	15600 5850 15750 5850
Wire Wire Line
	15600 6400 14950 6400
Wire Wire Line
	15600 7050 14950 7050
Wire Wire Line
	15600 7700 14950 7700
Wire Wire Line
	15600 7800 15500 7800
Wire Wire Line
	15600 8350 14950 8350
Wire Wire Line
	15600 8450 15500 8450
Wire Wire Line
	15600 10300 14950 10300
Wire Wire Line
	15600 10400 15500 10400
Wire Wire Line
	15600 10950 14950 10950
Wire Wire Line
	15600 11050 15500 11050
Wire Wire Line
	15600 11600 14950 11600
Wire Wire Line
	15600 11700 15500 11700
Wire Wire Line
	15600 12250 14950 12250
Wire Wire Line
	15600 12350 15500 12350
Wire Wire Line
	15750 5500 20150 5500
Wire Wire Line
	15750 5850 15750 5500
Wire Wire Line
	16150 6450 16850 6450
Wire Wire Line
	16150 8400 16850 8400
Wire Wire Line
	16150 11000 16850 11000
Wire Wire Line
	16150 12300 16850 12300
Wire Wire Line
	16250 5600 16250 8600
Wire Wire Line
	16250 5600 21750 5600
Wire Wire Line
	16250 8600 16850 8600
Wire Wire Line
	16250 9500 16250 12500
Wire Wire Line
	16250 9500 21750 9500
Wire Wire Line
	16250 12500 16850 12500
Wire Wire Line
	16350 5700 16350 7950
Wire Wire Line
	16350 5700 21650 5700
Wire Wire Line
	16350 7950 16850 7950
Wire Wire Line
	16350 9600 16350 11850
Wire Wire Line
	16350 9600 21650 9600
Wire Wire Line
	16350 11850 16850 11850
Wire Wire Line
	16450 5800 16450 7300
Wire Wire Line
	16450 5800 21550 5800
Wire Wire Line
	16450 7300 16850 7300
Wire Wire Line
	16450 9700 16450 11200
Wire Wire Line
	16450 9700 21550 9700
Wire Wire Line
	16450 11200 16850 11200
Wire Wire Line
	16550 5900 16550 6650
Wire Wire Line
	16550 5900 21450 5900
Wire Wire Line
	16550 6650 16850 6650
Wire Wire Line
	16550 9800 16550 10550
Wire Wire Line
	16550 9800 21450 9800
Wire Wire Line
	16550 10550 16850 10550
Wire Wire Line
	16650 6750 16650 7400
Wire Wire Line
	16650 7400 16650 8050
Wire Wire Line
	16650 8050 16650 8700
Wire Wire Line
	16650 8700 16850 8700
Wire Wire Line
	16650 9000 16650 8700
Wire Wire Line
	16650 10650 16650 9100
Wire Wire Line
	16650 10650 16650 11300
Wire Wire Line
	16650 11300 16650 11950
Wire Wire Line
	16650 11950 16650 12600
Wire Wire Line
	16650 12600 16850 12600
Wire Wire Line
	16750 6550 16750 7200
Wire Wire Line
	16750 7200 16750 7850
Wire Wire Line
	16750 7850 16750 8500
Wire Wire Line
	16750 8500 16850 8500
Wire Wire Line
	16750 8800 16750 8500
Wire Wire Line
	16750 8900 16750 10450
Wire Wire Line
	16750 10450 16850 10450
Wire Wire Line
	16750 11100 16750 10450
Wire Wire Line
	16750 11750 16750 11100
Wire Wire Line
	16750 12400 16750 11750
Wire Wire Line
	16850 6550 16750 6550
Wire Wire Line
	16850 6750 16650 6750
Wire Wire Line
	16850 7100 16150 7100
Wire Wire Line
	16850 7200 16750 7200
Wire Wire Line
	16850 7400 16650 7400
Wire Wire Line
	16850 7750 16150 7750
Wire Wire Line
	16850 7850 16750 7850
Wire Wire Line
	16850 8050 16650 8050
Wire Wire Line
	16850 10350 16150 10350
Wire Wire Line
	16850 10650 16650 10650
Wire Wire Line
	16850 11100 16750 11100
Wire Wire Line
	16850 11300 16650 11300
Wire Wire Line
	16850 11650 16150 11650
Wire Wire Line
	16850 11750 16750 11750
Wire Wire Line
	16850 11950 16650 11950
Wire Wire Line
	16850 12400 16750 12400
Wire Wire Line
	17650 9250 17800 9250
Wire Wire Line
	17800 6800 17900 6800
Wire Wire Line
	17800 7450 17800 6800
Wire Wire Line
	17800 8100 17800 7450
Wire Wire Line
	17800 8750 17800 8100
Wire Wire Line
	17800 9250 17800 8750
Wire Wire Line
	17800 10700 17800 9250
Wire Wire Line
	17800 11350 17800 10700
Wire Wire Line
	17800 12000 17800 11350
Wire Wire Line
	17800 12650 17800 12000
Wire Wire Line
	17900 6600 17700 6600
Wire Wire Line
	17900 7250 17700 7250
Wire Wire Line
	17900 7450 17800 7450
Wire Wire Line
	17900 7900 17700 7900
Wire Wire Line
	17900 8100 17800 8100
Wire Wire Line
	17900 8550 17700 8550
Wire Wire Line
	17900 8750 17800 8750
Wire Wire Line
	17900 10500 17700 10500
Wire Wire Line
	17900 10700 17800 10700
Wire Wire Line
	17900 11150 17700 11150
Wire Wire Line
	17900 11350 17800 11350
Wire Wire Line
	17900 11800 17700 11800
Wire Wire Line
	17900 12000 17800 12000
Wire Wire Line
	17900 12450 17700 12450
Wire Wire Line
	17900 12650 17800 12650
Wire Wire Line
	18400 6300 18400 6600
Wire Wire Line
	18400 6300 19950 6300
Wire Wire Line
	18400 6950 18400 7250
Wire Wire Line
	18400 6950 19850 6950
Wire Wire Line
	18400 7600 18400 7900
Wire Wire Line
	18400 7600 19750 7600
Wire Wire Line
	18400 8250 18400 8550
Wire Wire Line
	18400 8250 19650 8250
Wire Wire Line
	18400 10200 18400 10500
Wire Wire Line
	18400 10200 19950 10200
Wire Wire Line
	18400 10850 19850 10850
Wire Wire Line
	18400 11150 18400 10850
Wire Wire Line
	18400 11500 19750 11500
Wire Wire Line
	18400 11800 18400 11500
Wire Wire Line
	18400 12150 19650 12150
Wire Wire Line
	18400 12450 18400 12150
Wire Wire Line
	19000 12550 19300 12550
Wire Wire Line
	19000 6700 19300 6700
Wire Wire Line
	19000 7350 19300 7350
Wire Wire Line
	19000 8000 19300 8000
Wire Wire Line
	19000 8650 19300 8650
Wire Wire Line
	19000 10600 19300 10600
Wire Wire Line
	19000 11250 19300 11250
Wire Wire Line
	19000 11900 19300 11900
Wire Wire Line
	19650 8250 20900 8250
Wire Wire Line
	19650 8550 19650 8250
Wire Wire Line
	19650 12150 20900 12150
Wire Wire Line
	19650 12450 19650 12150
Wire Wire Line
	19750 7600 20900 7600
Wire Wire Line
	19750 7850 19750 7600
Wire Wire Line
	19750 7850 19750 8650
Wire Wire Line
	19750 8650 20250 8650
Wire Wire Line
	19750 11500 20900 11500
Wire Wire Line
	19750 11750 19750 11500
Wire Wire Line
	19750 11750 19750 12550
Wire Wire Line
	19750 12550 20250 12550
Wire Wire Line
	19850 6950 20900 6950
Wire Wire Line
	19850 7300 19850 6950
Wire Wire Line
	19850 7950 19850 7300
Wire Wire Line
	19850 8750 19850 7950
Wire Wire Line
	19850 10850 20900 10850
Wire Wire Line
	19850 11200 19850 10850
Wire Wire Line
	19850 11850 19850 11200
Wire Wire Line
	19850 12650 19850 11850
Wire Wire Line
	19950 6300 19950 6750
Wire Wire Line
	19950 6300 20900 6300
Wire Wire Line
	19950 6750 19950 7400
Wire Wire Line
	19950 6750 20250 6750
Wire Wire Line
	19950 8050 19950 7400
Wire Wire Line
	19950 8050 19950 8850
Wire Wire Line
	19950 8850 20250 8850
Wire Wire Line
	19950 10200 19950 10650
Wire Wire Line
	19950 10200 20900 10200
Wire Wire Line
	19950 10650 19950 11300
Wire Wire Line
	19950 10650 20250 10650
Wire Wire Line
	19950 11950 19950 11300
Wire Wire Line
	19950 11950 19950 12750
Wire Wire Line
	19950 12750 20250 12750
Wire Wire Line
	20100 5450 20100 8950
Wire Wire Line
	20100 8950 20250 8950
Wire Wire Line
	20100 9300 20100 12850
Wire Wire Line
	20100 12850 20250 12850
Wire Wire Line
	20150 5500 20150 6200
Wire Wire Line
	20150 6200 20900 6200
Wire Wire Line
	20150 6850 20150 6200
Wire Wire Line
	20150 7500 20150 6850
Wire Wire Line
	20150 8150 20150 7500
Wire Wire Line
	20150 9350 20150 10100
Wire Wire Line
	20150 9350 21750 9350
Wire Wire Line
	20150 10100 20900 10100
Wire Wire Line
	20150 10750 20150 10100
Wire Wire Line
	20150 11400 20150 10750
Wire Wire Line
	20150 12050 20150 11400
Wire Wire Line
	20250 6850 20150 6850
Wire Wire Line
	20250 7300 19850 7300
Wire Wire Line
	20250 7400 19950 7400
Wire Wire Line
	20250 7500 20150 7500
Wire Wire Line
	20250 7850 19750 7850
Wire Wire Line
	20250 7950 19850 7950
Wire Wire Line
	20250 8050 19950 8050
Wire Wire Line
	20250 8150 20150 8150
Wire Wire Line
	20250 8550 19650 8550
Wire Wire Line
	20250 8750 19850 8750
Wire Wire Line
	20250 10750 20150 10750
Wire Wire Line
	20250 11200 19850 11200
Wire Wire Line
	20250 11300 19950 11300
Wire Wire Line
	20250 11400 20150 11400
Wire Wire Line
	20250 11750 19750 11750
Wire Wire Line
	20250 11850 19850 11850
Wire Wire Line
	20250 11950 19950 11950
Wire Wire Line
	20250 12050 20150 12050
Wire Wire Line
	20250 12450 19650 12450
Wire Wire Line
	20250 12650 19850 12650
Wire Wire Line
	20800 6800 20850 6800
Wire Wire Line
	20800 10700 20850 10700
Wire Wire Line
	20850 6800 20850 6850
Wire Wire Line
	20850 6850 20900 6850
Wire Wire Line
	20850 7400 20900 7400
Wire Wire Line
	20850 10700 20850 10750
Wire Wire Line
	20850 10750 20900 10750
Wire Wire Line
	20850 11300 20900 11300
Wire Wire Line
	20900 7400 20900 7500
Wire Wire Line
	20900 8000 20850 8000
Wire Wire Line
	20900 8150 20900 8000
Wire Wire Line
	20900 11300 20900 11400
Wire Wire Line
	20900 11900 20850 11900
Wire Wire Line
	20900 12050 20900 11900
Wire Wire Line
	21000 8750 21000 9100
Wire Wire Line
	21000 9200 21000 9100
Wire Wire Line
	21000 12650 21150 12650
Wire Wire Line
	21200 9100 21000 9100
Wire Wire Line
	21200 9200 21000 9200
Wire Wire Line
	21450 6250 21450 5900
Wire Wire Line
	21450 6900 21550 6900
Wire Wire Line
	21450 8200 21750 8200
Wire Wire Line
	21450 10150 21450 9800
Wire Wire Line
	21450 10800 21550 10800
Wire Wire Line
	21450 11450 21650 11450
Wire Wire Line
	21550 6900 21550 5800
Wire Wire Line
	21550 10800 21550 9700
Wire Wire Line
	21600 8750 21800 8750
Wire Wire Line
	21650 5700 21650 7550
Wire Wire Line
	21650 7550 21450 7550
Wire Wire Line
	21650 11450 21650 9600
Wire Wire Line
	21750 5600 21750 8200
Wire Wire Line
	21750 9350 21750 9150
Wire Wire Line
	21750 9500 21750 12100
Wire Wire Line
	21750 12100 21450 12100
Wire Wire Line
	21800 8750 21800 9300
Wire Wire Line
	21800 9300 20100 9300
Wire Bus Line
	2450 2050 2300 2050
Wire Bus Line
	9300 9250 9400 9250
Wire Bus Line
	19400 9250 19500 9250
Text Notes 21250 12650 0    50   ~ 0
HAHA\nIt's actually unplugged
Text Label 2600 2350 0    50   ~ 0
BUS-DATA0
Text Label 2600 2450 0    50   ~ 0
BUS-DATA1
Text Label 2600 2550 0    50   ~ 0
BUS-DATA2
Text Label 2600 2650 0    50   ~ 0
BUS-DATA3
Text Label 2600 2750 0    50   ~ 0
BUS-DATA4
Text Label 2600 2850 0    50   ~ 0
BUS-DATA5
Text Label 2600 2950 0    50   ~ 0
BUS-DATA6
Text Label 2600 3050 0    50   ~ 0
BUS-DATA7
Text Label 2600 3800 0    50   ~ 0
BUS-DATA8
Text Label 2600 3900 0    50   ~ 0
BUS-DATA9
Text Label 2600 4000 0    50   ~ 0
BUS-DATA10
Text Label 2600 4100 0    50   ~ 0
BUS-DATA11
Text Label 2600 4200 0    50   ~ 0
BUS-DATA12
Text Label 2600 4300 0    50   ~ 0
BUS-DATA13
Text Label 2600 4400 0    50   ~ 0
BUS-DATA14
Text Label 2600 4500 0    50   ~ 0
BUS-DATA15
Text Label 5200 2350 0    50   ~ 0
DATA0
Text Label 5200 2450 0    50   ~ 0
DATA1
Text Label 5200 2550 0    50   ~ 0
DATA2
Text Label 5200 2650 0    50   ~ 0
DATA3
Text Label 5200 2750 0    50   ~ 0
DATA4
Text Label 5200 2850 0    50   ~ 0
DATA5
Text Label 5200 2950 0    50   ~ 0
DATA6
Text Label 5200 3050 0    50   ~ 0
DATA7
Text Label 5200 3800 0    50   ~ 0
DATA8
Text Label 5200 3900 0    50   ~ 0
DATA9
Text Label 5200 4000 0    50   ~ 0
DATA10
Text Label 5200 4100 0    50   ~ 0
DATA11
Text Label 5200 4200 0    50   ~ 0
DATA12
Text Label 5200 4300 0    50   ~ 0
DATA13
Text Label 5200 4400 0    50   ~ 0
DATA14
Text Label 5200 4500 0    50   ~ 0
DATA15
Text Label 5250 7050 2    50   ~ 0
DATA9
Text Label 5300 6400 2    50   ~ 0
DATA8
Text Label 5300 7700 2    50   ~ 0
DATA10
Text Label 5300 8350 2    50   ~ 0
DATA11
Text Label 5300 10300 2    50   ~ 0
DATA12
Text Label 5300 10950 2    50   ~ 0
DATA13
Text Label 5300 11600 2    50   ~ 0
DATA14
Text Label 5300 12250 2    50   ~ 0
DATA15
Text Label 15400 6400 2    50   ~ 0
DATA0
Text Label 15400 7050 2    50   ~ 0
DATA1
Text Label 15400 7700 2    50   ~ 0
DATA2
Text Label 15400 8350 2    50   ~ 0
DATA3
Text Label 15400 10300 2    50   ~ 0
DATA4
Text Label 15400 10950 2    50   ~ 0
DATA5
Text Label 15400 11600 2    50   ~ 0
DATA6
Text Label 15400 12250 2    50   ~ 0
DATA7
Text HLabel 1300 11250 0    50   Input ~ 0
FI
Text HLabel 1650 5000 0    50   Input ~ 0
~CLK4M
Text HLabel 1900 11450 0    50   Input ~ 0
~CLK4M
Text HLabel 2300 2050 0    50   Input ~ 0
BUS-DATA[0..15]
Text HLabel 2750 4800 0    50   Input ~ 0
~E
Text HLabel 2750 4900 0    50   Input ~ 0
~WR
Text HLabel 3500 12200 0    50   Input ~ 0
~RESETI
Text HLabel 3900 5100 0    50   Input ~ 0
~RESETI
Text HLabel 4250 14550 0    50   Input ~ 0
~COUNTER-SET
Text HLabel 7550 9250 0    50   Input ~ 0
~CLK4M
Text HLabel 9400 9250 2    50   Output ~ 0
LINE[0..8]
Text HLabel 12450 7100 0    50   Input ~ 0
LI
Text HLabel 13050 7300 0    50   Input ~ 0
~CLK4M
Text HLabel 13100 5000 0    50   Input ~ 0
COUNTER-INC
Text HLabel 13600 10650 0    50   Input ~ 0
~RESETI
Text HLabel 17650 9250 0    50   Input ~ 0
~CLK4M
Text HLabel 19500 9250 2    50   Output ~ 0
COL[1..8]
$Comp
L A5C:AND02 UBU451
U 1 1 61CCDE86
P 2650 11200
AR Path="/5F79F49D/61CCDE86" Ref="UBU451"  Part="1" 
AR Path="/5FC16B93/5FC17149/61CCDE86" Ref="UBU451"  Part="1" 
F 0 "UBU451" H 2675 11467 50  0000 C CNN
F 1 "AND02" H 2675 11376 50  0000 C CNN
F 2 "" H 2650 11200 50  0001 C CNN
F 3 "" H 2650 11200 50  0001 C CNN
	1    2650 11200
	1    0    0    -1  
$EndComp
$Comp
L A5C:AND02 UCC207
U 1 1 5F9C7000
P 3950 8800
AR Path="/5F79F49D/5F9C7000" Ref="UCC207"  Part="1" 
AR Path="/5FC16B93/5FC17149/5F9C7000" Ref="UCC207"  Part="1" 
F 0 "UCC207" H 3975 9067 50  0000 C CNN
F 1 "AND02" H 3975 8976 50  0000 C CNN
F 2 "" H 3950 8800 50  0001 C CNN
F 3 "" H 3950 8800 50  0001 C CNN
	1    3950 8800
	1    0    0    -1  
$EndComp
$Comp
L A5C:AND02 UCL205
U 1 1 5F9D9D6C
P 3950 9300
AR Path="/5F79F49D/5F9D9D6C" Ref="UCL205"  Part="1" 
AR Path="/5FC16B93/5FC17149/5F9D9D6C" Ref="UCL205"  Part="1" 
F 0 "UCL205" H 3975 9567 50  0000 C CNN
F 1 "AND02" H 3975 9476 50  0000 C CNN
F 2 "" H 3950 9300 50  0001 C CNN
F 3 "" H 3950 9300 50  0001 C CNN
	1    3950 9300
	1    0    0    -1  
$EndComp
$Comp
L A5C:AND02 UBW183
U 1 1 60FC2575
P 3950 9800
AR Path="/5F79F49D/60FC2575" Ref="UBW183"  Part="1" 
AR Path="/5FC16B93/5FC17149/60FC2575" Ref="UBW183"  Part="1" 
F 0 "UBW183" H 3975 10067 50  0000 C CNN
F 1 "AND02" H 3975 9976 50  0000 C CNN
F 2 "" H 3950 9800 50  0001 C CNN
F 3 "" H 3950 9800 50  0001 C CNN
	1    3950 9800
	1    0    0    -1  
$EndComp
$Comp
L A5C:AND02 UCG200
U 1 1 60FC2581
P 3950 10300
AR Path="/5F79F49D/60FC2581" Ref="UCG200"  Part="1" 
AR Path="/5FC16B93/5FC17149/60FC2581" Ref="UCG200"  Part="1" 
F 0 "UCG200" H 3975 10567 50  0000 C CNN
F 1 "AND02" H 3975 10476 50  0000 C CNN
F 2 "" H 3950 10300 50  0001 C CNN
F 3 "" H 3950 10300 50  0001 C CNN
	1    3950 10300
	1    0    0    -1  
$EndComp
$Comp
L A5C:AND02 UCG409
U 1 1 5FF70132
P 3950 11250
AR Path="/5F79F49D/5FF70132" Ref="UCG409"  Part="1" 
AR Path="/5FC16B93/5FC17149/5FF70132" Ref="UCG409"  Part="1" 
F 0 "UCG409" H 3975 11517 50  0000 C CNN
F 1 "AND02" H 3975 11426 50  0000 C CNN
F 2 "" H 3950 11250 50  0001 C CNN
F 3 "" H 3950 11250 50  0001 C CNN
	1    3950 11250
	1    0    0    -1  
$EndComp
$Comp
L A5C:AND02 UCG403
U 1 1 5FF8B2CF
P 3950 11850
AR Path="/5F79F49D/5FF8B2CF" Ref="UCG403"  Part="1" 
AR Path="/5FC16B93/5FC17149/5FF8B2CF" Ref="UCG403"  Part="1" 
F 0 "UCG403" H 3975 12117 50  0000 C CNN
F 1 "AND02" H 3975 12026 50  0000 C CNN
F 2 "" H 3950 11850 50  0001 C CNN
F 3 "" H 3950 11850 50  0001 C CNN
	1    3950 11850
	1    0    0    -1  
$EndComp
$Comp
L A5C:OR02 UCC428
U 1 1 5FCDE428
P 5750 6450
AR Path="/5F79F49D/5FCDE428" Ref="UCC428"  Part="1" 
AR Path="/5FC16B93/5FC17149/5FCDE428" Ref="UCC428"  Part="1" 
F 0 "UCC428" H 5775 6717 50  0000 C CNN
F 1 "OR02" H 5775 6626 50  0000 C CNN
F 2 "" H 5800 6450 50  0001 C CNN
F 3 "" H 5800 6450 50  0001 C CNN
	1    5750 6450
	1    0    0    -1  
$EndComp
$Comp
L A5C:AND02 UBZ475
U 1 1 5F7A0F7E
P 5750 7100
AR Path="/5F79F49D/5F7A0F7E" Ref="UBZ475"  Part="1" 
AR Path="/5FC16B93/5FC17149/5F7A0F7E" Ref="UBZ475"  Part="1" 
F 0 "UBZ475" H 5775 7367 50  0000 C CNN
F 1 "AND02" H 5775 7276 50  0000 C CNN
F 2 "" H 5750 7100 50  0001 C CNN
F 3 "" H 5750 7100 50  0001 C CNN
	1    5750 7100
	1    0    0    -1  
$EndComp
$Comp
L A5C:OR02 UBW447
U 1 1 5FCE559B
P 5750 7750
AR Path="/5F79F49D/5FCE559B" Ref="UBW447"  Part="1" 
AR Path="/5FC16B93/5FC17149/5FCE559B" Ref="UBW447"  Part="1" 
F 0 "UBW447" H 5775 8017 50  0000 C CNN
F 1 "OR02" H 5775 7926 50  0000 C CNN
F 2 "" H 5800 7750 50  0001 C CNN
F 3 "" H 5800 7750 50  0001 C CNN
	1    5750 7750
	1    0    0    -1  
$EndComp
$Comp
L A5C:OR02 UBW412
U 1 1 5FCE973D
P 5750 8400
AR Path="/5F79F49D/5FCE973D" Ref="UBW412"  Part="1" 
AR Path="/5FC16B93/5FC17149/5FCE973D" Ref="UBW412"  Part="1" 
F 0 "UBW412" H 5775 8667 50  0000 C CNN
F 1 "OR02" H 5775 8576 50  0000 C CNN
F 2 "" H 5800 8400 50  0001 C CNN
F 3 "" H 5800 8400 50  0001 C CNN
	1    5750 8400
	1    0    0    -1  
$EndComp
$Comp
L A5C:OR02 UBW496
U 1 1 5FCED8FC
P 5750 10350
AR Path="/5F79F49D/5FCED8FC" Ref="UBW496"  Part="1" 
AR Path="/5FC16B93/5FC17149/5FCED8FC" Ref="UBW496"  Part="1" 
F 0 "UBW496" H 5775 10617 50  0000 C CNN
F 1 "OR02" H 5775 10526 50  0000 C CNN
F 2 "" H 5800 10350 50  0001 C CNN
F 3 "" H 5800 10350 50  0001 C CNN
	1    5750 10350
	1    0    0    -1  
$EndComp
$Comp
L A5C:OR02 UBU496
U 1 1 5FCF1DBC
P 5750 11000
AR Path="/5F79F49D/5FCF1DBC" Ref="UBU496"  Part="1" 
AR Path="/5FC16B93/5FC17149/5FCF1DBC" Ref="UBU496"  Part="1" 
F 0 "UBU496" H 5775 11267 50  0000 C CNN
F 1 "OR02" H 5775 11176 50  0000 C CNN
F 2 "" H 5800 11000 50  0001 C CNN
F 3 "" H 5800 11000 50  0001 C CNN
	1    5750 11000
	1    0    0    -1  
$EndComp
$Comp
L A5C:OR02 UBN451
U 1 1 5FCF609A
P 5750 11650
AR Path="/5F79F49D/5FCF609A" Ref="UBN451"  Part="1" 
AR Path="/5FC16B93/5FC17149/5FCF609A" Ref="UBN451"  Part="1" 
F 0 "UBN451" H 5775 11917 50  0000 C CNN
F 1 "OR02" H 5775 11826 50  0000 C CNN
F 2 "" H 5800 11650 50  0001 C CNN
F 3 "" H 5800 11650 50  0001 C CNN
	1    5750 11650
	1    0    0    -1  
$EndComp
$Comp
L A5C:OR02 UBU453
U 1 1 5FCFA418
P 5750 12300
AR Path="/5F79F49D/5FCFA418" Ref="UBU453"  Part="1" 
AR Path="/5FC16B93/5FC17149/5FCFA418" Ref="UBU453"  Part="1" 
F 0 "UBU453" H 5775 12567 50  0000 C CNN
F 1 "OR02" H 5775 12476 50  0000 C CNN
F 2 "" H 5800 12300 50  0001 C CNN
F 3 "" H 5800 12300 50  0001 C CNN
	1    5750 12300
	1    0    0    -1  
$EndComp
$Comp
L A5C:NOR02 UBZ223
U 1 1 5F9017A2
P 10400 6800
AR Path="/5F79F49D/5F9017A2" Ref="UBZ223"  Part="1" 
AR Path="/5FC16B93/5FC17149/5F9017A2" Ref="UBZ223"  Part="1" 
F 0 "UBZ223" H 10425 7067 50  0000 C CNN
F 1 "NOR02" H 10425 6976 50  0000 C CNN
F 2 "" H 10400 6800 50  0001 C CNN
F 3 "" H 10400 6800 50  0001 C CNN
	1    10400 6800
	1    0    0    -1  
$EndComp
$Comp
L A5C:NOR02 UCL164
U 1 1 5FC55E32
P 10400 10700
AR Path="/5F79F49D/5FC55E32" Ref="UCL164"  Part="1" 
AR Path="/5FC16B93/5FC17149/5FC55E32" Ref="UCL164"  Part="1" 
F 0 "UCL164" H 10425 10967 50  0000 C CNN
F 1 "NOR02" H 10425 10876 50  0000 C CNN
F 2 "" H 10400 10700 50  0001 C CNN
F 3 "" H 10400 10700 50  0001 C CNN
	1    10400 10700
	1    0    0    -1  
$EndComp
$Comp
L A5C:XOR02 UBZ217
U 1 1 5F8B34DD
P 11050 6250
AR Path="/5F79F49D/5F8B34DD" Ref="UBZ217"  Part="1" 
AR Path="/5FC16B93/5FC17149/5F8B34DD" Ref="UBZ217"  Part="1" 
F 0 "UBZ217" H 11075 5983 50  0000 C CNN
F 1 "XOR02" H 11075 6074 50  0000 C CNN
F 2 "" H 11050 6250 50  0001 C CNN
F 3 "" H 11050 6250 50  0001 C CNN
	1    11050 6250
	1    0    0    1   
$EndComp
$Comp
L A5C:XOR02 UCJ159
U 1 1 5FC55E26
P 11050 10150
AR Path="/5F79F49D/5FC55E26" Ref="UCJ159"  Part="1" 
AR Path="/5FC16B93/5FC17149/5FC55E26" Ref="UCJ159"  Part="1" 
F 0 "UCJ159" H 11075 9883 50  0000 C CNN
F 1 "XOR02" H 11075 9974 50  0000 C CNN
F 2 "" H 11050 10150 50  0001 C CNN
F 3 "" H 11050 10150 50  0001 C CNN
	1    11050 10150
	1    0    0    1   
$EndComp
$Comp
L A5C:NAND02 UCG169
U 1 1 5FC55E8C
P 11350 9150
AR Path="/5F79F49D/5FC55E8C" Ref="UCG169"  Part="1" 
AR Path="/5FC16B93/5FC17149/5FC55E8C" Ref="UCG169"  Part="1" 
F 0 "UCG169" H 11375 9417 50  0000 C CNN
F 1 "NAND02" H 11375 9326 50  0000 C CNN
F 2 "" H 11350 9150 50  0001 C CNN
F 3 "" H 11350 9150 50  0001 C CNN
	1    11350 9150
	1    0    0    -1  
$EndComp
$Comp
L A5C:NAND02 UBZ197
U 1 1 5FA6C04C
P 12200 5850
AR Path="/5F79F49D/5FA6C04C" Ref="UBZ197"  Part="1" 
AR Path="/5FC16B93/5FC17149/5FA6C04C" Ref="UBZ197"  Part="1" 
F 0 "UBZ197" H 12225 6117 50  0000 C CNN
F 1 "NAND02" H 12225 6026 50  0000 C CNN
F 2 "" H 12200 5850 50  0001 C CNN
F 3 "" H 12200 5850 50  0001 C CNN
	1    12200 5850
	-1   0    0    -1  
$EndComp
$Comp
L A5C:NAND02 UBU265
U 1 1 635F64F7
P 13200 5450
AR Path="/5F79F49D/635F64F7" Ref="UBU265"  Part="1" 
AR Path="/5FC16B93/5FC17149/635F64F7" Ref="UBU265"  Part="1" 
F 0 "UBU265" H 13225 5717 50  0000 C CNN
F 1 "NAND02" H 13225 5626 50  0000 C CNN
F 2 "" H 13200 5450 50  0001 C CNN
F 3 "" H 13200 5450 50  0001 C CNN
	1    13200 5450
	-1   0    0    -1  
$EndComp
$Comp
L A5C:AND02 UBU293
U 1 1 63876152
P 13800 7050
AR Path="/5F79F49D/63876152" Ref="UBU293"  Part="1" 
AR Path="/5FC16B93/5FC17149/63876152" Ref="UBU293"  Part="1" 
F 0 "UBU293" H 13825 7317 50  0000 C CNN
F 1 "AND02" H 13825 7226 50  0000 C CNN
F 2 "" H 13800 7050 50  0001 C CNN
F 3 "" H 13800 7050 50  0001 C CNN
	1    13800 7050
	1    0    0    -1  
$EndComp
$Comp
L A5C:AND02 UBU182
U 1 1 63938380
P 14050 8800
AR Path="/5F79F49D/63938380" Ref="UBU182"  Part="1" 
AR Path="/5FC16B93/5FC17149/63938380" Ref="UBU182"  Part="1" 
F 0 "UBU182" H 14075 9067 50  0000 C CNN
F 1 "AND02" H 14075 8976 50  0000 C CNN
F 2 "" H 14050 8800 50  0001 C CNN
F 3 "" H 14050 8800 50  0001 C CNN
	1    14050 8800
	1    0    0    -1  
$EndComp
$Comp
L A5C:AND02 UCG167
U 1 1 6393838C
P 14050 9300
AR Path="/5F79F49D/6393838C" Ref="UCG167"  Part="1" 
AR Path="/5FC16B93/5FC17149/6393838C" Ref="UCG167"  Part="1" 
F 0 "UCG167" H 14075 9567 50  0000 C CNN
F 1 "AND02" H 14075 9476 50  0000 C CNN
F 2 "" H 14050 9300 50  0001 C CNN
F 3 "" H 14050 9300 50  0001 C CNN
	1    14050 9300
	1    0    0    -1  
$EndComp
$Comp
L A5C:AND02 UBW175
U 1 1 6393839D
P 14050 9800
AR Path="/5F79F49D/6393839D" Ref="UBW175"  Part="1" 
AR Path="/5FC16B93/5FC17149/6393839D" Ref="UBW175"  Part="1" 
F 0 "UBW175" H 14075 10067 50  0000 C CNN
F 1 "AND02" H 14075 9976 50  0000 C CNN
F 2 "" H 14050 9800 50  0001 C CNN
F 3 "" H 14050 9800 50  0001 C CNN
	1    14050 9800
	1    0    0    -1  
$EndComp
$Comp
L A5C:AND02 UCC185
U 1 1 639383A3
P 14050 10300
AR Path="/5F79F49D/639383A3" Ref="UCC185"  Part="1" 
AR Path="/5FC16B93/5FC17149/639383A3" Ref="UCC185"  Part="1" 
F 0 "UCC185" H 14075 10567 50  0000 C CNN
F 1 "AND02" H 14075 10476 50  0000 C CNN
F 2 "" H 14050 10300 50  0001 C CNN
F 3 "" H 14050 10300 50  0001 C CNN
	1    14050 10300
	1    0    0    -1  
$EndComp
$Comp
L A5C:NAND02 UBZ155
U 1 1 61ED650F
P 15300 5850
AR Path="/5F79F49D/61ED650F" Ref="UBZ155"  Part="1" 
AR Path="/5FC16B93/5FC17149/61ED650F" Ref="UBZ155"  Part="1" 
F 0 "UBZ155" H 15325 6117 50  0000 C CNN
F 1 "NAND02" H 15325 6026 50  0000 C CNN
F 2 "" H 15300 5850 50  0001 C CNN
F 3 "" H 15300 5850 50  0001 C CNN
	1    15300 5850
	1    0    0    -1  
$EndComp
$Comp
L A5C:AND02 UBW445
U 1 1 5FCCF6D2
P 15850 6450
AR Path="/5F79F49D/5FCCF6D2" Ref="UBW445"  Part="1" 
AR Path="/5FC16B93/5FC17149/5FCCF6D2" Ref="UBW445"  Part="1" 
F 0 "UBW445" H 15875 6717 50  0000 C CNN
F 1 "AND02" H 15875 6626 50  0000 C CNN
F 2 "" H 15850 6450 50  0001 C CNN
F 3 "" H 15850 6450 50  0001 C CNN
	1    15850 6450
	1    0    0    -1  
$EndComp
$Comp
L A5C:AND02 UBW442
U 1 1 5FCCF6D8
P 15850 7100
AR Path="/5F79F49D/5FCCF6D8" Ref="UBW442"  Part="1" 
AR Path="/5FC16B93/5FC17149/5FCCF6D8" Ref="UBW442"  Part="1" 
F 0 "UBW442" H 15875 7367 50  0000 C CNN
F 1 "AND02" H 15875 7276 50  0000 C CNN
F 2 "" H 15850 7100 50  0001 C CNN
F 3 "" H 15850 7100 50  0001 C CNN
	1    15850 7100
	1    0    0    -1  
$EndComp
$Comp
L A5C:AND02 UBW421
U 1 1 5FCD6E3F
P 15850 7750
AR Path="/5F79F49D/5FCD6E3F" Ref="UBW421"  Part="1" 
AR Path="/5FC16B93/5FC17149/5FCD6E3F" Ref="UBW421"  Part="1" 
F 0 "UBW421" H 15875 8017 50  0000 C CNN
F 1 "AND02" H 15875 7926 50  0000 C CNN
F 2 "" H 15850 7750 50  0001 C CNN
F 3 "" H 15850 7750 50  0001 C CNN
	1    15850 7750
	1    0    0    -1  
$EndComp
$Comp
L A5C:AND02 UBZ470
U 1 1 5F7A0E01
P 15850 8400
AR Path="/5F79F49D/5F7A0E01" Ref="UBZ470"  Part="1" 
AR Path="/5FC16B93/5FC17149/5F7A0E01" Ref="UBZ470"  Part="1" 
F 0 "UBZ470" H 15875 8667 50  0000 C CNN
F 1 "AND02" H 15875 8576 50  0000 C CNN
F 2 "" H 15850 8400 50  0001 C CNN
F 3 "" H 15850 8400 50  0001 C CNN
	1    15850 8400
	1    0    0    -1  
$EndComp
$Comp
L A5C:AND02 UBZ467
U 1 1 5F7A0B9B
P 15850 10350
AR Path="/5F79F49D/5F7A0B9B" Ref="UBZ467"  Part="1" 
AR Path="/5FC16B93/5FC17149/5F7A0B9B" Ref="UBZ467"  Part="1" 
F 0 "UBZ467" H 15875 10617 50  0000 C CNN
F 1 "AND02" H 15875 10526 50  0000 C CNN
F 2 "" H 15850 10350 50  0001 C CNN
F 3 "" H 15850 10350 50  0001 C CNN
	1    15850 10350
	1    0    0    -1  
$EndComp
$Comp
L A5C:AND02 UBZ430
U 1 1 5FCD4F59
P 15850 11000
AR Path="/5F79F49D/5FCD4F59" Ref="UBZ430"  Part="1" 
AR Path="/5FC16B93/5FC17149/5FCD4F59" Ref="UBZ430"  Part="1" 
F 0 "UBZ430" H 15875 11267 50  0000 C CNN
F 1 "AND02" H 15875 11176 50  0000 C CNN
F 2 "" H 15850 11000 50  0001 C CNN
F 3 "" H 15850 11000 50  0001 C CNN
	1    15850 11000
	1    0    0    -1  
$EndComp
$Comp
L A5C:AND02 UBW450
U 1 1 5FCD6E31
P 15850 11650
AR Path="/5F79F49D/5FCD6E31" Ref="UBW450"  Part="1" 
AR Path="/5FC16B93/5FC17149/5FCD6E31" Ref="UBW450"  Part="1" 
F 0 "UBW450" H 15875 11917 50  0000 C CNN
F 1 "AND02" H 15875 11826 50  0000 C CNN
F 2 "" H 15850 11650 50  0001 C CNN
F 3 "" H 15850 11650 50  0001 C CNN
	1    15850 11650
	1    0    0    -1  
$EndComp
$Comp
L A5C:AND02 UBW438
U 1 1 5FCCF6DE
P 15850 12300
AR Path="/5F79F49D/5FCCF6DE" Ref="UBW438"  Part="1" 
AR Path="/5FC16B93/5FC17149/5FCCF6DE" Ref="UBW438"  Part="1" 
F 0 "UBW438" H 15875 12567 50  0000 C CNN
F 1 "AND02" H 15875 12476 50  0000 C CNN
F 2 "" H 15850 12300 50  0001 C CNN
F 3 "" H 15850 12300 50  0001 C CNN
	1    15850 12300
	1    0    0    -1  
$EndComp
$Comp
L A5C:NOR02 UBZ173
U 1 1 61ED63BD
P 20500 6800
AR Path="/5F79F49D/61ED63BD" Ref="UBZ173"  Part="1" 
AR Path="/5FC16B93/5FC17149/61ED63BD" Ref="UBZ173"  Part="1" 
F 0 "UBZ173" H 20525 7067 50  0000 C CNN
F 1 "NOR02" H 20525 6976 50  0000 C CNN
F 2 "" H 20500 6800 50  0001 C CNN
F 3 "" H 20500 6800 50  0001 C CNN
	1    20500 6800
	1    0    0    -1  
$EndComp
$Comp
L A5C:NOR02 UCC169
U 1 1 61ED6421
P 20500 10700
AR Path="/5F79F49D/61ED6421" Ref="UCC169"  Part="1" 
AR Path="/5FC16B93/5FC17149/61ED6421" Ref="UCC169"  Part="1" 
F 0 "UCC169" H 20525 10967 50  0000 C CNN
F 1 "NOR02" H 20525 10876 50  0000 C CNN
F 2 "" H 20500 10700 50  0001 C CNN
F 3 "" H 20500 10700 50  0001 C CNN
	1    20500 10700
	1    0    0    -1  
$EndComp
$Comp
L A5C:XOR02 UBZ165
U 1 1 61ED63B1
P 21150 6250
AR Path="/5F79F49D/61ED63B1" Ref="UBZ165"  Part="1" 
AR Path="/5FC16B93/5FC17149/61ED63B1" Ref="UBZ165"  Part="1" 
F 0 "UBZ165" H 21175 5983 50  0000 C CNN
F 1 "XOR02" H 21175 6074 50  0000 C CNN
F 2 "" H 21150 6250 50  0001 C CNN
F 3 "" H 21150 6250 50  0001 C CNN
	1    21150 6250
	1    0    0    1   
$EndComp
$Comp
L A5C:XOR02 UCC166
U 1 1 61ED6415
P 21150 10150
AR Path="/5F79F49D/61ED6415" Ref="UCC166"  Part="1" 
AR Path="/5FC16B93/5FC17149/61ED6415" Ref="UCC166"  Part="1" 
F 0 "UCC166" H 21175 9883 50  0000 C CNN
F 1 "XOR02" H 21175 9974 50  0000 C CNN
F 2 "" H 21150 10150 50  0001 C CNN
F 3 "" H 21150 10150 50  0001 C CNN
	1    21150 10150
	1    0    0    1   
$EndComp
$Comp
L A5C:NAND02 UCC143
U 1 1 61ED6518
P 21450 9150
AR Path="/5F79F49D/61ED6518" Ref="UCC143"  Part="1" 
AR Path="/5FC16B93/5FC17149/61ED6518" Ref="UCC143"  Part="1" 
F 0 "UCC143" H 21475 9417 50  0000 C CNN
F 1 "NAND02" H 21475 9326 50  0000 C CNN
F 2 "" H 21450 9150 50  0001 C CNN
F 3 "" H 21450 9150 50  0001 C CNN
	1    21450 9150
	1    0    0    -1  
$EndComp
$Comp
L A5C:INV01 UBU443
U 1 1 61CD4D7B
P 1600 11250
AR Path="/5F79F49D/61CD4D7B" Ref="UBU443"  Part="1" 
AR Path="/5FC16B93/5FC17149/61CD4D7B" Ref="UBU443"  Part="1" 
F 0 "UBU443" H 1600 11567 50  0000 C CNN
F 1 "INV01" H 1600 11476 50  0000 C CNN
F 2 "" H 1600 11050 50  0001 C CNN
F 3 "" H 1600 11050 50  0001 C CNN
	1    1600 11250
	1    0    0    -1  
$EndComp
$Comp
L A5C:NBUF03 UCL?
U 1 1 5FCBCED1
P 1950 5000
AR Path="/5FCBCED1" Ref="UCL?"  Part="1" 
AR Path="/5F79F49D/5FCBCED1" Ref="UCL373"  Part="1" 
AR Path="/5FC16B93/5FC17149/5FCBCED1" Ref="UCL373"  Part="1" 
F 0 "UCL373" H 1950 5316 50  0000 C CNN
F 1 "NBUF03" H 1950 5225 50  0000 C CNN
F 2 "" H 1950 4800 50  0001 C CNN
F 3 "" H 1950 4800 50  0001 C CNN
	1    1950 5000
	1    0    0    -1  
$EndComp
$Comp
L A5C:OR03 UBN?
U 1 1 5FCBCED7
P 3050 4900
AR Path="/5FCBCED7" Ref="UBN?"  Part="1" 
AR Path="/5F79F49D/5FCBCED7" Ref="UBN388"  Part="1" 
AR Path="/5FC16B93/5FC17149/5FCBCED7" Ref="UBN388"  Part="1" 
F 0 "UBN388" H 3050 5216 50  0000 C CNN
F 1 "OR03" H 3050 5125 50  0000 C CNN
F 2 "" H 3050 4900 50  0001 C CNN
F 3 "" H 3050 4900 50  0001 C CNN
	1    3050 4900
	1    0    0    -1  
$EndComp
$Comp
L A5C:INV01 UCG202
U 1 1 5F9CA42C
P 3250 8750
AR Path="/5F79F49D/5F9CA42C" Ref="UCG202"  Part="1" 
AR Path="/5FC16B93/5FC17149/5F9CA42C" Ref="UCG202"  Part="1" 
F 0 "UCG202" H 3250 9067 50  0000 C CNN
F 1 "INV01" H 3250 8976 50  0000 C CNN
F 2 "" H 3250 8550 50  0001 C CNN
F 3 "" H 3250 8550 50  0001 C CNN
	1    3250 8750
	1    0    0    -1  
$EndComp
$Comp
L A5C:INV01 UCL201
U 1 1 5FA103EB
P 3250 9250
AR Path="/5F79F49D/5FA103EB" Ref="UCL201"  Part="1" 
AR Path="/5FC16B93/5FC17149/5FA103EB" Ref="UCL201"  Part="1" 
F 0 "UCL201" H 3250 9567 50  0000 C CNN
F 1 "INV01" H 3250 9476 50  0000 C CNN
F 2 "" H 3250 9050 50  0001 C CNN
F 3 "" H 3250 9050 50  0001 C CNN
	1    3250 9250
	1    0    0    -1  
$EndComp
$Comp
L A5C:INV01 UCG412
U 1 1 5FF6CB2E
P 3250 11200
AR Path="/5F79F49D/5FF6CB2E" Ref="UCG412"  Part="1" 
AR Path="/5FC16B93/5FC17149/5FF6CB2E" Ref="UCG412"  Part="1" 
F 0 "UCG412" H 3250 11517 50  0000 C CNN
F 1 "INV01" H 3250 11426 50  0000 C CNN
F 2 "" H 3250 11000 50  0001 C CNN
F 3 "" H 3250 11000 50  0001 C CNN
	1    3250 11200
	1    0    0    -1  
$EndComp
$Comp
L A5C:NBUF02 UBZ432
U 1 1 5FCFE6DE
P 5150 14550
AR Path="/5F79F49D/5FCFE6DE" Ref="UBZ432"  Part="1" 
AR Path="/5FC16B93/5FC17149/5FCFE6DE" Ref="UBZ432"  Part="1" 
F 0 "UBZ432" H 5150 14867 50  0000 C CNN
F 1 "NBUF02" H 5150 14776 50  0000 C CNN
F 2 "" H 5150 14350 50  0001 C CNN
F 3 "" H 5150 14350 50  0001 C CNN
	1    5150 14550
	1    0    0    -1  
$EndComp
$Comp
L A5C:BUF12 UCJ293
U 1 1 60445336
P 8600 6700
AR Path="/5F79F49D/60445336" Ref="UCJ293"  Part="1" 
AR Path="/5FC16B93/5FC17149/60445336" Ref="UCJ293"  Part="1" 
F 0 "UCJ293" H 8600 7017 50  0000 C CNN
F 1 "BUF12" H 8600 6926 50  0000 C CNN
F 2 "" H 8600 6700 50  0001 C CNN
F 3 "" H 8600 6700 50  0001 C CNN
	1    8600 6700
	1    0    0    -1  
$EndComp
$Comp
L A5C:BUF12 UCJ275
U 1 1 605CA265
P 8600 7350
AR Path="/5F79F49D/605CA265" Ref="UCJ275"  Part="1" 
AR Path="/5FC16B93/5FC17149/605CA265" Ref="UCJ275"  Part="1" 
F 0 "UCJ275" H 8600 7667 50  0000 C CNN
F 1 "BUF12" H 8600 7576 50  0000 C CNN
F 2 "" H 8600 7350 50  0001 C CNN
F 3 "" H 8600 7350 50  0001 C CNN
	1    8600 7350
	1    0    0    -1  
$EndComp
$Comp
L A5C:BUF12 UCJ273
U 1 1 605CA376
P 8600 8000
AR Path="/5F79F49D/605CA376" Ref="UCJ273"  Part="1" 
AR Path="/5FC16B93/5FC17149/605CA376" Ref="UCJ273"  Part="1" 
F 0 "UCJ273" H 8600 8317 50  0000 C CNN
F 1 "BUF12" H 8600 8226 50  0000 C CNN
F 2 "" H 8600 8000 50  0001 C CNN
F 3 "" H 8600 8000 50  0001 C CNN
	1    8600 8000
	1    0    0    -1  
$EndComp
$Comp
L A5C:BUF12 UCJ295
U 1 1 605CA468
P 8600 8650
AR Path="/5F79F49D/605CA468" Ref="UCJ295"  Part="1" 
AR Path="/5FC16B93/5FC17149/605CA468" Ref="UCJ295"  Part="1" 
F 0 "UCJ295" H 8600 8967 50  0000 C CNN
F 1 "BUF12" H 8600 8876 50  0000 C CNN
F 2 "" H 8600 8650 50  0001 C CNN
F 3 "" H 8600 8650 50  0001 C CNN
	1    8600 8650
	1    0    0    -1  
$EndComp
$Comp
L A5C:BUF12 UCL283
U 1 1 60635C47
P 8600 10600
AR Path="/5F79F49D/60635C47" Ref="UCL283"  Part="1" 
AR Path="/5FC16B93/5FC17149/60635C47" Ref="UCL283"  Part="1" 
F 0 "UCL283" H 8600 10917 50  0000 C CNN
F 1 "BUF12" H 8600 10826 50  0000 C CNN
F 2 "" H 8600 10600 50  0001 C CNN
F 3 "" H 8600 10600 50  0001 C CNN
	1    8600 10600
	1    0    0    -1  
$EndComp
$Comp
L A5C:BUF12 UCO265
U 1 1 60635DCB
P 8600 11250
AR Path="/5F79F49D/60635DCB" Ref="UCO265"  Part="1" 
AR Path="/5FC16B93/5FC17149/60635DCB" Ref="UCO265"  Part="1" 
F 0 "UCO265" H 8600 11567 50  0000 C CNN
F 1 "BUF12" H 8600 11476 50  0000 C CNN
F 2 "" H 8600 11250 50  0001 C CNN
F 3 "" H 8600 11250 50  0001 C CNN
	1    8600 11250
	1    0    0    -1  
$EndComp
$Comp
L A5C:BUF12 UCT312
U 1 1 60635F01
P 8600 11900
AR Path="/5F79F49D/60635F01" Ref="UCT312"  Part="1" 
AR Path="/5FC16B93/5FC17149/60635F01" Ref="UCT312"  Part="1" 
F 0 "UCT312" H 8600 12217 50  0000 C CNN
F 1 "BUF12" H 8600 12126 50  0000 C CNN
F 2 "" H 8600 11900 50  0001 C CNN
F 3 "" H 8600 11900 50  0001 C CNN
	1    8600 11900
	1    0    0    -1  
$EndComp
$Comp
L A5C:BUF12 UCL259
U 1 1 60636161
P 8600 12550
AR Path="/5F79F49D/60636161" Ref="UCL259"  Part="1" 
AR Path="/5FC16B93/5FC17149/60636161" Ref="UCL259"  Part="1" 
F 0 "UCL259" H 8600 12867 50  0000 C CNN
F 1 "BUF12" H 8600 12776 50  0000 C CNN
F 2 "" H 8600 12550 50  0001 C CNN
F 3 "" H 8600 12550 50  0001 C CNN
	1    8600 12550
	1    0    0    -1  
$EndComp
$Comp
L A5C:BUF12 UCJ330
U 1 1 61B74124
P 8600 13550
AR Path="/5F79F49D/61B74124" Ref="UCJ330"  Part="1" 
AR Path="/5FC16B93/5FC17149/61B74124" Ref="UCJ330"  Part="1" 
F 0 "UCJ330" H 8600 13867 50  0000 C CNN
F 1 "BUF12" H 8600 13776 50  0000 C CNN
F 2 "" H 8600 13550 50  0001 C CNN
F 3 "" H 8600 13550 50  0001 C CNN
	1    8600 13550
	1    0    0    -1  
$EndComp
$Comp
L A5C:NOR03 UBZ220
U 1 1 5F959523
P 10450 7400
AR Path="/5F79F49D/5F959523" Ref="UBZ220"  Part="1" 
AR Path="/5FC16B93/5FC17149/5F959523" Ref="UBZ220"  Part="1" 
F 0 "UBZ220" H 10450 7717 50  0000 C CNN
F 1 "NOR03" H 10450 7626 50  0000 C CNN
F 2 "" H 10450 7400 50  0001 C CNN
F 3 "" H 10450 7400 50  0001 C CNN
	1    10450 7400
	1    0    0    -1  
$EndComp
$Comp
L A5C:NOR03 UCJ151
U 1 1 5FC55E43
P 10450 11300
AR Path="/5F79F49D/5FC55E43" Ref="UCJ151"  Part="1" 
AR Path="/5FC16B93/5FC17149/5FC55E43" Ref="UCJ151"  Part="1" 
F 0 "UCJ151" H 10450 11617 50  0000 C CNN
F 1 "NOR03" H 10450 11526 50  0000 C CNN
F 2 "" H 10450 11300 50  0001 C CNN
F 3 "" H 10450 11300 50  0001 C CNN
	1    10450 11300
	1    0    0    -1  
$EndComp
$Comp
L A5C:INV01 UCJ188
U 1 1 5FC55E92
P 11200 8750
AR Path="/5F79F49D/5FC55E92" Ref="UCJ188"  Part="1" 
AR Path="/5FC16B93/5FC17149/5FC55E92" Ref="UCJ188"  Part="1" 
F 0 "UCJ188" H 11200 8433 50  0000 C CNN
F 1 "INV01" H 11200 8524 50  0000 C CNN
F 2 "" H 11200 8550 50  0001 C CNN
F 3 "" H 11200 8550 50  0001 C CNN
	1    11200 8750
	1    0    0    1   
$EndComp
$Comp
L A5C:INV01 UBZ199
U 1 1 5FA6D130
P 12350 5450
AR Path="/5F79F49D/5FA6D130" Ref="UBZ199"  Part="1" 
AR Path="/5FC16B93/5FC17149/5FA6D130" Ref="UBZ199"  Part="1" 
F 0 "UBZ199" H 12350 5133 50  0000 C CNN
F 1 "INV01" H 12350 5224 50  0000 C CNN
F 2 "" H 12350 5250 50  0001 C CNN
F 3 "" H 12350 5250 50  0001 C CNN
	1    12350 5450
	-1   0    0    1   
$EndComp
$Comp
L A5C:INV01 UBU328
U 1 1 636AC7C4
P 12750 7100
AR Path="/5F79F49D/636AC7C4" Ref="UBU328"  Part="1" 
AR Path="/5FC16B93/5FC17149/636AC7C4" Ref="UBU328"  Part="1" 
F 0 "UBU328" H 12750 6783 50  0000 C CNN
F 1 "INV01" H 12750 6874 50  0000 C CNN
F 2 "" H 12750 6900 50  0001 C CNN
F 3 "" H 12750 6900 50  0001 C CNN
	1    12750 7100
	1    0    0    1   
$EndComp
$Comp
L A5C:INV01 UBU180
U 1 1 63938386
P 13350 8750
AR Path="/5F79F49D/63938386" Ref="UBU180"  Part="1" 
AR Path="/5FC16B93/5FC17149/63938386" Ref="UBU180"  Part="1" 
F 0 "UBU180" H 13350 9067 50  0000 C CNN
F 1 "INV01" H 13350 8976 50  0000 C CNN
F 2 "" H 13350 8550 50  0001 C CNN
F 3 "" H 13350 8550 50  0001 C CNN
	1    13350 8750
	1    0    0    -1  
$EndComp
$Comp
L A5C:INV01 UCG166
U 1 1 63938392
P 13350 9250
AR Path="/5F79F49D/63938392" Ref="UCG166"  Part="1" 
AR Path="/5FC16B93/5FC17149/63938392" Ref="UCG166"  Part="1" 
F 0 "UCG166" H 13350 9567 50  0000 C CNN
F 1 "INV01" H 13350 9476 50  0000 C CNN
F 2 "" H 13350 9050 50  0001 C CNN
F 3 "" H 13350 9050 50  0001 C CNN
	1    13350 9250
	1    0    0    -1  
$EndComp
$Comp
L A5C:INV01 UCC130
U 1 1 61ED64FE
P 15150 5450
AR Path="/5F79F49D/61ED64FE" Ref="UCC130"  Part="1" 
AR Path="/5FC16B93/5FC17149/61ED64FE" Ref="UCC130"  Part="1" 
F 0 "UCC130" H 15150 5133 50  0000 C CNN
F 1 "INV01" H 15150 5224 50  0000 C CNN
F 2 "" H 15150 5250 50  0001 C CNN
F 3 "" H 15150 5250 50  0001 C CNN
	1    15150 5450
	1    0    0    1   
$EndComp
$Comp
L A5C:BUF12 UBW154
U 1 1 61ED648A
P 18700 6700
AR Path="/5F79F49D/61ED648A" Ref="UBW154"  Part="1" 
AR Path="/5FC16B93/5FC17149/61ED648A" Ref="UBW154"  Part="1" 
F 0 "UBW154" H 18700 7017 50  0000 C CNN
F 1 "BUF12" H 18700 6926 50  0000 C CNN
F 2 "" H 18700 6700 50  0001 C CNN
F 3 "" H 18700 6700 50  0001 C CNN
	1    18700 6700
	1    0    0    -1  
$EndComp
$Comp
L A5C:BUF12 UCG?
U 1 1 62AECF8B
P 18700 7350
AR Path="/62AECF8B" Ref="UCG?"  Part="1" 
AR Path="/5F79F49D/62AECF8B" Ref="UCG283"  Part="1" 
AR Path="/5FC16B93/5FC17149/62AECF8B" Ref="UCG283"  Part="1" 
F 0 "UCG283" H 18700 7667 50  0000 C CNN
F 1 "BUF12" H 18700 7576 50  0000 C CNN
F 2 "" H 18700 7350 50  0001 C CNN
F 3 "" H 18700 7350 50  0001 C CNN
	1    18700 7350
	1    0    0    -1  
$EndComp
$Comp
L A5C:BUF12 UBZ?
U 1 1 62C610D0
P 18700 8000
AR Path="/62C610D0" Ref="UBZ?"  Part="1" 
AR Path="/5F79F49D/62C610D0" Ref="UBZ131"  Part="1" 
AR Path="/5FC16B93/5FC17149/62C610D0" Ref="UBZ131"  Part="1" 
F 0 "UBZ131" H 18700 8316 50  0000 C CNN
F 1 "BUF12" H 18700 8225 50  0000 C CNN
F 2 "" H 18700 8000 50  0001 C CNN
F 3 "" H 18700 8000 50  0001 C CNN
	1    18700 8000
	1    0    0    -1  
$EndComp
$Comp
L A5C:BUF12 UBW278
U 1 1 61ED64A6
P 18700 8650
AR Path="/5F79F49D/61ED64A6" Ref="UBW278"  Part="1" 
AR Path="/5FC16B93/5FC17149/61ED64A6" Ref="UBW278"  Part="1" 
F 0 "UBW278" H 18700 8967 50  0000 C CNN
F 1 "BUF12" H 18700 8876 50  0000 C CNN
F 2 "" H 18700 8650 50  0001 C CNN
F 3 "" H 18700 8650 50  0001 C CNN
	1    18700 8650
	1    0    0    -1  
$EndComp
$Comp
L A5C:BUF12 UCC192
U 1 1 61ED64B2
P 18700 10600
AR Path="/5F79F49D/61ED64B2" Ref="UCC192"  Part="1" 
AR Path="/5FC16B93/5FC17149/61ED64B2" Ref="UCC192"  Part="1" 
F 0 "UCC192" H 18700 10917 50  0000 C CNN
F 1 "BUF12" H 18700 10826 50  0000 C CNN
F 2 "" H 18700 10600 50  0001 C CNN
F 3 "" H 18700 10600 50  0001 C CNN
	1    18700 10600
	1    0    0    -1  
$EndComp
$Comp
L A5C:BUF12 UCC172
U 1 1 61ED64B8
P 18700 11250
AR Path="/5F79F49D/61ED64B8" Ref="UCC172"  Part="1" 
AR Path="/5FC16B93/5FC17149/61ED64B8" Ref="UCC172"  Part="1" 
F 0 "UCC172" H 18700 11567 50  0000 C CNN
F 1 "BUF12" H 18700 11476 50  0000 C CNN
F 2 "" H 18700 11250 50  0001 C CNN
F 3 "" H 18700 11250 50  0001 C CNN
	1    18700 11250
	1    0    0    -1  
$EndComp
$Comp
L A5C:BUF12 UCC198
U 1 1 61ED64BE
P 18700 11900
AR Path="/5F79F49D/61ED64BE" Ref="UCC198"  Part="1" 
AR Path="/5FC16B93/5FC17149/61ED64BE" Ref="UCC198"  Part="1" 
F 0 "UCC198" H 18700 12217 50  0000 C CNN
F 1 "BUF12" H 18700 12126 50  0000 C CNN
F 2 "" H 18700 11900 50  0001 C CNN
F 3 "" H 18700 11900 50  0001 C CNN
	1    18700 11900
	1    0    0    -1  
$EndComp
$Comp
L A5C:BUF12 UCJ217
U 1 1 61ED64C4
P 18700 12550
AR Path="/5F79F49D/61ED64C4" Ref="UCJ217"  Part="1" 
AR Path="/5FC16B93/5FC17149/61ED64C4" Ref="UCJ217"  Part="1" 
F 0 "UCJ217" H 18700 12867 50  0000 C CNN
F 1 "BUF12" H 18700 12776 50  0000 C CNN
F 2 "" H 18700 12550 50  0001 C CNN
F 3 "" H 18700 12550 50  0001 C CNN
	1    18700 12550
	1    0    0    -1  
$EndComp
$Comp
L A5C:NOR03 UBZ138
U 1 1 61ED63CC
P 20550 7400
AR Path="/5F79F49D/61ED63CC" Ref="UBZ138"  Part="1" 
AR Path="/5FC16B93/5FC17149/61ED63CC" Ref="UBZ138"  Part="1" 
F 0 "UBZ138" H 20550 7717 50  0000 C CNN
F 1 "NOR03" H 20550 7626 50  0000 C CNN
F 2 "" H 20550 7400 50  0001 C CNN
F 3 "" H 20550 7400 50  0001 C CNN
	1    20550 7400
	1    0    0    -1  
$EndComp
$Comp
L A5C:NOR03 UCC147
U 1 1 61ED6430
P 20550 11300
AR Path="/5F79F49D/61ED6430" Ref="UCC147"  Part="1" 
AR Path="/5FC16B93/5FC17149/61ED6430" Ref="UCC147"  Part="1" 
F 0 "UCC147" H 20550 11617 50  0000 C CNN
F 1 "NOR03" H 20550 11526 50  0000 C CNN
F 2 "" H 20550 11300 50  0001 C CNN
F 3 "" H 20550 11300 50  0001 C CNN
	1    20550 11300
	1    0    0    -1  
$EndComp
$Comp
L A5C:INV01 UCC141
U 1 1 61ED647F
P 21300 8750
AR Path="/5F79F49D/61ED647F" Ref="UCC141"  Part="1" 
AR Path="/5FC16B93/5FC17149/61ED647F" Ref="UCC141"  Part="1" 
F 0 "UCC141" H 21300 8433 50  0000 C CNN
F 1 "INV01" H 21300 8524 50  0000 C CNN
F 2 "" H 21300 8550 50  0001 C CNN
F 3 "" H 21300 8550 50  0001 C CNN
	1    21300 8750
	1    0    0    1   
$EndComp
$Comp
L A5C:DFFCOO UBU446
U 1 1 61CD1613
P 2150 11350
AR Path="/5F79F49D/61CD1613" Ref="UBU446"  Part="1" 
AR Path="/5FC16B93/5FC17149/61CD1613" Ref="UBU446"  Part="1" 
F 0 "UBU446" H 2150 11715 50  0000 C CNN
F 1 "DFFCOO" H 2150 11624 50  0000 C CNN
F 2 "" H 2150 11350 50  0001 C CNN
F 3 "" H 2150 11350 50  0001 C CNN
F 4 "UBU444" H 2150 11350 50  0001 C CNN "MiscRef"
	1    2150 11350
	1    0    0    -1  
$EndComp
$Comp
L A5C:DFFCOO UCG275
U 1 1 5FD7C581
P 8050 6700
AR Path="/5F79F49D/5FD7C581" Ref="UCG275"  Part="1" 
AR Path="/5FC16B93/5FC17149/5FD7C581" Ref="UCG275"  Part="1" 
F 0 "UCG275" H 8050 7065 50  0000 C CNN
F 1 "DFFCOO" H 8050 6974 50  0000 C CNN
F 2 "" H 8050 6700 50  0001 C CNN
F 3 "" H 8050 6700 50  0001 C CNN
	1    8050 6700
	1    0    0    -1  
$EndComp
$Comp
L A5C:DFFCOO UBZ234
U 1 1 5FD6C6CF
P 8050 7350
AR Path="/5F79F49D/5FD6C6CF" Ref="UBZ234"  Part="1" 
AR Path="/5FC16B93/5FC17149/5FD6C6CF" Ref="UBZ234"  Part="1" 
F 0 "UBZ234" H 8050 7715 50  0000 C CNN
F 1 "DFFCOO" H 8050 7624 50  0000 C CNN
F 2 "" H 8050 7350 50  0001 C CNN
F 3 "" H 8050 7350 50  0001 C CNN
	1    8050 7350
	1    0    0    -1  
$EndComp
$Comp
L A5C:DFFCOO UCC269
U 1 1 5FD77299
P 8050 8000
AR Path="/5F79F49D/5FD77299" Ref="UCC269"  Part="1" 
AR Path="/5FC16B93/5FC17149/5FD77299" Ref="UCC269"  Part="1" 
F 0 "UCC269" H 8050 8365 50  0000 C CNN
F 1 "DFFCOO" H 8050 8274 50  0000 C CNN
F 2 "" H 8050 8000 50  0001 C CNN
F 3 "" H 8050 8000 50  0001 C CNN
	1    8050 8000
	1    0    0    -1  
$EndComp
$Comp
L A5C:DFFCOO UBZ243
U 1 1 5FD72074
P 8050 8650
AR Path="/5F79F49D/5FD72074" Ref="UBZ243"  Part="1" 
AR Path="/5FC16B93/5FC17149/5FD72074" Ref="UBZ243"  Part="1" 
F 0 "UBZ243" H 8050 9015 50  0000 C CNN
F 1 "DFFCOO" H 8050 8924 50  0000 C CNN
F 2 "" H 8050 8650 50  0001 C CNN
F 3 "" H 8050 8650 50  0001 C CNN
	1    8050 8650
	1    0    0    -1  
$EndComp
$Comp
L A5C:DFFCOO UCL186
U 1 1 5FD85CB4
P 8050 10600
AR Path="/5F79F49D/5FD85CB4" Ref="UCL186"  Part="1" 
AR Path="/5FC16B93/5FC17149/5FD85CB4" Ref="UCL186"  Part="1" 
F 0 "UCL186" H 8050 10965 50  0000 C CNN
F 1 "DFFCOO" H 8050 10874 50  0000 C CNN
F 2 "" H 8050 10600 50  0001 C CNN
F 3 "" H 8050 10600 50  0001 C CNN
	1    8050 10600
	1    0    0    -1  
$EndComp
$Comp
L A5C:DFFCOO UCL207
U 1 1 5FD8D64D
P 8050 11250
AR Path="/5F79F49D/5FD8D64D" Ref="UCL207"  Part="1" 
AR Path="/5FC16B93/5FC17149/5FD8D64D" Ref="UCL207"  Part="1" 
F 0 "UCL207" H 8050 11615 50  0000 C CNN
F 1 "DFFCOO" H 8050 11524 50  0000 C CNN
F 2 "" H 8050 11250 50  0001 C CNN
F 3 "" H 8050 11250 50  0001 C CNN
	1    8050 11250
	1    0    0    -1  
$EndComp
$Comp
L A5C:DFFCOO UCJ162
U 1 1 5FD920AA
P 8050 11900
AR Path="/5F79F49D/5FD920AA" Ref="UCJ162"  Part="1" 
AR Path="/5FC16B93/5FC17149/5FD920AA" Ref="UCJ162"  Part="1" 
F 0 "UCJ162" H 8050 12265 50  0000 C CNN
F 1 "DFFCOO" H 8050 12174 50  0000 C CNN
F 2 "" H 8050 11900 50  0001 C CNN
F 3 "" H 8050 11900 50  0001 C CNN
	1    8050 11900
	1    0    0    -1  
$EndComp
$Comp
L A5C:DFFCOO UCJ222
U 1 1 5FD96D46
P 8050 12550
AR Path="/5F79F49D/5FD96D46" Ref="UCJ222"  Part="1" 
AR Path="/5FC16B93/5FC17149/5FD96D46" Ref="UCJ222"  Part="1" 
F 0 "UCJ222" H 8050 12915 50  0000 C CNN
F 1 "DFFCOO" H 8050 12824 50  0000 C CNN
F 2 "" H 8050 12550 50  0001 C CNN
F 3 "" H 8050 12550 50  0001 C CNN
	1    8050 12550
	1    0    0    -1  
$EndComp
$Comp
L A5C:DFFCOO UCJ280
U 1 1 6017A4F0
P 8050 13550
AR Path="/5F79F49D/6017A4F0" Ref="UCJ280"  Part="1" 
AR Path="/5FC16B93/5FC17149/6017A4F0" Ref="UCJ280"  Part="1" 
F 0 "UCJ280" H 8050 13915 50  0000 C CNN
F 1 "DFFCOO" H 8050 13824 50  0000 C CNN
F 2 "" H 8050 13550 50  0001 C CNN
F 3 "" H 8050 13550 50  0001 C CNN
	1    8050 13550
	1    0    0    -1  
$EndComp
$Comp
L A5C:DFFCOO UBU370
U 1 1 63767469
P 13300 7200
AR Path="/5F79F49D/63767469" Ref="UBU370"  Part="1" 
AR Path="/5FC16B93/5FC17149/63767469" Ref="UBU370"  Part="1" 
F 0 "UBU370" H 13300 7565 50  0000 C CNN
F 1 "DFFCOO" H 13300 7474 50  0000 C CNN
F 2 "" H 13300 7200 50  0001 C CNN
F 3 "" H 13300 7200 50  0001 C CNN
F 4 "UBU369" H 13300 7200 50  0001 C CNN "MiscRef"
	1    13300 7200
	1    0    0    -1  
$EndComp
$Comp
L A5C:DFFCOO UBW150
U 1 1 5FD9BE4D
P 18150 6700
AR Path="/5F79F49D/5FD9BE4D" Ref="UBW150"  Part="1" 
AR Path="/5FC16B93/5FC17149/5FD9BE4D" Ref="UBW150"  Part="1" 
F 0 "UBW150" H 18150 7065 50  0000 C CNN
F 1 "DFFCOO" H 18150 6974 50  0000 C CNN
F 2 "" H 18150 6700 50  0001 C CNN
F 3 "" H 18150 6700 50  0001 C CNN
	1    18150 6700
	1    0    0    -1  
$EndComp
$Comp
L A5C:DFFCOO UCC181
U 1 1 5FDA16CE
P 18150 7350
AR Path="/5F79F49D/5FDA16CE" Ref="UCC181"  Part="1" 
AR Path="/5FC16B93/5FC17149/5FDA16CE" Ref="UCC181"  Part="1" 
F 0 "UCC181" H 18150 7715 50  0000 C CNN
F 1 "DFFCOO" H 18150 7624 50  0000 C CNN
F 2 "" H 18150 7350 50  0001 C CNN
F 3 "" H 18150 7350 50  0001 C CNN
	1    18150 7350
	1    0    0    -1  
$EndComp
$Comp
L A5C:DFFCOO UBZ126
U 1 1 5FDA6745
P 18150 8000
AR Path="/5F79F49D/5FDA6745" Ref="UBZ126"  Part="1" 
AR Path="/5FC16B93/5FC17149/5FDA6745" Ref="UBZ126"  Part="1" 
F 0 "UBZ126" H 18150 8365 50  0000 C CNN
F 1 "DFFCOO" H 18150 8274 50  0000 C CNN
F 2 "" H 18150 8000 50  0001 C CNN
F 3 "" H 18150 8000 50  0001 C CNN
	1    18150 8000
	1    0    0    -1  
$EndComp
$Comp
L A5C:DFFCOO UBZ187
U 1 1 5FDAEAA9
P 18150 8650
AR Path="/5F79F49D/5FDAEAA9" Ref="UBZ187"  Part="1" 
AR Path="/5FC16B93/5FC17149/5FDAEAA9" Ref="UBZ187"  Part="1" 
F 0 "UBZ187" H 18150 9015 50  0000 C CNN
F 1 "DFFCOO" H 18150 8924 50  0000 C CNN
F 2 "" H 18150 8650 50  0001 C CNN
F 3 "" H 18150 8650 50  0001 C CNN
	1    18150 8650
	1    0    0    -1  
$EndComp
$Comp
L A5C:DFFCOO UCC176
U 1 1 5FDB3E66
P 18150 10600
AR Path="/5F79F49D/5FDB3E66" Ref="UCC176"  Part="1" 
AR Path="/5FC16B93/5FC17149/5FDB3E66" Ref="UCC176"  Part="1" 
F 0 "UCC176" H 18150 10965 50  0000 C CNN
F 1 "DFFCOO" H 18150 10874 50  0000 C CNN
F 2 "" H 18150 10600 50  0001 C CNN
F 3 "" H 18150 10600 50  0001 C CNN
	1    18150 10600
	1    0    0    -1  
$EndComp
$Comp
L A5C:DFFCOO UBZ150
U 1 1 5FDB93DF
P 18150 11250
AR Path="/5F79F49D/5FDB93DF" Ref="UBZ150"  Part="1" 
AR Path="/5FC16B93/5FC17149/5FDB93DF" Ref="UBZ150"  Part="1" 
F 0 "UBZ150" H 18150 11615 50  0000 C CNN
F 1 "DFFCOO" H 18150 11524 50  0000 C CNN
F 2 "" H 18150 11250 50  0001 C CNN
F 3 "" H 18150 11250 50  0001 C CNN
	1    18150 11250
	1    0    0    -1  
$EndComp
$Comp
L A5C:DFFCOO UCC161
U 1 1 5FDBEA8E
P 18150 11900
AR Path="/5F79F49D/5FDBEA8E" Ref="UCC161"  Part="1" 
AR Path="/5FC16B93/5FC17149/5FDBEA8E" Ref="UCC161"  Part="1" 
F 0 "UCC161" H 18150 12265 50  0000 C CNN
F 1 "DFFCOO" H 18150 12174 50  0000 C CNN
F 2 "" H 18150 11900 50  0001 C CNN
F 3 "" H 18150 11900 50  0001 C CNN
	1    18150 11900
	1    0    0    -1  
$EndComp
$Comp
L A5C:DFFCOO UCG161
U 1 1 5FDC7705
P 18150 12550
AR Path="/5F79F49D/5FDC7705" Ref="UCG161"  Part="1" 
AR Path="/5FC16B93/5FC17149/5FDC7705" Ref="UCG161"  Part="1" 
F 0 "UCG161" H 18150 12915 50  0000 C CNN
F 1 "DFFCOO" H 18150 12824 50  0000 C CNN
F 2 "" H 18150 12550 50  0001 C CNN
F 3 "" H 18150 12550 50  0001 C CNN
	1    18150 12550
	1    0    0    -1  
$EndComp
$Comp
L A5C:NOR04 UBZ205
U 1 1 5F9A41B3
P 10450 8000
AR Path="/5F79F49D/5F9A41B3" Ref="UBZ205"  Part="1" 
AR Path="/5FC16B93/5FC17149/5F9A41B3" Ref="UBZ205"  Part="1" 
F 0 "UBZ205" H 10450 8342 50  0000 C CNN
F 1 "NOR04" H 10450 8251 50  0000 C CNN
F 2 "" H 10450 8000 50  0001 C CNN
F 3 "" H 10450 8000 50  0001 C CNN
	1    10450 8000
	1    0    0    -1  
$EndComp
$Comp
L A5C:NOR04 UCJ147
U 1 1 5FC55E5D
P 10450 11900
AR Path="/5F79F49D/5FC55E5D" Ref="UCJ147"  Part="1" 
AR Path="/5FC16B93/5FC17149/5FC55E5D" Ref="UCJ147"  Part="1" 
F 0 "UCJ147" H 10450 12242 50  0000 C CNN
F 1 "NOR04" H 10450 12151 50  0000 C CNN
F 2 "" H 10450 11900 50  0001 C CNN
F 3 "" H 10450 11900 50  0001 C CNN
	1    10450 11900
	1    0    0    -1  
$EndComp
$Comp
L A5C:NOR04 UBZ141
U 1 1 61ED63E5
P 20550 8000
AR Path="/5F79F49D/61ED63E5" Ref="UBZ141"  Part="1" 
AR Path="/5FC16B93/5FC17149/61ED63E5" Ref="UBZ141"  Part="1" 
F 0 "UBZ141" H 20550 8342 50  0000 C CNN
F 1 "NOR04" H 20550 8251 50  0000 C CNN
F 2 "" H 20550 8000 50  0001 C CNN
F 3 "" H 20550 8000 50  0001 C CNN
	1    20550 8000
	1    0    0    -1  
$EndComp
$Comp
L A5C:NOR04 UCC153
U 1 1 61ED6449
P 20550 11900
AR Path="/5F79F49D/61ED6449" Ref="UCC153"  Part="1" 
AR Path="/5FC16B93/5FC17149/61ED6449" Ref="UCC153"  Part="1" 
F 0 "UCC153" H 20550 12242 50  0000 C CNN
F 1 "NOR04" H 20550 12151 50  0000 C CNN
F 2 "" H 20550 11900 50  0001 C CNN
F 3 "" H 20550 11900 50  0001 C CNN
	1    20550 11900
	1    0    0    -1  
$EndComp
$Comp
L A5C:AOI22 UCC264
U 1 1 5FD412A8
P 7150 6550
AR Path="/5F79F49D/5FD412A8" Ref="UCC264"  Part="1" 
AR Path="/5FC16B93/5FC17149/5FD412A8" Ref="UCC264"  Part="1" 
F 0 "UCC264" H 7175 6867 50  0000 C CNN
F 1 "AOI22" H 7175 6776 50  0000 C CNN
F 2 "" H 7300 6550 50  0001 C CNN
F 3 "" H 7300 6550 50  0001 C CNN
	1    7150 6550
	1    0    0    -1  
$EndComp
$Comp
L A5C:AOI22 UBZ232
U 1 1 5FD61533
P 7150 7200
AR Path="/5F79F49D/5FD61533" Ref="UBZ232"  Part="1" 
AR Path="/5FC16B93/5FC17149/5FD61533" Ref="UBZ232"  Part="1" 
F 0 "UBZ232" H 7175 7517 50  0000 C CNN
F 1 "AOI22" H 7175 7426 50  0000 C CNN
F 2 "" H 7300 7200 50  0001 C CNN
F 3 "" H 7300 7200 50  0001 C CNN
	1    7150 7200
	1    0    0    -1  
$EndComp
$Comp
L A5C:AOI22 UBZ269
U 1 1 5FD417FA
P 7150 7850
AR Path="/5F79F49D/5FD417FA" Ref="UBZ269"  Part="1" 
AR Path="/5FC16B93/5FC17149/5FD417FA" Ref="UBZ269"  Part="1" 
F 0 "UBZ269" H 7175 8167 50  0000 C CNN
F 1 "AOI22" H 7175 8076 50  0000 C CNN
F 2 "" H 7300 7850 50  0001 C CNN
F 3 "" H 7300 7850 50  0001 C CNN
	1    7150 7850
	1    0    0    -1  
$EndComp
$Comp
L A5C:AOI22 UBZ240
U 1 1 5FD48608
P 7150 8500
AR Path="/5F79F49D/5FD48608" Ref="UBZ240"  Part="1" 
AR Path="/5FC16B93/5FC17149/5FD48608" Ref="UBZ240"  Part="1" 
F 0 "UBZ240" H 7175 8817 50  0000 C CNN
F 1 "AOI22" H 7175 8726 50  0000 C CNN
F 2 "" H 7300 8500 50  0001 C CNN
F 3 "" H 7300 8500 50  0001 C CNN
	1    7150 8500
	1    0    0    -1  
$EndComp
$Comp
L A5C:AOI22 UCJ185
U 1 1 5FD4926C
P 7150 10450
AR Path="/5F79F49D/5FD4926C" Ref="UCJ185"  Part="1" 
AR Path="/5FC16B93/5FC17149/5FD4926C" Ref="UCJ185"  Part="1" 
F 0 "UCJ185" H 7175 10767 50  0000 C CNN
F 1 "AOI22" H 7175 10676 50  0000 C CNN
F 2 "" H 7300 10450 50  0001 C CNN
F 3 "" H 7300 10450 50  0001 C CNN
	1    7150 10450
	1    0    0    -1  
$EndComp
$Comp
L A5C:AOI22 UCL202
U 1 1 5FD49D7E
P 7150 11100
AR Path="/5F79F49D/5FD49D7E" Ref="UCL202"  Part="1" 
AR Path="/5FC16B93/5FC17149/5FD49D7E" Ref="UCL202"  Part="1" 
F 0 "UCL202" H 7175 11417 50  0000 C CNN
F 1 "AOI22" H 7175 11326 50  0000 C CNN
F 2 "" H 7300 11100 50  0001 C CNN
F 3 "" H 7300 11100 50  0001 C CNN
	1    7150 11100
	1    0    0    -1  
$EndComp
$Comp
L A5C:AOI22 UCJ180
U 1 1 5FD4A492
P 7150 11750
AR Path="/5F79F49D/5FD4A492" Ref="UCJ180"  Part="1" 
AR Path="/5FC16B93/5FC17149/5FD4A492" Ref="UCJ180"  Part="1" 
F 0 "UCJ180" H 7175 12067 50  0000 C CNN
F 1 "AOI22" H 7175 11976 50  0000 C CNN
F 2 "" H 7300 11750 50  0001 C CNN
F 3 "" H 7300 11750 50  0001 C CNN
	1    7150 11750
	1    0    0    -1  
$EndComp
$Comp
L A5C:AOI22 UCJ182
U 1 1 5FD4AB5F
P 7150 12400
AR Path="/5F79F49D/5FD4AB5F" Ref="UCJ182"  Part="1" 
AR Path="/5FC16B93/5FC17149/5FD4AB5F" Ref="UCJ182"  Part="1" 
F 0 "UCJ182" H 7175 12717 50  0000 C CNN
F 1 "AOI22" H 7175 12626 50  0000 C CNN
F 2 "" H 7300 12400 50  0001 C CNN
F 3 "" H 7300 12400 50  0001 C CNN
	1    7150 12400
	1    0    0    -1  
$EndComp
$Comp
L A5C:AOI22 UCG405
U 1 1 5FD38BF4
P 7150 13400
AR Path="/5F79F49D/5FD38BF4" Ref="UCG405"  Part="1" 
AR Path="/5FC16B93/5FC17149/5FD38BF4" Ref="UCG405"  Part="1" 
F 0 "UCG405" H 7175 13717 50  0000 C CNN
F 1 "AOI22" H 7175 13626 50  0000 C CNN
F 2 "" H 7300 13400 50  0001 C CNN
F 3 "" H 7300 13400 50  0001 C CNN
	1    7150 13400
	1    0    0    -1  
$EndComp
$Comp
L A5C:AOI22 UBW177
U 1 1 5FD4E549
P 17250 6550
AR Path="/5F79F49D/5FD4E549" Ref="UBW177"  Part="1" 
AR Path="/5FC16B93/5FC17149/5FD4E549" Ref="UBW177"  Part="1" 
F 0 "UBW177" H 17275 6867 50  0000 C CNN
F 1 "AOI22" H 17275 6776 50  0000 C CNN
F 2 "" H 17400 6550 50  0001 C CNN
F 3 "" H 17400 6550 50  0001 C CNN
	1    17250 6550
	1    0    0    -1  
$EndComp
$Comp
L A5C:AOI22 UBZ179
U 1 1 5FD51E61
P 17250 7200
AR Path="/5F79F49D/5FD51E61" Ref="UBZ179"  Part="1" 
AR Path="/5FC16B93/5FC17149/5FD51E61" Ref="UBZ179"  Part="1" 
F 0 "UBZ179" H 17275 7517 50  0000 C CNN
F 1 "AOI22" H 17275 7426 50  0000 C CNN
F 2 "" H 17400 7200 50  0001 C CNN
F 3 "" H 17400 7200 50  0001 C CNN
	1    17250 7200
	1    0    0    -1  
$EndComp
$Comp
L A5C:AOI22 UBW180
U 1 1 5FD5975D
P 17250 7850
AR Path="/5F79F49D/5FD5975D" Ref="UBW180"  Part="1" 
AR Path="/5FC16B93/5FC17149/5FD5975D" Ref="UBW180"  Part="1" 
F 0 "UBW180" H 17275 8167 50  0000 C CNN
F 1 "AOI22" H 17275 8076 50  0000 C CNN
F 2 "" H 17400 7850 50  0001 C CNN
F 3 "" H 17400 7850 50  0001 C CNN
	1    17250 7850
	1    0    0    -1  
$EndComp
$Comp
L A5C:AOI22 UBZ185
U 1 1 5FD59F8B
P 17250 8500
AR Path="/5F79F49D/5FD59F8B" Ref="UBZ185"  Part="1" 
AR Path="/5FC16B93/5FC17149/5FD59F8B" Ref="UBZ185"  Part="1" 
F 0 "UBZ185" H 17275 8817 50  0000 C CNN
F 1 "AOI22" H 17275 8726 50  0000 C CNN
F 2 "" H 17400 8500 50  0001 C CNN
F 3 "" H 17400 8500 50  0001 C CNN
	1    17250 8500
	1    0    0    -1  
$EndComp
$Comp
L A5C:AOI22 UCC174
U 1 1 5FD5DACE
P 17250 10450
AR Path="/5F79F49D/5FD5DACE" Ref="UCC174"  Part="1" 
AR Path="/5FC16B93/5FC17149/5FD5DACE" Ref="UCC174"  Part="1" 
F 0 "UCC174" H 17275 10767 50  0000 C CNN
F 1 "AOI22" H 17275 10676 50  0000 C CNN
F 2 "" H 17400 10450 50  0001 C CNN
F 3 "" H 17400 10450 50  0001 C CNN
	1    17250 10450
	1    0    0    -1  
$EndComp
$Comp
L A5C:AOI22 UBZ171
U 1 1 5FD5DF80
P 17250 11100
AR Path="/5F79F49D/5FD5DF80" Ref="UBZ171"  Part="1" 
AR Path="/5FC16B93/5FC17149/5FD5DF80" Ref="UBZ171"  Part="1" 
F 0 "UBZ171" H 17275 11417 50  0000 C CNN
F 1 "AOI22" H 17275 11326 50  0000 C CNN
F 2 "" H 17400 11100 50  0001 C CNN
F 3 "" H 17400 11100 50  0001 C CNN
	1    17250 11100
	1    0    0    -1  
$EndComp
$Comp
L A5C:AOI22 UBZ159
U 1 1 5FD5E58C
P 17250 11750
AR Path="/5F79F49D/5FD5E58C" Ref="UBZ159"  Part="1" 
AR Path="/5FC16B93/5FC17149/5FD5E58C" Ref="UBZ159"  Part="1" 
F 0 "UBZ159" H 17275 12067 50  0000 C CNN
F 1 "AOI22" H 17275 11976 50  0000 C CNN
F 2 "" H 17400 11750 50  0001 C CNN
F 3 "" H 17400 11750 50  0001 C CNN
	1    17250 11750
	1    0    0    -1  
$EndComp
$Comp
L A5C:AOI22 UBZ162
U 1 1 5FD60F4A
P 17250 12400
AR Path="/5F79F49D/5FD60F4A" Ref="UBZ162"  Part="1" 
AR Path="/5FC16B93/5FC17149/5FD60F4A" Ref="UBZ162"  Part="1" 
F 0 "UBZ162" H 17275 12717 50  0000 C CNN
F 1 "AOI22" H 17275 12626 50  0000 C CNN
F 2 "" H 17400 12400 50  0001 C CNN
F 3 "" H 17400 12400 50  0001 C CNN
	1    17250 12400
	1    0    0    -1  
$EndComp
$Comp
L A5C:NOR05 UBZ200
U 1 1 5F9E7706
P 10450 8750
AR Path="/5F79F49D/5F9E7706" Ref="UBZ200"  Part="1" 
AR Path="/5FC16B93/5FC17149/5F9E7706" Ref="UBZ200"  Part="1" 
F 0 "UBZ200" H 10525 9165 50  0000 C CNN
F 1 "NOR05" H 10525 9074 50  0000 C CNN
F 2 "" H 10450 8800 50  0001 C CNN
F 3 "" H 10450 8800 50  0001 C CNN
	1    10450 8750
	1    0    0    -1  
$EndComp
$Comp
L A5C:NOR05 UCJ172
U 1 1 5FC55E78
P 10450 12650
AR Path="/5F79F49D/5FC55E78" Ref="UCJ172"  Part="1" 
AR Path="/5FC16B93/5FC17149/5FC55E78" Ref="UCJ172"  Part="1" 
F 0 "UCJ172" H 10525 13065 50  0000 C CNN
F 1 "NOR05" H 10525 12974 50  0000 C CNN
F 2 "" H 10450 12700 50  0001 C CNN
F 3 "" H 10450 12700 50  0001 C CNN
	1    10450 12650
	1    0    0    -1  
$EndComp
$Comp
L A5C:NOR05 UCC131
U 1 1 61ED6400
P 20550 8750
AR Path="/5F79F49D/61ED6400" Ref="UCC131"  Part="1" 
AR Path="/5FC16B93/5FC17149/61ED6400" Ref="UCC131"  Part="1" 
F 0 "UCC131" H 20625 9165 50  0000 C CNN
F 1 "NOR05" H 20625 9074 50  0000 C CNN
F 2 "" H 20550 8800 50  0001 C CNN
F 3 "" H 20550 8800 50  0001 C CNN
	1    20550 8750
	1    0    0    -1  
$EndComp
$Comp
L A5C:NOR05 UCC144
U 1 1 61ED6464
P 20550 12650
AR Path="/5F79F49D/61ED6464" Ref="UCC144"  Part="1" 
AR Path="/5FC16B93/5FC17149/61ED6464" Ref="UCC144"  Part="1" 
F 0 "UCC144" H 20625 13065 50  0000 C CNN
F 1 "NOR05" H 20625 12974 50  0000 C CNN
F 2 "" H 20550 12700 50  0001 C CNN
F 3 "" H 20550 12700 50  0001 C CNN
	1    20550 12650
	1    0    0    -1  
$EndComp
$Comp
L A5C:M273C UBW?
U 1 1 5FCBCEE3
P 4650 2850
AR Path="/5FCBCEE3" Ref="UBW?"  Part="1" 
AR Path="/5F79F49D/5FCBCEE3" Ref="UBW457"  Part="1" 
AR Path="/5FC16B93/5FC17149/5FCBCEE3" Ref="UBW457"  Part="1" 
F 0 "UBW457" H 4650 3617 50  0000 C CNN
F 1 "M273C" H 4650 3526 50  0000 C CNN
F 2 "" H 4650 2850 50  0001 C CNN
F 3 "" H 4650 2850 50  0001 C CNN
F 4 "UBW455;UBW462;UBW466;UBW471;UBW475;UBW480;UBW484;UBW488;UBW493" H 4650 2850 50  0001 C CNN "MiscRef"
	1    4650 2850
	1    0    0    -1  
$EndComp
$Comp
L A5C:M273C UBN?
U 1 1 5FCBCEDD
P 4650 4300
AR Path="/5FCBCEDD" Ref="UBN?"  Part="1" 
AR Path="/5F79F49D/5FCBCEDD" Ref="UBN485"  Part="1" 
AR Path="/5FC16B93/5FC17149/5FCBCEDD" Ref="UBN485"  Part="1" 
F 0 "UBN485" H 4650 5067 50  0000 C CNN
F 1 "M273C" H 4650 4976 50  0000 C CNN
F 2 "" H 4650 4300 50  0001 C CNN
F 3 "" H 4650 4300 50  0001 C CNN
F 4 "UBN482;UBN489;UBN494;UBN498;UBN503;UBN507;UBN512;UBN516;UBN520" H 4650 4300 50  0001 C CNN "MiscRef"
	1    4650 4300
	1    0    0    -1  
$EndComp
Text Label 19050 12550 0    50   ~ 0
COL8
Text Label 19050 6700 0    50   ~ 0
COL1
Text Label 19050 7350 0    50   ~ 0
COL2
Text Label 19050 8000 0    50   ~ 0
COL3
Text Label 19050 8650 0    50   ~ 0
COL4
Text Label 19050 10600 0    50   ~ 0
COL5
Text Label 19050 11250 0    50   ~ 0
COL6
Text Label 19050 11900 0    50   ~ 0
COL7
Connection ~ 19400 9250
Text Label 8950 6700 0    50   ~ 0
LINE0
Text Label 8950 7350 0    50   ~ 0
LINE1
Text Label 8950 8000 0    50   ~ 0
LINE2
Text Label 8950 8650 0    50   ~ 0
LINE3
Text Label 8950 10600 0    50   ~ 0
LINE4
Text Label 8950 11250 0    50   ~ 0
LINE5
Text Label 8950 11900 0    50   ~ 0
LINE6
Text Label 8950 12550 0    50   ~ 0
LINE7
Text Label 8950 13550 0    50   ~ 0
LINE8
Connection ~ 9300 9250
Connection ~ 19650 8250
Connection ~ 19750 7600
Connection ~ 19850 6950
Connection ~ 19650 12150
Connection ~ 19750 11500
Connection ~ 19850 10850
$Comp
L A5C:XNOR02 UBZ225
U 1 1 5FD9F2DB
P 11050 6900
F 0 "UBZ225" H 11075 7167 50  0000 C CNN
F 1 "XNOR02" H 11075 7076 50  0000 C CNN
F 2 "" H 11075 6900 50  0001 C CNN
F 3 "" H 11075 6900 50  0001 C CNN
	1    11050 6900
	1    0    0    -1  
$EndComp
$Comp
L A5C:XNOR02 UBZ229
U 1 1 5FD9FA20
P 11050 7550
F 0 "UBZ229" H 11075 7817 50  0000 C CNN
F 1 "XNOR02" H 11075 7726 50  0000 C CNN
F 2 "" H 11075 7550 50  0001 C CNN
F 3 "" H 11075 7550 50  0001 C CNN
	1    11050 7550
	1    0    0    -1  
$EndComp
$Comp
L A5C:XNOR02 UBZ209
U 1 1 5FD9FCE7
P 11050 8200
F 0 "UBZ209" H 11075 8467 50  0000 C CNN
F 1 "XNOR02" H 11075 8376 50  0000 C CNN
F 2 "" H 11075 8200 50  0001 C CNN
F 3 "" H 11075 8200 50  0001 C CNN
	1    11050 8200
	1    0    0    -1  
$EndComp
$Comp
L A5C:XNOR02 UCL160
U 1 1 5FDA0413
P 11050 10800
F 0 "UCL160" H 11075 11067 50  0000 C CNN
F 1 "XNOR02" H 11075 10976 50  0000 C CNN
F 2 "" H 11075 10800 50  0001 C CNN
F 3 "" H 11075 10800 50  0001 C CNN
	1    11050 10800
	1    0    0    -1  
$EndComp
$Comp
L A5C:XNOR02 UCJ154
U 1 1 5FF437B0
P 11050 11450
F 0 "UCJ154" H 11075 11717 50  0000 C CNN
F 1 "XNOR02" H 11075 11626 50  0000 C CNN
F 2 "" H 11075 11450 50  0001 C CNN
F 3 "" H 11075 11450 50  0001 C CNN
	1    11050 11450
	1    0    0    -1  
$EndComp
$Comp
L A5C:XNOR02 UCJ167
U 1 1 5FF43987
P 11050 12100
F 0 "UCJ167" H 11075 12367 50  0000 C CNN
F 1 "XNOR02" H 11075 12276 50  0000 C CNN
F 2 "" H 11075 12100 50  0001 C CNN
F 3 "" H 11075 12100 50  0001 C CNN
	1    11050 12100
	1    0    0    -1  
$EndComp
$Comp
L A5C:XNOR02 UCJ278
U 1 1 5FF43B86
P 11300 13100
F 0 "UCJ278" H 11325 13367 50  0000 C CNN
F 1 "XNOR02" H 11325 13276 50  0000 C CNN
F 2 "" H 11325 13100 50  0001 C CNN
F 3 "" H 11325 13100 50  0001 C CNN
	1    11300 13100
	1    0    0    -1  
$EndComp
$Comp
L A5C:XNOR02 UBZ176
U 1 1 600E7951
P 21150 6900
F 0 "UBZ176" H 21175 7167 50  0000 C CNN
F 1 "XNOR02" H 21175 7076 50  0000 C CNN
F 2 "" H 21175 6900 50  0001 C CNN
F 3 "" H 21175 6900 50  0001 C CNN
	1    21150 6900
	1    0    0    -1  
$EndComp
$Comp
L A5C:XNOR02 UBZ135
U 1 1 600E7957
P 21150 7550
F 0 "UBZ135" H 21175 7817 50  0000 C CNN
F 1 "XNOR02" H 21175 7726 50  0000 C CNN
F 2 "" H 21175 7550 50  0001 C CNN
F 3 "" H 21175 7550 50  0001 C CNN
	1    21150 7550
	1    0    0    -1  
$EndComp
$Comp
L A5C:XNOR02 UBZ182
U 1 1 600E795D
P 21150 8200
F 0 "UBZ182" H 21175 8467 50  0000 C CNN
F 1 "XNOR02" H 21175 8376 50  0000 C CNN
F 2 "" H 21175 8200 50  0001 C CNN
F 3 "" H 21175 8200 50  0001 C CNN
	1    21150 8200
	1    0    0    -1  
$EndComp
$Comp
L A5C:XNOR02 UBZ168
U 1 1 6013BC9B
P 21150 10800
F 0 "UBZ168" H 21175 11067 50  0000 C CNN
F 1 "XNOR02" H 21175 10976 50  0000 C CNN
F 2 "" H 21175 10800 50  0001 C CNN
F 3 "" H 21175 10800 50  0001 C CNN
	1    21150 10800
	1    0    0    -1  
$EndComp
$Comp
L A5C:XNOR02 UCC139
U 1 1 6013BCA1
P 21150 11450
F 0 "UCC139" H 21175 11717 50  0000 C CNN
F 1 "XNOR02" H 21175 11626 50  0000 C CNN
F 2 "" H 21175 11450 50  0001 C CNN
F 3 "" H 21175 11450 50  0001 C CNN
	1    21150 11450
	1    0    0    -1  
$EndComp
$Comp
L A5C:XNOR02 UCC150
U 1 1 6013BCA7
P 21150 12100
F 0 "UCC150" H 21175 12367 50  0000 C CNN
F 1 "XNOR02" H 21175 12276 50  0000 C CNN
F 2 "" H 21175 12100 50  0001 C CNN
F 3 "" H 21175 12100 50  0001 C CNN
	1    21150 12100
	1    0    0    -1  
$EndComp
Wire Bus Line
	9300 6800 9300 9250
Wire Bus Line
	19400 6800 19400 9250
Wire Bus Line
	19400 9250 19400 12450
Wire Bus Line
	9300 9250 9300 13450
Wire Bus Line
	2450 2050 2450 4400
$EndSCHEMATC
