EESchema Schematic File Version 4
EELAYER 30 0
EELAYER END
$Descr A4 11693 8268
encoding utf-8
Sheet 13 83
Title "CPS Reverse Engineering: DL-0311"
Date "2021-09-12"
Rev ""
Comp ""
Comment1 ""
Comment2 ""
Comment3 "Licence: CC-BY"
Comment4 "Author: Loïc *WydD* Petit"
$EndDescr
Connection ~ 4200 4400
Connection ~ 8650 4400
Connection ~ 4200 5850
Connection ~ 1650 1450
Connection ~ 9950 1250
Entry Wire Line
	1650 1900 1750 2000
Entry Wire Line
	1650 2400 1750 2500
Entry Wire Line
	1650 2900 1750 3000
Entry Wire Line
	1650 3400 1750 3500
Entry Wire Line
	1650 3900 1750 4000
Entry Wire Line
	1650 4400 1750 4500
Entry Wire Line
	1650 4900 1750 5000
Entry Wire Line
	1650 5400 1750 5500
Entry Wire Line
	5400 2600 5500 2500
Entry Wire Line
	5400 2700 5500 2600
Entry Wire Line
	5400 2800 5500 2700
Entry Wire Line
	5400 2900 5500 2800
Entry Wire Line
	5400 4600 5500 4500
Entry Wire Line
	5400 4700 5500 4600
Entry Wire Line
	5400 4800 5500 4700
Entry Wire Line
	5400 4900 5500 4800
Entry Wire Line
	6100 1900 6200 2000
Entry Wire Line
	6100 2400 6200 2500
Entry Wire Line
	6100 2900 6200 3000
Entry Wire Line
	6100 3400 6200 3500
Entry Wire Line
	6100 3900 6200 4000
Entry Wire Line
	6100 4400 6200 4500
Entry Wire Line
	6100 4900 6200 5000
Entry Wire Line
	6100 5400 6200 5500
Entry Wire Line
	9850 2600 9950 2500
Entry Wire Line
	9850 2700 9950 2600
Entry Wire Line
	9850 2800 9950 2700
Entry Wire Line
	9850 2900 9950 2800
Entry Wire Line
	9850 4600 9950 4500
Entry Wire Line
	9850 4700 9950 4600
Entry Wire Line
	9850 4800 9950 4700
Entry Wire Line
	9850 4900 9950 4800
Wire Wire Line
	2000 2000 1750 2000
Wire Wire Line
	2000 2500 1750 2500
Wire Wire Line
	2000 3000 1750 3000
Wire Wire Line
	2000 3500 1750 3500
Wire Wire Line
	2000 4000 1750 4000
Wire Wire Line
	2000 4500 1750 4500
Wire Wire Line
	2000 5000 1750 5000
Wire Wire Line
	2000 5500 1750 5500
Wire Wire Line
	3800 2500 3900 2500
Wire Wire Line
	3800 3000 3900 3000
Wire Wire Line
	3800 3500 4000 3500
Wire Wire Line
	3800 4500 3900 4500
Wire Wire Line
	3800 5000 3900 5000
Wire Wire Line
	3800 5500 4000 5500
Wire Wire Line
	3900 2500 3900 2700
Wire Wire Line
	3900 2800 3900 3000
Wire Wire Line
	3900 2800 4300 2800
Wire Wire Line
	3900 4500 3900 4700
Wire Wire Line
	3900 4800 3900 5000
Wire Wire Line
	3900 4800 4300 4800
Wire Wire Line
	4000 2000 3800 2000
Wire Wire Line
	4000 2600 4000 2000
Wire Wire Line
	4000 3500 4000 2900
Wire Wire Line
	4000 4000 3800 4000
Wire Wire Line
	4000 4600 4000 4000
Wire Wire Line
	4000 5500 4000 4900
Wire Wire Line
	4200 2400 4200 4400
Wire Wire Line
	4200 4400 4200 5850
Wire Wire Line
	4200 5850 3550 5850
Wire Wire Line
	4300 2400 4200 2400
Wire Wire Line
	4300 2600 4000 2600
Wire Wire Line
	4300 2700 3900 2700
Wire Wire Line
	4300 2900 4000 2900
Wire Wire Line
	4300 4400 4200 4400
Wire Wire Line
	4300 4600 4000 4600
Wire Wire Line
	4300 4700 3900 4700
Wire Wire Line
	4300 4900 4000 4900
Wire Wire Line
	5100 2600 5400 2600
Wire Wire Line
	5100 2700 5400 2700
Wire Wire Line
	5100 2800 5400 2800
Wire Wire Line
	5100 2900 5400 2900
Wire Wire Line
	5100 4600 5400 4600
Wire Wire Line
	5100 4700 5400 4700
Wire Wire Line
	5100 4800 5400 4800
Wire Wire Line
	5100 4900 5400 4900
Wire Wire Line
	6450 2000 6200 2000
Wire Wire Line
	6450 2500 6200 2500
Wire Wire Line
	6450 3000 6200 3000
Wire Wire Line
	6450 3500 6200 3500
Wire Wire Line
	6450 4000 6200 4000
Wire Wire Line
	6450 4500 6200 4500
Wire Wire Line
	6450 5000 6200 5000
Wire Wire Line
	6450 5500 6200 5500
Wire Wire Line
	8250 2500 8350 2500
Wire Wire Line
	8250 3000 8350 3000
Wire Wire Line
	8250 3500 8450 3500
Wire Wire Line
	8250 4500 8350 4500
Wire Wire Line
	8250 5000 8350 5000
Wire Wire Line
	8250 5500 8450 5500
Wire Wire Line
	8350 2500 8350 2700
Wire Wire Line
	8350 2800 8350 3000
Wire Wire Line
	8350 2800 8750 2800
Wire Wire Line
	8350 4500 8350 4700
Wire Wire Line
	8350 4800 8350 5000
Wire Wire Line
	8350 4800 8750 4800
Wire Wire Line
	8450 2000 8250 2000
Wire Wire Line
	8450 2600 8450 2000
Wire Wire Line
	8450 3500 8450 2900
Wire Wire Line
	8450 4000 8250 4000
Wire Wire Line
	8450 4600 8450 4000
Wire Wire Line
	8450 5500 8450 4900
Wire Wire Line
	8650 2400 8650 4400
Wire Wire Line
	8650 4400 8650 5850
Wire Wire Line
	8650 5850 4200 5850
Wire Wire Line
	8750 2400 8650 2400
Wire Wire Line
	8750 2600 8450 2600
Wire Wire Line
	8750 2700 8350 2700
Wire Wire Line
	8750 2900 8450 2900
Wire Wire Line
	8750 4400 8650 4400
Wire Wire Line
	8750 4600 8450 4600
Wire Wire Line
	8750 4700 8350 4700
Wire Wire Line
	8750 4900 8450 4900
Wire Wire Line
	9550 2600 9850 2600
Wire Wire Line
	9550 2700 9850 2700
Wire Wire Line
	9550 2800 9850 2800
Wire Wire Line
	9550 2900 9850 2900
Wire Wire Line
	9550 4600 9850 4600
Wire Wire Line
	9550 4700 9850 4700
Wire Wire Line
	9550 4800 9850 4800
Wire Wire Line
	9550 4900 9850 4900
Wire Bus Line
	1650 1450 1300 1450
Wire Bus Line
	1650 1450 1650 5400
Wire Bus Line
	1650 1450 6100 1450
Wire Bus Line
	5500 1250 5500 4800
Wire Bus Line
	6100 1450 6100 5400
Wire Bus Line
	9950 1250 5500 1250
Wire Bus Line
	9950 1250 9950 4800
Wire Bus Line
	9950 1250 10250 1250
Text Label 2000 2000 2    50   ~ 0
IN0
Text Label 2000 2500 2    50   ~ 0
IN1
Text Label 2000 3000 2    50   ~ 0
IN2
Text Label 2000 3500 2    50   ~ 0
IN3
Text Label 2000 4000 2    50   ~ 0
IN4
Text Label 2000 4500 2    50   ~ 0
IN5
Text Label 2000 5000 2    50   ~ 0
IN6
Text Label 2000 5500 2    50   ~ 0
IN7
Text Label 5100 2600 0    50   ~ 0
~OUT0
Text Label 5100 2700 0    50   ~ 0
~OUT1
Text Label 5100 2800 0    50   ~ 0
~OUT2
Text Label 5100 2900 0    50   ~ 0
~OUT3
Text Label 5100 4600 0    50   ~ 0
~OUT4
Text Label 5100 4700 0    50   ~ 0
~OUT5
Text Label 5100 4800 0    50   ~ 0
~OUT6
Text Label 5100 4900 0    50   ~ 0
~OUT7
Text Label 6450 2000 2    50   ~ 0
IN8
Text Label 6450 2500 2    50   ~ 0
IN9
Text Label 6450 3000 2    50   ~ 0
IN10
Text Label 6450 3500 2    50   ~ 0
IN11
Text Label 6450 4000 2    50   ~ 0
IN12
Text Label 6450 4500 2    50   ~ 0
IN13
Text Label 6450 5000 2    50   ~ 0
IN14
Text Label 6450 5500 2    50   ~ 0
IN15
Text Label 9550 2600 0    50   ~ 0
~OUT8
Text Label 9550 2700 0    50   ~ 0
~OUT9
Text Label 9550 2800 0    50   ~ 0
~OUT10
Text Label 9550 2900 0    50   ~ 0
~OUT11
Text Label 9550 4600 0    50   ~ 0
~OUT12
Text Label 9550 4700 0    50   ~ 0
~OUT13
Text Label 9550 4800 0    50   ~ 0
~OUT14
Text Label 9550 4900 0    50   ~ 0
~OUT15
Text HLabel 1300 1450 0    50   Input ~ 0
IN[0..15]
Text HLabel 3550 5850 0    50   Input ~ 0
CLK
Text HLabel 10250 1250 2    50   Output ~ 0
~OUT[0..15]
$Comp
L power:VCC #PWR0196
U 1 1 6109EFCF
P 4300 2300
F 0 "#PWR0196" H 4300 2150 50  0001 C CNN
F 1 "VCC" H 4315 2473 50  0000 C CNN
F 2 "" H 4300 2300 50  0001 C CNN
F 3 "" H 4300 2300 50  0001 C CNN
	1    4300 2300
	1    0    0    -1  
$EndComp
$Comp
L power:VCC #PWR0197
U 1 1 610A0119
P 4300 4300
F 0 "#PWR0197" H 4300 4150 50  0001 C CNN
F 1 "VCC" H 4315 4473 50  0000 C CNN
F 2 "" H 4300 4300 50  0001 C CNN
F 3 "" H 4300 4300 50  0001 C CNN
	1    4300 4300
	1    0    0    -1  
$EndComp
$Comp
L power:VCC #PWR0198
U 1 1 610A9CAD
P 8750 2300
F 0 "#PWR0198" H 8750 2150 50  0001 C CNN
F 1 "VCC" H 8765 2473 50  0000 C CNN
F 2 "" H 8750 2300 50  0001 C CNN
F 3 "" H 8750 2300 50  0001 C CNN
	1    8750 2300
	1    0    0    -1  
$EndComp
$Comp
L power:VCC #PWR0199
U 1 1 610A9CB9
P 8750 4300
F 0 "#PWR0199" H 8750 4150 50  0001 C CNN
F 1 "VCC" H 8765 4473 50  0000 C CNN
F 2 "" H 8750 4300 50  0001 C CNN
F 3 "" H 8750 4300 50  0001 C CNN
	1    8750 4300
	1    0    0    -1  
$EndComp
$Comp
L A5C:BUF12 UAD68
U 1 1 61118F5E
P 2300 2000
AR Path="/7FFFFFFF/60A9C2DF/61118F5E" Ref="UAD68"  Part="1" 
AR Path="/61118D89/60A9C2DF/61118F5E" Ref="UAD68"  Part="1" 
AR Path="/61116467/61117C32/60A9C2DF/61118F5E" Ref="UAD68"  Part="1" 
AR Path="/6112ED27/60A9C2DF/61118F5E" Ref="UAD68"  Part="1" 
AR Path="/612E497E/612E4DFA/60A9C2DF/61118F5E" Ref="UAD68"  Part="1" 
F 0 "UAD68" H 2300 2317 50  0000 C CNN
F 1 "BUF11" H 2300 2226 50  0000 C CNN
F 2 "" H 2300 2000 50  0001 C CNN
F 3 "" H 2300 2000 50  0001 C CNN
	1    2300 2000
	1    0    0    -1  
$EndComp
$Comp
L A5C:BUF12 UAA116
U 1 1 61118F63
P 2300 2500
AR Path="/7FFFFFFF/60A9C2DF/61118F63" Ref="UAA116"  Part="1" 
AR Path="/61118D89/60A9C2DF/61118F63" Ref="UAA116"  Part="1" 
AR Path="/61116467/61117C32/60A9C2DF/61118F63" Ref="UAA116"  Part="1" 
AR Path="/6112ED27/60A9C2DF/61118F63" Ref="UAA116"  Part="1" 
AR Path="/612E497E/612E4DFA/60A9C2DF/61118F63" Ref="UAA116"  Part="1" 
F 0 "UAA116" H 2300 2817 50  0000 C CNN
F 1 "BUF11" H 2300 2726 50  0000 C CNN
F 2 "" H 2300 2500 50  0001 C CNN
F 3 "" H 2300 2500 50  0001 C CNN
	1    2300 2500
	1    0    0    -1  
$EndComp
$Comp
L A5C:BUF12 UAC174
U 1 1 61118F69
P 2300 3000
AR Path="/7FFFFFFF/60A9C2DF/61118F69" Ref="UAC174"  Part="1" 
AR Path="/61118D89/60A9C2DF/61118F69" Ref="UAC174"  Part="1" 
AR Path="/61116467/61117C32/60A9C2DF/61118F69" Ref="UAC174"  Part="1" 
AR Path="/6112ED27/60A9C2DF/61118F69" Ref="UAC174"  Part="1" 
AR Path="/612E497E/612E4DFA/60A9C2DF/61118F69" Ref="UAC174"  Part="1" 
F 0 "UAC174" H 2300 3317 50  0000 C CNN
F 1 "BUF11" H 2300 3226 50  0000 C CNN
F 2 "" H 2300 3000 50  0001 C CNN
F 3 "" H 2300 3000 50  0001 C CNN
	1    2300 3000
	1    0    0    -1  
$EndComp
$Comp
L A5C:BUF12 UAD178
U 1 1 61118F68
P 2300 3500
AR Path="/7FFFFFFF/60A9C2DF/61118F68" Ref="UAD178"  Part="1" 
AR Path="/61118D89/60A9C2DF/61118F68" Ref="UAD178"  Part="1" 
AR Path="/61116467/61117C32/60A9C2DF/61118F68" Ref="UAD178"  Part="1" 
AR Path="/6112ED27/60A9C2DF/61118F68" Ref="UAD178"  Part="1" 
AR Path="/612E497E/612E4DFA/60A9C2DF/61118F68" Ref="UAD178"  Part="1" 
F 0 "UAD178" H 2300 3817 50  0000 C CNN
F 1 "BUF11" H 2300 3726 50  0000 C CNN
F 2 "" H 2300 3500 50  0001 C CNN
F 3 "" H 2300 3500 50  0001 C CNN
	1    2300 3500
	1    0    0    -1  
$EndComp
$Comp
L A5C:BUF12 UAC224
U 1 1 61118F6A
P 2300 4000
AR Path="/7FFFFFFF/60A9C2DF/61118F6A" Ref="UAC224"  Part="1" 
AR Path="/61118D89/60A9C2DF/61118F6A" Ref="UAC224"  Part="1" 
AR Path="/61116467/61117C32/60A9C2DF/61118F6A" Ref="UAC224"  Part="1" 
AR Path="/6112ED27/60A9C2DF/61118F6A" Ref="UAC224"  Part="1" 
AR Path="/612E497E/612E4DFA/60A9C2DF/61118F6A" Ref="UAC224"  Part="1" 
F 0 "UAC224" H 2300 4317 50  0000 C CNN
F 1 "BUF11" H 2300 4226 50  0000 C CNN
F 2 "" H 2300 4000 50  0001 C CNN
F 3 "" H 2300 4000 50  0001 C CNN
	1    2300 4000
	1    0    0    -1  
$EndComp
$Comp
L A5C:BUF12 UAD193
U 1 1 61118F37
P 2300 4500
AR Path="/7FFFFFFF/60A9C2DF/61118F37" Ref="UAD193"  Part="1" 
AR Path="/61118D89/60A9C2DF/61118F37" Ref="UAD193"  Part="1" 
AR Path="/61116467/61117C32/60A9C2DF/61118F37" Ref="UAD193"  Part="1" 
AR Path="/6112ED27/60A9C2DF/61118F37" Ref="UAD193"  Part="1" 
AR Path="/612E497E/612E4DFA/60A9C2DF/61118F37" Ref="UAD193"  Part="1" 
F 0 "UAD193" H 2300 4817 50  0000 C CNN
F 1 "BUF11" H 2300 4726 50  0000 C CNN
F 2 "" H 2300 4500 50  0001 C CNN
F 3 "" H 2300 4500 50  0001 C CNN
	1    2300 4500
	1    0    0    -1  
$EndComp
$Comp
L A5C:BUF12 UAD220
U 1 1 61118F3D
P 2300 5000
AR Path="/7FFFFFFF/60A9C2DF/61118F3D" Ref="UAD220"  Part="1" 
AR Path="/61118D89/60A9C2DF/61118F3D" Ref="UAD220"  Part="1" 
AR Path="/61116467/61117C32/60A9C2DF/61118F3D" Ref="UAD220"  Part="1" 
AR Path="/6112ED27/60A9C2DF/61118F3D" Ref="UAD220"  Part="1" 
AR Path="/612E497E/612E4DFA/60A9C2DF/61118F3D" Ref="UAD220"  Part="1" 
F 0 "UAD220" H 2300 5317 50  0000 C CNN
F 1 "BUF11" H 2300 5226 50  0000 C CNN
F 2 "" H 2300 5000 50  0001 C CNN
F 3 "" H 2300 5000 50  0001 C CNN
	1    2300 5000
	1    0    0    -1  
$EndComp
$Comp
L A5C:BUF12 UAD258
U 1 1 61118F3B
P 2300 5500
AR Path="/7FFFFFFF/60A9C2DF/61118F3B" Ref="UAD258"  Part="1" 
AR Path="/61118D89/60A9C2DF/61118F3B" Ref="UAD258"  Part="1" 
AR Path="/61116467/61117C32/60A9C2DF/61118F3B" Ref="UAD258"  Part="1" 
AR Path="/6112ED27/60A9C2DF/61118F3B" Ref="UAD258"  Part="1" 
AR Path="/612E497E/612E4DFA/60A9C2DF/61118F3B" Ref="UAD258"  Part="1" 
F 0 "UAD258" H 2300 5817 50  0000 C CNN
F 1 "BUF11" H 2300 5726 50  0000 C CNN
F 2 "" H 2300 5500 50  0001 C CNN
F 3 "" H 2300 5500 50  0001 C CNN
	1    2300 5500
	1    0    0    -1  
$EndComp
$Comp
L A5C:BUF12 UAD70
U 1 1 61118F5F
P 2900 2000
AR Path="/7FFFFFFF/60A9C2DF/61118F5F" Ref="UAD70"  Part="1" 
AR Path="/61118D89/60A9C2DF/61118F5F" Ref="UAD70"  Part="1" 
AR Path="/61116467/61117C32/60A9C2DF/61118F5F" Ref="UAD70"  Part="1" 
AR Path="/6112ED27/60A9C2DF/61118F5F" Ref="UAD70"  Part="1" 
AR Path="/612E497E/612E4DFA/60A9C2DF/61118F5F" Ref="UAD70"  Part="1" 
F 0 "UAD70" H 2900 2317 50  0000 C CNN
F 1 "BUF11" H 2900 2226 50  0000 C CNN
F 2 "" H 2900 2000 50  0001 C CNN
F 3 "" H 2900 2000 50  0001 C CNN
	1    2900 2000
	1    0    0    -1  
$EndComp
$Comp
L A5C:BUF12 UAA117
U 1 1 61118F60
P 2900 2500
AR Path="/7FFFFFFF/60A9C2DF/61118F60" Ref="UAA117"  Part="1" 
AR Path="/61118D89/60A9C2DF/61118F60" Ref="UAA117"  Part="1" 
AR Path="/61116467/61117C32/60A9C2DF/61118F60" Ref="UAA117"  Part="1" 
AR Path="/6112ED27/60A9C2DF/61118F60" Ref="UAA117"  Part="1" 
AR Path="/612E497E/612E4DFA/60A9C2DF/61118F60" Ref="UAA117"  Part="1" 
F 0 "UAA117" H 2900 2817 50  0000 C CNN
F 1 "BUF11" H 2900 2726 50  0000 C CNN
F 2 "" H 2900 2500 50  0001 C CNN
F 3 "" H 2900 2500 50  0001 C CNN
	1    2900 2500
	1    0    0    -1  
$EndComp
$Comp
L A5C:BUF12 UAC184
U 1 1 61118F65
P 2900 3000
AR Path="/7FFFFFFF/60A9C2DF/61118F65" Ref="UAC184"  Part="1" 
AR Path="/61118D89/60A9C2DF/61118F65" Ref="UAC184"  Part="1" 
AR Path="/61116467/61117C32/60A9C2DF/61118F65" Ref="UAC184"  Part="1" 
AR Path="/6112ED27/60A9C2DF/61118F65" Ref="UAC184"  Part="1" 
AR Path="/612E497E/612E4DFA/60A9C2DF/61118F65" Ref="UAC184"  Part="1" 
F 0 "UAC184" H 2900 3317 50  0000 C CNN
F 1 "BUF11" H 2900 3226 50  0000 C CNN
F 2 "" H 2900 3000 50  0001 C CNN
F 3 "" H 2900 3000 50  0001 C CNN
	1    2900 3000
	1    0    0    -1  
$EndComp
$Comp
L A5C:BUF12 UAD254
U 1 1 61118F66
P 2900 3500
AR Path="/7FFFFFFF/60A9C2DF/61118F66" Ref="UAD254"  Part="1" 
AR Path="/61118D89/60A9C2DF/61118F66" Ref="UAD254"  Part="1" 
AR Path="/61116467/61117C32/60A9C2DF/61118F66" Ref="UAD254"  Part="1" 
AR Path="/6112ED27/60A9C2DF/61118F66" Ref="UAD254"  Part="1" 
AR Path="/612E497E/612E4DFA/60A9C2DF/61118F66" Ref="UAD254"  Part="1" 
F 0 "UAD254" H 2900 3817 50  0000 C CNN
F 1 "BUF11" H 2900 3726 50  0000 C CNN
F 2 "" H 2900 3500 50  0001 C CNN
F 3 "" H 2900 3500 50  0001 C CNN
	1    2900 3500
	1    0    0    -1  
$EndComp
$Comp
L A5C:BUF12 UAA235
U 1 1 61118F67
P 2900 4000
AR Path="/7FFFFFFF/60A9C2DF/61118F67" Ref="UAA235"  Part="1" 
AR Path="/61118D89/60A9C2DF/61118F67" Ref="UAA235"  Part="1" 
AR Path="/61116467/61117C32/60A9C2DF/61118F67" Ref="UAA235"  Part="1" 
AR Path="/6112ED27/60A9C2DF/61118F67" Ref="UAA235"  Part="1" 
AR Path="/612E497E/612E4DFA/60A9C2DF/61118F67" Ref="UAA235"  Part="1" 
F 0 "UAA235" H 2900 4317 50  0000 C CNN
F 1 "BUF11" H 2900 4226 50  0000 C CNN
F 2 "" H 2900 4000 50  0001 C CNN
F 3 "" H 2900 4000 50  0001 C CNN
	1    2900 4000
	1    0    0    -1  
$EndComp
$Comp
L A5C:BUF12 UAD282
U 1 1 61118F62
P 2900 4500
AR Path="/7FFFFFFF/60A9C2DF/61118F62" Ref="UAD282"  Part="1" 
AR Path="/61118D89/60A9C2DF/61118F62" Ref="UAD282"  Part="1" 
AR Path="/61116467/61117C32/60A9C2DF/61118F62" Ref="UAD282"  Part="1" 
AR Path="/6112ED27/60A9C2DF/61118F62" Ref="UAD282"  Part="1" 
AR Path="/612E497E/612E4DFA/60A9C2DF/61118F62" Ref="UAD282"  Part="1" 
F 0 "UAD282" H 2900 4817 50  0000 C CNN
F 1 "BUF11" H 2900 4726 50  0000 C CNN
F 2 "" H 2900 4500 50  0001 C CNN
F 3 "" H 2900 4500 50  0001 C CNN
	1    2900 4500
	1    0    0    -1  
$EndComp
$Comp
L A5C:BUF12 UAD243
U 1 1 61118F61
P 2900 5000
AR Path="/7FFFFFFF/60A9C2DF/61118F61" Ref="UAD243"  Part="1" 
AR Path="/61118D89/60A9C2DF/61118F61" Ref="UAD243"  Part="1" 
AR Path="/61116467/61117C32/60A9C2DF/61118F61" Ref="UAD243"  Part="1" 
AR Path="/6112ED27/60A9C2DF/61118F61" Ref="UAD243"  Part="1" 
AR Path="/612E497E/612E4DFA/60A9C2DF/61118F61" Ref="UAD243"  Part="1" 
F 0 "UAD243" H 2900 5317 50  0000 C CNN
F 1 "BUF11" H 2900 5226 50  0000 C CNN
F 2 "" H 2900 5000 50  0001 C CNN
F 3 "" H 2900 5000 50  0001 C CNN
	1    2900 5000
	1    0    0    -1  
$EndComp
$Comp
L A5C:BUF12 UAC274
U 1 1 61118F3C
P 2900 5500
AR Path="/7FFFFFFF/60A9C2DF/61118F3C" Ref="UAC274"  Part="1" 
AR Path="/61118D89/60A9C2DF/61118F3C" Ref="UAC274"  Part="1" 
AR Path="/61116467/61117C32/60A9C2DF/61118F3C" Ref="UAC274"  Part="1" 
AR Path="/6112ED27/60A9C2DF/61118F3C" Ref="UAC274"  Part="1" 
AR Path="/612E497E/612E4DFA/60A9C2DF/61118F3C" Ref="UAC274"  Part="1" 
F 0 "UAC274" H 2900 5817 50  0000 C CNN
F 1 "BUF11" H 2900 5726 50  0000 C CNN
F 2 "" H 2900 5500 50  0001 C CNN
F 3 "" H 2900 5500 50  0001 C CNN
	1    2900 5500
	1    0    0    -1  
$EndComp
$Comp
L A5C:BUF12 UCA288
U 1 1 61118F64
P 3500 2000
AR Path="/7FFFFFFF/60A9C2DF/61118F64" Ref="UCA288"  Part="1" 
AR Path="/61118D89/60A9C2DF/61118F64" Ref="UCA288"  Part="1" 
AR Path="/61116467/61117C32/60A9C2DF/61118F64" Ref="UCA288"  Part="1" 
AR Path="/6112ED27/60A9C2DF/61118F64" Ref="UCA288"  Part="1" 
AR Path="/612E497E/612E4DFA/60A9C2DF/61118F64" Ref="UCA288"  Part="1" 
F 0 "UCA288" H 3500 2317 50  0000 C CNN
F 1 "BUF11" H 3500 2226 50  0000 C CNN
F 2 "" H 3500 2000 50  0001 C CNN
F 3 "" H 3500 2000 50  0001 C CNN
	1    3500 2000
	1    0    0    -1  
$EndComp
$Comp
L A5C:BUF12 UAB339
U 1 1 61118F5D
P 3500 2500
AR Path="/7FFFFFFF/60A9C2DF/61118F5D" Ref="UAB339"  Part="1" 
AR Path="/61118D89/60A9C2DF/61118F5D" Ref="UAB339"  Part="1" 
AR Path="/61116467/61117C32/60A9C2DF/61118F5D" Ref="UAB339"  Part="1" 
AR Path="/6112ED27/60A9C2DF/61118F5D" Ref="UAB339"  Part="1" 
AR Path="/612E497E/612E4DFA/60A9C2DF/61118F5D" Ref="UAB339"  Part="1" 
F 0 "UAB339" H 3500 2817 50  0000 C CNN
F 1 "BUF11" H 3500 2726 50  0000 C CNN
F 2 "" H 3500 2500 50  0001 C CNN
F 3 "" H 3500 2500 50  0001 C CNN
	1    3500 2500
	1    0    0    -1  
$EndComp
$Comp
L A5C:BUF12 UAC201
U 1 1 61118F5A
P 3500 3000
AR Path="/7FFFFFFF/60A9C2DF/61118F5A" Ref="UAC201"  Part="1" 
AR Path="/61118D89/60A9C2DF/61118F5A" Ref="UAC201"  Part="1" 
AR Path="/61116467/61117C32/60A9C2DF/61118F5A" Ref="UAC201"  Part="1" 
AR Path="/6112ED27/60A9C2DF/61118F5A" Ref="UAC201"  Part="1" 
AR Path="/612E497E/612E4DFA/60A9C2DF/61118F5A" Ref="UAC201"  Part="1" 
F 0 "UAC201" H 3500 3317 50  0000 C CNN
F 1 "BUF11" H 3500 3226 50  0000 C CNN
F 2 "" H 3500 3000 50  0001 C CNN
F 3 "" H 3500 3000 50  0001 C CNN
	1    3500 3000
	1    0    0    -1  
$EndComp
$Comp
L A5C:BUF12 UAD263
U 1 1 61118F5B
P 3500 3500
AR Path="/7FFFFFFF/60A9C2DF/61118F5B" Ref="UAD263"  Part="1" 
AR Path="/61118D89/60A9C2DF/61118F5B" Ref="UAD263"  Part="1" 
AR Path="/61116467/61117C32/60A9C2DF/61118F5B" Ref="UAD263"  Part="1" 
AR Path="/6112ED27/60A9C2DF/61118F5B" Ref="UAD263"  Part="1" 
AR Path="/612E497E/612E4DFA/60A9C2DF/61118F5B" Ref="UAD263"  Part="1" 
F 0 "UAD263" H 3500 3817 50  0000 C CNN
F 1 "BUF11" H 3500 3726 50  0000 C CNN
F 2 "" H 3500 3500 50  0001 C CNN
F 3 "" H 3500 3500 50  0001 C CNN
	1    3500 3500
	1    0    0    -1  
$EndComp
$Comp
L A5C:BUF12 UAA236
U 1 1 61118F59
P 3500 4000
AR Path="/7FFFFFFF/60A9C2DF/61118F59" Ref="UAA236"  Part="1" 
AR Path="/61118D89/60A9C2DF/61118F59" Ref="UAA236"  Part="1" 
AR Path="/61116467/61117C32/60A9C2DF/61118F59" Ref="UAA236"  Part="1" 
AR Path="/6112ED27/60A9C2DF/61118F59" Ref="UAA236"  Part="1" 
AR Path="/612E497E/612E4DFA/60A9C2DF/61118F59" Ref="UAA236"  Part="1" 
F 0 "UAA236" H 3500 4317 50  0000 C CNN
F 1 "BUF11" H 3500 4226 50  0000 C CNN
F 2 "" H 3500 4000 50  0001 C CNN
F 3 "" H 3500 4000 50  0001 C CNN
	1    3500 4000
	1    0    0    -1  
$EndComp
$Comp
L A5C:BUF12 UAD321
U 1 1 61118F38
P 3500 4500
AR Path="/7FFFFFFF/60A9C2DF/61118F38" Ref="UAD321"  Part="1" 
AR Path="/61118D89/60A9C2DF/61118F38" Ref="UAD321"  Part="1" 
AR Path="/61116467/61117C32/60A9C2DF/61118F38" Ref="UAD321"  Part="1" 
AR Path="/6112ED27/60A9C2DF/61118F38" Ref="UAD321"  Part="1" 
AR Path="/612E497E/612E4DFA/60A9C2DF/61118F38" Ref="UAD321"  Part="1" 
F 0 "UAD321" H 3500 4817 50  0000 C CNN
F 1 "BUF11" H 3500 4726 50  0000 C CNN
F 2 "" H 3500 4500 50  0001 C CNN
F 3 "" H 3500 4500 50  0001 C CNN
	1    3500 4500
	1    0    0    -1  
$EndComp
$Comp
L A5C:BUF12 UAD328
U 1 1 61118F39
P 3500 5000
AR Path="/7FFFFFFF/60A9C2DF/61118F39" Ref="UAD328"  Part="1" 
AR Path="/61118D89/60A9C2DF/61118F39" Ref="UAD328"  Part="1" 
AR Path="/61116467/61117C32/60A9C2DF/61118F39" Ref="UAD328"  Part="1" 
AR Path="/6112ED27/60A9C2DF/61118F39" Ref="UAD328"  Part="1" 
AR Path="/612E497E/612E4DFA/60A9C2DF/61118F39" Ref="UAD328"  Part="1" 
F 0 "UAD328" H 3500 5317 50  0000 C CNN
F 1 "BUF11" H 3500 5226 50  0000 C CNN
F 2 "" H 3500 5000 50  0001 C CNN
F 3 "" H 3500 5000 50  0001 C CNN
	1    3500 5000
	1    0    0    -1  
$EndComp
$Comp
L A5C:BUF12 UAD326
U 1 1 61118F3A
P 3500 5500
AR Path="/7FFFFFFF/60A9C2DF/61118F3A" Ref="UAD326"  Part="1" 
AR Path="/61118D89/60A9C2DF/61118F3A" Ref="UAD326"  Part="1" 
AR Path="/61116467/61117C32/60A9C2DF/61118F3A" Ref="UAD326"  Part="1" 
AR Path="/6112ED27/60A9C2DF/61118F3A" Ref="UAD326"  Part="1" 
AR Path="/612E497E/612E4DFA/60A9C2DF/61118F3A" Ref="UAD326"  Part="1" 
F 0 "UAD326" H 3500 5817 50  0000 C CNN
F 1 "BUF11" H 3500 5726 50  0000 C CNN
F 2 "" H 3500 5500 50  0001 C CNN
F 3 "" H 3500 5500 50  0001 C CNN
	1    3500 5500
	1    0    0    -1  
$EndComp
$Comp
L A5C:BUF12 UAA254
U 1 1 61118F3E
P 6750 2000
AR Path="/7FFFFFFF/60A9C2DF/61118F3E" Ref="UAA254"  Part="1" 
AR Path="/61118D89/60A9C2DF/61118F3E" Ref="UAA254"  Part="1" 
AR Path="/61116467/61117C32/60A9C2DF/61118F3E" Ref="UAA254"  Part="1" 
AR Path="/6112ED27/60A9C2DF/61118F3E" Ref="UAA254"  Part="1" 
AR Path="/612E497E/612E4DFA/60A9C2DF/61118F3E" Ref="UAA254"  Part="1" 
F 0 "UAA254" H 6750 2317 50  0000 C CNN
F 1 "BUF11" H 6750 2226 50  0000 C CNN
F 2 "" H 6750 2000 50  0001 C CNN
F 3 "" H 6750 2000 50  0001 C CNN
	1    6750 2000
	1    0    0    -1  
$EndComp
$Comp
L A5C:BUF12 UAB263
U 1 1 61118F41
P 6750 2500
AR Path="/7FFFFFFF/60A9C2DF/61118F41" Ref="UAB263"  Part="1" 
AR Path="/61118D89/60A9C2DF/61118F41" Ref="UAB263"  Part="1" 
AR Path="/61116467/61117C32/60A9C2DF/61118F41" Ref="UAB263"  Part="1" 
AR Path="/6112ED27/60A9C2DF/61118F41" Ref="UAB263"  Part="1" 
AR Path="/612E497E/612E4DFA/60A9C2DF/61118F41" Ref="UAB263"  Part="1" 
F 0 "UAB263" H 6750 2817 50  0000 C CNN
F 1 "BUF11" H 6750 2726 50  0000 C CNN
F 2 "" H 6750 2500 50  0001 C CNN
F 3 "" H 6750 2500 50  0001 C CNN
	1    6750 2500
	1    0    0    -1  
$EndComp
$Comp
L A5C:BUF12 UAD273
U 1 1 61118F44
P 6750 3000
AR Path="/7FFFFFFF/60A9C2DF/61118F44" Ref="UAD273"  Part="1" 
AR Path="/61118D89/60A9C2DF/61118F44" Ref="UAD273"  Part="1" 
AR Path="/61116467/61117C32/60A9C2DF/61118F44" Ref="UAD273"  Part="1" 
AR Path="/6112ED27/60A9C2DF/61118F44" Ref="UAD273"  Part="1" 
AR Path="/612E497E/612E4DFA/60A9C2DF/61118F44" Ref="UAD273"  Part="1" 
F 0 "UAD273" H 6750 3317 50  0000 C CNN
F 1 "BUF11" H 6750 3226 50  0000 C CNN
F 2 "" H 6750 3000 50  0001 C CNN
F 3 "" H 6750 3000 50  0001 C CNN
	1    6750 3000
	1    0    0    -1  
$EndComp
$Comp
L A5C:BUF12 UAB173
U 1 1 61118F50
P 6750 3500
AR Path="/7FFFFFFF/60A9C2DF/61118F50" Ref="UAB173"  Part="1" 
AR Path="/61118D89/60A9C2DF/61118F50" Ref="UAB173"  Part="1" 
AR Path="/61116467/61117C32/60A9C2DF/61118F50" Ref="UAB173"  Part="1" 
AR Path="/6112ED27/60A9C2DF/61118F50" Ref="UAB173"  Part="1" 
AR Path="/612E497E/612E4DFA/60A9C2DF/61118F50" Ref="UAB173"  Part="1" 
F 0 "UAB173" H 6750 3817 50  0000 C CNN
F 1 "BUF11" H 6750 3726 50  0000 C CNN
F 2 "" H 6750 3500 50  0001 C CNN
F 3 "" H 6750 3500 50  0001 C CNN
	1    6750 3500
	1    0    0    -1  
$EndComp
$Comp
L A5C:BUF12 UAB255
U 1 1 61118F48
P 6750 4000
AR Path="/7FFFFFFF/60A9C2DF/61118F48" Ref="UAB255"  Part="1" 
AR Path="/61118D89/60A9C2DF/61118F48" Ref="UAB255"  Part="1" 
AR Path="/61116467/61117C32/60A9C2DF/61118F48" Ref="UAB255"  Part="1" 
AR Path="/6112ED27/60A9C2DF/61118F48" Ref="UAB255"  Part="1" 
AR Path="/612E497E/612E4DFA/60A9C2DF/61118F48" Ref="UAB255"  Part="1" 
F 0 "UAB255" H 6750 4317 50  0000 C CNN
F 1 "BUF11" H 6750 4226 50  0000 C CNN
F 2 "" H 6750 4000 50  0001 C CNN
F 3 "" H 6750 4000 50  0001 C CNN
	1    6750 4000
	1    0    0    -1  
$EndComp
$Comp
L A5C:BUF12 UAC273
U 1 1 61118F49
P 6750 4500
AR Path="/7FFFFFFF/60A9C2DF/61118F49" Ref="UAC273"  Part="1" 
AR Path="/61118D89/60A9C2DF/61118F49" Ref="UAC273"  Part="1" 
AR Path="/61116467/61117C32/60A9C2DF/61118F49" Ref="UAC273"  Part="1" 
AR Path="/6112ED27/60A9C2DF/61118F49" Ref="UAC273"  Part="1" 
AR Path="/612E497E/612E4DFA/60A9C2DF/61118F49" Ref="UAC273"  Part="1" 
F 0 "UAC273" H 6750 4817 50  0000 C CNN
F 1 "BUF11" H 6750 4726 50  0000 C CNN
F 2 "" H 6750 4500 50  0001 C CNN
F 3 "" H 6750 4500 50  0001 C CNN
	1    6750 4500
	1    0    0    -1  
$EndComp
$Comp
L A5C:BUF12 UAD265
U 1 1 61118F4A
P 6750 5000
AR Path="/7FFFFFFF/60A9C2DF/61118F4A" Ref="UAD265"  Part="1" 
AR Path="/61118D89/60A9C2DF/61118F4A" Ref="UAD265"  Part="1" 
AR Path="/61116467/61117C32/60A9C2DF/61118F4A" Ref="UAD265"  Part="1" 
AR Path="/6112ED27/60A9C2DF/61118F4A" Ref="UAD265"  Part="1" 
AR Path="/612E497E/612E4DFA/60A9C2DF/61118F4A" Ref="UAD265"  Part="1" 
F 0 "UAD265" H 6750 5317 50  0000 C CNN
F 1 "BUF11" H 6750 5226 50  0000 C CNN
F 2 "" H 6750 5000 50  0001 C CNN
F 3 "" H 6750 5000 50  0001 C CNN
	1    6750 5000
	1    0    0    -1  
$EndComp
$Comp
L A5C:BUF12 UAC260
U 1 1 61118F54
P 6750 5500
AR Path="/7FFFFFFF/60A9C2DF/61118F54" Ref="UAC260"  Part="1" 
AR Path="/61118D89/60A9C2DF/61118F54" Ref="UAC260"  Part="1" 
AR Path="/61116467/61117C32/60A9C2DF/61118F54" Ref="UAC260"  Part="1" 
AR Path="/6112ED27/60A9C2DF/61118F54" Ref="UAC260"  Part="1" 
AR Path="/612E497E/612E4DFA/60A9C2DF/61118F54" Ref="UAC260"  Part="1" 
F 0 "UAC260" H 6750 5817 50  0000 C CNN
F 1 "BUF11" H 6750 5726 50  0000 C CNN
F 2 "" H 6750 5500 50  0001 C CNN
F 3 "" H 6750 5500 50  0001 C CNN
	1    6750 5500
	1    0    0    -1  
$EndComp
$Comp
L A5C:BUF12 UAA255
U 1 1 61118F3F
P 7350 2000
AR Path="/7FFFFFFF/60A9C2DF/61118F3F" Ref="UAA255"  Part="1" 
AR Path="/61118D89/60A9C2DF/61118F3F" Ref="UAA255"  Part="1" 
AR Path="/61116467/61117C32/60A9C2DF/61118F3F" Ref="UAA255"  Part="1" 
AR Path="/6112ED27/60A9C2DF/61118F3F" Ref="UAA255"  Part="1" 
AR Path="/612E497E/612E4DFA/60A9C2DF/61118F3F" Ref="UAA255"  Part="1" 
F 0 "UAA255" H 7350 2317 50  0000 C CNN
F 1 "BUF11" H 7350 2226 50  0000 C CNN
F 2 "" H 7350 2000 50  0001 C CNN
F 3 "" H 7350 2000 50  0001 C CNN
	1    7350 2000
	1    0    0    -1  
$EndComp
$Comp
L A5C:BUF12 UAB265
U 1 1 61118F42
P 7350 2500
AR Path="/7FFFFFFF/60A9C2DF/61118F42" Ref="UAB265"  Part="1" 
AR Path="/61118D89/60A9C2DF/61118F42" Ref="UAB265"  Part="1" 
AR Path="/61116467/61117C32/60A9C2DF/61118F42" Ref="UAB265"  Part="1" 
AR Path="/6112ED27/60A9C2DF/61118F42" Ref="UAB265"  Part="1" 
AR Path="/612E497E/612E4DFA/60A9C2DF/61118F42" Ref="UAB265"  Part="1" 
F 0 "UAB265" H 7350 2817 50  0000 C CNN
F 1 "BUF11" H 7350 2726 50  0000 C CNN
F 2 "" H 7350 2500 50  0001 C CNN
F 3 "" H 7350 2500 50  0001 C CNN
	1    7350 2500
	1    0    0    -1  
$EndComp
$Comp
L A5C:BUF12 UAD274
U 1 1 61118F45
P 7350 3000
AR Path="/7FFFFFFF/60A9C2DF/61118F45" Ref="UAD274"  Part="1" 
AR Path="/61118D89/60A9C2DF/61118F45" Ref="UAD274"  Part="1" 
AR Path="/61116467/61117C32/60A9C2DF/61118F45" Ref="UAD274"  Part="1" 
AR Path="/6112ED27/60A9C2DF/61118F45" Ref="UAD274"  Part="1" 
AR Path="/612E497E/612E4DFA/60A9C2DF/61118F45" Ref="UAD274"  Part="1" 
F 0 "UAD274" H 7350 3317 50  0000 C CNN
F 1 "BUF11" H 7350 3226 50  0000 C CNN
F 2 "" H 7350 3000 50  0001 C CNN
F 3 "" H 7350 3000 50  0001 C CNN
	1    7350 3000
	1    0    0    -1  
$EndComp
$Comp
L A5C:BUF12 UAB171
U 1 1 61118F51
P 7350 3500
AR Path="/7FFFFFFF/60A9C2DF/61118F51" Ref="UAB171"  Part="1" 
AR Path="/61118D89/60A9C2DF/61118F51" Ref="UAB171"  Part="1" 
AR Path="/61116467/61117C32/60A9C2DF/61118F51" Ref="UAB171"  Part="1" 
AR Path="/6112ED27/60A9C2DF/61118F51" Ref="UAB171"  Part="1" 
AR Path="/612E497E/612E4DFA/60A9C2DF/61118F51" Ref="UAB171"  Part="1" 
F 0 "UAB171" H 7350 3817 50  0000 C CNN
F 1 "BUF11" H 7350 3726 50  0000 C CNN
F 2 "" H 7350 3500 50  0001 C CNN
F 3 "" H 7350 3500 50  0001 C CNN
	1    7350 3500
	1    0    0    -1  
$EndComp
$Comp
L A5C:BUF12 UAB235
U 1 1 61118F4C
P 7350 4000
AR Path="/7FFFFFFF/60A9C2DF/61118F4C" Ref="UAB235"  Part="1" 
AR Path="/61118D89/60A9C2DF/61118F4C" Ref="UAB235"  Part="1" 
AR Path="/61116467/61117C32/60A9C2DF/61118F4C" Ref="UAB235"  Part="1" 
AR Path="/6112ED27/60A9C2DF/61118F4C" Ref="UAB235"  Part="1" 
AR Path="/612E497E/612E4DFA/60A9C2DF/61118F4C" Ref="UAB235"  Part="1" 
F 0 "UAB235" H 7350 4317 50  0000 C CNN
F 1 "BUF11" H 7350 4226 50  0000 C CNN
F 2 "" H 7350 4000 50  0001 C CNN
F 3 "" H 7350 4000 50  0001 C CNN
	1    7350 4000
	1    0    0    -1  
$EndComp
$Comp
L A5C:BUF12 UAB250
U 1 1 61118F4D
P 7350 4500
AR Path="/7FFFFFFF/60A9C2DF/61118F4D" Ref="UAB250"  Part="1" 
AR Path="/61118D89/60A9C2DF/61118F4D" Ref="UAB250"  Part="1" 
AR Path="/61116467/61117C32/60A9C2DF/61118F4D" Ref="UAB250"  Part="1" 
AR Path="/6112ED27/60A9C2DF/61118F4D" Ref="UAB250"  Part="1" 
AR Path="/612E497E/612E4DFA/60A9C2DF/61118F4D" Ref="UAB250"  Part="1" 
F 0 "UAB250" H 7350 4817 50  0000 C CNN
F 1 "BUF11" H 7350 4726 50  0000 C CNN
F 2 "" H 7350 4500 50  0001 C CNN
F 3 "" H 7350 4500 50  0001 C CNN
	1    7350 4500
	1    0    0    -1  
$EndComp
$Comp
L A5C:BUF12 UAC182
U 1 1 61118F52
P 7350 5000
AR Path="/7FFFFFFF/60A9C2DF/61118F52" Ref="UAC182"  Part="1" 
AR Path="/61118D89/60A9C2DF/61118F52" Ref="UAC182"  Part="1" 
AR Path="/61116467/61117C32/60A9C2DF/61118F52" Ref="UAC182"  Part="1" 
AR Path="/6112ED27/60A9C2DF/61118F52" Ref="UAC182"  Part="1" 
AR Path="/612E497E/612E4DFA/60A9C2DF/61118F52" Ref="UAC182"  Part="1" 
F 0 "UAC182" H 7350 5317 50  0000 C CNN
F 1 "BUF11" H 7350 5226 50  0000 C CNN
F 2 "" H 7350 5000 50  0001 C CNN
F 3 "" H 7350 5000 50  0001 C CNN
	1    7350 5000
	1    0    0    -1  
$EndComp
$Comp
L A5C:BUF12 UAC225
U 1 1 61118F55
P 7350 5500
AR Path="/7FFFFFFF/60A9C2DF/61118F55" Ref="UAC225"  Part="1" 
AR Path="/61118D89/60A9C2DF/61118F55" Ref="UAC225"  Part="1" 
AR Path="/61116467/61117C32/60A9C2DF/61118F55" Ref="UAC225"  Part="1" 
AR Path="/6112ED27/60A9C2DF/61118F55" Ref="UAC225"  Part="1" 
AR Path="/612E497E/612E4DFA/60A9C2DF/61118F55" Ref="UAC225"  Part="1" 
F 0 "UAC225" H 7350 5817 50  0000 C CNN
F 1 "BUF11" H 7350 5726 50  0000 C CNN
F 2 "" H 7350 5500 50  0001 C CNN
F 3 "" H 7350 5500 50  0001 C CNN
	1    7350 5500
	1    0    0    -1  
$EndComp
$Comp
L A5C:BUF12 UBH21
U 1 1 61118F40
P 7950 2000
AR Path="/7FFFFFFF/60A9C2DF/61118F40" Ref="UBH21"  Part="1" 
AR Path="/61118D89/60A9C2DF/61118F40" Ref="UBH21"  Part="1" 
AR Path="/61116467/61117C32/60A9C2DF/61118F40" Ref="UBH21"  Part="1" 
AR Path="/6112ED27/60A9C2DF/61118F40" Ref="UBH21"  Part="1" 
AR Path="/612E497E/612E4DFA/60A9C2DF/61118F40" Ref="UBH21"  Part="1" 
F 0 "UBH21" H 7950 2317 50  0000 C CNN
F 1 "BUF11" H 7950 2226 50  0000 C CNN
F 2 "" H 7950 2000 50  0001 C CNN
F 3 "" H 7950 2000 50  0001 C CNN
	1    7950 2000
	1    0    0    -1  
$EndComp
$Comp
L A5C:BUF12 UAB254
U 1 1 61118F43
P 7950 2500
AR Path="/7FFFFFFF/60A9C2DF/61118F43" Ref="UAB254"  Part="1" 
AR Path="/61118D89/60A9C2DF/61118F43" Ref="UAB254"  Part="1" 
AR Path="/61116467/61117C32/60A9C2DF/61118F43" Ref="UAB254"  Part="1" 
AR Path="/6112ED27/60A9C2DF/61118F43" Ref="UAB254"  Part="1" 
AR Path="/612E497E/612E4DFA/60A9C2DF/61118F43" Ref="UAB254"  Part="1" 
F 0 "UAB254" H 7950 2817 50  0000 C CNN
F 1 "BUF11" H 7950 2726 50  0000 C CNN
F 2 "" H 7950 2500 50  0001 C CNN
F 3 "" H 7950 2500 50  0001 C CNN
	1    7950 2500
	1    0    0    -1  
$EndComp
$Comp
L A5C:BUF12 UAD350
U 1 1 61118F46
P 7950 3000
AR Path="/7FFFFFFF/60A9C2DF/61118F46" Ref="UAD350"  Part="1" 
AR Path="/61118D89/60A9C2DF/61118F46" Ref="UAD350"  Part="1" 
AR Path="/61116467/61117C32/60A9C2DF/61118F46" Ref="UAD350"  Part="1" 
AR Path="/6112ED27/60A9C2DF/61118F46" Ref="UAD350"  Part="1" 
AR Path="/612E497E/612E4DFA/60A9C2DF/61118F46" Ref="UAD350"  Part="1" 
F 0 "UAD350" H 7950 3317 50  0000 C CNN
F 1 "BUF11" H 7950 3226 50  0000 C CNN
F 2 "" H 7950 3000 50  0001 C CNN
F 3 "" H 7950 3000 50  0001 C CNN
	1    7950 3000
	1    0    0    -1  
$EndComp
$Comp
L A5C:BUF12 UAC186
U 1 1 61118F4F
P 7950 3500
AR Path="/7FFFFFFF/60A9C2DF/61118F4F" Ref="UAC186"  Part="1" 
AR Path="/61118D89/60A9C2DF/61118F4F" Ref="UAC186"  Part="1" 
AR Path="/61116467/61117C32/60A9C2DF/61118F4F" Ref="UAC186"  Part="1" 
AR Path="/6112ED27/60A9C2DF/61118F4F" Ref="UAC186"  Part="1" 
AR Path="/612E497E/612E4DFA/60A9C2DF/61118F4F" Ref="UAC186"  Part="1" 
F 0 "UAC186" H 7950 3817 50  0000 C CNN
F 1 "BUF11" H 7950 3726 50  0000 C CNN
F 2 "" H 7950 3500 50  0001 C CNN
F 3 "" H 7950 3500 50  0001 C CNN
	1    7950 3500
	1    0    0    -1  
$EndComp
$Comp
L A5C:BUF12 UAD209
U 1 1 61118F4B
P 7950 4000
AR Path="/7FFFFFFF/60A9C2DF/61118F4B" Ref="UAD209"  Part="1" 
AR Path="/61118D89/60A9C2DF/61118F4B" Ref="UAD209"  Part="1" 
AR Path="/61116467/61117C32/60A9C2DF/61118F4B" Ref="UAD209"  Part="1" 
AR Path="/6112ED27/60A9C2DF/61118F4B" Ref="UAD209"  Part="1" 
AR Path="/612E497E/612E4DFA/60A9C2DF/61118F4B" Ref="UAD209"  Part="1" 
F 0 "UAD209" H 7950 4317 50  0000 C CNN
F 1 "BUF11" H 7950 4226 50  0000 C CNN
F 2 "" H 7950 4000 50  0001 C CNN
F 3 "" H 7950 4000 50  0001 C CNN
	1    7950 4000
	1    0    0    -1  
$EndComp
$Comp
L A5C:BUF12 UAB241
U 1 1 61118F4E
P 7950 4500
AR Path="/7FFFFFFF/60A9C2DF/61118F4E" Ref="UAB241"  Part="1" 
AR Path="/61118D89/60A9C2DF/61118F4E" Ref="UAB241"  Part="1" 
AR Path="/61116467/61117C32/60A9C2DF/61118F4E" Ref="UAB241"  Part="1" 
AR Path="/6112ED27/60A9C2DF/61118F4E" Ref="UAB241"  Part="1" 
AR Path="/612E497E/612E4DFA/60A9C2DF/61118F4E" Ref="UAB241"  Part="1" 
F 0 "UAB241" H 7950 4817 50  0000 C CNN
F 1 "BUF11" H 7950 4726 50  0000 C CNN
F 2 "" H 7950 4500 50  0001 C CNN
F 3 "" H 7950 4500 50  0001 C CNN
	1    7950 4500
	1    0    0    -1  
$EndComp
$Comp
L A5C:BUF12 UCB188
U 1 1 61118F53
P 7950 5000
AR Path="/7FFFFFFF/60A9C2DF/61118F53" Ref="UCB188"  Part="1" 
AR Path="/61118D89/60A9C2DF/61118F53" Ref="UCB188"  Part="1" 
AR Path="/61116467/61117C32/60A9C2DF/61118F53" Ref="UCB188"  Part="1" 
AR Path="/6112ED27/60A9C2DF/61118F53" Ref="UCB188"  Part="1" 
AR Path="/612E497E/612E4DFA/60A9C2DF/61118F53" Ref="UCB188"  Part="1" 
F 0 "UCB188" H 7950 5317 50  0000 C CNN
F 1 "BUF11" H 7950 5226 50  0000 C CNN
F 2 "" H 7950 5000 50  0001 C CNN
F 3 "" H 7950 5000 50  0001 C CNN
	1    7950 5000
	1    0    0    -1  
$EndComp
$Comp
L A5C:BUF12 UAD212
U 1 1 61118F56
P 7950 5500
AR Path="/7FFFFFFF/60A9C2DF/61118F56" Ref="UAD212"  Part="1" 
AR Path="/61118D89/60A9C2DF/61118F56" Ref="UAD212"  Part="1" 
AR Path="/61116467/61117C32/60A9C2DF/61118F56" Ref="UAD212"  Part="1" 
AR Path="/6112ED27/60A9C2DF/61118F56" Ref="UAD212"  Part="1" 
AR Path="/612E497E/612E4DFA/60A9C2DF/61118F56" Ref="UAD212"  Part="1" 
F 0 "UAD212" H 7950 5817 50  0000 C CNN
F 1 "BUF11" H 7950 5726 50  0000 C CNN
F 2 "" H 7950 5500 50  0001 C CNN
F 3 "" H 7950 5500 50  0001 C CNN
	1    7950 5500
	1    0    0    -1  
$EndComp
$Comp
L A5C:M175CL UCC357
U 1 1 61118F5C
P 4700 2600
AR Path="/7FFFFFFF/60A9C2DF/61118F5C" Ref="UCC357"  Part="1" 
AR Path="/61118D89/60A9C2DF/61118F5C" Ref="UCC357"  Part="1" 
AR Path="/61116467/61117C32/60A9C2DF/61118F5C" Ref="UCC357"  Part="1" 
AR Path="/6112ED27/60A9C2DF/61118F5C" Ref="UCC357"  Part="1" 
AR Path="/612E497E/612E4DFA/60A9C2DF/61118F5C" Ref="UCC357"  Part="1" 
F 0 "UCC357" H 4700 3165 50  0000 C CNN
F 1 "M175CL" H 4700 3074 50  0000 C CNN
F 2 "" H 4700 2400 50  0001 C CNN
F 3 "" H 4700 2400 50  0001 C CNN
	1    4700 2600
	1    0    0    1   
$EndComp
$Comp
L A5C:M175CL UBH0
U 1 1 61118F47
P 4700 4600
AR Path="/7FFFFFFF/60A9C2DF/61118F47" Ref="UBH0"  Part="1" 
AR Path="/61118D89/60A9C2DF/61118F47" Ref="UBH0"  Part="1" 
AR Path="/61116467/61117C32/60A9C2DF/61118F47" Ref="UBH0"  Part="1" 
AR Path="/6112ED27/60A9C2DF/61118F47" Ref="UBH0"  Part="1" 
AR Path="/612E497E/612E4DFA/60A9C2DF/61118F47" Ref="UBH0"  Part="1" 
F 0 "UBH0" H 4700 5165 50  0000 C CNN
F 1 "M175CL" H 4700 5074 50  0000 C CNN
F 2 "" H 4700 4400 50  0001 C CNN
F 3 "" H 4700 4400 50  0001 C CNN
	1    4700 4600
	1    0    0    1   
$EndComp
$Comp
L A5C:M175CL UCC380
U 1 1 61118F57
P 9150 2600
AR Path="/7FFFFFFF/60A9C2DF/61118F57" Ref="UCC380"  Part="1" 
AR Path="/61118D89/60A9C2DF/61118F57" Ref="UCC380"  Part="1" 
AR Path="/61116467/61117C32/60A9C2DF/61118F57" Ref="UCC380"  Part="1" 
AR Path="/6112ED27/60A9C2DF/61118F57" Ref="UCC380"  Part="1" 
AR Path="/612E497E/612E4DFA/60A9C2DF/61118F57" Ref="UCC380"  Part="1" 
F 0 "UCC380" H 9150 3165 50  0000 C CNN
F 1 "M175CL" H 9150 3074 50  0000 C CNN
F 2 "" H 9150 2400 50  0001 C CNN
F 3 "" H 9150 2400 50  0001 C CNN
	1    9150 2600
	1    0    0    1   
$EndComp
$Comp
L A5C:M175CL UCC190
U 1 1 61118F58
P 9150 4600
AR Path="/7FFFFFFF/60A9C2DF/61118F58" Ref="UCC190"  Part="1" 
AR Path="/61118D89/60A9C2DF/61118F58" Ref="UCC190"  Part="1" 
AR Path="/61116467/61117C32/60A9C2DF/61118F58" Ref="UCC190"  Part="1" 
AR Path="/6112ED27/60A9C2DF/61118F58" Ref="UCC190"  Part="1" 
AR Path="/612E497E/612E4DFA/60A9C2DF/61118F58" Ref="UCC190"  Part="1" 
F 0 "UCC190" H 9150 5165 50  0000 C CNN
F 1 "M175CL" H 9150 5074 50  0000 C CNN
F 2 "" H 9150 4400 50  0001 C CNN
F 3 "" H 9150 4400 50  0001 C CNN
	1    9150 4600
	1    0    0    1   
$EndComp
$EndSCHEMATC
