EESchema Schematic File Version 4
EELAYER 30 0
EELAYER END
$Descr A4 11693 8268
encoding utf-8
Sheet 5 69
Title ""
Date "2020-11-26"
Rev ""
Comp ""
Comment1 "Licence: CC-BY"
Comment2 "Author: Loïc *WydD* Petit"
Comment3 ""
Comment4 ""
$EndDescr
Connection ~ 3250 5000
Connection ~ 2900 4800
Connection ~ 3650 3500
Connection ~ 3650 4250
Connection ~ 2900 3300
Connection ~ 2900 4050
Connection ~ 5900 4200
Connection ~ 3650 2350
Connection ~ 3750 2450
Connection ~ 3850 2550
Connection ~ 3950 2650
Connection ~ 1350 2150
Connection ~ 1250 2250
Connection ~ 1150 2350
Connection ~ 1050 2450
Connection ~ 1150 2550
Connection ~ 7700 3000
NoConn ~ 3500 2450
NoConn ~ 3500 4700
NoConn ~ 3500 3950
NoConn ~ 3500 3200
Entry Wire Line
	5100 1850 5200 1950
Entry Wire Line
	5100 1950 5200 2050
Entry Wire Line
	5100 2050 5200 2150
Entry Wire Line
	5100 2150 5200 2250
Entry Wire Line
	5100 3200 5200 3300
Entry Wire Line
	5100 3300 5200 3400
Entry Wire Line
	5100 3400 5200 3500
Entry Wire Line
	5100 3500 5200 3600
Entry Wire Line
	5100 3600 5200 3700
Entry Wire Line
	5100 3700 5200 3800
Entry Wire Line
	5100 3800 5200 3900
Entry Wire Line
	5100 3900 5200 4000
Entry Wire Line
	7600 1950 7700 2050
Entry Wire Line
	7600 2050 7700 2150
Entry Wire Line
	7600 2150 7700 2250
Entry Wire Line
	7600 2250 7700 2350
Entry Wire Line
	7600 2350 7700 2450
Entry Wire Line
	7600 2450 7700 2550
Entry Wire Line
	7600 2550 7700 2650
Entry Wire Line
	7600 2650 7700 2750
Entry Wire Line
	7600 3300 7700 3200
Entry Wire Line
	7600 3400 7700 3300
Entry Wire Line
	7600 3500 7700 3400
Entry Wire Line
	7600 3600 7700 3500
Entry Wire Line
	7600 3700 7700 3600
Entry Wire Line
	7600 3800 7700 3700
Entry Wire Line
	7600 3900 7700 3800
Entry Wire Line
	7600 4000 7700 3900
Wire Wire Line
	1050 1650 1050 2450
Wire Wire Line
	1050 2450 1050 2650
Wire Wire Line
	1150 1750 1150 2350
Wire Wire Line
	1150 2350 1150 2550
Wire Wire Line
	1150 2550 1150 4600
Wire Wire Line
	1150 4600 3000 4600
Wire Wire Line
	1250 1850 1250 2250
Wire Wire Line
	1250 2250 1250 3850
Wire Wire Line
	1250 3850 3000 3850
Wire Wire Line
	1350 1950 1350 2150
Wire Wire Line
	1350 1950 3650 1950
Wire Wire Line
	1350 2150 1350 3100
Wire Wire Line
	1350 3100 3000 3100
Wire Wire Line
	1550 2550 1150 2550
Wire Wire Line
	1550 2650 1050 2650
Wire Wire Line
	2100 2150 1350 2150
Wire Wire Line
	2100 2250 1250 2250
Wire Wire Line
	2100 2350 1150 2350
Wire Wire Line
	2100 2450 1050 2450
Wire Wire Line
	2100 2600 2100 2550
Wire Wire Line
	2600 5000 3250 5000
Wire Wire Line
	2900 2550 3000 2550
Wire Wire Line
	2900 3300 2900 2550
Wire Wire Line
	2900 4050 2900 3300
Wire Wire Line
	2900 4050 3000 4050
Wire Wire Line
	2900 4800 2900 4050
Wire Wire Line
	2900 5100 2900 4800
Wire Wire Line
	3000 3300 2900 3300
Wire Wire Line
	3000 4800 2900 4800
Wire Wire Line
	3250 2750 3650 2750
Wire Wire Line
	3250 3500 3650 3500
Wire Wire Line
	3250 4250 3650 4250
Wire Wire Line
	3500 2350 3650 2350
Wire Wire Line
	3500 4600 3950 4600
Wire Wire Line
	3650 2350 3650 1950
Wire Wire Line
	3650 2350 6000 2350
Wire Wire Line
	3650 2750 3650 3500
Wire Wire Line
	3650 3500 3650 4250
Wire Wire Line
	3650 4250 3650 5000
Wire Wire Line
	3650 5000 3250 5000
Wire Wire Line
	3750 1850 1250 1850
Wire Wire Line
	3750 1850 3750 2450
Wire Wire Line
	3750 2450 3750 3100
Wire Wire Line
	3750 3100 3500 3100
Wire Wire Line
	3850 1750 1150 1750
Wire Wire Line
	3850 2550 3850 1750
Wire Wire Line
	3850 2550 3850 3850
Wire Wire Line
	3850 2550 6000 2550
Wire Wire Line
	3850 3850 3500 3850
Wire Wire Line
	3950 1650 1050 1650
Wire Wire Line
	3950 2650 3950 1650
Wire Wire Line
	3950 2650 3950 4600
Wire Wire Line
	5050 4200 5900 4200
Wire Wire Line
	5900 2850 6000 2850
Wire Wire Line
	5900 4200 5900 2850
Wire Wire Line
	5900 4200 5900 5100
Wire Wire Line
	5900 4200 6000 4200
Wire Wire Line
	5900 5100 2900 5100
Wire Wire Line
	6000 1950 5200 1950
Wire Wire Line
	6000 2050 5200 2050
Wire Wire Line
	6000 2150 5200 2150
Wire Wire Line
	6000 2250 5200 2250
Wire Wire Line
	6000 2450 3750 2450
Wire Wire Line
	6000 2650 3950 2650
Wire Wire Line
	6000 3300 5200 3300
Wire Wire Line
	6000 3400 5200 3400
Wire Wire Line
	6000 3500 5200 3500
Wire Wire Line
	6000 3600 5200 3600
Wire Wire Line
	6000 3700 5200 3700
Wire Wire Line
	6000 3800 5200 3800
Wire Wire Line
	6000 3900 5200 3900
Wire Wire Line
	6000 4000 5200 4000
Wire Wire Line
	7000 1950 7600 1950
Wire Wire Line
	7000 2050 7600 2050
Wire Wire Line
	7000 2150 7600 2150
Wire Wire Line
	7000 2250 7600 2250
Wire Wire Line
	7000 2350 7600 2350
Wire Wire Line
	7000 2450 7600 2450
Wire Wire Line
	7000 2550 7600 2550
Wire Wire Line
	7000 2650 7600 2650
Wire Wire Line
	7000 3300 7600 3300
Wire Wire Line
	7000 3400 7600 3400
Wire Wire Line
	7000 3500 7600 3500
Wire Wire Line
	7000 3600 7600 3600
Wire Wire Line
	7000 3700 7600 3700
Wire Wire Line
	7000 3800 7600 3800
Wire Wire Line
	7000 3900 7600 3900
Wire Wire Line
	7000 4000 7600 4000
Wire Bus Line
	5100 1700 5000 1700
Wire Bus Line
	7700 3000 8150 3000
Text Label 5800 1950 2    50   ~ 0
CPS-ID-D12
Text Label 5800 2050 2    50   ~ 0
CPS-ID-D13
Text Label 5800 2150 2    50   ~ 0
CPS-ID-D14
Text Label 5800 2250 2    50   ~ 0
CPS-ID-D15
Text Label 5800 3300 2    50   ~ 0
CPS-ID-D11
Text Label 5800 3400 2    50   ~ 0
CPS-ID-D10
Text Label 5800 3500 2    50   ~ 0
CPS-ID-D5
Text Label 5800 3600 2    50   ~ 0
CPS-ID-D4
Text Label 5800 3700 2    50   ~ 0
CPS-ID-D3
Text Label 5800 3800 2    50   ~ 0
CPS-ID-D2
Text Label 5800 3900 2    50   ~ 0
CPS-ID-D1
Text Label 5800 4000 2    50   ~ 0
CPS-ID-D0
Text Label 7050 1950 0    50   ~ 0
DATA12
Text Label 7050 2050 0    50   ~ 0
DATA13
Text Label 7050 2150 0    50   ~ 0
DATA14
Text Label 7050 2250 0    50   ~ 0
DATA15
Text Label 7050 2350 0    50   ~ 0
DATA6
Text Label 7050 2450 0    50   ~ 0
DATA7
Text Label 7050 2550 0    50   ~ 0
DATA8
Text Label 7050 2650 0    50   ~ 0
DATA9
Text Label 7050 3300 0    50   ~ 0
DATA11
Text Label 7050 3400 0    50   ~ 0
DATA10
Text Label 7050 3500 0    50   ~ 0
DATA5
Text Label 7050 3600 0    50   ~ 0
DATA4
Text Label 7050 3700 0    50   ~ 0
DATA3
Text Label 7050 3800 0    50   ~ 0
DATA2
Text Label 7050 3900 0    50   ~ 0
DATA1
Text Label 7050 4000 0    50   ~ 0
DATA0
Text HLabel 2600 5000 0    50   Input ~ 0
~RESET
Text HLabel 4500 4150 0    50   Input ~ 0
~E
Text HLabel 4500 4250 0    50   Input ~ 0
~RD
Text HLabel 5000 1700 0    50   Input ~ 0
CPS-ID-D[0..15]
Text HLabel 8150 3000 2    50   3State ~ 0
DATA[0..15]
$Comp
L A5C:XNOR02 UCL460
U 1 1 667A1B21
P 1800 2600
F 0 "UCL460" H 1800 2917 50  0000 C CNN
F 1 "XNOR02" H 1800 2826 50  0000 C CNN
F 2 "" H 1800 2600 50  0001 C CNN
F 3 "" H 1800 2600 50  0001 C CNN
	1    1800 2600
	1    0    0    1   
$EndComp
$Comp
L A5C:OR02 UCO?
U 1 1 6280AFAD
P 4750 4200
AR Path="/6280AFAD" Ref="UCO?"  Part="1" 
AR Path="/5FD87927/6280AFAD" Ref="UCO374"  Part="1" 
F 0 "UCO374" H 4775 4467 50  0000 C CNN
F 1 "OR02" H 4775 4376 50  0000 C CNN
F 2 "" H 4800 4200 50  0001 C CNN
F 3 "" H 4800 4200 50  0001 C CNN
	1    4750 4200
	1    0    0    -1  
$EndComp
$Comp
L A5C:DFFCOR UCL481
U 1 1 61A334C8
P 3250 2450
F 0 "UCL481" H 3250 2815 50  0000 C CNN
F 1 "DFFCOR" H 3250 2724 50  0000 C CNN
F 2 "" H 3250 2450 50  0001 C CNN
F 3 "" H 3250 2450 50  0001 C CNN
	1    3250 2450
	1    0    0    -1  
$EndComp
$Comp
L A5C:DFFCOR UCL477
U 1 1 61A32D21
P 3250 3200
F 0 "UCL477" H 3250 3565 50  0000 C CNN
F 1 "DFFCOR" H 3250 3474 50  0000 C CNN
F 2 "" H 3250 3200 50  0001 C CNN
F 3 "" H 3250 3200 50  0001 C CNN
	1    3250 3200
	1    0    0    -1  
$EndComp
$Comp
L A5C:DFFCOR UCL472
U 1 1 61A3265A
P 3250 3950
F 0 "UCL472" H 3250 4315 50  0000 C CNN
F 1 "DFFCOR" H 3250 4224 50  0000 C CNN
F 2 "" H 3250 3950 50  0001 C CNN
F 3 "" H 3250 3950 50  0001 C CNN
	1    3250 3950
	1    0    0    -1  
$EndComp
$Comp
L A5C:DFFCOR UCL468
U 1 1 61A3117A
P 3250 4700
F 0 "UCL468" H 3250 5065 50  0000 C CNN
F 1 "DFFCOR" H 3250 4974 50  0000 C CNN
F 2 "" H 3250 4700 50  0001 C CNN
F 3 "" H 3250 4700 50  0001 C CNN
F 4 "UCL466;UCL486" H 3250 4700 50  0001 C CNN "MiscRef"
	1    3250 4700
	1    0    0    -1  
$EndComp
$Comp
L A5C:OAI41 UCL463
U 1 1 6679FBC9
P 2550 2350
F 0 "UCL463" H 2550 2731 50  0000 C CNN
F 1 "OAI41" H 2550 2640 50  0000 C CNN
F 2 "" H 2550 2200 50  0001 C CNN
F 3 "" H 2550 2200 50  0001 C CNN
	1    2550 2350
	1    0    0    1   
$EndComp
$Comp
L A5C:M541C UCR405
U 1 1 5EF71034
P 6500 2400
F 0 "UCR405" H 6500 3115 50  0000 C CNN
F 1 "M541C" H 6500 3024 50  0000 C CNN
F 2 "" H 6800 2400 50  0001 C CNN
F 3 "" H 6800 2400 50  0001 C CNN
	1    6500 2400
	1    0    0    -1  
$EndComp
$Comp
L A5C:M541C UCO383
U 1 1 61946AFB
P 6500 3750
F 0 "UCO383" H 6500 4465 50  0000 C CNN
F 1 "M541C" H 6500 4374 50  0000 C CNN
F 2 "" H 6800 3750 50  0001 C CNN
F 3 "" H 6800 3750 50  0001 C CNN
	1    6500 3750
	1    0    0    -1  
$EndComp
Wire Bus Line
	7700 2050 7700 3000
Wire Bus Line
	7700 3000 7700 3900
Wire Bus Line
	5100 1700 5100 3900
$EndSCHEMATC
