EESchema Schematic File Version 4
EELAYER 30 0
EELAYER END
$Descr A4 8268 11693 portrait
encoding utf-8
Sheet 18 83
Title "CPS Reverse Engineering: DL-0311"
Date "2021-09-12"
Rev ""
Comp ""
Comment1 ""
Comment2 ""
Comment3 "Licence: CC-BY"
Comment4 "Author: Loïc *WydD* Petit"
$EndDescr
Connection ~ 1850 4000
Connection ~ 1950 4350
Connection ~ 1950 7950
Connection ~ 1750 3800
Connection ~ 3750 3350
Connection ~ 3650 3050
Connection ~ 3650 7450
Connection ~ 3750 7600
Connection ~ 1750 8050
Connection ~ 1950 4900
Connection ~ 1750 1950
Connection ~ 3650 4750
Wire Wire Line
	1500 1950 1750 1950
Wire Wire Line
	1500 4000 1850 4000
Wire Wire Line
	1500 6600 1950 6600
Wire Wire Line
	1600 1500 2050 1500
Wire Wire Line
	1600 3450 2050 3450
Wire Wire Line
	1600 5900 2050 5900
Wire Wire Line
	1600 7700 2050 7700
Wire Wire Line
	1600 8800 2050 8800
Wire Wire Line
	1750 1850 2050 1850
Wire Wire Line
	1750 1950 1750 1850
Wire Wire Line
	1750 3800 1750 1950
Wire Wire Line
	1750 3800 2050 3800
Wire Wire Line
	1750 8050 1750 9250
Wire Wire Line
	1750 8050 2050 8050
Wire Wire Line
	1750 9250 2050 9250
Wire Wire Line
	1850 1950 2050 1950
Wire Wire Line
	1850 4000 1850 1950
Wire Wire Line
	1850 4000 2050 4000
Wire Wire Line
	1950 2200 1950 4350
Wire Wire Line
	1950 4350 1950 4900
Wire Wire Line
	1950 4900 5350 4900
Wire Wire Line
	1950 6600 2050 6600
Wire Wire Line
	1950 7950 1950 6600
Wire Wire Line
	1950 7950 1950 9150
Wire Wire Line
	1950 9150 2050 9150
Wire Wire Line
	2050 1400 1600 1400
Wire Wire Line
	2050 1650 1600 1650
Wire Wire Line
	2050 2050 1650 2050
Wire Wire Line
	2050 2200 1950 2200
Wire Wire Line
	2050 3250 1600 3250
Wire Wire Line
	2050 3350 1600 3350
Wire Wire Line
	2050 3600 1600 3600
Wire Wire Line
	2050 3900 1650 3900
Wire Wire Line
	2050 4100 1650 4100
Wire Wire Line
	2050 4200 1650 4200
Wire Wire Line
	2050 4350 1950 4350
Wire Wire Line
	2050 5800 1600 5800
Wire Wire Line
	2050 6050 1600 6050
Wire Wire Line
	2050 6350 1850 6350
Wire Wire Line
	2050 6450 1650 6450
Wire Wire Line
	2050 7600 1600 7600
Wire Wire Line
	2050 7800 1600 7800
Wire Wire Line
	2050 7950 1950 7950
Wire Wire Line
	2050 8700 1600 8700
Wire Wire Line
	2050 8900 1600 8900
Wire Wire Line
	4350 9850 4150 9850
Wire Wire Line
	5350 6400 5250 6400
Wire Wire Line
	5350 6500 5250 6500
Wire Wire Line
	5350 6600 5250 6600
Wire Wire Line
	5350 6250 5250 6250
Wire Wire Line
	5350 8150 5250 8150
Wire Wire Line
	5350 8000 5250 8000
Wire Bus Line
	2050 1200 1600 1200
Wire Bus Line
	2050 3050 1600 3050
Wire Bus Line
	2050 5600 1600 5600
Wire Bus Line
	2050 7450 1600 7450
Wire Bus Line
	2050 8550 1600 8550
Wire Bus Line
	3550 1200 3650 1200
Wire Bus Line
	3550 1350 3850 1350
Wire Bus Line
	3550 3050 3650 3050
Wire Bus Line
	3550 3200 3850 3200
Wire Bus Line
	3550 6000 3750 6000
Wire Bus Line
	3550 7450 3650 7450
Wire Bus Line
	3550 7600 3750 7600
Wire Bus Line
	3550 8700 3750 8700
Wire Bus Line
	3550 8850 3850 8850
Wire Bus Line
	3650 1200 3650 3050
Wire Bus Line
	3650 3050 3650 4750
Wire Bus Line
	3650 4750 5350 4750
Wire Bus Line
	3650 5600 3550 5600
Wire Bus Line
	3650 7450 3650 5600
Wire Bus Line
	3650 7450 3650 8550
Wire Bus Line
	3650 8550 3550 8550
Wire Bus Line
	3750 1500 3550 1500
Wire Bus Line
	3750 3350 3550 3350
Wire Bus Line
	3750 3350 3750 1500
Wire Bus Line
	3750 6000 5350 6000
Wire Bus Line
	3750 7600 3750 6000
Wire Bus Line
	3850 7850 3850 8850
Wire Bus Line
	5350 5700 5250 5700
Wire Bus Line
	6750 4750 7150 4750
Wire Bus Line
	6750 5700 7150 5700
Text Notes 2050 7150 0    197  ~ 0
STARS
Text Notes 3350 2747 2    197  ~ 0
SCROLL2
Text Notes 3350 5297 2    197  ~ 0
SCROLL3
Text Notes 3450 897  2    197  ~ 0
SCROLL1
Text Notes 5350 4450 0    197  ~ 0
XS OUTPUT
Text Notes 6750 7200 2    197  ~ 0
SCROLL Y
Text HLabel 1050 9300 0    50   Input ~ 0
~STAR1-T
Text HLabel 1050 9400 0    50   Input ~ 0
~SCROLL3-T
Text HLabel 1050 9500 0    50   Input ~ 0
~SCROLL2-T
Text HLabel 1050 9600 0    50   Input ~ 0
~SCROLL1-T
Text HLabel 900  1950 0    50   Input ~ 0
LI
Text HLabel 900  4000 0    50   Input ~ 0
FLIP
Text HLabel 900  6600 0    50   Input ~ 0
CLK4M
Text HLabel 1600 1200 0    50   Input ~ 0
BUS-DATA[0..8]
Text HLabel 1600 1400 0    50   Input ~ 0
~SCROLL1-X
Text HLabel 1600 1500 0    50   Input ~ 0
~SCROLL1-Y
Text HLabel 1600 1650 0    50   Input ~ 0
~SCROLL1-T
Text HLabel 1600 3050 0    50   Input ~ 0
BUS-DATA[0..8]
Text HLabel 1600 3250 0    50   Input ~ 0
~BUS-ROWSCROLL
Text HLabel 1600 3350 0    50   Input ~ 0
~SCROLL2-X
Text HLabel 1600 3450 0    50   Input ~ 0
~SCROLL2-Y
Text HLabel 1600 3600 0    50   Input ~ 0
~SCROLL2-T
Text HLabel 1600 5600 0    50   Input ~ 0
BUS-DATA[0..8]
Text HLabel 1600 5800 0    50   Input ~ 0
~SCROLL3-X
Text HLabel 1600 5900 0    50   Input ~ 0
~SCROLL3-Y
Text HLabel 1600 6050 0    50   Input ~ 0
~SCROLL3-T
Text HLabel 1600 7450 0    50   Input ~ 0
BUS-DATA[0..8]
Text HLabel 1600 7600 0    50   Input ~ 0
~STAR1-X
Text HLabel 1600 7700 0    50   Input ~ 0
~STAR1-Y
Text HLabel 1600 7800 0    50   Input ~ 0
~STAR1-T
Text HLabel 1600 8550 0    50   Input ~ 0
BUS-DATA[0..8]
Text HLabel 1600 8700 0    50   Input ~ 0
~STAR2-X
Text HLabel 1600 8800 0    50   Input ~ 0
~STAR2-Y
Text HLabel 1600 8900 0    50   Input ~ 0
~STAR2-T
Text HLabel 1650 2050 0    50   Input ~ 0
FLIP
Text HLabel 1650 3900 0    50   Input ~ 0
LI
Text HLabel 1650 4100 0    50   Input ~ 0
FLIP
Text HLabel 1650 4200 0    50   Input ~ 0
FI
Text HLabel 1650 6450 0    50   Input ~ 0
FLIP
Text HLabel 3600 9550 0    50   Input ~ 0
~STAR2-T
Text HLabel 3600 9650 0    50   Input ~ 0
~STAR1-T
Text HLabel 4350 9850 2    50   Output ~ 0
STARS-T
Text HLabel 3850 1350 2    50   Output ~ 0
SCROLL1-X[0..5]
Text HLabel 3850 3200 2    50   Output ~ 0
SCROLL2-X[0..5]
Text HLabel 5250 5700 0    50   Input ~ 0
LINE[0..8]
Text HLabel 5250 6400 0    50   Input ~ 0
~SCROLL1-T
Text HLabel 5250 6500 0    50   Input ~ 0
~SCROLL2-T
Text HLabel 5250 6600 0    50   Input ~ 0
~SCROLL3-T
Text HLabel 5250 6250 0    50   Input ~ 0
FLIP
Text HLabel 5250 8150 0    50   Input ~ 0
~STAR2-T
Text HLabel 5250 8000 0    50   Input ~ 0
FLIP
Text HLabel 7150 4750 2    50   Output ~ 0
XS-OUT[0..4]
Text HLabel 7150 5700 2    50   3State ~ 0
ROMA-Y[0..5]
Text HLabel 7050 8100 2    50   3State ~ 0
GFX-ADDR[4..19]
$Comp
L A5C:NAND02 UEE217
U 1 1 61118DB9
P 3850 9600
F 0 "UEE217" H 3875 9867 50  0000 C CNN
F 1 "NAND02" H 3875 9776 50  0000 C CNN
F 2 "" H 3850 9600 50  0001 C CNN
F 3 "" H 3850 9600 50  0001 C CNN
	1    3850 9600
	1    0    0    -1  
$EndComp
$Comp
L A5C:NBUF03 UEJ26
U 1 1 66450EF8
P 1200 1950
F 0 "UEJ26" H 1200 2267 50  0000 C CNN
F 1 "NBUF03" H 1200 2176 50  0000 C CNN
F 2 "" H 1200 1750 50  0001 C CNN
F 3 "" H 1200 1750 50  0001 C CNN
	1    1200 1950
	1    0    0    1   
$EndComp
$Comp
L A5C:NBUF03 UEJ8
U 1 1 7AB5232D
P 1200 4000
F 0 "UEJ8" H 1200 4317 50  0000 C CNN
F 1 "NBUF03" H 1200 4226 50  0000 C CNN
F 2 "" H 1200 3800 50  0001 C CNN
F 3 "" H 1200 3800 50  0001 C CNN
	1    1200 4000
	1    0    0    -1  
$EndComp
$Comp
L A5C:NBUF02 UEK107
U 1 1 626670C3
P 1200 6600
F 0 "UEK107" H 1200 6917 50  0000 C CNN
F 1 "NBUF02" H 1200 6826 50  0000 C CNN
F 2 "" H 1200 6400 50  0001 C CNN
F 3 "" H 1200 6400 50  0001 C CNN
	1    1200 6600
	1    0    0    -1  
$EndComp
$Comp
L A5C:NAND04 UEH?
U 1 1 61AE9143
P 1350 9450
AR Path="/611F07C1/61AE9143" Ref="UEH?"  Part="1" 
AR Path="/61AE9143" Ref="UEH82"  Part="1" 
AR Path="/612D3239/61AE9143" Ref="UEH82"  Part="1" 
F 0 "UEH82" H 1350 9792 50  0000 C CNN
F 1 "NAND04" H 1350 9701 50  0000 C CNN
F 2 "" H 1350 9200 50  0001 C CNN
F 3 "" H 1350 9200 50  0001 C CNN
	1    1350 9450
	1    0    0    -1  
$EndComp
$Sheet
S 5350 5550 1400 1300
U 612D3C76
F0 "scroll-y" 50
F1 "scroll-y.sch" 50
F2 "LINE[0..8]" I L 5350 5700 50 
F3 "~FLIP" I L 5350 6150 50 
F4 "Y[0..8]" I L 5350 6000 50 
F5 "FLIP" I L 5350 6250 50 
F6 "~SCROLL1-T" I L 5350 6400 50 
F7 "~SCROLL2-T" I L 5350 6500 50 
F8 "~SCROLL3-T" I L 5350 6600 50 
F9 "~STARS-T" I L 5350 6700 50 
F10 "Y-OUT[3..8]" O R 6750 6700 50 
F11 "ROMA-Y[0..5]" T R 6750 5700 50 
F12 "SECOND-BLOCK" I L 5350 5850 50 
$EndSheet
$Sheet
S 2050 1050 1500 1300
U 612D3C97
F0 "scroll1" 50
F1 "scroll1.sch" 50
F2 "BUS-DATA[0..2]" I L 2050 1200 50 
F3 "~SCROLL1-X" I L 2050 1400 50 
F4 "~CLK4M" I L 2050 2200 50 
F5 "~SCROLL1-T" I L 2050 1650 50 
F6 "XSHIFT[0..2]" T R 3550 1200 50 
F7 "~SCROLL1-Y" I L 2050 1500 50 
F8 "Y[0..7]" T R 3550 1500 50 
F9 "~LI" I L 2050 1850 50 
F10 "~FLIP" I L 2050 1950 50 
F11 "SCROLL1-X[0..5]" O R 3550 1350 50 
F12 "FLIP" I L 2050 2050 50 
$EndSheet
$Sheet
S 2050 2900 1500 1850
U 612D3C9E
F0 "scroll2" 50
F1 "scroll2.sch" 50
F2 "~SCROLL2-Y" I L 2050 3450 50 
F3 "~CLK4M" I L 2050 4350 50 
F4 "~SCROLL2-T" I L 2050 3600 50 
F5 "Y[0..7]" T R 3550 3350 50 
F6 "~FLIP" I L 2050 4000 50 
F7 "~LI" I L 2050 3800 50 
F8 "LI" I L 2050 3900 50 
F9 "CLK4M" I L 2050 4450 50 
F10 "BUS-DATA[0..8]" I L 2050 3050 50 
F11 "~BUS-ROWSCROLL" I L 2050 3250 50 
F12 "FLIP" I L 2050 4100 50 
F13 "MAIN-RESET" I L 2050 4600 50 
F14 "FI" I L 2050 4200 50 
F15 "~SCROLL2-X" I L 2050 3350 50 
F16 "XSHIFT[0..3]" T R 3550 3050 50 
F17 "SCROLL2-X[0..5]" O R 3550 3200 50 
$EndSheet
$Sheet
S 2050 5450 1500 1300
U 612D3C7B
F0 "scroll3" 50
F1 "scroll3.sch" 50
F2 "~LI" I L 2050 6250 50 
F3 "~SCROLL3-Y" I L 2050 5900 50 
F4 "~CLK4M" I L 2050 6600 50 
F5 "~SCROLL3-X" I L 2050 5800 50 
F6 "~SCROLL3-T" I L 2050 6050 50 
F7 "BUS-DATA[0..4]" I L 2050 5600 50 
F8 "Y[0..7]" T R 3550 6000 50 
F9 "~FLIP" I L 2050 6350 50 
F10 "FLIP" I L 2050 6450 50 
F11 "XSHIFT[0..3]" T R 3550 5600 50 
F12 "SECOND-BLOCK" O R 3550 5850 50 
F13 "SCROLL3-X[0..3]" O R 3550 5750 50 
$EndSheet
$Sheet
S 2050 8400 1500 1000
U 612D3CBC
F0 "star2" 50
F1 "star2.sch" 50
F2 "~ELSE-T" I L 2050 9000 50 
F3 "~STAR2-T" I L 2050 8900 50 
F4 "BUS-DATA[0..8]" I L 2050 8550 50 
F5 "~CLK4M" I L 2050 9150 50 
F6 "~STAR2-Y" I L 2050 8800 50 
F7 "~STAR2-X" I L 2050 8700 50 
F8 "Y[0..8]" T R 3550 8700 50 
F9 "XSHIFT[0..4]" T R 3550 8550 50 
F10 "~LI" I L 2050 9250 50 
F11 "STAR2-X[0..3]" O R 3550 8850 50 
$EndSheet
$Sheet
S 5350 7600 1500 900 
U 612D3C70
F0 "stars-x" 50
F1 "stars-x.sch" 50
F2 "STAR1-X[0..3]" I L 5350 7750 50 
F3 "STAR2-X[0..3]" I L 5350 7850 50 
F4 "~STAR2-T" I L 5350 8150 50 
F5 "~STARS-T" I L 5350 8250 50 
F6 "FLIP" I L 5350 8000 50 
F7 "GFX-ADDR[4..19]" T R 6850 8100 50 
F8 "Y-OUT[5..8]" I R 6850 7850 50 
$EndSheet
$Sheet
S 5350 4600 1400 550 
U 612D3CB0
F0 "xshift" 50
F1 "xshift.sch" 50
F2 "XS[0..4]" I L 5350 4750 50 
F3 "~CLK4M" I L 5350 4900 50 
F4 "XS-OUT[0..4]" O R 6750 4750 50 
F5 "~FLIP" I L 5350 5000 50 
$EndSheet
Text HLabel 1650 4450 0    50   Input ~ 0
CLK4M
Wire Wire Line
	2050 4450 1650 4450
Text HLabel 1650 4600 0    50   Input ~ 0
MAIN-RESET
Wire Wire Line
	2050 4600 1650 4600
Text Label 4800 4750 0    50   ~ 0
XSHIFT[0..4]
Wire Wire Line
	4150 9850 4150 9600
Wire Wire Line
	1850 5000 1850 4000
Text HLabel 7150 6700 2    50   Output ~ 0
Y-OUT[3..8]
Connection ~ 1750 6250
Wire Wire Line
	1750 6250 1750 8050
Connection ~ 1950 6600
Connection ~ 3650 5600
Wire Wire Line
	1750 3800 1750 6250
Wire Bus Line
	3650 4750 3650 5600
Wire Wire Line
	1950 4900 1950 6600
Wire Wire Line
	1750 6250 2050 6250
Wire Wire Line
	1850 5000 1850 6350
Connection ~ 1850 5000
$Comp
L A5C:INV01 UEE131
U 1 1 61118DB8
P 4450 9600
F 0 "UEE131" H 4450 9917 50  0000 C CNN
F 1 "INV01" H 4450 9826 50  0000 C CNN
F 2 "" H 4450 9400 50  0001 C CNN
F 3 "" H 4450 9400 50  0001 C CNN
	1    4450 9600
	1    0    0    -1  
$EndComp
Text Notes 5350 9150 0    197  ~ 0
STARS\nGFX OUTPUT
Wire Wire Line
	5350 8250 4750 8250
Connection ~ 4750 8250
Wire Wire Line
	4750 8250 4750 9600
Text HLabel 3850 5750 2    50   Output ~ 0
SCROLL3-X[0..3]
Connection ~ 4150 9600
Wire Wire Line
	1850 9000 1850 9450
Wire Wire Line
	1850 9450 1650 9450
Wire Wire Line
	1850 9000 2050 9000
Wire Bus Line
	3850 7850 5350 7850
Wire Bus Line
	3750 7600 3750 8700
Wire Bus Line
	3550 7750 5350 7750
Wire Wire Line
	4750 6700 5350 6700
Wire Bus Line
	6850 8100 7050 8100
Wire Bus Line
	3550 5750 3850 5750
Connection ~ 3750 6000
Wire Bus Line
	3750 3350 3750 6000
Wire Wire Line
	1850 5000 4700 5000
Wire Wire Line
	3550 5850 5350 5850
Wire Bus Line
	6750 6700 6950 6700
Wire Bus Line
	6950 7850 6850 7850
Wire Bus Line
	6950 6700 7150 6700
Wire Wire Line
	4750 6700 4750 8250
Connection ~ 6950 6700
Wire Bus Line
	6950 6700 6950 7850
Wire Wire Line
	5350 6150 4700 6150
Wire Wire Line
	4700 6150 4700 5000
Connection ~ 4700 5000
Wire Wire Line
	4700 5000 5350 5000
$Sheet
S 2050 7300 1500 900 
U 612D3C64
F0 "star1" 50
F1 "star1.sch" 50
F2 "BUS-DATA[0..8]" I L 2050 7450 50 
F3 "Y[0..8]" T R 3550 7600 50 
F4 "XSHIFT[0..4]" T R 3550 7450 50 
F5 "~CLK4M" I L 2050 7950 50 
F6 "~STAR1-Y" I L 2050 7700 50 
F7 "~STAR1-X" I L 2050 7600 50 
F8 "~STAR1-T" I L 2050 7800 50 
F9 "~LI" I L 2050 8050 50 
F10 "STAR1-X[0..3]" O R 3550 7750 50 
$EndSheet
$EndSCHEMATC
