EESchema Schematic File Version 4
EELAYER 30 0
EELAYER END
$Descr A4 11693 8268
encoding utf-8
Sheet 7 20
Title "DL-1727"
Date "2020-04-26"
Rev ""
Comp ""
Comment1 ""
Comment2 "Licence: CC-BY"
Comment3 "Author: Loic *WydD* Petit"
Comment4 "Project: CPS2 Reverse Engineering: DL-1727"
$EndDescr
$Comp
L CG24-cells:V2B U40R41
U 1 1 5EB4C778
P 1750 6050
F 0 "U40R41" H 1750 6367 50  0000 C CNN
F 1 "V2B" H 1750 6276 50  0000 C CNN
F 2 "" H 1750 5850 50  0001 C CNN
F 3 "" H 1750 5850 50  0001 C CNN
	1    1750 6050
	1    0    0    -1  
$EndComp
$Comp
L CG24-cells:V2B U36R41
U 1 1 5EB4C794
P 6650 6050
F 0 "U36R41" H 6650 6367 50  0000 C CNN
F 1 "V2B" H 6650 6276 50  0000 C CNN
F 2 "" H 6650 5850 50  0001 C CNN
F 3 "" H 6650 5850 50  0001 C CNN
	1    6650 6050
	1    0    0    -1  
$EndComp
$Comp
L CG24-cells:V2B U40R51
U 1 1 6799C3E2
P 1750 6400
F 0 "U40R51" H 1750 6717 50  0000 C CNN
F 1 "V2B" H 1750 6626 50  0000 C CNN
F 2 "" H 1750 6200 50  0001 C CNN
F 3 "" H 1750 6200 50  0001 C CNN
	1    1750 6400
	1    0    0    1   
$EndComp
$Comp
L CG24-cells:V2B U26R41
U 1 1 6799BD1C
P 6650 6400
F 0 "U26R41" H 6650 6717 50  0000 C CNN
F 1 "V2B" H 6650 6626 50  0000 C CNN
F 2 "" H 6650 6200 50  0001 C CNN
F 3 "" H 6650 6200 50  0001 C CNN
	1    6650 6400
	1    0    0    1   
$EndComp
$Comp
L CG24-cells:B1N U41R61
U 1 1 6757D03A
P 9850 1250
F 0 "U41R61" H 9850 933 50  0000 C CNN
F 1 "B1N" H 9850 1024 50  0000 C CNN
F 2 "" H 9850 1250 50  0001 C CNN
F 3 "" H 9850 1250 50  0001 C CNN
	1    9850 1250
	1    0    0    1   
$EndComp
$Comp
L CG24-cells:B1N U38R41
U 1 1 6757E3DD
P 9850 1900
F 0 "U38R41" H 9850 1583 50  0000 C CNN
F 1 "B1N" H 9850 1674 50  0000 C CNN
F 2 "" H 9850 1900 50  0001 C CNN
F 3 "" H 9850 1900 50  0001 C CNN
	1    9850 1900
	1    0    0    1   
$EndComp
$Comp
L CG24-cells:B1N U35R31
U 1 1 6757F728
P 9850 2550
F 0 "U35R31" H 9850 2233 50  0000 C CNN
F 1 "B1N" H 9850 2324 50  0000 C CNN
F 2 "" H 9850 2550 50  0001 C CNN
F 3 "" H 9850 2550 50  0001 C CNN
	1    9850 2550
	1    0    0    1   
$EndComp
$Comp
L CG24-cells:B1N U39R41
U 1 1 67580A25
P 9850 3200
F 0 "U39R41" H 9850 2883 50  0000 C CNN
F 1 "B1N" H 9850 2974 50  0000 C CNN
F 2 "" H 9850 3200 50  0001 C CNN
F 3 "" H 9850 3200 50  0001 C CNN
	1    9850 3200
	1    0    0    1   
$EndComp
$Comp
L CG24-cells:B1N U36R40
U 1 1 67581D5F
P 9850 3850
F 0 "U36R40" H 9850 3533 50  0000 C CNN
F 1 "B1N" H 9850 3624 50  0000 C CNN
F 2 "" H 9850 3850 50  0001 C CNN
F 3 "" H 9850 3850 50  0001 C CNN
	1    9850 3850
	1    0    0    1   
$EndComp
$Comp
L CG24-cells:B1N U30R31
U 1 1 67583137
P 9850 4500
F 0 "U30R31" H 9850 4183 50  0000 C CNN
F 1 "B1N" H 9850 4274 50  0000 C CNN
F 2 "" H 9850 4500 50  0001 C CNN
F 3 "" H 9850 4500 50  0001 C CNN
	1    9850 4500
	1    0    0    1   
$EndComp
$Comp
L CG24-cells:B1N U33R41
U 1 1 6758513B
P 9850 5150
F 0 "U33R41" H 9850 4833 50  0000 C CNN
F 1 "B1N" H 9850 4924 50  0000 C CNN
F 2 "" H 9850 5150 50  0001 C CNN
F 3 "" H 9850 5150 50  0001 C CNN
	1    9850 5150
	1    0    0    1   
$EndComp
$Comp
L CG24-cells:B1N U24R31
U 1 1 675864A5
P 9850 5800
F 0 "U24R31" H 9850 5483 50  0000 C CNN
F 1 "B1N" H 9850 5574 50  0000 C CNN
F 2 "" H 9850 5800 50  0001 C CNN
F 3 "" H 9850 5800 50  0001 C CNN
	1    9850 5800
	1    0    0    1   
$EndComp
$Comp
L CG24-cells:O4R U42R41
U 1 1 5E9C5998
P 3200 1250
F 0 "U42R41" H 3200 1567 50  0000 C CNN
F 1 "O4R" H 3200 1476 50  0000 C CNN
F 2 "" H 3200 1250 50  0001 C CNN
F 3 "" H 3200 1250 50  0001 C CNN
	1    3200 1250
	1    0    0    -1  
$EndComp
$Comp
L CG24-cells:O4R U42R32
U 1 1 5E9C5982
P 3200 1900
F 0 "U42R32" H 3200 2217 50  0000 C CNN
F 1 "O4R" H 3200 2126 50  0000 C CNN
F 2 "" H 3200 1900 50  0001 C CNN
F 3 "" H 3200 1900 50  0001 C CNN
	1    3200 1900
	1    0    0    -1  
$EndComp
$Comp
L CG24-cells:O4R U42R25
U 1 1 5E9C5990
P 3200 2550
F 0 "U42R25" H 3200 2867 50  0000 C CNN
F 1 "O4R" H 3200 2776 50  0000 C CNN
F 2 "" H 3200 2550 50  0001 C CNN
F 3 "" H 3200 2550 50  0001 C CNN
	1    3200 2550
	1    0    0    -1  
$EndComp
$Comp
L CG24-cells:O4R U40R21
U 1 1 5E9C5978
P 3200 3200
F 0 "U40R21" H 3200 3517 50  0000 C CNN
F 1 "O4R" H 3200 3426 50  0000 C CNN
F 2 "" H 3200 3200 50  0001 C CNN
F 3 "" H 3200 3200 50  0001 C CNN
	1    3200 3200
	1    0    0    -1  
$EndComp
$Comp
L CG24-cells:O4R U40R24
U 1 1 5E9C5984
P 3200 3850
F 0 "U40R24" H 3200 4167 50  0000 C CNN
F 1 "O4R" H 3200 4076 50  0000 C CNN
F 2 "" H 3200 3850 50  0001 C CNN
F 3 "" H 3200 3850 50  0001 C CNN
	1    3200 3850
	1    0    0    -1  
$EndComp
$Comp
L CG24-cells:O4R U40R29
U 1 1 5E9C598E
P 3200 4500
F 0 "U40R29" H 3200 4817 50  0000 C CNN
F 1 "O4R" H 3200 4726 50  0000 C CNN
F 2 "" H 3200 4500 50  0001 C CNN
F 3 "" H 3200 4500 50  0001 C CNN
	1    3200 4500
	1    0    0    -1  
$EndComp
$Comp
L CG24-cells:O4R U40R34
U 1 1 5E9C5995
P 3200 5150
F 0 "U40R34" H 3200 5467 50  0000 C CNN
F 1 "O4R" H 3200 5376 50  0000 C CNN
F 2 "" H 3200 5150 50  0001 C CNN
F 3 "" H 3200 5150 50  0001 C CNN
	1    3200 5150
	1    0    0    -1  
$EndComp
$Comp
L CG24-cells:O4R U40R44
U 1 1 5E9C59A9
P 3200 5800
F 0 "U40R44" H 3200 6117 50  0000 C CNN
F 1 "O4R" H 3200 6026 50  0000 C CNN
F 2 "" H 3200 5800 50  0001 C CNN
F 3 "" H 3200 5800 50  0001 C CNN
	1    3200 5800
	1    0    0    -1  
$EndComp
$Comp
L CG24-cells:O4R U40R39
U 1 1 5E9C59AB
P 8100 1250
F 0 "U40R39" H 8100 1567 50  0000 C CNN
F 1 "O4R" H 8100 1476 50  0000 C CNN
F 2 "" H 8100 1250 50  0001 C CNN
F 3 "" H 8100 1250 50  0001 C CNN
	1    8100 1250
	1    0    0    -1  
$EndComp
$Comp
L CG24-cells:O4R U38R28
U 1 1 5EA968A2
P 8100 1900
F 0 "U38R28" H 8100 2217 50  0000 C CNN
F 1 "O4R" H 8100 2126 50  0000 C CNN
F 2 "" H 8100 1900 50  0001 C CNN
F 3 "" H 8100 1900 50  0001 C CNN
	1    8100 1900
	1    0    0    -1  
$EndComp
$Comp
L CG24-cells:O4R U38R26
U 1 1 5E9C59B1
P 8100 2550
F 0 "U38R26" H 8100 2867 50  0000 C CNN
F 1 "O4R" H 8100 2776 50  0000 C CNN
F 2 "" H 8100 2550 50  0001 C CNN
F 3 "" H 8100 2550 50  0001 C CNN
	1    8100 2550
	1    0    0    -1  
$EndComp
$Comp
L CG24-cells:O4R U38R21
U 1 1 5E9C59AF
P 8100 3200
F 0 "U38R21" H 8100 3517 50  0000 C CNN
F 1 "O4R" H 8100 3426 50  0000 C CNN
F 2 "" H 8100 3200 50  0001 C CNN
F 3 "" H 8100 3200 50  0001 C CNN
	1    8100 3200
	1    0    0    -1  
$EndComp
$Comp
L CG24-cells:O4R U36R21
U 1 1 5E9C59B2
P 8100 3850
F 0 "U36R21" H 8100 4167 50  0000 C CNN
F 1 "O4R" H 8100 4076 50  0000 C CNN
F 2 "" H 8100 3850 50  0001 C CNN
F 3 "" H 8100 3850 50  0001 C CNN
	1    8100 3850
	1    0    0    -1  
$EndComp
$Comp
L CG24-cells:O4R U34R23
U 1 1 5E9C5992
P 8100 4500
F 0 "U34R23" H 8100 4817 50  0000 C CNN
F 1 "O4R" H 8100 4726 50  0000 C CNN
F 2 "" H 8100 4500 50  0001 C CNN
F 3 "" H 8100 4500 50  0001 C CNN
	1    8100 4500
	1    0    0    -1  
$EndComp
$Comp
L CG24-cells:O4R U34R21
U 1 1 5E9C59AE
P 8100 5150
F 0 "U34R21" H 8100 5467 50  0000 C CNN
F 1 "O4R" H 8100 5376 50  0000 C CNN
F 2 "" H 8100 5150 50  0001 C CNN
F 3 "" H 8100 5150 50  0001 C CNN
	1    8100 5150
	1    0    0    -1  
$EndComp
$Comp
L CG24-cells:O4R U30R22
U 1 1 5E9C5991
P 8100 5800
F 0 "U30R22" H 8100 6117 50  0000 C CNN
F 1 "O4R" H 8100 6026 50  0000 C CNN
F 2 "" H 8100 5800 50  0001 C CNN
F 3 "" H 8100 5800 50  0001 C CNN
	1    8100 5800
	1    0    0    -1  
$EndComp
$Comp
L CG24-cells:B12 U42R39
U 1 1 5E9C58DC
P 4350 1250
F 0 "U42R39" H 4350 1567 50  0000 C CNN
F 1 "B12" H 4350 1476 50  0000 C CNN
F 2 "" H 4350 1250 50  0001 C CNN
F 3 "" H 4350 1250 50  0001 C CNN
	1    4350 1250
	1    0    0    -1  
$EndComp
$Comp
L CG24-cells:B12 U42R35
U 1 1 5E9C58EF
P 4350 1900
F 0 "U42R35" H 4350 2217 50  0000 C CNN
F 1 "B12" H 4350 2126 50  0000 C CNN
F 2 "" H 4350 1900 50  0001 C CNN
F 3 "" H 4350 1900 50  0001 C CNN
	1    4350 1900
	1    0    0    -1  
$EndComp
$Comp
L CG24-cells:B12 U42R28
U 1 1 5E9C58CE
P 4350 2550
F 0 "U42R28" H 4350 2867 50  0000 C CNN
F 1 "B12" H 4350 2776 50  0000 C CNN
F 2 "" H 4350 2550 50  0001 C CNN
F 3 "" H 4350 2550 50  0001 C CNN
	1    4350 2550
	1    0    0    -1  
$EndComp
$Comp
L CG24-cells:B12 U42R37
U 1 1 5E9C58C5
P 4350 3200
F 0 "U42R37" H 4350 3517 50  0000 C CNN
F 1 "B12" H 4350 3426 50  0000 C CNN
F 2 "" H 4350 3200 50  0001 C CNN
F 3 "" H 4350 3200 50  0001 C CNN
	1    4350 3200
	1    0    0    -1  
$EndComp
$Comp
L CG24-cells:B12 U40R27
U 1 1 5E9C58DB
P 4350 3850
F 0 "U40R27" H 4350 4167 50  0000 C CNN
F 1 "B12" H 4350 4076 50  0000 C CNN
F 2 "" H 4350 3850 50  0001 C CNN
F 3 "" H 4350 3850 50  0001 C CNN
	1    4350 3850
	1    0    0    -1  
$EndComp
$Comp
L CG24-cells:B12 U40R32
U 1 1 5E9C58CF
P 4350 4500
F 0 "U40R32" H 4350 4817 50  0000 C CNN
F 1 "B12" H 4350 4726 50  0000 C CNN
F 2 "" H 4350 4500 50  0001 C CNN
F 3 "" H 4350 4500 50  0001 C CNN
	1    4350 4500
	1    0    0    -1  
$EndComp
$Comp
L CG24-cells:B12 U40R37
U 1 1 5E9C58D0
P 4350 5150
F 0 "U40R37" H 4350 5467 50  0000 C CNN
F 1 "B12" H 4350 5376 50  0000 C CNN
F 2 "" H 4350 5150 50  0001 C CNN
F 3 "" H 4350 5150 50  0001 C CNN
	1    4350 5150
	1    0    0    -1  
$EndComp
$Comp
L CG24-cells:B12 U40R47
U 1 1 5E9C58B0
P 4350 5800
F 0 "U40R47" H 4350 6117 50  0000 C CNN
F 1 "B12" H 4350 6026 50  0000 C CNN
F 2 "" H 4350 5800 50  0001 C CNN
F 3 "" H 4350 5800 50  0001 C CNN
	1    4350 5800
	1    0    0    -1  
$EndComp
$Comp
L CG24-cells:B12 U40R42
U 1 1 5E9C589E
P 9250 1250
F 0 "U40R42" H 9250 1567 50  0000 C CNN
F 1 "B12" H 9250 1476 50  0000 C CNN
F 2 "" H 9250 1250 50  0001 C CNN
F 3 "" H 9250 1250 50  0001 C CNN
	1    9250 1250
	1    0    0    -1  
$EndComp
$Comp
L CG24-cells:B12 U38R31
U 1 1 5E9C58BA
P 9250 1900
F 0 "U38R31" H 9250 2217 50  0000 C CNN
F 1 "B12" H 9250 2126 50  0000 C CNN
F 2 "" H 9250 1900 50  0001 C CNN
F 3 "" H 9250 1900 50  0001 C CNN
	1    9250 1900
	1    0    0    -1  
$EndComp
$Comp
L CG24-cells:B12 U36R26
U 1 1 5E9C58C0
P 9250 2550
F 0 "U36R26" H 9250 2867 50  0000 C CNN
F 1 "B12" H 9250 2776 50  0000 C CNN
F 2 "" H 9250 2550 50  0001 C CNN
F 3 "" H 9250 2550 50  0001 C CNN
	1    9250 2550
	1    0    0    -1  
$EndComp
$Comp
L CG24-cells:B12 U38R24
U 1 1 5E9C58A3
P 9250 3200
F 0 "U38R24" H 9250 3517 50  0000 C CNN
F 1 "B12" H 9250 3426 50  0000 C CNN
F 2 "" H 9250 3200 50  0001 C CNN
F 3 "" H 9250 3200 50  0001 C CNN
	1    9250 3200
	1    0    0    -1  
$EndComp
$Comp
L CG24-cells:B12 U36R24
U 1 1 5E9C58A0
P 9250 3850
F 0 "U36R24" H 9250 4167 50  0000 C CNN
F 1 "B12" H 9250 4076 50  0000 C CNN
F 2 "" H 9250 3850 50  0001 C CNN
F 3 "" H 9250 3850 50  0001 C CNN
	1    9250 3850
	1    0    0    -1  
$EndComp
$Comp
L CG24-cells:B12 U30R25
U 1 1 5E9C58BF
P 9250 4500
F 0 "U30R25" H 9250 4817 50  0000 C CNN
F 1 "B12" H 9250 4726 50  0000 C CNN
F 2 "" H 9250 4500 50  0001 C CNN
F 3 "" H 9250 4500 50  0001 C CNN
	1    9250 4500
	1    0    0    -1  
$EndComp
$Comp
L CG24-cells:B12 U32R24
U 1 1 5E9C58BD
P 9250 5150
F 0 "U32R24" H 9250 5467 50  0000 C CNN
F 1 "B12" H 9250 5376 50  0000 C CNN
F 2 "" H 9250 5150 50  0001 C CNN
F 3 "" H 9250 5150 50  0001 C CNN
	1    9250 5150
	1    0    0    -1  
$EndComp
$Comp
L CG24-cells:B12 U28R24
U 1 1 5E9C58BC
P 9250 5800
F 0 "U28R24" H 9250 6117 50  0000 C CNN
F 1 "B12" H 9250 6026 50  0000 C CNN
F 2 "" H 9250 5800 50  0001 C CNN
F 3 "" H 9250 5800 50  0001 C CNN
	1    9250 5800
	1    0    0    -1  
$EndComp
Entry Wire Line
	2450 1800 2550 1900
Entry Wire Line
	2550 1250 2450 1150
Entry Wire Line
	2550 2550 2450 2450
Entry Wire Line
	2550 3200 2450 3100
Entry Wire Line
	2550 3850 2450 3750
Entry Wire Line
	2550 4500 2450 4400
Entry Wire Line
	2550 5150 2450 5050
Entry Wire Line
	2550 5800 2450 5700
Wire Wire Line
	2200 2150 3200 2150
Wire Wire Line
	2200 2800 3200 2800
Wire Wire Line
	2200 3450 3200 3450
Wire Wire Line
	2200 4750 3200 4750
Wire Wire Line
	3200 1500 2200 1500
Wire Wire Line
	2200 4100 3200 4100
Text Label 10450 5800 2    50   ~ 0
IN0
Text Label 10450 5150 2    50   ~ 0
IN1
Text Label 10450 4500 2    50   ~ 0
IN2
Text Label 10450 3850 2    50   ~ 0
IN3
Text Label 10450 3200 2    50   ~ 0
IN4
Text Label 10450 2550 2    50   ~ 0
IN5
Text Label 10450 1900 2    50   ~ 0
IN6
Text Label 10450 1250 2    50   ~ 0
IN7
Text Label 5550 5800 2    50   ~ 0
IN8
Text Label 5550 5150 2    50   ~ 0
IN9
Text Label 5550 4500 2    50   ~ 0
IN10
Text Label 5550 3850 2    50   ~ 0
IN11
Text Label 5550 3200 2    50   ~ 0
IN12
Text Label 5550 2550 2    50   ~ 0
IN13
Text Label 5550 1900 2    50   ~ 0
IN14
Text Label 5550 1250 2    50   ~ 0
IN15
Wire Wire Line
	5250 5800 5600 5800
Wire Wire Line
	5250 4500 5600 4500
Wire Wire Line
	5250 3850 5600 3850
Wire Wire Line
	5250 3200 5600 3200
Wire Wire Line
	5250 2550 5600 2550
Wire Wire Line
	5250 1900 5600 1900
Wire Wire Line
	5250 1250 5600 1250
Wire Wire Line
	2050 6050 2200 6050
Text HLabel 8750 5700 0    50   BiDi ~ 0
DATA0
Text HLabel 8750 5050 0    50   BiDi ~ 0
DATA1
Text HLabel 8750 4400 0    50   BiDi ~ 0
DATA2
Text HLabel 8750 3750 0    50   BiDi ~ 0
DATA3
Text HLabel 8750 3100 0    50   BiDi ~ 0
DATA4
Text HLabel 8750 2450 0    50   BiDi ~ 0
DATA5
Text HLabel 8750 1800 0    50   BiDi ~ 0
DATA6
Text HLabel 8750 1150 0    50   BiDi ~ 0
DATA7
Text HLabel 3850 5700 0    50   BiDi ~ 0
DATA8
Text HLabel 3850 5050 0    50   BiDi ~ 0
DATA9
Text HLabel 3850 4400 0    50   BiDi ~ 0
DATA10
Text HLabel 3850 3750 0    50   BiDi ~ 0
DATA11
Text HLabel 3850 3100 0    50   BiDi ~ 0
DATA12
Text HLabel 3850 2450 0    50   BiDi ~ 0
DATA13
Text HLabel 3850 1800 0    50   BiDi ~ 0
DATA14
Text HLabel 3850 1150 0    50   BiDi ~ 0
DATA15
Wire Wire Line
	4050 1250 3950 1250
Wire Wire Line
	3850 1150 3950 1150
Wire Wire Line
	3950 1150 3950 1250
Connection ~ 3950 1250
Wire Wire Line
	3950 1250 3500 1250
Wire Wire Line
	4050 1900 3950 1900
Wire Wire Line
	3850 1800 3950 1800
Wire Wire Line
	3950 1800 3950 1900
Connection ~ 3950 1900
Wire Wire Line
	3950 1900 3500 1900
Wire Wire Line
	4050 2550 3950 2550
Wire Wire Line
	3850 2450 3950 2450
Wire Wire Line
	3950 2450 3950 2550
Connection ~ 3950 2550
Wire Wire Line
	3950 2550 3500 2550
Wire Wire Line
	4050 3200 3950 3200
Wire Wire Line
	3850 3100 3950 3100
Wire Wire Line
	3950 3100 3950 3200
Connection ~ 3950 3200
Wire Wire Line
	3950 3200 3500 3200
Wire Wire Line
	4050 3850 3950 3850
Wire Wire Line
	3850 3750 3950 3750
Wire Wire Line
	3950 3750 3950 3850
Connection ~ 3950 3850
Wire Wire Line
	3950 3850 3500 3850
Wire Wire Line
	4050 4500 3950 4500
Wire Wire Line
	3850 4400 3950 4400
Wire Wire Line
	3950 4400 3950 4500
Connection ~ 3950 4500
Wire Wire Line
	3950 4500 3500 4500
Wire Wire Line
	4050 5150 3950 5150
Wire Wire Line
	3850 5050 3950 5050
Wire Wire Line
	3950 5050 3950 5150
Connection ~ 3950 5150
Wire Wire Line
	3950 5150 3500 5150
Wire Wire Line
	4050 5800 3950 5800
Wire Wire Line
	3850 5700 3950 5700
Wire Wire Line
	3950 5700 3950 5800
Connection ~ 3950 5800
Wire Wire Line
	3950 5800 3500 5800
Text Label 7500 5800 0    50   ~ 0
OUT0
Text Label 7500 5150 0    50   ~ 0
OUT1
Text Label 7500 4500 0    50   ~ 0
OUT2
Text Label 7500 3850 0    50   ~ 0
OUT3
Text Label 7500 3200 0    50   ~ 0
OUT4
Text Label 7500 2550 0    50   ~ 0
OUT5
Text Label 7500 1900 0    50   ~ 0
OUT6
Text Label 7500 1250 0    50   ~ 0
OUT7
Wire Wire Line
	5950 6400 5950 6050
Entry Wire Line
	7350 1800 7450 1900
Entry Wire Line
	7450 1250 7350 1150
Entry Wire Line
	7450 2550 7350 2450
Entry Wire Line
	7450 3200 7350 3100
Entry Wire Line
	7450 3850 7350 3750
Entry Wire Line
	7450 4500 7350 4400
Entry Wire Line
	7450 5150 7350 5050
Entry Wire Line
	7450 5800 7350 5700
Wire Wire Line
	7100 2150 8100 2150
Wire Wire Line
	7100 2800 8100 2800
Wire Wire Line
	7100 3450 8100 3450
Wire Wire Line
	7100 4750 8100 4750
Wire Wire Line
	7100 5400 8100 5400
Wire Wire Line
	8100 1500 7100 1500
Wire Wire Line
	7100 4100 8100 4100
Wire Wire Line
	10150 5800 10500 5800
Wire Wire Line
	10150 5150 10500 5150
Wire Wire Line
	10150 4500 10500 4500
Wire Wire Line
	10150 3850 10500 3850
Wire Wire Line
	10150 3200 10500 3200
Wire Wire Line
	10150 2550 10500 2550
Wire Wire Line
	10150 1900 10500 1900
Wire Wire Line
	10150 1250 10500 1250
Wire Wire Line
	6950 6050 7100 6050
Entry Wire Line
	10600 1800 10500 1900
Entry Wire Line
	10500 1250 10600 1150
Entry Wire Line
	10500 2550 10600 2450
Entry Wire Line
	10500 3200 10600 3100
Entry Wire Line
	10500 3850 10600 3750
Entry Wire Line
	10500 4500 10600 4400
Entry Wire Line
	10500 5150 10600 5050
Entry Wire Line
	10500 5800 10600 5700
Wire Wire Line
	7800 5800 7450 5800
Wire Wire Line
	7800 5150 7450 5150
Wire Wire Line
	7800 4500 7450 4500
Wire Wire Line
	7800 3850 7450 3850
Wire Wire Line
	7800 3200 7450 3200
Wire Wire Line
	7800 2550 7450 2550
Wire Wire Line
	7800 1900 7450 1900
Wire Wire Line
	7800 1250 7450 1250
Wire Wire Line
	8950 1250 8850 1250
Wire Wire Line
	8750 1150 8850 1150
Wire Wire Line
	8850 1150 8850 1250
Connection ~ 8850 1250
Wire Wire Line
	8850 1250 8400 1250
Wire Wire Line
	8950 1900 8850 1900
Wire Wire Line
	8750 1800 8850 1800
Wire Wire Line
	8850 1800 8850 1900
Connection ~ 8850 1900
Wire Wire Line
	8850 1900 8400 1900
Wire Wire Line
	8950 2550 8850 2550
Wire Wire Line
	8750 2450 8850 2450
Wire Wire Line
	8850 2450 8850 2550
Connection ~ 8850 2550
Wire Wire Line
	8850 2550 8400 2550
Wire Wire Line
	8950 3200 8850 3200
Wire Wire Line
	8750 3100 8850 3100
Wire Wire Line
	8850 3100 8850 3200
Connection ~ 8850 3200
Wire Wire Line
	8850 3200 8400 3200
Wire Wire Line
	8950 3850 8850 3850
Wire Wire Line
	8750 3750 8850 3750
Wire Wire Line
	8850 3750 8850 3850
Connection ~ 8850 3850
Wire Wire Line
	8850 3850 8400 3850
Wire Wire Line
	8950 4500 8850 4500
Wire Wire Line
	8750 4400 8850 4400
Wire Wire Line
	8850 4400 8850 4500
Connection ~ 8850 4500
Wire Wire Line
	8850 4500 8400 4500
Wire Wire Line
	8950 5150 8850 5150
Wire Wire Line
	8750 5050 8850 5050
Wire Wire Line
	8850 5050 8850 5150
Connection ~ 8850 5150
Wire Wire Line
	8850 5150 8400 5150
Wire Wire Line
	8950 5800 8850 5800
Wire Wire Line
	8750 5700 8850 5700
Wire Wire Line
	8850 5700 8850 5800
Connection ~ 8850 5800
Wire Wire Line
	8850 5800 8400 5800
Wire Wire Line
	1450 6050 1350 6050
Wire Wire Line
	6350 6400 6350 6950
Wire Wire Line
	1250 6950 1250 6400
Wire Wire Line
	1250 6400 1450 6400
Wire Wire Line
	1350 6050 1350 6850
Text HLabel 1150 6950 0    50   Input ~ 0
IN-ENABLE
Text HLabel 1150 6850 0    50   Input ~ 0
OUT-ENABLE
Wire Wire Line
	1350 6850 1150 6850
Connection ~ 1350 6850
Wire Wire Line
	1250 6950 1150 6950
Connection ~ 1250 6950
Text HLabel 1600 700  0    50   Output ~ 0
IN[0..15]
Text HLabel 1600 800  0    50   Input ~ 0
OUT[0..15]
Wire Wire Line
	2200 5400 3200 5400
Wire Wire Line
	5250 5150 5600 5150
Wire Wire Line
	1250 6950 6350 6950
Wire Wire Line
	6350 6050 6250 6050
Wire Wire Line
	6250 6050 6250 6850
Wire Wire Line
	1350 6850 6250 6850
$Comp
L CG24-cells:B1N U40R61
U 1 1 67577469
P 4950 5800
F 0 "U40R61" H 4950 5483 50  0000 C CNN
F 1 "B1N" H 4950 5574 50  0000 C CNN
F 2 "" H 4950 5800 50  0001 C CNN
F 3 "" H 4950 5800 50  0001 C CNN
	1    4950 5800
	1    0    0    1   
$EndComp
$Comp
L CG24-cells:B1N U32R41
U 1 1 67575D99
P 4950 5150
F 0 "U32R41" H 4950 4833 50  0000 C CNN
F 1 "B1N" H 4950 4924 50  0000 C CNN
F 2 "" H 4950 5150 50  0001 C CNN
F 3 "" H 4950 5150 50  0001 C CNN
	1    4950 5150
	1    0    0    1   
$EndComp
$Comp
L CG24-cells:B1N U34R40
U 1 1 67572510
P 4950 4500
F 0 "U34R40" H 4950 4183 50  0000 C CNN
F 1 "B1N" H 4950 4274 50  0000 C CNN
F 2 "" H 4950 4500 50  0001 C CNN
F 3 "" H 4950 4500 50  0001 C CNN
	1    4950 4500
	1    0    0    1   
$EndComp
$Comp
L CG24-cells:B1N U41R29
U 1 1 674BFB16
P 4950 3850
F 0 "U41R29" H 4950 3533 50  0000 C CNN
F 1 "B1N" H 4950 3624 50  0000 C CNN
F 2 "" H 4950 3850 50  0001 C CNN
F 3 "" H 4950 3850 50  0001 C CNN
	1    4950 3850
	1    0    0    1   
$EndComp
$Comp
L CG24-cells:B1N U35R41
U 1 1 674BE6AD
P 4950 3200
F 0 "U35R41" H 4950 2883 50  0000 C CNN
F 1 "B1N" H 4950 2974 50  0000 C CNN
F 2 "" H 4950 3200 50  0001 C CNN
F 3 "" H 4950 3200 50  0001 C CNN
	1    4950 3200
	1    0    0    1   
$EndComp
$Comp
L CG24-cells:B1N U34R31
U 1 1 6737257C
P 4950 2550
F 0 "U34R31" H 4950 2233 50  0000 C CNN
F 1 "B1N" H 4950 2324 50  0000 C CNN
F 2 "" H 4950 2550 50  0001 C CNN
F 3 "" H 4950 2550 50  0001 C CNN
	1    4950 2550
	1    0    0    1   
$EndComp
$Comp
L CG24-cells:B1N U34R41
U 1 1 672717BF
P 4950 1900
F 0 "U34R41" H 4950 1583 50  0000 C CNN
F 1 "B1N" H 4950 1674 50  0000 C CNN
F 2 "" H 4950 1900 50  0001 C CNN
F 3 "" H 4950 1900 50  0001 C CNN
	1    4950 1900
	1    0    0    1   
$EndComp
$Comp
L CG24-cells:B1N U37R41
U 1 1 5EC0967E
P 4950 1250
F 0 "U37R41" H 4950 1567 50  0000 C CNN
F 1 "B1N" H 4950 1476 50  0000 C CNN
F 2 "" H 4950 1250 50  0001 C CNN
F 3 "" H 4950 1250 50  0001 C CNN
	1    4950 1250
	1    0    0    -1  
$EndComp
Connection ~ 5950 6050
Text Label 2600 1250 0    50   ~ 0
OUT15
Text Label 2600 1900 0    50   ~ 0
OUT14
Text Label 2600 2550 0    50   ~ 0
OUT13
Text Label 2600 3200 0    50   ~ 0
OUT12
Text Label 2600 3850 0    50   ~ 0
OUT11
Text Label 2600 4500 0    50   ~ 0
OUT10
Text Label 2600 5150 0    50   ~ 0
OUT9
Text Label 2600 5800 0    50   ~ 0
OUT8
Wire Wire Line
	2900 1250 2550 1250
Wire Wire Line
	2900 1900 2550 1900
Wire Wire Line
	2900 2550 2550 2550
Wire Wire Line
	2900 3200 2550 3200
Wire Wire Line
	2900 3850 2550 3850
Wire Wire Line
	2900 4500 2550 4500
Wire Wire Line
	2900 5150 2550 5150
Wire Wire Line
	2900 5800 2550 5800
Entry Wire Line
	5600 5800 5700 5700
Entry Wire Line
	5600 5150 5700 5050
Entry Wire Line
	5600 4500 5700 4400
Entry Wire Line
	5600 3850 5700 3750
Entry Wire Line
	5600 3200 5700 3100
Entry Wire Line
	5600 2550 5700 2450
Entry Wire Line
	5600 1250 5700 1150
Entry Wire Line
	5700 1800 5600 1900
Wire Wire Line
	2200 1500 2200 2150
Connection ~ 2200 2150
Wire Wire Line
	2200 2150 2200 2800
Connection ~ 2200 2800
Wire Wire Line
	2200 2800 2200 3450
Connection ~ 2200 3450
Wire Wire Line
	2200 3450 2200 4100
Connection ~ 2200 4100
Wire Wire Line
	2200 4100 2200 4750
Connection ~ 2200 4750
Wire Wire Line
	2200 4750 2200 5400
Connection ~ 2200 5400
Wire Wire Line
	2200 5400 2200 6050
Wire Wire Line
	5950 1500 5950 2150
Connection ~ 5950 2150
Wire Wire Line
	5950 2150 5950 2800
Connection ~ 5950 2800
Wire Wire Line
	5950 2800 5950 3450
Connection ~ 5950 3450
Wire Wire Line
	5950 3450 5950 4100
Connection ~ 5950 4100
Wire Wire Line
	5950 4100 5950 4750
Connection ~ 5950 4750
Wire Wire Line
	5950 4750 5950 5400
Connection ~ 5950 5400
Wire Wire Line
	5950 5400 5950 6050
Wire Wire Line
	7100 1500 7100 2150
Connection ~ 7100 2150
Wire Wire Line
	7100 2150 7100 2800
Connection ~ 7100 2800
Wire Wire Line
	7100 2800 7100 3450
Connection ~ 7100 3450
Wire Wire Line
	7100 3450 7100 4100
Connection ~ 7100 4100
Wire Wire Line
	7100 4100 7100 4750
Connection ~ 7100 4750
Wire Wire Line
	7100 4750 7100 5400
Connection ~ 7100 5400
Wire Wire Line
	7100 5400 7100 6050
Wire Bus Line
	1600 700  5700 700 
Connection ~ 2200 6050
Connection ~ 2450 800 
Wire Bus Line
	2450 800  1600 800 
Wire Bus Line
	2450 800  7350 800 
Wire Wire Line
	2200 6050 3200 6050
Wire Wire Line
	4350 1500 5950 1500
Wire Wire Line
	4350 2150 5950 2150
Wire Wire Line
	4350 2800 5950 2800
Wire Wire Line
	4350 3450 5950 3450
Wire Wire Line
	4350 4100 5950 4100
Wire Wire Line
	4350 4750 5950 4750
Wire Wire Line
	4350 5400 5950 5400
Wire Wire Line
	4350 6050 5950 6050
Wire Wire Line
	2050 6400 5950 6400
Connection ~ 7100 6050
Wire Wire Line
	7100 6050 8100 6050
Wire Wire Line
	10850 1500 10850 2150
Wire Wire Line
	9250 1500 10850 1500
Wire Wire Line
	9250 2150 10850 2150
Wire Wire Line
	9250 2800 10850 2800
Wire Wire Line
	9250 3450 10850 3450
Wire Wire Line
	9250 4100 10850 4100
Wire Wire Line
	9250 4750 10850 4750
Wire Wire Line
	9250 5400 10850 5400
Wire Wire Line
	9250 6050 10850 6050
Connection ~ 10850 2150
Wire Wire Line
	10850 2150 10850 2800
Connection ~ 10850 2800
Wire Wire Line
	10850 2800 10850 3450
Connection ~ 10850 3450
Wire Wire Line
	10850 3450 10850 4100
Connection ~ 10850 4100
Wire Wire Line
	10850 4100 10850 4750
Connection ~ 10850 4750
Wire Wire Line
	10850 4750 10850 5400
Connection ~ 10850 5400
Wire Wire Line
	6950 6400 10850 6400
Wire Wire Line
	10850 5400 10850 6050
Connection ~ 10850 6050
Wire Wire Line
	10850 6050 10850 6400
Wire Bus Line
	5700 700  10600 700 
Connection ~ 5700 700 
Entry Wire Line
	1900 4800 2000 4700
Entry Wire Line
	1900 4700 2000 4600
Entry Wire Line
	1900 4600 2000 4500
Entry Wire Line
	1900 4500 2000 4400
Entry Wire Line
	1900 4400 2000 4300
Entry Wire Line
	1900 4300 2000 4200
Entry Wire Line
	1900 4200 2000 4100
Entry Wire Line
	1900 4100 2000 4000
Entry Wire Line
	1900 3400 2000 3300
Entry Wire Line
	1900 3300 2000 3200
Entry Wire Line
	1900 3200 2000 3100
Entry Wire Line
	1900 3100 2000 3000
Entry Wire Line
	1900 3000 2000 2900
Entry Wire Line
	1900 2900 2000 2800
Entry Wire Line
	1900 2800 2000 2700
Entry Wire Line
	1900 2700 2000 2600
Wire Wire Line
	1250 4100 1900 4100
Wire Wire Line
	1250 4200 1900 4200
Wire Wire Line
	1250 4300 1900 4300
Wire Wire Line
	1250 4400 1900 4400
Wire Wire Line
	1250 4500 1900 4500
Wire Wire Line
	1250 4600 1900 4600
Wire Wire Line
	1250 4700 1900 4700
Wire Wire Line
	1250 4800 1900 4800
Wire Wire Line
	1250 2700 1900 2700
Wire Wire Line
	1250 2800 1900 2800
Wire Wire Line
	1250 2900 1900 2900
Wire Wire Line
	1250 3000 1900 3000
Wire Wire Line
	1250 3100 1900 3100
Wire Wire Line
	1250 3200 1900 3200
Wire Wire Line
	1250 3300 1900 3300
Wire Wire Line
	1250 3400 1900 3400
Entry Wire Line
	1150 3500 1250 3400
Entry Wire Line
	1150 3400 1250 3300
Entry Wire Line
	1150 3300 1250 3200
Entry Wire Line
	1150 3200 1250 3100
Entry Wire Line
	1150 3100 1250 3000
Entry Wire Line
	1150 3000 1250 2900
Entry Wire Line
	1150 2900 1250 2800
Entry Wire Line
	1150 2800 1250 2700
Entry Wire Line
	1150 4900 1250 4800
Entry Wire Line
	1150 4800 1250 4700
Entry Wire Line
	1150 4700 1250 4600
Entry Wire Line
	1150 4600 1250 4500
Entry Wire Line
	1150 4500 1250 4400
Entry Wire Line
	1150 4400 1250 4300
Entry Wire Line
	1150 4300 1250 4200
Entry Wire Line
	1150 4200 1250 4100
Wire Bus Line
	1150 3650 950  3650
Wire Bus Line
	1150 5050 950  5050
Text Label 1650 2700 0    50   ~ 0
IN0
Text Label 1650 2800 0    50   ~ 0
IN1
Text Label 1650 2900 0    50   ~ 0
IN2
Text Label 1650 3000 0    50   ~ 0
IN3
Text Label 1650 3100 0    50   ~ 0
IN4
Text Label 1650 3200 0    50   ~ 0
IN5
Text Label 1650 3300 0    50   ~ 0
IN6
Text Label 1650 3400 0    50   ~ 0
IN7
Text Label 1650 4100 0    50   ~ 0
IN8
Text Label 1650 4200 0    50   ~ 0
IN9
Text Label 1650 4300 0    50   ~ 0
IN10
Text Label 1650 4400 0    50   ~ 0
IN11
Text Label 1650 4500 0    50   ~ 0
IN12
Text Label 1650 4600 0    50   ~ 0
IN13
Text Label 1650 4700 0    50   ~ 0
IN14
Text Label 1650 4800 0    50   ~ 0
IN15
Text Label 1300 2700 0    50   ~ 0
C0
Text Label 1300 2800 0    50   ~ 0
C1
Text Label 1300 2900 0    50   ~ 0
C2
Text Label 1300 3000 0    50   ~ 0
C3
Text Label 1300 3100 0    50   ~ 0
C4
Text Label 1300 3200 0    50   ~ 0
C5
Text Label 1300 3300 0    50   ~ 0
C6
Text Label 1300 3400 0    50   ~ 0
C7
Text HLabel 950  5050 0    50   Output ~ 0
D[0..7]
Text HLabel 950  3650 0    50   Output ~ 0
C[0..7]
Text Label 1300 4100 0    50   ~ 0
D0
Text Label 1300 4200 0    50   ~ 0
D1
Text Label 1300 4300 0    50   ~ 0
D2
Text Label 1300 4400 0    50   ~ 0
D3
Text Label 1300 4500 0    50   ~ 0
D4
Text Label 1300 4600 0    50   ~ 0
D5
Text Label 1300 4700 0    50   ~ 0
D6
Text Label 1300 4800 0    50   ~ 0
D7
Wire Bus Line
	1150 4200 1150 5050
Wire Bus Line
	1150 2800 1150 3650
Wire Bus Line
	5700 700  5700 5700
Wire Bus Line
	10600 700  10600 5700
Wire Bus Line
	7350 800  7350 5700
Wire Bus Line
	2450 800  2450 5700
Wire Bus Line
	2000 2300 2000 4700
$EndSCHEMATC
