EESchema Schematic File Version 4
EELAYER 30 0
EELAYER END
$Descr A4 11693 8268
encoding utf-8
Sheet 17 20
Title "DL-1727"
Date "2020-04-26"
Rev ""
Comp ""
Comment1 ""
Comment2 "Licence: CC-BY"
Comment3 "Author: Loic *WydD* Petit"
Comment4 "Project: CPS2 Reverse Engineering: DL-1727"
$EndDescr
Wire Wire Line
	8250 4850 8450 4850
Wire Wire Line
	5050 1350 5200 1350
$Comp
L power:GND #PWR0118
U 1 1 66C0F627
P 5050 1350
F 0 "#PWR0118" H 5050 1100 50  0001 C CNN
F 1 "GND" H 5055 1177 50  0001 C CNN
F 2 "" H 5050 1350 50  0001 C CNN
F 3 "" H 5050 1350 50  0001 C CNN
	1    5050 1350
	1    0    0    -1  
$EndComp
$Comp
L CG24-cells:V2B U5R154
U 1 1 69061B5A
P 4200 2900
F 0 "U5R154" H 4200 3217 50  0000 C CNN
F 1 "V2B" H 4200 3126 50  0000 C CNN
F 2 "" H 4200 2700 50  0001 C CNN
F 3 "" H 4200 2700 50  0001 C CNN
	1    4200 2900
	1    0    0    -1  
$EndComp
$Comp
L CG24-cells:V2B U6R123
U 1 1 68B8BF81
P 4200 4850
F 0 "U6R123" H 4200 5167 50  0000 C CNN
F 1 "V2B" H 4200 5076 50  0000 C CNN
F 2 "" H 4200 4650 50  0001 C CNN
F 3 "" H 4200 4650 50  0001 C CNN
	1    4200 4850
	1    0    0    -1  
$EndComp
$Comp
L CG24-cells:V2B U21R154
U 1 1 6C013537
P 7950 4850
F 0 "U21R154" H 7950 5167 50  0000 C CNN
F 1 "V2B" H 7950 5076 50  0000 C CNN
F 2 "" H 7950 4650 50  0001 C CNN
F 3 "" H 7950 4650 50  0001 C CNN
	1    7950 4850
	-1   0    0    -1  
$EndComp
$Comp
L CG24-cells:O4R U2R156
U 1 1 5E9C59B8
P 5500 3950
F 0 "U2R156" H 5500 4267 50  0000 C CNN
F 1 "O4R" H 5500 4176 50  0000 C CNN
F 2 "" H 5500 3950 50  0001 C CNN
F 3 "" H 5500 3950 50  0001 C CNN
	1    5500 3950
	1    0    0    -1  
$EndComp
$Comp
L CG24-cells:O4R U2R158
U 1 1 5E9C5971
P 5500 4600
F 0 "U2R158" H 5500 4917 50  0000 C CNN
F 1 "O4R" H 5500 4826 50  0000 C CNN
F 2 "" H 5500 4600 50  0001 C CNN
F 3 "" H 5500 4600 50  0001 C CNN
	1    5500 4600
	1    0    0    -1  
$EndComp
$Comp
L CG24-cells:O4R U42R64
U 1 1 5E9C598F
P 5500 3300
F 0 "U42R64" H 5500 3617 50  0000 C CNN
F 1 "O4R" H 5500 3526 50  0000 C CNN
F 2 "" H 5500 3300 50  0001 C CNN
F 3 "" H 5500 3300 50  0001 C CNN
	1    5500 3300
	1    0    0    -1  
$EndComp
$Comp
L CG24-cells:O4R U42R62
U 1 1 5E9C59A3
P 5500 2650
F 0 "U42R62" H 5500 2967 50  0000 C CNN
F 1 "O4R" H 5500 2876 50  0000 C CNN
F 2 "" H 5500 2650 50  0001 C CNN
F 3 "" H 5500 2650 50  0001 C CNN
	1    5500 2650
	1    0    0    -1  
$EndComp
$Comp
L CG24-cells:O4R U42R53
U 1 1 5E9C596B
P 5500 2000
F 0 "U42R53" H 5500 2317 50  0000 C CNN
F 1 "O4R" H 5500 2226 50  0000 C CNN
F 2 "" H 5500 2000 50  0001 C CNN
F 3 "" H 5500 2000 50  0001 C CNN
	1    5500 2000
	1    0    0    -1  
$EndComp
$Comp
L CG24-cells:B12 U42R46
U 1 1 5E9C58C4
P 6650 1350
F 0 "U42R46" H 6650 1667 50  0000 C CNN
F 1 "B12" H 6650 1576 50  0000 C CNN
F 2 "" H 6650 1350 50  0001 C CNN
F 3 "" H 6650 1350 50  0001 C CNN
	1    6650 1350
	1    0    0    -1  
$EndComp
$Comp
L CG24-cells:B12 U2R163
U 1 1 5E9C58D5
P 6650 3950
F 0 "U2R163" H 6650 4267 50  0000 C CNN
F 1 "B12" H 6650 4176 50  0000 C CNN
F 2 "" H 6650 3950 50  0001 C CNN
F 3 "" H 6650 3950 50  0001 C CNN
	1    6650 3950
	1    0    0    -1  
$EndComp
$Comp
L CG24-cells:B12 U2R161
U 1 1 5E9C58E4
P 6650 4600
F 0 "U2R161" H 6650 4917 50  0000 C CNN
F 1 "B12" H 6650 4826 50  0000 C CNN
F 2 "" H 6650 4600 50  0001 C CNN
F 3 "" H 6650 4600 50  0001 C CNN
	1    6650 4600
	1    0    0    -1  
$EndComp
$Comp
L CG24-cells:B12 U42R67
U 1 1 5E9C58D9
P 6650 3300
F 0 "U42R67" H 6650 3617 50  0000 C CNN
F 1 "B12" H 6650 3526 50  0000 C CNN
F 2 "" H 6650 3300 50  0001 C CNN
F 3 "" H 6650 3300 50  0001 C CNN
	1    6650 3300
	1    0    0    -1  
$EndComp
$Comp
L CG24-cells:B12 U42R60
U 1 1 5E9C58D1
P 6650 2650
F 0 "U42R60" H 6650 2967 50  0000 C CNN
F 1 "B12" H 6650 2876 50  0000 C CNN
F 2 "" H 6650 2650 50  0001 C CNN
F 3 "" H 6650 2650 50  0001 C CNN
	1    6650 2650
	1    0    0    -1  
$EndComp
$Comp
L CG24-cells:B12 U42R56
U 1 1 5E9C58CC
P 6650 2000
F 0 "U42R56" H 6650 2317 50  0000 C CNN
F 1 "B12" H 6650 2226 50  0000 C CNN
F 2 "" H 6650 2000 50  0001 C CNN
F 3 "" H 6650 2000 50  0001 C CNN
	1    6650 2000
	1    0    0    -1  
$EndComp
$Comp
L CG24-cells:O4R U42R43
U 1 1 5E9C5996
P 5500 1350
F 0 "U42R43" H 5500 1667 50  0000 C CNN
F 1 "O4R" H 5500 1576 50  0000 C CNN
F 2 "" H 5500 1350 50  0001 C CNN
F 3 "" H 5500 1350 50  0001 C CNN
	1    5500 1350
	1    0    0    -1  
$EndComp
Text Label 7200 4600 2    50   ~ 0
IN0
Text Label 7200 3950 2    50   ~ 0
IN1
Text Label 7200 3300 2    50   ~ 0
IN2
Text Label 7200 2650 2    50   ~ 0
IN3
Text Label 7200 2000 2    50   ~ 0
IN4
Text HLabel 6150 4500 0    50   BiDi ~ 0
DATA0
Text HLabel 6150 3850 0    50   BiDi ~ 0
DATA1
Text HLabel 6150 3200 0    50   BiDi ~ 0
DATA2
Text HLabel 6150 2550 0    50   BiDi ~ 0
DATA3
Text HLabel 6150 1900 0    50   BiDi ~ 0
DATA4
Text HLabel 6150 1250 0    50   BiDi ~ 0
DATA15
Text Label 4900 4600 0    50   ~ 0
OUT0
Text Label 4900 3950 0    50   ~ 0
OUT1
Text Label 4900 3300 0    50   ~ 0
OUT2
Text Label 4900 2650 0    50   ~ 0
OUT3
Text Label 4900 2000 0    50   ~ 0
OUT4
Entry Wire Line
	4850 4600 4750 4700
Entry Wire Line
	4850 3950 4750 4050
Entry Wire Line
	4850 3300 4750 3400
Entry Wire Line
	4850 2650 4750 2750
Entry Wire Line
	4850 2000 4750 2100
Wire Wire Line
	4500 3550 5500 3550
Wire Wire Line
	4500 4200 5500 4200
Wire Wire Line
	7650 2250 6650 2250
Wire Wire Line
	7650 2900 6650 2900
Wire Wire Line
	7650 3550 6650 3550
Wire Wire Line
	7650 4200 6650 4200
Wire Wire Line
	4500 2900 5500 2900
Wire Wire Line
	6950 2000 7300 2000
Wire Wire Line
	6950 2650 7300 2650
Wire Wire Line
	6950 3300 7300 3300
Wire Wire Line
	6950 3950 7300 3950
Wire Wire Line
	6950 4600 7300 4600
Entry Wire Line
	7300 4600 7400 4700
Entry Wire Line
	7300 3950 7400 4050
Entry Wire Line
	7300 3300 7400 3400
Entry Wire Line
	7300 2650 7400 2750
Entry Wire Line
	7300 2000 7400 2100
Wire Wire Line
	5200 4600 4850 4600
Wire Wire Line
	5200 3950 4850 3950
Wire Wire Line
	5200 3300 4850 3300
Wire Wire Line
	5200 2650 4850 2650
Wire Wire Line
	5200 2000 4850 2000
Wire Wire Line
	6350 1350 6250 1350
Wire Wire Line
	6150 1250 6250 1250
Wire Wire Line
	6250 1250 6250 1350
Connection ~ 6250 1350
Wire Wire Line
	6250 1350 5800 1350
Wire Wire Line
	6350 2000 6250 2000
Wire Wire Line
	6150 1900 6250 1900
Wire Wire Line
	6250 1900 6250 2000
Connection ~ 6250 2000
Wire Wire Line
	6250 2000 5800 2000
Wire Wire Line
	6350 2650 6250 2650
Wire Wire Line
	6150 2550 6250 2550
Wire Wire Line
	6250 2550 6250 2650
Connection ~ 6250 2650
Wire Wire Line
	6250 2650 5800 2650
Wire Wire Line
	6350 3300 6250 3300
Wire Wire Line
	6150 3200 6250 3200
Wire Wire Line
	6250 3200 6250 3300
Connection ~ 6250 3300
Wire Wire Line
	6250 3300 5800 3300
Wire Wire Line
	6350 3950 6250 3950
Wire Wire Line
	6150 3850 6250 3850
Wire Wire Line
	6250 3850 6250 3950
Connection ~ 6250 3950
Wire Wire Line
	6250 3950 5800 3950
Wire Wire Line
	6350 4600 6250 4600
Wire Wire Line
	6150 4500 6250 4500
Wire Wire Line
	6250 4500 6250 4600
Connection ~ 6250 4600
Wire Wire Line
	6250 4600 5800 4600
Wire Wire Line
	6650 1600 7650 1600
Wire Wire Line
	4500 2250 5500 2250
Wire Wire Line
	7650 4850 6650 4850
Wire Wire Line
	5500 4850 4500 4850
Connection ~ 4500 4850
Wire Wire Line
	3900 2900 3900 4850
Wire Wire Line
	4500 2250 4500 2900
$Comp
L CG24-cells:R2P U38R?
U 1 1 5EEBBD32
P 4300 1600
AR Path="/5EBEBBD5/5EEBBD32" Ref="U38R?"  Part="1" 
AR Path="/5EE26DF9/5EEBBD32" Ref="U38R71"  Part="1" 
F 0 "U38R71" H 4325 1867 50  0000 C CNN
F 1 "R2P" H 4325 1776 50  0000 C CNN
F 2 "" H 4350 1600 50  0001 C CNN
F 3 "" H 4350 1600 50  0001 C CNN
	1    4300 1600
	1    0    0    -1  
$EndComp
Wire Wire Line
	4500 3550 4500 4200
Connection ~ 4500 2900
Connection ~ 4500 4200
Wire Wire Line
	4500 4200 4500 4850
Connection ~ 7650 4850
Wire Bus Line
	7400 5250 8450 5250
Text HLabel 3650 1550 0    50   Input ~ 0
~ENABLE-OUT15
Wire Wire Line
	3650 1550 4050 1550
Text HLabel 3650 1650 0    50   Input ~ 0
OUT15
Text HLabel 3700 4850 0    50   Input ~ 0
ENABLE-OUT-LO
Wire Wire Line
	3700 4850 3900 4850
Connection ~ 3900 4850
Text HLabel 3700 5250 0    50   Input ~ 0
OUT[0..4]
Wire Bus Line
	3700 5250 4750 5250
Text HLabel 8450 5250 2    50   Output ~ 0
IN[0..4]
Text HLabel 8450 4850 2    50   Input ~ 0
ENABLE-IN
Text HLabel 8400 1300 2    50   Output ~ 0
IN15
Wire Wire Line
	7250 850  7250 1250
Wire Wire Line
	7250 1250 7500 1250
$Comp
L CG24-cells:N2P U34R?
U 1 1 5F2427BC
P 7750 1300
AR Path="/5EBEBBD5/5F2427BC" Ref="U34R?"  Part="1" 
AR Path="/5F2427BC" Ref="U34R?"  Part="1" 
AR Path="/5EE26DF9/5F2427BC" Ref="U34R81"  Part="1" 
F 0 "U34R81" H 7775 1567 50  0000 C CNN
F 1 "N2P" H 7775 1476 50  0000 C CNN
F 2 "" H 7750 1300 50  0001 C CNN
F 3 "" H 7750 1300 50  0001 C CNN
	1    7750 1300
	1    0    0    -1  
$EndComp
Wire Wire Line
	8050 1300 8400 1300
Wire Wire Line
	6950 1350 7250 1350
Wire Wire Line
	4600 1600 5500 1600
Wire Wire Line
	3950 1650 3950 850 
Wire Wire Line
	3950 850  7250 850 
Connection ~ 3950 1650
Wire Wire Line
	3950 1650 4050 1650
Wire Wire Line
	3650 1650 3950 1650
Text HLabel 8400 1500 2    50   Output ~ 0
_IN15
Wire Wire Line
	8400 1500 7250 1500
Connection ~ 7250 1350
Wire Wire Line
	7250 1350 7500 1350
Wire Wire Line
	7250 1350 7250 1500
Text Label 7600 5600 0    50   ~ 0
IN0
Text Label 7600 5700 0    50   ~ 0
IN1
Text Label 7600 5800 0    50   ~ 0
IN2
Text Label 7600 5900 0    50   ~ 0
IN3
Text Label 7600 6000 0    50   ~ 0
IN4
Text Label 7900 6000 0    50   ~ 0
DE3
Text Label 7900 5900 0    50   ~ 0
DE4
Text Label 7900 5800 0    50   ~ 0
DE5
Text Label 7900 5700 0    50   ~ 0
DE6
Text Label 7900 5600 0    50   ~ 0
DE7
Wire Wire Line
	7500 5600 8150 5600
Wire Wire Line
	7500 5700 8150 5700
Wire Wire Line
	7500 5800 8150 5800
Wire Wire Line
	7500 5900 8150 5900
Wire Wire Line
	7500 6000 8150 6000
Entry Wire Line
	7400 5500 7500 5600
Entry Wire Line
	7400 5600 7500 5700
Entry Wire Line
	7400 5700 7500 5800
Entry Wire Line
	7400 5800 7500 5900
Entry Wire Line
	7400 5900 7500 6000
Connection ~ 7400 5250
Entry Wire Line
	8150 5600 8250 5700
Entry Wire Line
	8150 5700 8250 5800
Entry Wire Line
	8150 5800 8250 5900
Entry Wire Line
	8150 5900 8250 6000
Entry Wire Line
	8150 6000 8250 6100
Wire Bus Line
	8250 6250 8400 6250
Text HLabel 8400 6250 2    50   Output ~ 0
DE[3..7]
Wire Wire Line
	7650 1600 7650 2250
Connection ~ 7650 2250
Wire Wire Line
	7650 2250 7650 2900
Connection ~ 7650 2900
Wire Wire Line
	7650 2900 7650 3550
Connection ~ 7650 3550
Wire Wire Line
	7650 3550 7650 4200
Connection ~ 7650 4200
Wire Wire Line
	7650 4200 7650 4850
Wire Bus Line
	7400 5250 7400 5900
Wire Bus Line
	8250 5700 8250 6250
Wire Bus Line
	4750 2100 4750 5250
Wire Bus Line
	7400 2100 7400 5250
$EndSCHEMATC
