EESchema Schematic File Version 4
EELAYER 30 0
EELAYER END
$Descr A4 11693 8268
encoding utf-8
Sheet 82 83
Title "CPS Reverse Engineering: DL-0311"
Date "2021-09-12"
Rev ""
Comp ""
Comment1 ""
Comment2 ""
Comment3 "Licence: CC-BY"
Comment4 "Author: Loïc *WydD* Petit"
$EndDescr
Connection ~ 2050 4000
Connection ~ 5450 4500
Connection ~ 4750 4050
Connection ~ 4650 2900
Connection ~ 3600 4050
Connection ~ 7000 2600
Connection ~ 7000 2100
Connection ~ 6900 3600
Connection ~ 5450 4050
Connection ~ 4950 6600
Connection ~ 6200 3500
NoConn ~ 5850 3200
NoConn ~ 2650 4100
NoConn ~ 5850 3400
NoConn ~ 5850 3300
Entry Wire Line
	1050 800  1150 900 
Entry Wire Line
	1050 900  1150 1000
Entry Wire Line
	1050 1000 1150 1100
Entry Wire Line
	1050 1100 1150 1200
Entry Wire Line
	1050 1200 1150 1300
Entry Wire Line
	1050 1300 1150 1400
Entry Wire Line
	1050 1400 1150 1500
Entry Wire Line
	1050 1500 1150 1600
Entry Wire Line
	1050 1600 1150 1700
Entry Wire Line
	2000 800  2100 900 
Entry Wire Line
	2000 900  2100 1000
Entry Wire Line
	2000 1000 2100 1100
Entry Wire Line
	2000 1100 2100 1200
Entry Wire Line
	2000 1200 2100 1300
Entry Wire Line
	2000 1300 2100 1400
Entry Wire Line
	2000 1400 2100 1500
Entry Wire Line
	2000 1500 2100 1600
Entry Wire Line
	2000 1600 2100 1700
Entry Wire Line
	2950 900  3050 1000
Entry Wire Line
	2950 1000 3050 1100
Entry Wire Line
	2950 1100 3050 1200
Entry Wire Line
	2950 1200 3050 1300
Entry Wire Line
	2950 1300 3050 1400
Entry Wire Line
	2950 1400 3050 1500
Entry Wire Line
	2950 1500 3050 1600
Entry Wire Line
	2950 1600 3050 1700
Entry Wire Line
	3800 1000 3900 1100
Entry Wire Line
	3800 1100 3900 1200
Entry Wire Line
	3800 1200 3900 1300
Entry Wire Line
	6000 3850 6100 3950
Entry Wire Line
	6000 4400 6100 4500
Entry Wire Line
	6000 4850 6100 4950
Wire Wire Line
	1150 900  1450 900 
Wire Wire Line
	1150 1000 1450 1000
Wire Wire Line
	1150 1100 1450 1100
Wire Wire Line
	1150 1200 1450 1200
Wire Wire Line
	1150 1300 1450 1300
Wire Wire Line
	1150 1400 1450 1400
Wire Wire Line
	1150 1500 1450 1500
Wire Wire Line
	1150 1600 1450 1600
Wire Wire Line
	1150 1700 1450 1700
Wire Wire Line
	1300 4000 2050 4000
Wire Wire Line
	1950 4200 2150 4200
Wire Wire Line
	2050 4000 2050 4400
Wire Wire Line
	2050 4000 2150 4000
Wire Wire Line
	2050 4400 2900 4400
Wire Wire Line
	2100 900  2400 900 
Wire Wire Line
	2100 1000 2400 1000
Wire Wire Line
	2100 1100 2400 1100
Wire Wire Line
	2100 1200 2400 1200
Wire Wire Line
	2100 1300 2400 1300
Wire Wire Line
	2100 1400 2400 1400
Wire Wire Line
	2100 1500 2400 1500
Wire Wire Line
	2100 1600 2400 1600
Wire Wire Line
	2100 1700 2400 1700
Wire Wire Line
	2650 4000 2900 4000
Wire Wire Line
	2900 4400 2900 4100
Wire Wire Line
	3050 1000 3350 1000
Wire Wire Line
	3050 1100 3350 1100
Wire Wire Line
	3050 1200 3350 1200
Wire Wire Line
	3050 1300 3350 1300
Wire Wire Line
	3050 1400 3350 1400
Wire Wire Line
	3050 1500 3350 1500
Wire Wire Line
	3050 1600 3350 1600
Wire Wire Line
	3050 1700 3350 1700
Wire Wire Line
	3450 4050 3600 4050
Wire Wire Line
	3600 4050 3900 4050
Wire Wire Line
	3600 4400 3600 4050
Wire Wire Line
	3700 4400 3600 4400
Wire Wire Line
	3900 1100 4200 1100
Wire Wire Line
	3900 1200 4200 1200
Wire Wire Line
	3900 1300 4200 1300
Wire Wire Line
	3950 7150 4350 7150
Wire Wire Line
	3950 7250 4350 7250
Wire Wire Line
	3950 7350 4350 7350
Wire Wire Line
	4350 6350 3950 6350
Wire Wire Line
	4350 6450 3950 6450
Wire Wire Line
	4350 6550 3950 6550
Wire Wire Line
	4350 6650 3950 6650
Wire Wire Line
	4350 6750 3950 6750
Wire Wire Line
	4350 6850 3950 6850
Wire Wire Line
	4500 4050 4750 4050
Wire Wire Line
	4600 2900 4650 2900
Wire Wire Line
	4650 2900 4650 3850
Wire Wire Line
	4650 2900 4850 2900
Wire Wire Line
	4650 3850 4950 3850
Wire Wire Line
	4750 3300 4850 3300
Wire Wire Line
	4750 4050 4750 3300
Wire Wire Line
	4750 4050 5450 4050
Wire Wire Line
	4950 5750 4650 5750
Wire Wire Line
	4950 5850 4650 5850
Wire Wire Line
	4950 5950 4950 6600
Wire Wire Line
	4950 6900 4950 6600
Wire Wire Line
	4950 7000 4950 7300
Wire Wire Line
	5250 3950 5450 3950
Wire Wire Line
	5250 4500 5450 4500
Wire Wire Line
	5250 4950 5450 4950
Wire Wire Line
	5350 3850 6000 3850
Wire Wire Line
	5350 4400 6000 4400
Wire Wire Line
	5350 4850 6000 4850
Wire Wire Line
	5450 3950 5450 4050
Wire Wire Line
	5450 4050 5450 4500
Wire Wire Line
	5450 4950 5450 4500
Wire Wire Line
	5850 2700 6450 2700
Wire Wire Line
	5850 2800 6550 2800
Wire Wire Line
	5850 2900 6650 2900
Wire Wire Line
	5850 3000 7100 3000
Wire Wire Line
	5850 3100 6900 3100
Wire Wire Line
	5900 3500 6200 3500
Wire Wire Line
	6200 3500 6200 4000
Wire Wire Line
	6200 4000 7100 4000
Wire Wire Line
	6450 1600 6450 2700
Wire Wire Line
	6450 1600 7100 1600
Wire Wire Line
	6550 2000 6550 2800
Wire Wire Line
	6600 1250 7000 1250
Wire Wire Line
	6650 2500 6650 2900
Wire Wire Line
	6650 2500 7100 2500
Wire Wire Line
	6800 3500 7100 3500
Wire Wire Line
	6900 3100 6900 3600
Wire Wire Line
	6900 3600 6900 4100
Wire Wire Line
	7000 1250 7000 2100
Wire Wire Line
	7000 2100 7000 2600
Wire Wire Line
	7000 2100 7100 2100
Wire Wire Line
	7000 2600 7000 3100
Wire Wire Line
	7100 2000 6550 2000
Wire Wire Line
	7100 2600 7000 2600
Wire Wire Line
	7100 3100 7000 3100
Wire Wire Line
	7100 3600 6900 3600
Wire Wire Line
	7100 4100 6900 4100
Wire Wire Line
	8250 1600 7700 1600
Wire Bus Line
	1050 700  950  700 
Wire Bus Line
	2000 700  1900 700 
Wire Bus Line
	2950 700  2850 700 
Wire Bus Line
	3800 700  3700 700 
Wire Bus Line
	6100 5050 6200 5050
Text Notes 4850 2250 0    50   ~ 0
432  S  O Value\n000 100 4 0\n001 001 1 4\n010 010 2 8\n011 011 3 12\n100 000 0 16\n101 001 1 20\n110 010 2 24\n111 011 3 28
Text Notes 5800 5700 0    50   ~ 0
01111000x\n01111001x\n01111010x\n240-245
Text Notes 6100 7000 0    50   ~ 0
011110011\n243
Text Notes 6400 3000 0    50   ~ 0
12-15 MOD16
Text Notes 6450 2500 0    50   ~ 0
8-11 MOD16
Text Notes 6500 2000 0    50   ~ 0
4-7 MOD16
Text Notes 8850 1600 0    50   ~ 0
0 if 0-3 MOD32
Text Notes 8850 2050 0    50   ~ 0
0 if 4-7 MOD16 and >= 32
Text Notes 8850 2550 0    50   ~ 0
0 if 8-11 MOD16 and >= 32
Text Notes 8850 3050 0    50   ~ 0
0 if 12-15 MOD16 and >= 32
Text Notes 8850 3550 0    50   ~ 0
0 if 18-19 MOD32
Text Notes 8850 4050 0    50   ~ 0
0 if 16-17 MOD32
Text Label 1200 900  0    50   ~ 0
LINE0
Text Label 1200 1000 0    50   ~ 0
LINE1
Text Label 1200 1100 0    50   ~ 0
LINE2
Text Label 1200 1200 0    50   ~ 0
LINE3
Text Label 1200 1300 0    50   ~ 0
LINE4
Text Label 1200 1400 0    50   ~ 0
LINE5
Text Label 1200 1500 0    50   ~ 0
LINE6
Text Label 1200 1600 0    50   ~ 0
LINE7
Text Label 1200 1700 0    50   ~ 0
LINE8
Text Label 1350 4200 2    50   ~ 0
COL2
Text Label 2150 900  0    50   ~ 0
~LINE0
Text Label 2150 1000 0    50   ~ 0
~LINE1
Text Label 2150 1100 0    50   ~ 0
~LINE2
Text Label 2150 1200 0    50   ~ 0
~LINE3
Text Label 2150 1300 0    50   ~ 0
~LINE4
Text Label 2150 1400 0    50   ~ 0
~LINE5
Text Label 2150 1500 0    50   ~ 0
~LINE6
Text Label 2150 1600 0    50   ~ 0
~LINE7
Text Label 2150 1700 0    50   ~ 0
~LINE8
Text Label 3100 1000 0    50   ~ 0
COL1
Text Label 3100 1100 0    50   ~ 0
COL2
Text Label 3100 1200 0    50   ~ 0
COL3
Text Label 3100 1300 0    50   ~ 0
COL4
Text Label 3100 1400 0    50   ~ 0
COL5
Text Label 3100 1500 0    50   ~ 0
COL6
Text Label 3100 1600 0    50   ~ 0
COL7
Text Label 3100 1700 0    50   ~ 0
COL8
Text Label 3950 1100 0    50   ~ 0
~COL2
Text Label 3950 1200 0    50   ~ 0
~COL3
Text Label 3950 1300 0    50   ~ 0
~COL4
Text Label 4050 2800 2    50   ~ 0
~COL2
Text Label 4050 2900 2    50   ~ 0
~COL3
Text Label 4250 6350 2    50   ~ 0
~LINE3
Text Label 4250 6450 2    50   ~ 0
LINE4
Text Label 4250 6550 2    50   ~ 0
LINE5
Text Label 4250 6650 2    50   ~ 0
LINE6
Text Label 4250 6750 2    50   ~ 0
LINE7
Text Label 4250 6850 2    50   ~ 0
~LINE8
Text Label 4250 7150 2    50   ~ 0
~LINE2
Text Label 4250 7250 2    50   ~ 0
LINE1
Text Label 4250 7350 2    50   ~ 0
LINE0
Text Label 4850 2700 2    50   ~ 0
COL2
Text Label 4850 2800 2    50   ~ 0
COL3
Text Label 4900 5750 2    50   ~ 0
LINE2
Text Label 4900 5850 2    50   ~ 0
LINE1
Text Label 4950 4400 2    50   ~ 0
COL3
Text Label 4950 4850 2    50   ~ 0
COL2
Text Label 5500 3850 0    50   ~ 0
GFX-ADDR22
Text Label 5500 4400 0    50   ~ 0
GFX-ADDR21
Text Label 5500 4850 0    50   ~ 0
GFX-ADDR20
Text Label 6000 1100 2    50   ~ 0
COL5
Text Label 6000 1200 2    50   ~ 0
COL6
Text Label 6000 1300 2    50   ~ 0
COL7
Text Label 6000 1400 2    50   ~ 0
COL8
Text Label 6100 3500 2    50   ~ 0
COL1
Text HLabel 950  700  0    50   Input ~ 0
LINE[0..8]
Text HLabel 1300 4000 0    50   Input ~ 0
~BUS-WSTROM
Text HLabel 1900 700  0    50   Input ~ 0
~LINE[0..8]
Text HLabel 2850 700  0    50   Input ~ 0
COL[1..8]
Text HLabel 3700 700  0    50   Input ~ 0
~COL[1..8]
Text HLabel 3700 4400 2    50   Output ~ 0
~WSTROM
Text HLabel 4350 7450 0    50   Input ~ 0
LINE-INC
Text HLabel 5500 6950 2    50   Output ~ 0
SCAN-243
Text HLabel 5800 5850 2    50   Output ~ 0
SCAN-240-245
Text HLabel 6200 5050 2    50   3State ~ 0
GFX-ADDR[20..22]
Text HLabel 8250 1600 2    50   Output ~ 0
~SPRITE-T
Text HLabel 8250 2050 2    50   Output ~ 0
~SCROLL1-T
Text HLabel 8250 2550 2    50   Output ~ 0
~SCROLL2-T
Text HLabel 8250 3050 2    50   Output ~ 0
~SCROLL3-T
Text HLabel 8250 3550 2    50   Output ~ 0
~STAR2-T
Text HLabel 8250 4050 2    50   Output ~ 0
~STAR1-T
$Comp
L power:VCC #PWR0216
U 1 1 74FC06DE
P 4850 3200
F 0 "#PWR0216" H 4850 3050 50  0001 C CNN
F 1 "VCC" H 4865 3373 50  0000 C CNN
F 2 "" H 4850 3200 50  0001 C CNN
F 3 "" H 4850 3200 50  0001 C CNN
	1    4850 3200
	1    0    0    -1  
$EndComp
$Comp
L power:GND #PWR0217
U 1 1 7505A78A
P 4850 3400
F 0 "#PWR0217" H 4850 3150 50  0001 C CNN
F 1 "GND" H 4855 3227 50  0000 C CNN
F 2 "" H 4850 3400 50  0001 C CNN
F 3 "" H 4850 3400 50  0001 C CNN
	1    4850 3400
	1    0    0    -1  
$EndComp
$Comp
L A5C:M125C UAC227
U 1 1 73194FAB
P 5150 3850
F 0 "UAC227" H 5150 4115 50  0000 C CNN
F 1 "M125C" H 5150 4024 50  0000 C CNN
F 2 "" H 4650 3800 50  0001 C CNN
F 3 "" H 4650 3800 50  0001 C CNN
	1    5150 3850
	1    0    0    -1  
$EndComp
$Comp
L A5C:M125C UCA249
U 1 1 749BCBB8
P 5150 4400
F 0 "UCA249" H 5150 4665 50  0000 C CNN
F 1 "M125C" H 5150 4574 50  0000 C CNN
F 2 "" H 4650 4350 50  0001 C CNN
F 3 "" H 4650 4350 50  0001 C CNN
	1    5150 4400
	1    0    0    -1  
$EndComp
$Comp
L A5C:M125C UCC253
U 1 1 74E8DFC4
P 5150 4850
F 0 "UCC253" H 5150 5115 50  0000 C CNN
F 1 "M125C" H 5150 5024 50  0000 C CNN
F 2 "" H 4650 4800 50  0001 C CNN
F 3 "" H 4650 4800 50  0001 C CNN
	1    5150 4850
	1    0    0    -1  
$EndComp
$Comp
L A5C:OR02 UAC249
U 1 1 625CC94E
P 3150 4050
F 0 "UAC249" H 3175 4317 50  0000 C CNN
F 1 "OR02" H 3175 4226 50  0000 C CNN
F 2 "" H 3200 4050 50  0001 C CNN
F 3 "" H 3200 4050 50  0001 C CNN
	1    3150 4050
	1    0    0    -1  
$EndComp
$Comp
L A5C:NOR02 UBC5
U 1 1 64241B57
P 5200 6950
AR Path="/64241B57" Ref="UBC5"  Part="1" 
AR Path="/60A4D282/64241B57" Ref="UBC5"  Part="1" 
AR Path="/612BE578/64241B57" Ref="UBC5"  Part="1" 
F 0 "UBC5" H 5225 7217 50  0000 C CNN
F 1 "NOR02" H 5225 7126 50  0000 C CNN
F 2 "" H 5200 6950 50  0001 C CNN
F 3 "" H 5200 6950 50  0001 C CNN
	1    5200 6950
	1    0    0    -1  
$EndComp
$Comp
L A5C:OR02 UAD82
U 1 1 7346CE74
P 7350 2050
F 0 "UAD82" H 7375 2317 50  0000 C CNN
F 1 "OR02" H 7375 2226 50  0000 C CNN
F 2 "" H 7400 2050 50  0001 C CNN
F 3 "" H 7400 2050 50  0001 C CNN
	1    7350 2050
	1    0    0    -1  
$EndComp
$Comp
L A5C:OR02 UAC33
U 1 1 734FC618
P 7350 2550
F 0 "UAC33" H 7375 2817 50  0000 C CNN
F 1 "OR02" H 7375 2726 50  0000 C CNN
F 2 "" H 7400 2550 50  0001 C CNN
F 3 "" H 7400 2550 50  0001 C CNN
	1    7350 2550
	1    0    0    -1  
$EndComp
$Comp
L A5C:OR02 UAD51
U 1 1 7346D309
P 7350 3050
F 0 "UAD51" H 7375 3317 50  0000 C CNN
F 1 "OR02" H 7375 3226 50  0000 C CNN
F 2 "" H 7400 3050 50  0001 C CNN
F 3 "" H 7400 3050 50  0001 C CNN
	1    7350 3050
	1    0    0    -1  
$EndComp
$Comp
L A5C:OR02 UAC28
U 1 1 6F61E4E9
P 7350 3550
F 0 "UAC28" H 7375 3817 50  0000 C CNN
F 1 "OR02" H 7375 3726 50  0000 C CNN
F 2 "" H 7400 3550 50  0001 C CNN
F 3 "" H 7400 3550 50  0001 C CNN
	1    7350 3550
	1    0    0    -1  
$EndComp
$Comp
L A5C:OR02 UCC74
U 1 1 6FE865AA
P 7350 4050
F 0 "UCC74" H 7375 4317 50  0000 C CNN
F 1 "OR02" H 7375 4226 50  0000 C CNN
F 2 "" H 7400 4050 50  0001 C CNN
F 3 "" H 7400 4050 50  0001 C CNN
	1    7350 4050
	1    0    0    -1  
$EndComp
$Comp
L A5C:AND03 U?
U 1 1 7293AD2E
P 4300 2900
AR Path="/60A9F60C/7293AD2E" Ref="U?"  Part="1" 
AR Path="/60A4D282/7293AD2E" Ref="UAC239"  Part="1" 
AR Path="/7293AD2E" Ref="UAC239"  Part="1" 
AR Path="/612BE578/7293AD2E" Ref="UAC239"  Part="1" 
F 0 "UAC239" H 4325 3192 50  0000 C CNN
F 1 "AND03" H 4325 3101 50  0000 C CNN
F 2 "" H 4300 2900 50  0001 C CNN
F 3 "" H 4300 2900 50  0001 C CNN
	1    4300 2900
	1    0    0    -1  
$EndComp
$Comp
L A5C:INV01 UAC233
U 1 1 62981AE8
P 1650 4200
F 0 "UAC233" H 1650 4517 50  0000 C CNN
F 1 "INV01" H 1650 4426 50  0000 C CNN
F 2 "" H 1650 4000 50  0001 C CNN
F 3 "" H 1650 4000 50  0001 C CNN
	1    1650 4200
	1    0    0    1   
$EndComp
$Comp
L A5C:INV01 UAC258
U 1 1 74920A93
P 4200 4050
F 0 "UAC258" H 4200 4367 50  0000 C CNN
F 1 "INV01" H 4200 4276 50  0000 C CNN
F 2 "" H 4200 3850 50  0001 C CNN
F 3 "" H 4200 3850 50  0001 C CNN
	1    4200 4050
	1    0    0    -1  
$EndComp
$Comp
L A5C:INV01 UAC43
U 1 1 6F6B8440
P 6500 3500
F 0 "UAC43" H 6500 3817 50  0000 C CNN
F 1 "INV01" H 6500 3726 50  0000 C CNN
F 2 "" H 6500 3300 50  0001 C CNN
F 3 "" H 6500 3300 50  0001 C CNN
	1    6500 3500
	1    0    0    -1  
$EndComp
$Comp
L A5C:BUF12 UAD33
U 1 1 73D04E53
P 7400 1600
F 0 "UAD33" H 7400 1917 50  0000 C CNN
F 1 "BUF12" H 7400 1826 50  0000 C CNN
F 2 "" H 7400 1600 50  0001 C CNN
F 3 "" H 7400 1600 50  0001 C CNN
	1    7400 1600
	1    0    0    -1  
$EndComp
$Comp
L A5C:BUF12 UAD182
U 1 1 7458CE81
P 7950 2050
AR Path="/7458CE81" Ref="UAD182"  Part="1" 
AR Path="/60A4D282/7458CE81" Ref="UAD182"  Part="1" 
AR Path="/612BE578/7458CE81" Ref="UAD182"  Part="1" 
F 0 "UAD182" H 7950 2367 50  0000 C CNN
F 1 "BUF12" H 7950 2276 50  0000 C CNN
F 2 "" H 7950 2050 50  0001 C CNN
F 3 "" H 7950 2050 50  0001 C CNN
	1    7950 2050
	1    0    0    -1  
$EndComp
$Comp
L A5C:BUF12 UAC52
U 1 1 73D0696F
P 7950 2550
F 0 "UAC52" H 7950 2867 50  0000 C CNN
F 1 "BUF12" H 7950 2776 50  0000 C CNN
F 2 "" H 7950 2550 50  0001 C CNN
F 3 "" H 7950 2550 50  0001 C CNN
	1    7950 2550
	1    0    0    -1  
$EndComp
$Comp
L A5C:BUF12 UAD60
U 1 1 73D07021
P 7950 3050
F 0 "UAD60" H 7950 3367 50  0000 C CNN
F 1 "BUF12" H 7950 3276 50  0000 C CNN
F 2 "" H 7950 3050 50  0001 C CNN
F 3 "" H 7950 3050 50  0001 C CNN
	1    7950 3050
	1    0    0    -1  
$EndComp
$Comp
L A5C:BUF12 UCA65
U 1 1 6FFBF32C
P 7950 3550
F 0 "UCA65" H 7950 3867 50  0000 C CNN
F 1 "BUF12" H 7950 3776 50  0000 C CNN
F 2 "" H 7950 3550 50  0001 C CNN
F 3 "" H 7950 3550 50  0001 C CNN
	1    7950 3550
	1    0    0    -1  
$EndComp
$Comp
L A5C:BUF12 UCC89
U 1 1 6FFBEC20
P 7950 4050
F 0 "UCC89" H 7950 4367 50  0000 C CNN
F 1 "BUF12" H 7950 4276 50  0000 C CNN
F 2 "" H 7950 4050 50  0001 C CNN
F 3 "" H 7950 4050 50  0001 C CNN
	1    7950 4050
	1    0    0    -1  
$EndComp
$Comp
L A5C:DFFCOO UAC235
U 1 1 6270B975
P 2400 4100
F 0 "UAC235" H 2400 4465 50  0000 C CNN
F 1 "DFFCOO" H 2400 4374 50  0000 C CNN
F 2 "" H 2400 4100 50  0001 C CNN
F 3 "" H 2400 4100 50  0001 C CNN
	1    2400 4100
	1    0    0    -1  
$EndComp
$Comp
L A5C:NAND04 UBB32
U 1 1 62AD49CC
P 4650 7300
F 0 "UBB32" H 4650 7642 50  0000 C CNN
F 1 "NAND04" H 4650 7551 50  0000 C CNN
F 2 "" H 4650 7050 50  0001 C CNN
F 3 "" H 4650 7050 50  0001 C CNN
	1    4650 7300
	1    0    0    -1  
$EndComp
$Comp
L A5C:NOR04 UAC?
U 1 1 7293AD1C
P 6300 1250
AR Path="/60A9F60C/7293AD1C" Ref="UAC?"  Part="1" 
AR Path="/60A4D282/7293AD1C" Ref="UAC124"  Part="1" 
AR Path="/7293AD1C" Ref="UAC124"  Part="1" 
AR Path="/612BE578/7293AD1C" Ref="UAC124"  Part="1" 
F 0 "UAC124" H 6300 1592 50  0000 C CNN
F 1 "NOR04" H 6300 1501 50  0000 C CNN
F 2 "" H 6300 1250 50  0001 C CNN
F 3 "" H 6300 1250 50  0001 C CNN
	1    6300 1250
	1    0    0    -1  
$EndComp
$Comp
L A5C:AOI21 UBE5
U 1 1 6450A764
P 5350 5850
F 0 "UBE5" H 5375 6167 50  0000 C CNN
F 1 "AOI21" H 5375 6076 50  0000 C CNN
F 2 "" H 5500 5850 50  0001 C CNN
F 3 "" H 5500 5850 50  0001 C CNN
	1    5350 5850
	1    0    0    -1  
$EndComp
$Comp
L A5C:NAND06 UAD?
U 1 1 634474BE
P 4650 6600
AR Path="/60A9F60C/634474BE" Ref="UAD?"  Part="1" 
AR Path="/60A4D282/634474BE" Ref="UAD356"  Part="1" 
AR Path="/634474BE" Ref="UAD356"  Part="1" 
AR Path="/612BE578/634474BE" Ref="UAD356"  Part="1" 
F 0 "UAD356" H 4650 7040 50  0000 C CNN
F 1 "NAND06" H 4650 6949 50  0000 C CNN
F 2 "" H 4600 6700 50  0001 C CNN
F 3 "" H 4600 6700 50  0001 C CNN
	1    4650 6600
	1    0    0    -1  
$EndComp
$Comp
L A5C:D38GL U?
U 1 1 7293AD26
P 5350 3050
AR Path="/60A9F60C/7293AD26" Ref="U?"  Part="1" 
AR Path="/60A4D282/7293AD26" Ref="UAC63"  Part="1" 
AR Path="/7293AD26" Ref="UAC63"  Part="1" 
AR Path="/612BE578/7293AD26" Ref="UAC63"  Part="1" 
F 0 "UAC63" H 5350 3667 50  0000 C CNN
F 1 "D38GL" H 5350 3576 50  0000 C CNN
F 2 "" H 5350 3575 50  0001 C CNN
F 3 "" H 5350 3575 50  0001 C CNN
	1    5350 3050
	1    0    0    -1  
$EndComp
Text Label 4050 3000 2    50   ~ 0
COL4
Text Notes 6400 3100 0    50   ~ 0
16-19 MOD32
Wire Bus Line
	6100 3950 6100 5050
Wire Bus Line
	3800 700  3800 1200
Wire Bus Line
	2950 700  2950 1600
Wire Bus Line
	2000 700  2000 1600
Wire Bus Line
	1050 700  1050 1600
Text Notes 6500 1600 0    50   ~ 0
0-3 MOD32
$EndSCHEMATC
