EESchema Schematic File Version 4
EELAYER 30 0
EELAYER END
$Descr A4 11693 8268
encoding utf-8
Sheet 38 83
Title "CPS Reverse Engineering: DL-0311"
Date "2021-09-12"
Rev ""
Comp ""
Comment1 ""
Comment2 ""
Comment3 "Licence: CC-BY"
Comment4 "Author: Loïc *WydD* Petit"
$EndDescr
Connection ~ 5850 3050
Connection ~ 5950 2950
Connection ~ 4750 4000
Connection ~ 9200 2600
Connection ~ 9200 3050
Connection ~ 3450 4000
Connection ~ 3550 4100
Connection ~ 5850 2100
Connection ~ 5250 2100
Connection ~ 3450 2950
Connection ~ 3550 3050
Connection ~ 4650 2100
Connection ~ 4050 2100
Connection ~ 9200 5300
Connection ~ 9200 3950
Connection ~ 9200 4400
Connection ~ 9200 4850
Connection ~ 9200 3500
Connection ~ 4650 3050
Connection ~ 4750 2950
Connection ~ 5950 4000
NoConn ~ 5500 1800
NoConn ~ 4300 1800
NoConn ~ 6700 1800
Entry Wire Line
	2900 1600 3000 1700
Entry Wire Line
	2900 2350 3000 2450
Entry Wire Line
	2900 2450 3000 2550
Entry Wire Line
	2900 2550 3000 2650
Entry Wire Line
	2900 2650 3000 2750
Entry Wire Line
	2900 3400 3000 3500
Entry Wire Line
	2900 3500 3000 3600
Entry Wire Line
	2900 3600 3000 3700
Entry Wire Line
	2900 3700 3000 3800
Entry Wire Line
	7500 1900 7600 2000
Entry Wire Line
	7500 2000 7600 2100
Entry Wire Line
	7500 2750 7600 2850
Entry Wire Line
	7500 2850 7600 2950
Entry Wire Line
	7500 3600 7600 3700
Entry Wire Line
	7500 3700 7600 3800
Entry Wire Line
	7500 4450 7600 4550
Entry Wire Line
	7500 5100 7600 5200
Entry Wire Line
	10150 1650 10250 1750
Entry Wire Line
	10150 2100 10250 2200
Entry Wire Line
	10150 2550 10250 2650
Entry Wire Line
	10150 3000 10250 3100
Entry Wire Line
	10150 3450 10250 3550
Entry Wire Line
	10150 3900 10250 4000
Entry Wire Line
	10150 4350 10250 4450
Entry Wire Line
	10150 4800 10250 4900
Entry Wire Line
	10150 5250 10250 5350
Wire Wire Line
	1950 4400 2900 4400
Wire Wire Line
	3000 1700 3800 1700
Wire Wire Line
	3000 2450 3650 2450
Wire Wire Line
	3000 2550 3650 2550
Wire Wire Line
	3000 2650 3650 2650
Wire Wire Line
	3000 2750 3650 2750
Wire Wire Line
	3000 3500 3650 3500
Wire Wire Line
	3000 3600 3650 3600
Wire Wire Line
	3000 3700 3650 3700
Wire Wire Line
	3000 3800 3650 3800
Wire Wire Line
	3450 1900 3450 2950
Wire Wire Line
	3450 1900 3800 1900
Wire Wire Line
	3450 2950 3450 4000
Wire Wire Line
	3450 2950 3650 2950
Wire Wire Line
	3450 4000 3650 4000
Wire Wire Line
	3450 4400 3450 4000
Wire Wire Line
	3550 2100 4050 2100
Wire Wire Line
	3550 3050 3550 2100
Wire Wire Line
	3550 3050 3550 4100
Wire Wire Line
	3550 3050 3650 3050
Wire Wire Line
	3550 4100 3550 4700
Wire Wire Line
	3550 4700 2900 4700
Wire Wire Line
	3650 4100 3550 4100
Wire Wire Line
	4050 2100 4650 2100
Wire Wire Line
	4650 2100 4650 3050
Wire Wire Line
	4650 2100 5250 2100
Wire Wire Line
	4650 3050 4650 4100
Wire Wire Line
	4650 3050 4850 3050
Wire Wire Line
	4650 4100 4850 4100
Wire Wire Line
	4750 1900 5000 1900
Wire Wire Line
	4750 2950 4750 1900
Wire Wire Line
	4750 2950 4750 4000
Wire Wire Line
	4750 4000 4750 4500
Wire Wire Line
	4750 4000 4850 4000
Wire Wire Line
	4750 4500 4300 4500
Wire Wire Line
	4850 2450 4450 2450
Wire Wire Line
	4850 2550 4450 2550
Wire Wire Line
	4850 2650 4450 2650
Wire Wire Line
	4850 2750 4450 2750
Wire Wire Line
	4850 2950 4750 2950
Wire Wire Line
	4850 3500 4450 3500
Wire Wire Line
	4850 3600 4450 3600
Wire Wire Line
	4850 3700 4450 3700
Wire Wire Line
	4850 3800 4450 3800
Wire Wire Line
	5000 1700 4300 1700
Wire Wire Line
	5250 2100 5850 2100
Wire Wire Line
	5850 2100 6450 2100
Wire Wire Line
	5850 3050 5850 2100
Wire Wire Line
	5850 3050 6050 3050
Wire Wire Line
	5850 4100 5850 3050
Wire Wire Line
	5850 4100 6050 4100
Wire Wire Line
	5950 1900 6200 1900
Wire Wire Line
	5950 2950 5950 1900
Wire Wire Line
	5950 2950 6050 2950
Wire Wire Line
	5950 4000 5950 2950
Wire Wire Line
	5950 4000 5950 4500
Wire Wire Line
	5950 4000 6050 4000
Wire Wire Line
	5950 4500 5550 4500
Wire Wire Line
	6050 2450 5650 2450
Wire Wire Line
	6050 2550 5650 2550
Wire Wire Line
	6050 2650 5650 2650
Wire Wire Line
	6050 2750 5650 2750
Wire Wire Line
	6050 3500 5650 3500
Wire Wire Line
	6050 3600 5650 3600
Wire Wire Line
	6050 3700 5650 3700
Wire Wire Line
	6050 3800 5650 3800
Wire Wire Line
	6200 1700 5500 1700
Wire Wire Line
	6700 1700 9300 1700
Wire Wire Line
	6850 2450 6950 2450
Wire Wire Line
	6850 2750 6950 2750
Wire Wire Line
	6850 3500 7350 3500
Wire Wire Line
	6850 3700 7150 3700
Wire Wire Line
	6950 2300 7900 2300
Wire Wire Line
	6950 2450 6950 2300
Wire Wire Line
	6950 2750 6950 3250
Wire Wire Line
	6950 3250 7900 3250
Wire Wire Line
	7050 2400 7050 2550
Wire Wire Line
	7050 2400 7900 2400
Wire Wire Line
	7050 2550 6850 2550
Wire Wire Line
	7050 2650 6850 2650
Wire Wire Line
	7050 3150 7050 2650
Wire Wire Line
	7050 3150 7900 3150
Wire Wire Line
	7050 3800 6850 3800
Wire Wire Line
	7050 5400 7050 3800
Wire Wire Line
	7050 5400 8000 5400
Wire Wire Line
	7150 3700 7150 4750
Wire Wire Line
	7150 4750 8000 4750
Wire Wire Line
	7250 3600 6850 3600
Wire Wire Line
	7250 4100 7250 3600
Wire Wire Line
	7250 4100 7900 4100
Wire Wire Line
	7350 3500 7350 4000
Wire Wire Line
	7350 4000 7900 4000
Wire Wire Line
	7600 4550 8000 4550
Wire Wire Line
	7600 5200 8000 5200
Wire Wire Line
	7900 2000 7600 2000
Wire Wire Line
	7900 2100 7600 2100
Wire Wire Line
	7900 2850 7600 2850
Wire Wire Line
	7900 2950 7600 2950
Wire Wire Line
	7900 3700 7600 3700
Wire Wire Line
	7900 3800 7600 3800
Wire Wire Line
	8600 4550 8700 4550
Wire Wire Line
	8600 5200 8600 4750
Wire Wire Line
	8600 5300 8700 5300
Wire Wire Line
	8700 1600 8700 2000
Wire Wire Line
	8700 2150 8800 2150
Wire Wire Line
	8700 2400 8700 2850
Wire Wire Line
	8700 3250 8700 3700
Wire Wire Line
	8700 3850 9300 3850
Wire Wire Line
	8700 4550 8700 4100
Wire Wire Line
	8700 4650 8600 4650
Wire Wire Line
	8700 4750 8700 4650
Wire Wire Line
	8700 5200 9300 5200
Wire Wire Line
	8700 5300 8700 5200
Wire Wire Line
	8800 2050 9300 2050
Wire Wire Line
	8800 2150 8800 2050
Wire Wire Line
	8800 2250 8700 2250
Wire Wire Line
	8800 2500 8800 2250
Wire Wire Line
	8800 2950 8800 3000
Wire Wire Line
	8800 3000 8700 3000
Wire Wire Line
	8800 3100 8700 3100
Wire Wire Line
	8800 3400 8800 3100
Wire Wire Line
	8800 3950 8700 3950
Wire Wire Line
	8800 4300 8800 3950
Wire Wire Line
	9200 2150 9200 2600
Wire Wire Line
	9200 2600 9200 3050
Wire Wire Line
	9200 3050 9200 3500
Wire Wire Line
	9200 3500 9200 3950
Wire Wire Line
	9200 3950 9200 4400
Wire Wire Line
	9200 4400 9200 4850
Wire Wire Line
	9200 4850 9200 5300
Wire Wire Line
	9200 5300 9200 5600
Wire Wire Line
	9200 5600 8800 5600
Wire Wire Line
	9300 1600 8700 1600
Wire Wire Line
	9300 2150 9200 2150
Wire Wire Line
	9300 2500 8800 2500
Wire Wire Line
	9300 2600 9200 2600
Wire Wire Line
	9300 2950 8800 2950
Wire Wire Line
	9300 3050 9200 3050
Wire Wire Line
	9300 3400 8800 3400
Wire Wire Line
	9300 3500 9200 3500
Wire Wire Line
	9300 3950 9200 3950
Wire Wire Line
	9300 4300 8800 4300
Wire Wire Line
	9300 4400 9200 4400
Wire Wire Line
	9300 4750 8700 4750
Wire Wire Line
	9300 4850 9200 4850
Wire Wire Line
	9300 5300 9200 5300
Wire Wire Line
	9850 1650 10150 1650
Wire Wire Line
	9850 2100 10150 2100
Wire Wire Line
	9850 2550 10150 2550
Wire Wire Line
	9850 3000 10150 3000
Wire Wire Line
	9850 3450 10150 3450
Wire Wire Line
	9850 3900 10150 3900
Wire Wire Line
	9850 4350 10150 4350
Wire Wire Line
	9850 4800 10150 4800
Wire Wire Line
	9850 5250 10150 5250
Wire Bus Line
	2900 1400 2750 1400
Wire Bus Line
	7500 1400 7350 1400
Wire Bus Line
	10250 5500 10350 5500
Text Label 3000 1700 0    50   ~ 0
BUS-DATA8
Text Label 3000 2450 0    50   ~ 0
BUS-DATA7
Text Label 3000 2550 0    50   ~ 0
BUS-DATA6
Text Label 3000 2650 0    50   ~ 0
BUS-DATA5
Text Label 3000 2750 0    50   ~ 0
BUS-DATA4
Text Label 3000 3500 0    50   ~ 0
BUS-DATA3
Text Label 3000 3600 0    50   ~ 0
BUS-DATA2
Text Label 3000 3700 0    50   ~ 0
BUS-DATA1
Text Label 3000 3800 0    50   ~ 0
BUS-DATA0
Text Label 7900 2000 2    50   ~ 0
WY-C7
Text Label 7900 2100 2    50   ~ 0
WY-C6
Text Label 7900 2850 2    50   ~ 0
WY-C5
Text Label 7900 2950 2    50   ~ 0
WY-C4
Text Label 7900 3700 2    50   ~ 0
WY-C3
Text Label 7900 3800 2    50   ~ 0
WY-C2
Text Label 8000 4550 2    50   ~ 0
WY-C1
Text Label 8000 5200 2    50   ~ 0
WY-C0
Text Label 9850 1650 0    50   ~ 0
WY-A8
Text Label 9850 2100 0    50   ~ 0
WY-A7
Text Label 9850 2550 0    50   ~ 0
WY-A6
Text Label 9850 3000 0    50   ~ 0
WY-A5
Text Label 9850 3450 0    50   ~ 0
WY-A4
Text Label 9850 3900 0    50   ~ 0
WY-A3
Text Label 9850 4350 0    50   ~ 0
WY-A2
Text Label 9850 4800 0    50   ~ 0
WY-A1
Text Label 9850 5250 0    50   ~ 0
WY-A0
Text HLabel 1350 4400 0    50   Input ~ 0
~BUS-SPRITE-Y
Text HLabel 2750 1400 0    50   Input ~ 0
BUS-DATA[0..8]
Text HLabel 2900 4300 0    50   Input ~ 0
SPRITE-BLOCK-READY
Text HLabel 2900 4500 0    50   Input ~ 0
CLK4M
Text HLabel 2900 4700 0    50   Input ~ 0
~RESET
Text HLabel 4300 4500 0    50   Input ~ 0
~CLK4MLI
Text HLabel 5550 4500 0    50   Input ~ 0
~CLK8M4M
Text HLabel 7350 1400 0    50   Input ~ 0
WY-C[0..7]
Text HLabel 8800 5600 0    50   Input ~ 0
~FLIP
Text HLabel 10350 5500 2    50   Output ~ 0
WY-A[0..8]
$Comp
L A5C:XNOR02 UDH80
U 1 1 6A303A3B
P 9550 1650
F 0 "UDH80" H 9575 1917 50  0000 C CNN
F 1 "XNOR02" H 9575 1826 50  0000 C CNN
F 2 "" H 9575 1650 50  0001 C CNN
F 3 "" H 9575 1650 50  0001 C CNN
	1    9550 1650
	1    0    0    -1  
$EndComp
$Comp
L A5C:XNOR02 UDG53
U 1 1 622E4F2B
P 9550 2100
F 0 "UDG53" H 9575 2367 50  0000 C CNN
F 1 "XNOR02" H 9575 2276 50  0000 C CNN
F 2 "" H 9575 2100 50  0001 C CNN
F 3 "" H 9575 2100 50  0001 C CNN
	1    9550 2100
	1    0    0    -1  
$EndComp
$Comp
L A5C:XNOR02 UDG99
U 1 1 6239CBE6
P 9550 2550
F 0 "UDG99" H 9575 2817 50  0000 C CNN
F 1 "XNOR02" H 9575 2726 50  0000 C CNN
F 2 "" H 9575 2550 50  0001 C CNN
F 3 "" H 9575 2550 50  0001 C CNN
	1    9550 2550
	1    0    0    -1  
$EndComp
$Comp
L A5C:XNOR02 UDG113
U 1 1 627C2514
P 9550 3000
F 0 "UDG113" H 9575 3267 50  0000 C CNN
F 1 "XNOR02" H 9575 3176 50  0000 C CNN
F 2 "" H 9575 3000 50  0001 C CNN
F 3 "" H 9575 3000 50  0001 C CNN
	1    9550 3000
	1    0    0    -1  
$EndComp
$Comp
L A5C:XNOR02 UDJ103
U 1 1 627C250E
P 9550 3450
F 0 "UDJ103" H 9575 3717 50  0000 C CNN
F 1 "XNOR02" H 9575 3626 50  0000 C CNN
F 2 "" H 9575 3450 50  0001 C CNN
F 3 "" H 9575 3450 50  0001 C CNN
	1    9550 3450
	1    0    0    -1  
$EndComp
$Comp
L A5C:XNOR02 UDG92
U 1 1 62873B76
P 9550 3900
F 0 "UDG92" H 9575 4167 50  0000 C CNN
F 1 "XNOR02" H 9575 4076 50  0000 C CNN
F 2 "" H 9575 3900 50  0001 C CNN
F 3 "" H 9575 3900 50  0001 C CNN
	1    9550 3900
	1    0    0    -1  
$EndComp
$Comp
L A5C:XNOR02 UDG86
U 1 1 62873B7C
P 9550 4350
F 0 "UDG86" H 9575 4617 50  0000 C CNN
F 1 "XNOR02" H 9575 4526 50  0000 C CNN
F 2 "" H 9575 4350 50  0001 C CNN
F 3 "" H 9575 4350 50  0001 C CNN
	1    9550 4350
	1    0    0    -1  
$EndComp
$Comp
L A5C:XNOR02 UDG96
U 1 1 62BEE388
P 9550 4800
F 0 "UDG96" H 9575 5067 50  0000 C CNN
F 1 "XNOR02" H 9575 4976 50  0000 C CNN
F 2 "" H 9575 4800 50  0001 C CNN
F 3 "" H 9575 4800 50  0001 C CNN
	1    9550 4800
	1    0    0    -1  
$EndComp
$Comp
L A5C:XNOR02 UDE86
U 1 1 62B3D073
P 9550 5250
F 0 "UDE86" H 9575 5517 50  0000 C CNN
F 1 "XNOR02" H 9575 5426 50  0000 C CNN
F 2 "" H 9575 5250 50  0001 C CNN
F 3 "" H 9575 5250 50  0001 C CNN
	1    9550 5250
	1    0    0    -1  
$EndComp
$Comp
L A5C:NAND03 UDA119
U 1 1 65DF0B25
P 3150 4400
F 0 "UDA119" H 3175 4692 50  0000 C CNN
F 1 "NAND03" H 3175 4601 50  0000 C CNN
F 2 "" H 3150 4400 50  0001 C CNN
F 3 "" H 3150 4400 50  0001 C CNN
	1    3150 4400
	1    0    0    -1  
$EndComp
$Comp
L A5C:INV01 UDA121
U 1 1 65DF73A5
P 1650 4400
F 0 "UDA121" H 1650 4717 50  0000 C CNN
F 1 "INV01" H 1650 4626 50  0000 C CNN
F 2 "" H 1650 4200 50  0001 C CNN
F 3 "" H 1650 4200 50  0001 C CNN
	1    1650 4400
	1    0    0    -1  
$EndComp
$Comp
L A5C:FA1 UDH129
U 1 1 61BFA714
P 8300 4700
F 0 "UDH129" H 8300 5115 50  0000 C CNN
F 1 "FA1" H 8300 5024 50  0000 C CNN
F 2 "" H 8250 4750 50  0001 C CNN
F 3 "" H 8250 4750 50  0001 C CNN
	1    8300 4700
	1    0    0    -1  
$EndComp
$Comp
L A5C:HA1 UDF111
U 1 1 61BF9F9F
P 8300 5300
F 0 "UDF111" H 8300 5665 50  0000 C CNN
F 1 "HA1" H 8300 5574 50  0000 C CNN
F 2 "" H 8250 5300 50  0001 C CNN
F 3 "" H 8250 5300 50  0001 C CNN
	1    8300 5300
	1    0    0    -1  
$EndComp
$Comp
L A5C:DFFCOR UDA114
U 1 1 64A0A163
P 4050 1800
F 0 "UDA114" H 4050 2165 50  0000 C CNN
F 1 "DFFCOR" H 4050 2074 50  0000 C CNN
F 2 "" H 4050 1800 50  0001 C CNN
F 3 "" H 4050 1800 50  0001 C CNN
	1    4050 1800
	1    0    0    -1  
$EndComp
$Comp
L A5C:DFFCOR UDA87
U 1 1 64A099DD
P 5250 1800
F 0 "UDA87" H 5250 2165 50  0000 C CNN
F 1 "DFFCOR" H 5250 2074 50  0000 C CNN
F 2 "" H 5250 1800 50  0001 C CNN
F 3 "" H 5250 1800 50  0001 C CNN
	1    5250 1800
	1    0    0    -1  
$EndComp
$Comp
L A5C:DFFCOR UDE76
U 1 1 641BC6FC
P 6450 1800
F 0 "UDE76" H 6450 2165 50  0000 C CNN
F 1 "DFFCOR" H 6450 2074 50  0000 C CNN
F 2 "" H 6450 1800 50  0001 C CNN
F 3 "" H 6450 1800 50  0001 C CNN
	1    6450 1800
	1    0    0    -1  
$EndComp
$Comp
L A5C:FA2 UDH109
U 1 1 61F67647
P 8300 2300
F 0 "UDH109" H 8300 2865 50  0000 C CNN
F 1 "FA2" H 8300 2774 50  0000 C CNN
F 2 "" H 8150 2500 50  0001 C CNN
F 3 "" H 8150 2500 50  0001 C CNN
	1    8300 2300
	1    0    0    -1  
$EndComp
$Comp
L A5C:FA2 UDJ106
U 1 1 61EB3F58
P 8300 3150
F 0 "UDJ106" H 8300 3715 50  0000 C CNN
F 1 "FA2" H 8300 3624 50  0000 C CNN
F 2 "" H 8150 3350 50  0001 C CNN
F 3 "" H 8150 3350 50  0001 C CNN
	1    8300 3150
	1    0    0    -1  
$EndComp
$Comp
L A5C:FA2 UDI84
U 1 1 61D56502
P 8300 4000
F 0 "UDI84" H 8300 4565 50  0000 C CNN
F 1 "FA2" H 8300 4474 50  0000 C CNN
F 2 "" H 8150 4200 50  0001 C CNN
F 3 "" H 8150 4200 50  0001 C CNN
	1    8300 4000
	1    0    0    -1  
$EndComp
$Comp
L A5C:M175C UDI110
U 1 1 64B8F111
P 4050 2750
F 0 "UDI110" H 4050 3315 50  0000 C CNN
F 1 "M175C" H 4050 3224 50  0000 C CNN
F 2 "" H 4050 2550 50  0001 C CNN
F 3 "" H 4050 2550 50  0001 C CNN
	1    4050 2750
	1    0    0    -1  
$EndComp
$Comp
L A5C:M175C UDA92
U 1 1 6531CF4E
P 4050 3800
F 0 "UDA92" H 4050 4365 50  0000 C CNN
F 1 "M175C" H 4050 4274 50  0000 C CNN
F 2 "" H 4050 3600 50  0001 C CNN
F 3 "" H 4050 3600 50  0001 C CNN
	1    4050 3800
	1    0    0    -1  
$EndComp
$Comp
L A5C:M175C UDF115
U 1 1 68BDCA79
P 5250 2750
F 0 "UDF115" H 5250 3315 50  0000 C CNN
F 1 "M175C" H 5250 3224 50  0000 C CNN
F 2 "" H 5250 2550 50  0001 C CNN
F 3 "" H 5250 2550 50  0001 C CNN
	1    5250 2750
	1    0    0    -1  
$EndComp
$Comp
L A5C:M175C UDB108
U 1 1 671294E3
P 5250 3800
F 0 "UDB108" H 5250 4365 50  0000 C CNN
F 1 "M175C" H 5250 4274 50  0000 C CNN
F 2 "" H 5250 3600 50  0001 C CNN
F 3 "" H 5250 3600 50  0001 C CNN
	1    5250 3800
	1    0    0    -1  
$EndComp
$Comp
L A5C:M175C UDG123
U 1 1 68BDF35E
P 6450 2750
F 0 "UDG123" H 6450 3315 50  0000 C CNN
F 1 "M175C" H 6450 3224 50  0000 C CNN
F 2 "" H 6450 2550 50  0001 C CNN
F 3 "" H 6450 2550 50  0001 C CNN
	1    6450 2750
	1    0    0    -1  
$EndComp
$Comp
L A5C:M175C UDC98
U 1 1 679944C3
P 6450 3800
F 0 "UDC98" H 6450 4365 50  0000 C CNN
F 1 "M175C" H 6450 4274 50  0000 C CNN
F 2 "" H 6450 3600 50  0001 C CNN
F 3 "" H 6450 3600 50  0001 C CNN
	1    6450 3800
	1    0    0    -1  
$EndComp
Wire Bus Line
	2900 1400 2900 3700
Wire Bus Line
	7500 1400 7500 5100
Wire Bus Line
	10250 1750 10250 5500
$EndSCHEMATC
