EESchema Schematic File Version 4
EELAYER 30 0
EELAYER END
$Descr A4 11693 8268
encoding utf-8
Sheet 64 69
Title ""
Date "2020-11-26"
Rev ""
Comp ""
Comment1 "Licence: CC-BY"
Comment2 "Author: Loïc *WydD* Petit"
Comment3 ""
Comment4 ""
$EndDescr
Connection ~ 6650 1900
Connection ~ 6950 2350
Connection ~ 6750 2050
Connection ~ 6850 2200
Connection ~ 4950 2500
Connection ~ 4650 2800
Connection ~ 4750 2700
Connection ~ 4850 2600
Wire Wire Line
	3000 2850 3100 2850
Wire Wire Line
	3000 3450 3100 3450
Wire Wire Line
	7300 4800 7400 4800
Wire Bus Line
	2100 3900 3100 3900
Wire Bus Line
	4650 2800 5050 2800
Wire Bus Line
	4650 3350 4650 2800
Wire Bus Line
	4750 2700 4750 3250
Wire Bus Line
	4750 2700 5050 2700
Wire Bus Line
	4750 3250 7400 3250
Wire Bus Line
	4850 2600 4850 3150
Wire Bus Line
	4850 2600 5050 2600
Wire Bus Line
	4850 3150 7400 3150
Wire Bus Line
	4950 2500 5050 2500
Wire Bus Line
	4950 3050 4950 2500
Wire Bus Line
	6450 1900 6650 1900
Wire Bus Line
	6450 2050 6750 2050
Wire Bus Line
	6450 2200 6850 2200
Wire Bus Line
	6450 2350 6950 2350
Wire Bus Line
	6450 3900 6550 3900
Wire Bus Line
	6450 4100 6650 4100
Wire Bus Line
	6450 4200 6750 4200
Wire Bus Line
	6450 4300 6850 4300
Wire Bus Line
	6450 4400 6950 4400
Wire Bus Line
	6450 4650 7400 4650
Wire Bus Line
	6550 2800 6450 2800
Wire Bus Line
	6650 1900 7400 1900
Wire Bus Line
	6750 2050 7400 2050
Wire Bus Line
	6850 2200 7400 2200
Wire Bus Line
	6950 2350 7400 2350
Wire Bus Line
	7400 3050 4950 3050
Wire Bus Line
	7400 3350 4650 3350
Text Notes 2200 2850 0    50   ~ 0
0x26
Text Notes 2300 4050 0    50   ~ 0
0x28
Text Notes 2300 4150 0    50   ~ 0
0x2A
Text Notes 2300 4250 0    50   ~ 0
0x2C
Text Notes 2300 4350 0    50   ~ 0
0x2E
Text Label 2100 3450 2    50   ~ 0
BUS-DATA[0..15]
Text Label 2200 4050 2    50   ~ 0
~PRIORITY0
Text Label 2200 4150 2    50   ~ 0
~PRIORITY1
Text Label 2200 4250 2    50   ~ 0
~PRIORITY2
Text Label 2200 4350 2    50   ~ 0
~PRIORITY3
$Sheet
S 5050 1800 1400 1100
U 5FC01C0B
F0 "layer-draw-order" 50
F1 "layer-draw-order.sch" 50
F2 "ROW3-D[0..11]" O R 6450 2200 50 
F3 "ROW2-D[0..11]" O R 6450 2050 50 
F4 "ROW1-D[0..11]" O R 6450 1900 50 
F5 "COL4-D[0..11]" I L 5050 2350 50 
F6 "COL3-D[0..11]" I L 5050 2200 50 
F7 "COL2-D[0..11]" I L 5050 2050 50 
F8 "COL1-D[0..8]" I L 5050 1900 50 
F9 "ROW4-D[0..11]" O R 6450 2350 50 
F10 "ROW4-S[0..1]" I L 5050 2800 50 
F11 "ROW3-S[0..1]" I L 5050 2700 50 
F12 "ROW2-S[0..1]" I L 5050 2600 50 
F13 "ROW1-S[0..1]" I L 5050 2500 50 
F14 "~SPRITE-R[1..4]" O R 6450 2800 50 
$EndSheet
$Sheet
S 7400 1750 1300 3150
U 5FC01BF6
F0 "lut-storage" 50
F1 "lut-storage.sch" 50
F2 "ROW1-D[0..8]" I L 7400 1900 50 
F3 "ROW2-D[0..8]" I L 7400 2050 50 
F4 "ROW3-D[0..8]" I L 7400 2200 50 
F5 "ROW4-D[0..8]" I L 7400 2350 50 
F6 "CLK" I L 7400 4800 50 
F7 "OUT[0..11]" O R 8700 1900 50 
F8 "~E[1..7]" I L 7400 4650 50 
F9 "ROW5-D[0..6]" I L 7400 2500 50 
F10 "ROW6-D[0..6]" I L 7400 2650 50 
F11 "ROW4-S[0..1]" I L 7400 3350 50 
F12 "ROW3-S[0..1]" I L 7400 3250 50 
F13 "ROW2-S[0..1]" I L 7400 3150 50 
F14 "ROW1-S[0..1]" I L 7400 3050 50 
$EndSheet
$Sheet
S 3100 3750 1250 1250
U 5FC01C21
F0 "priority-masks" 50
F1 "priority-masks.sch" 50
F2 "~RESET" I L 3100 4850 50 
F3 "~CLK4M" I L 3100 4550 50 
F4 "WR" I L 3100 4650 50 
F5 "ROW3" I L 3100 4350 50 
F6 "ROW2" I L 3100 4250 50 
F7 "OUT" O R 4350 4000 50 
F8 "S[0..5]" I R 4350 3900 50 
F9 "ROW1" I L 3100 4150 50 
F10 "ROW0" I L 3100 4050 50 
F11 "DATA[0..15]" I L 3100 3900 50 
$EndSheet
$Sheet
S 5050 3750 1400 1650
U 5FC01C06
F0 "priority-transparency" 50
F1 "priority-transparency.sch" 50
F2 "BLANK" I L 5050 5200 50 
F3 "ROW1-D[0..11]" I R 6450 4100 50 
F4 "ROW2-D[0..11]" I R 6450 4200 50 
F5 "ROW3-D[0..11]" I R 6450 4300 50 
F6 "ROW4-D[0..11]" I R 6450 4400 50 
F7 "CLK8M" I L 5050 5300 50 
F8 "~ROW-E[1..7]" O R 6450 4650 50 
F9 "PRIO-S[0..5]" O L 5050 3900 50 
F10 "~ROW5-E" I L 5050 4650 50 
F11 "~ROW6-E" I L 5050 4750 50 
F12 "PRIORITY" I L 5050 4000 50 
F13 "~SPRITE-R[1..4]" I R 6450 3900 50 
$EndSheet
Wire Bus Line
	6550 2800 6550 3900
Wire Bus Line
	6650 1900 6650 4100
Wire Bus Line
	6750 2050 6750 4200
Wire Bus Line
	6850 2200 6850 4300
Wire Bus Line
	6950 2350 6950 4400
Wire Wire Line
	5050 5300 4950 5300
Wire Wire Line
	4950 5300 4950 5550
Wire Wire Line
	4950 5550 7300 5550
Wire Wire Line
	7300 5550 7300 4800
Text HLabel 4750 5550 0    50   Input ~ 0
CLK8M
Text HLabel 4750 5200 0    50   Input ~ 0
BLANK
Text HLabel 4950 4750 0    50   Input ~ 0
~STARS2-E
Text HLabel 4950 4650 0    50   Input ~ 0
~STARS1-E
Text HLabel 5000 3450 2    50   Output ~ 0
~LAYERS-E[0..4]
Wire Bus Line
	2100 3900 2100 2600
Wire Bus Line
	2100 2600 3100 2600
Wire Bus Line
	2100 2600 1650 2600
Connection ~ 2100 2600
Wire Bus Line
	1650 2500 3100 2500
Text HLabel 1650 2500 0    50   Input ~ 0
LAYER-D[1..5]
Text HLabel 1650 2600 0    50   Input ~ 0
BUS-DATA[0..15]
Text Label 2900 2600 2    50   ~ 0
BUS-DATA[6..13]
Text HLabel 2400 4550 0    50   Input ~ 0
~CLK4M
Text HLabel 3000 2850 0    50   Input ~ 0
~LAYER-CTRL
Text HLabel 2400 4650 0    50   Input ~ 0
~BUS-WR
Text HLabel 2400 4850 0    50   Input ~ 0
~LUT-RESET
Entry Wire Line
	1700 3950 1800 4050
Entry Wire Line
	1700 4050 1800 4150
Entry Wire Line
	1700 4150 1800 4250
Entry Wire Line
	1700 4250 1800 4350
Wire Wire Line
	1800 4050 3100 4050
Wire Wire Line
	1800 4150 3100 4150
Wire Wire Line
	1800 4250 3100 4250
Wire Wire Line
	1800 4350 3100 4350
Wire Wire Line
	3000 3450 3000 4850
Wire Wire Line
	3000 4850 3100 4850
Wire Wire Line
	3000 4850 2400 4850
Connection ~ 3000 4850
Wire Wire Line
	3100 4650 2900 4650
Wire Wire Line
	2900 4650 2900 3150
Wire Wire Line
	2900 3150 3100 3150
Wire Wire Line
	3100 3050 2800 3050
Wire Wire Line
	2800 3050 2800 4550
Wire Wire Line
	2800 4550 3100 4550
Wire Wire Line
	2800 4550 2400 4550
Connection ~ 2800 4550
Wire Wire Line
	2400 4650 2900 4650
Connection ~ 2900 4650
Wire Bus Line
	1700 3800 1600 3800
Text HLabel 1600 3800 0    50   Input ~ 0
~PRIORITY[0..3]
Text HLabel 4300 1350 0    50   Input ~ 0
SCROLL1[0..11]
Text HLabel 4300 1500 0    50   Input ~ 0
SCROLL2[0..11]
Text HLabel 4300 1650 0    50   Input ~ 0
SCROLL3[0..11]
Text HLabel 6900 1200 0    50   Input ~ 0
STARS1[0..6]
Text HLabel 6900 1350 0    50   Input ~ 0
STARS2[0..6]
Text HLabel 4300 1200 0    50   Input ~ 0
SPRITES[0..8]
Wire Bus Line
	6900 1350 7100 1350
Wire Bus Line
	7100 1350 7100 2650
Wire Bus Line
	7400 2500 7250 2500
Wire Bus Line
	7250 2500 7250 1200
Wire Bus Line
	7250 1200 6900 1200
Wire Bus Line
	7100 2650 7400 2650
Wire Bus Line
	5050 1900 4900 1900
Wire Bus Line
	4900 1900 4900 1200
Wire Bus Line
	4900 1200 4300 1200
Wire Bus Line
	5050 2050 4750 2050
Wire Bus Line
	4750 2050 4750 1350
Wire Bus Line
	4750 1350 4300 1350
Wire Bus Line
	5050 2200 4600 2200
Wire Bus Line
	4600 2200 4600 1500
Wire Bus Line
	4600 1500 4300 1500
Wire Bus Line
	5050 2350 4450 2350
Wire Bus Line
	4450 2350 4450 1650
Wire Bus Line
	4450 1650 4300 1650
Wire Bus Line
	4300 2500 4950 2500
Wire Bus Line
	4300 2600 4850 2600
Wire Bus Line
	4300 2700 4750 2700
Wire Bus Line
	4300 2800 4650 2800
Wire Bus Line
	4300 3450 5000 3450
Wire Bus Line
	4350 3900 5050 3900
Wire Wire Line
	4350 4000 5050 4000
Wire Wire Line
	4950 4650 5050 4650
Wire Wire Line
	4950 4750 5050 4750
Wire Wire Line
	4950 5550 4750 5550
Connection ~ 4950 5550
Wire Wire Line
	4750 5200 5050 5200
Text HLabel 8800 1900 2    50   Output ~ 0
LUT[0..11]
Wire Bus Line
	8800 1900 8700 1900
$Sheet
S 3100 2350 1200 1200
U 5FC01C28
F0 "layer-control" 50
F1 "layer-control.sch" 50
F2 "~RESET" I L 3100 3450 50 
F3 "~E" I L 3100 2850 50 
F4 "WR" I L 3100 3150 50 
F5 "~CLK4M" I L 3100 3050 50 
F6 "BUS[6..13]" I L 3100 2600 50 
F7 "~LAYERS-E[0..4]" O R 4300 3450 50 
F8 "ROW4-S[0..1]" O R 4300 2800 50 
F9 "ROW3-S[0..1]" O R 4300 2700 50 
F10 "ROW2-S[0..1]" O R 4300 2600 50 
F11 "ROW1-S[0..1]" O R 4300 2500 50 
F12 "BUS[1..5]" I L 3100 2500 50 
$EndSheet
Wire Bus Line
	1700 3800 1700 4250
$EndSCHEMATC
