EESchema Schematic File Version 4
EELAYER 30 0
EELAYER END
$Descr A4 11693 8268
encoding utf-8
Sheet 20 20
Title "DL-1727"
Date "2020-04-26"
Rev ""
Comp ""
Comment1 ""
Comment2 "Licence: CC-BY"
Comment3 "Author: Loic *WydD* Petit"
Comment4 "Project: CPS2 Reverse Engineering: DL-1727"
$EndDescr
Connection ~ 6350 5150
Connection ~ 6350 4550
Connection ~ 3850 4600
Connection ~ 3750 5150
Connection ~ 3850 5350
Connection ~ 8700 1000
Connection ~ 3750 4400
Connection ~ 8800 1850
Connection ~ 8800 2850
Connection ~ 8700 2050
Connection ~ 8600 2250
Connection ~ 6350 2250
Connection ~ 6450 2850
Connection ~ 6450 3800
Connection ~ 1450 5650
Connection ~ 3750 2150
Connection ~ 3850 2350
Connection ~ 8700 4500
Connection ~ 8600 5150
Connection ~ 8800 3800
Wire Wire Line
	6350 1050 6350 2250
Wire Wire Line
	6350 2250 6350 4550
Wire Wire Line
	6350 4550 6350 5150
Wire Wire Line
	6350 5150 6350 5500
Wire Wire Line
	6350 5500 6500 5500
Wire Wire Line
	6350 6000 8950 6000
Wire Wire Line
	1450 5650 1500 5650
Wire Wire Line
	6450 950  6450 2850
Wire Wire Line
	6450 950  6550 950 
Wire Wire Line
	6450 2850 6450 3800
Wire Wire Line
	6450 3800 6450 4450
Wire Wire Line
	6450 4450 6550 4450
Wire Wire Line
	6500 2250 6350 2250
Wire Wire Line
	6500 2850 6450 2850
Wire Wire Line
	6500 3800 6450 3800
Wire Wire Line
	6500 5150 6350 5150
Wire Wire Line
	6550 1050 6350 1050
Wire Wire Line
	6550 4550 6350 4550
Wire Wire Line
	2100 3200 3850 3200
Wire Wire Line
	2100 5650 3750 5650
Wire Wire Line
	7100 2850 8800 2850
Wire Wire Line
	7100 4500 8700 4500
Wire Wire Line
	7100 5150 8600 5150
Wire Wire Line
	8600 1200 8600 2250
Wire Wire Line
	8600 2250 8600 3250
Wire Wire Line
	8600 2250 8900 2250
Wire Wire Line
	8600 3250 8900 3250
Wire Wire Line
	8600 4200 8600 5150
Wire Wire Line
	8600 5150 8900 5150
Wire Wire Line
	8700 1000 8700 2050
Wire Wire Line
	8700 1000 8900 1000
Wire Wire Line
	8700 2050 8700 3050
Wire Wire Line
	8700 2050 8900 2050
Wire Wire Line
	8700 3050 8900 3050
Wire Wire Line
	8700 4000 8700 4500
Wire Wire Line
	8700 4000 8900 4000
Wire Wire Line
	8700 4500 8700 4950
Wire Wire Line
	8700 4950 8900 4950
Wire Wire Line
	3750 3400 1450 3400
Wire Wire Line
	3750 1450 3950 1450
Wire Wire Line
	3750 2150 3750 1450
Wire Wire Line
	3750 2800 3750 2150
Wire Wire Line
	3750 2800 3950 2800
Wire Wire Line
	3750 3650 3750 4400
Wire Wire Line
	3750 4400 3750 5150
Wire Wire Line
	3750 5150 3750 5650
Wire Wire Line
	3750 5150 3950 5150
Wire Wire Line
	8800 800  8800 1850
Wire Wire Line
	8800 800  8900 800 
Wire Wire Line
	8800 1850 8900 1850
Wire Wire Line
	8800 2850 8800 1850
Wire Wire Line
	8800 2850 8900 2850
Wire Wire Line
	8800 3800 8900 3800
Wire Wire Line
	8800 4750 8800 3800
Wire Wire Line
	8800 4750 8900 4750
Wire Wire Line
	3850 1650 3950 1650
Wire Wire Line
	3850 2350 3850 1650
Wire Wire Line
	3850 2350 3950 2350
Wire Wire Line
	3850 3000 3850 2350
Wire Wire Line
	3850 3000 3950 3000
Wire Wire Line
	3850 3850 3850 4600
Wire Wire Line
	3850 3850 3950 3850
Wire Wire Line
	3850 4600 3950 4600
Wire Wire Line
	3850 5350 3850 4600
Wire Wire Line
	8900 1200 8600 1200
Wire Wire Line
	8900 4200 8600 4200
Wire Wire Line
	3950 2150 3750 2150
Wire Wire Line
	3950 3650 3750 3650
Wire Wire Line
	3950 4400 3750 4400
Wire Wire Line
	3950 5350 3850 5350
$Comp
L CG24-cells:N2P U30R81
U 1 1 5EF70988
P 6800 1000
F 0 "U30R81" H 6825 1267 50  0000 C CNN
F 1 "N2P" H 6825 1176 50  0000 C CNN
F 2 "" H 6800 1000 50  0001 C CNN
F 3 "" H 6800 1000 50  0001 C CNN
	1    6800 1000
	1    0    0    -1  
$EndComp
$Comp
L CG24-cells:N2P U28R101
U 1 1 5ED7C3E7
P 6800 4500
F 0 "U28R101" H 6825 4767 50  0000 C CNN
F 1 "N2P" H 6825 4676 50  0000 C CNN
F 2 "" H 6800 4500 50  0001 C CNN
F 3 "" H 6800 4500 50  0001 C CNN
	1    6800 4500
	1    0    0    -1  
$EndComp
$Comp
L CG24-cells:V1N U29R82
U 1 1 60DBF5F7
P 1800 3200
F 0 "U29R82" H 1800 3517 50  0000 C CNN
F 1 "V1N" H 1800 3426 50  0000 C CNN
F 2 "" H 1800 3000 50  0001 C CNN
F 3 "" H 1800 3000 50  0001 C CNN
	1    1800 3200
	1    0    0    -1  
$EndComp
$Comp
L CG24-cells:V1N U25R72
U 1 1 6056997C
P 1800 5650
F 0 "U25R72" H 1800 5967 50  0000 C CNN
F 1 "V1N" H 1800 5876 50  0000 C CNN
F 2 "" H 1800 5450 50  0001 C CNN
F 3 "" H 1800 5450 50  0001 C CNN
	1    1800 5650
	1    0    0    -1  
$EndComp
$Comp
L CG24-cells:V1N U30R92
U 1 1 5EDF8895
P 6800 2250
F 0 "U30R92" H 6800 2567 50  0000 C CNN
F 1 "V1N" H 6800 2476 50  0000 C CNN
F 2 "" H 6800 2050 50  0001 C CNN
F 3 "" H 6800 2050 50  0001 C CNN
	1    6800 2250
	1    0    0    -1  
$EndComp
$Comp
L CG24-cells:V1N U29R72
U 1 1 61319BC5
P 6800 2850
F 0 "U29R72" H 6800 3167 50  0000 C CNN
F 1 "V1N" H 6800 3076 50  0000 C CNN
F 2 "" H 6800 2650 50  0001 C CNN
F 3 "" H 6800 2650 50  0001 C CNN
	1    6800 2850
	1    0    0    -1  
$EndComp
$Comp
L CG24-cells:V1N U23R101
U 1 1 5FC3F349
P 6800 3800
F 0 "U23R101" H 6800 4117 50  0000 C CNN
F 1 "V1N" H 6800 4026 50  0000 C CNN
F 2 "" H 6800 3600 50  0001 C CNN
F 3 "" H 6800 3600 50  0001 C CNN
	1    6800 3800
	1    0    0    -1  
$EndComp
$Comp
L CG24-cells:V1N U24R102
U 1 1 5ECC1293
P 6800 5150
F 0 "U24R102" H 6800 5467 50  0000 C CNN
F 1 "V1N" H 6800 5376 50  0000 C CNN
F 2 "" H 6800 4950 50  0001 C CNN
F 3 "" H 6800 4950 50  0001 C CNN
	1    6800 5150
	1    0    0    -1  
$EndComp
$Comp
L CG24-cells:V1N U33R82
U 1 1 5EC1176A
P 6800 5500
F 0 "U33R82" H 6800 5817 50  0000 C CNN
F 1 "V1N" H 6800 5726 50  0000 C CNN
F 2 "" H 6800 5300 50  0001 C CNN
F 3 "" H 6800 5300 50  0001 C CNN
	1    6800 5500
	1    0    0    1   
$EndComp
$Comp
L CG24-cells:B1N U9R51
U 1 1 6721C77B
P 2650 6850
F 0 "U9R51" H 2650 6533 50  0000 C CNN
F 1 "B1N" H 2650 6624 50  0000 C CNN
F 2 "" H 2650 6850 50  0001 C CNN
F 3 "" H 2650 6850 50  0001 C CNN
	1    2650 6850
	1    0    0    1   
$EndComp
$Comp
L CG24-cells:B1N U5R51
U 1 1 67372576
P 2650 7400
F 0 "U5R51" H 2650 7083 50  0000 C CNN
F 1 "B1N" H 2650 7174 50  0000 C CNN
F 2 "" H 2650 7400 50  0001 C CNN
F 3 "" H 2650 7400 50  0001 C CNN
	1    2650 7400
	1    0    0    1   
$EndComp
$Comp
L CG24-cells:B1N U3R27
U 1 1 6756CD69
P 5050 6850
F 0 "U3R27" H 5050 6533 50  0000 C CNN
F 1 "B1N" H 5050 6624 50  0000 C CNN
F 2 "" H 5050 6850 50  0001 C CNN
F 3 "" H 5050 6850 50  0001 C CNN
	1    5050 6850
	1    0    0    1   
$EndComp
$Comp
L CG24-cells:B1N U36R31
U 1 1 674C1A45
P 5050 7400
F 0 "U36R31" H 5050 7083 50  0000 C CNN
F 1 "B1N" H 5050 7174 50  0000 C CNN
F 2 "" H 5050 7400 50  0001 C CNN
F 3 "" H 5050 7400 50  0001 C CNN
	1    5050 7400
	1    0    0    1   
$EndComp
$Comp
L CG24-cells:V1N U15R31
U 1 1 64A757DA
P 5050 1600
F 0 "U15R31" H 5050 1917 50  0000 C CNN
F 1 "V1N" H 5050 1826 50  0000 C CNN
F 2 "" H 5050 1400 50  0001 C CNN
F 3 "" H 5050 1400 50  0001 C CNN
	1    5050 1600
	1    0    0    -1  
$EndComp
$Comp
L CG24-cells:V1N U8R61
U 1 1 649CDFFB
P 5050 2300
F 0 "U8R61" H 5050 2617 50  0000 C CNN
F 1 "V1N" H 5050 2526 50  0000 C CNN
F 2 "" H 5050 2100 50  0001 C CNN
F 3 "" H 5050 2100 50  0001 C CNN
	1    5050 2300
	1    0    0    -1  
$EndComp
$Comp
L CG24-cells:V1N U8R51
U 1 1 64A21CD2
P 5050 2950
F 0 "U8R51" H 5050 3267 50  0000 C CNN
F 1 "V1N" H 5050 3176 50  0000 C CNN
F 2 "" H 5050 2750 50  0001 C CNN
F 3 "" H 5050 2750 50  0001 C CNN
	1    5050 2950
	1    0    0    -1  
$EndComp
$Comp
L CG24-cells:V1N U12R51
U 1 1 64976690
P 5050 3700
F 0 "U12R51" H 5050 4017 50  0000 C CNN
F 1 "V1N" H 5050 3926 50  0000 C CNN
F 2 "" H 5050 3500 50  0001 C CNN
F 3 "" H 5050 3500 50  0001 C CNN
	1    5050 3700
	1    0    0    -1  
$EndComp
$Comp
L CG24-cells:V1N U12R61
U 1 1 64921BD8
P 5050 4450
F 0 "U12R61" H 5050 4767 50  0000 C CNN
F 1 "V1N" H 5050 4676 50  0000 C CNN
F 2 "" H 5050 4250 50  0001 C CNN
F 3 "" H 5050 4250 50  0001 C CNN
	1    5050 4450
	1    0    0    -1  
$EndComp
$Comp
L CG24-cells:V1N U8R72
U 1 1 64728930
P 5050 5200
F 0 "U8R72" H 5050 5517 50  0000 C CNN
F 1 "V1N" H 5050 5426 50  0000 C CNN
F 2 "" H 5050 5000 50  0001 C CNN
F 3 "" H 5050 5000 50  0001 C CNN
	1    5050 5200
	1    0    0    -1  
$EndComp
$Comp
L CG24-cells:V1N U20R61
U 1 1 64040186
P 10050 1050
F 0 "U20R61" H 10050 1367 50  0000 C CNN
F 1 "V1N" H 10050 1276 50  0000 C CNN
F 2 "" H 10050 850 50  0001 C CNN
F 3 "" H 10050 850 50  0001 C CNN
	1    10050 1050
	1    0    0    -1  
$EndComp
$Comp
L CG24-cells:V1N U10R51
U 1 1 641E409F
P 10050 2100
F 0 "U10R51" H 10050 2417 50  0000 C CNN
F 1 "V1N" H 10050 2326 50  0000 C CNN
F 2 "" H 10050 1900 50  0001 C CNN
F 3 "" H 10050 1900 50  0001 C CNN
	1    10050 2100
	1    0    0    -1  
$EndComp
$Comp
L CG24-cells:V1N U10R61
U 1 1 640E9032
P 10050 3100
F 0 "U10R61" H 10050 3417 50  0000 C CNN
F 1 "V1N" H 10050 3326 50  0000 C CNN
F 2 "" H 10050 2900 50  0001 C CNN
F 3 "" H 10050 2900 50  0001 C CNN
	1    10050 3100
	1    0    0    -1  
$EndComp
$Comp
L CG24-cells:V1N U4R92
U 1 1 642DE8A5
P 10050 4050
F 0 "U4R92" H 10050 4367 50  0000 C CNN
F 1 "V1N" H 10050 4276 50  0000 C CNN
F 2 "" H 10050 3850 50  0001 C CNN
F 3 "" H 10050 3850 50  0001 C CNN
	1    10050 4050
	1    0    0    -1  
$EndComp
$Comp
L CG24-cells:V1N U3R102
U 1 1 64237A40
P 10050 5000
F 0 "U3R102" H 10050 5317 50  0000 C CNN
F 1 "V1N" H 10050 5226 50  0000 C CNN
F 2 "" H 10050 4800 50  0001 C CNN
F 3 "" H 10050 4800 50  0001 C CNN
	1    10050 5000
	1    0    0    -1  
$EndComp
$Comp
L CG24-cells:V1N U12R41
U 1 1 63FEAAD5
P 10050 5850
F 0 "U12R41" H 10050 6167 50  0000 C CNN
F 1 "V1N" H 10050 6076 50  0000 C CNN
F 2 "" H 10050 5650 50  0001 C CNN
F 3 "" H 10050 5650 50  0001 C CNN
	1    10050 5850
	1    0    0    -1  
$EndComp
$Comp
L CG24-cells:D24 U30R71
U 1 1 610A760A
P 4350 1600
F 0 "U30R71" H 4350 1967 50  0000 C CNN
F 1 "D24" H 4350 1876 50  0000 C CNN
F 2 "" H 4450 1600 50  0001 C CNN
F 3 "" H 4450 1600 50  0001 C CNN
	1    4350 1600
	1    0    0    -1  
$EndComp
$Comp
L CG24-cells:D24 U28R81
U 1 1 60EE6131
P 4350 2300
F 0 "U28R81" H 4350 2667 50  0000 C CNN
F 1 "D24" H 4350 2576 50  0000 C CNN
F 2 "" H 4450 2300 50  0001 C CNN
F 3 "" H 4450 2300 50  0001 C CNN
	1    4350 2300
	1    0    0    -1  
$EndComp
$Comp
L CG24-cells:D24 U28R71
U 1 1 610A6BA0
P 4350 2950
F 0 "U28R71" H 4350 3317 50  0000 C CNN
F 1 "D24" H 4350 3226 50  0000 C CNN
F 2 "" H 4450 2950 50  0001 C CNN
F 3 "" H 4450 2950 50  0001 C CNN
	1    4350 2950
	1    0    0    -1  
$EndComp
$Comp
L CG24-cells:D24 U26R71
U 1 1 60643390
P 4350 3700
F 0 "U26R71" H 4350 4067 50  0000 C CNN
F 1 "D24" H 4350 3976 50  0000 C CNN
F 2 "" H 4450 3700 50  0001 C CNN
F 3 "" H 4450 3700 50  0001 C CNN
	1    4350 3700
	1    0    0    -1  
$EndComp
$Comp
L CG24-cells:D24 U24R71
U 1 1 604D574D
P 4350 4450
F 0 "U24R71" H 4350 4817 50  0000 C CNN
F 1 "D24" H 4350 4726 50  0000 C CNN
F 2 "" H 4450 4450 50  0001 C CNN
F 3 "" H 4450 4450 50  0001 C CNN
	1    4350 4450
	1    0    0    -1  
$EndComp
$Comp
L CG24-cells:D24 U24R81
U 1 1 604D2624
P 4350 5200
F 0 "U24R81" H 4350 5567 50  0000 C CNN
F 1 "D24" H 4350 5476 50  0000 C CNN
F 2 "" H 4450 5200 50  0001 C CNN
F 3 "" H 4450 5200 50  0001 C CNN
	1    4350 5200
	1    0    0    -1  
$EndComp
$Comp
L CG24-cells:D24 U32R81
U 1 1 5EC0F8F0
P 9350 5850
F 0 "U32R81" H 9350 6217 50  0000 C CNN
F 1 "D24" H 9350 6126 50  0000 C CNN
F 2 "" H 9450 5850 50  0001 C CNN
F 3 "" H 9450 5850 50  0001 C CNN
	1    9350 5850
	1    0    0    -1  
$EndComp
$Comp
L CG24-cells:D36 U28R60
U 1 1 612CE6B8
P 9300 1050
F 0 "U28R60" H 9325 1517 50  0000 C CNN
F 1 "D36" H 9325 1426 50  0000 C CNN
F 2 "" H 9350 1200 50  0001 C CNN
F 3 "" H 9350 1200 50  0001 C CNN
	1    9300 1050
	1    0    0    -1  
$EndComp
$Comp
L CG24-cells:D36 U28R50
U 1 1 614E84A7
P 9300 2100
F 0 "U28R50" H 9325 2567 50  0000 C CNN
F 1 "D36" H 9325 2476 50  0000 C CNN
F 2 "" H 9350 2250 50  0001 C CNN
F 3 "" H 9350 2250 50  0001 C CNN
	1    9300 2100
	1    0    0    -1  
$EndComp
$Comp
L CG24-cells:D36 U30R60
U 1 1 612CE6B2
P 9300 3100
F 0 "U30R60" H 9325 3567 50  0000 C CNN
F 1 "D36" H 9325 3476 50  0000 C CNN
F 2 "" H 9350 3250 50  0001 C CNN
F 3 "" H 9350 3250 50  0001 C CNN
	1    9300 3100
	1    0    0    -1  
$EndComp
$Comp
L CG24-cells:D36 U22R101
U 1 1 5FC3F350
P 9300 4050
F 0 "U22R101" H 9325 4517 50  0000 C CNN
F 1 "D36" H 9325 4426 50  0000 C CNN
F 2 "" H 9350 4200 50  0001 C CNN
F 3 "" H 9350 4200 50  0001 C CNN
	1    9300 4050
	1    0    0    -1  
$EndComp
$Comp
L CG24-cells:D36 U22R99
U 1 1 5ED00A66
P 9300 5000
F 0 "U22R99" H 9325 5467 50  0000 C CNN
F 1 "D36" H 9325 5376 50  0000 C CNN
F 2 "" H 9350 5150 50  0001 C CNN
F 3 "" H 9350 5150 50  0001 C CNN
	1    9300 5000
	1    0    0    -1  
$EndComp
Wire Wire Line
	3850 3200 3850 3000
Connection ~ 3850 3000
Wire Wire Line
	3750 2800 3750 3400
Connection ~ 3750 2800
Wire Wire Line
	1500 3200 1450 3200
Wire Wire Line
	1450 3200 1450 3400
Connection ~ 1450 3400
Wire Wire Line
	1450 3400 1450 5650
Text Label 8050 5050 0    50   ~ 0
IN0
Text Label 8050 4100 0    50   ~ 0
IN1
Text Label 8050 3150 0    50   ~ 0
IN2
Text Label 8050 2150 0    50   ~ 0
IN3
Text Label 8050 1100 0    50   ~ 0
IN4
Text Label 3150 5250 0    50   ~ 0
IN5
Text Label 3150 4500 0    50   ~ 0
IN6
Text Label 3150 3750 0    50   ~ 0
IN7
Text Label 3150 2900 0    50   ~ 0
IN8
Text Label 3150 2250 0    50   ~ 0
IN9
Text Label 4650 7400 2    50   ~ 0
IN11
Text Label 4650 6850 2    50   ~ 0
IN12
Text Label 2250 7400 2    50   ~ 0
IN13
Text Label 2250 6850 2    50   ~ 0
IN14
Text Label 8050 4850 0    50   ~ 0
REG8-D0
Text Label 8050 3900 0    50   ~ 0
REG8-D1
Text Label 8050 2950 0    50   ~ 0
REG8-D2
Text Label 8050 1950 0    50   ~ 0
REG8-D3
Text Label 8050 900  0    50   ~ 0
REG8-D4
Text Label 3150 5050 0    50   ~ 0
REG8-D5
Text Label 3150 4300 0    50   ~ 0
REG8-D6
Text Label 3150 3550 0    50   ~ 0
REG8-D7
Text Label 3150 3100 0    50   ~ 0
REG8-D8
Text Label 3150 2450 0    50   ~ 0
REG8-D9
Entry Wire Line
	7550 4750 7650 4850
Entry Wire Line
	7700 4950 7800 5050
Wire Wire Line
	7800 5050 8900 5050
Wire Wire Line
	7650 4850 8900 4850
Wire Wire Line
	7950 4300 8900 4300
Entry Wire Line
	7550 4000 7650 3900
Entry Wire Line
	7700 4000 7800 4100
Entry Wire Line
	7850 4200 7950 4300
Wire Wire Line
	7800 4100 8900 4100
Wire Wire Line
	7650 3900 8900 3900
Wire Wire Line
	7100 3800 8800 3800
Wire Wire Line
	7950 3350 8900 3350
Entry Wire Line
	7550 3050 7650 2950
Entry Wire Line
	7700 3050 7800 3150
Entry Wire Line
	7850 3250 7950 3350
Wire Wire Line
	7800 3150 8900 3150
Wire Wire Line
	7650 2950 8900 2950
Wire Wire Line
	7950 2350 8900 2350
Entry Wire Line
	7550 1850 7650 1950
Entry Wire Line
	7700 2050 7800 2150
Entry Wire Line
	7850 2450 7950 2350
Wire Wire Line
	7800 2150 8900 2150
Wire Wire Line
	7650 1950 8900 1950
Wire Wire Line
	7100 2250 8600 2250
Wire Wire Line
	7950 1300 8900 1300
Entry Wire Line
	7550 800  7650 900 
Entry Wire Line
	7700 1200 7800 1100
Entry Wire Line
	7850 1400 7950 1300
Wire Wire Line
	7800 1100 8900 1100
Wire Wire Line
	7650 900  8900 900 
Wire Wire Line
	7100 1000 8700 1000
Text Label 8050 4300 0    50   ~ 0
REG9-D1
Text Label 8050 3350 0    50   ~ 0
REG9-D2
Text Label 8050 2350 0    50   ~ 0
REG9-D3
Text Label 8050 1300 0    50   ~ 0
REG9-D4
Connection ~ 6350 5500
Wire Wire Line
	6350 5500 6350 6000
Text Label 8050 5900 0    50   ~ 0
IN15
Entry Wire Line
	7700 5800 7800 5900
Wire Wire Line
	7800 5900 8950 5900
Entry Wire Line
	7850 5350 7950 5250
Wire Wire Line
	7950 5250 8900 5250
Text Label 8050 5250 0    50   ~ 0
REG9-D0
Text HLabel 8750 5700 0    50   Input ~ 0
REG9-D15
Wire Wire Line
	7950 5800 7950 5500
Wire Wire Line
	8750 5700 8950 5700
Wire Wire Line
	7950 5500 7100 5500
Wire Wire Line
	7950 5800 8950 5800
Wire Bus Line
	7550 650  3000 650 
Text Label 3150 1750 0    50   ~ 0
REG8-D10
Text Label 3150 1550 0    50   ~ 0
IN10
Wire Wire Line
	3100 1750 3950 1750
Wire Wire Line
	2950 1550 3950 1550
Entry Wire Line
	2950 1550 2850 1650
Entry Wire Line
	3100 1750 3000 1850
Wire Wire Line
	3100 2450 3950 2450
Wire Wire Line
	2950 2250 3950 2250
Entry Wire Line
	2950 2250 2850 2350
Entry Wire Line
	3100 2450 3000 2550
Wire Wire Line
	3100 3100 3950 3100
Wire Wire Line
	2950 2900 3950 2900
Entry Wire Line
	2950 2900 2850 2800
Entry Wire Line
	3100 3100 3000 3000
Wire Wire Line
	3100 3550 3950 3550
Wire Wire Line
	2950 3750 3950 3750
Entry Wire Line
	2950 3750 2850 3850
Entry Wire Line
	3100 3550 3000 3650
Wire Wire Line
	3100 4300 3950 4300
Wire Wire Line
	2950 4500 3950 4500
Entry Wire Line
	2950 4500 2850 4600
Entry Wire Line
	3100 4300 3000 4400
Wire Wire Line
	3100 5050 3950 5050
Wire Wire Line
	2950 5250 3950 5250
Entry Wire Line
	2950 5250 2850 5150
Entry Wire Line
	3100 5050 3000 4950
Wire Wire Line
	2350 6850 1850 6850
Entry Wire Line
	1750 6750 1850 6850
Wire Wire Line
	2350 7400 1850 7400
Entry Wire Line
	1750 7300 1850 7400
Wire Wire Line
	4750 6850 4250 6850
Entry Wire Line
	4150 6750 4250 6850
Wire Wire Line
	4750 7400 4250 7400
Entry Wire Line
	4150 7300 4250 7400
Text Label 3050 7400 0    50   ~ 0
OUT13
Text Label 3050 6850 0    50   ~ 0
OUT14
Wire Wire Line
	2950 6850 3450 6850
Entry Wire Line
	3550 6750 3450 6850
Wire Wire Line
	2950 7400 3450 7400
Entry Wire Line
	3550 7300 3450 7400
Text Label 5450 7400 0    50   ~ 0
OUT11
Text Label 5450 6850 0    50   ~ 0
OUT12
Wire Wire Line
	5350 6850 5850 6850
Entry Wire Line
	5950 6750 5850 6850
Wire Wire Line
	5350 7400 5850 7400
Entry Wire Line
	5950 7300 5850 7400
Text Label 5450 5200 0    50   ~ 0
OUT5
Wire Wire Line
	5350 5200 5850 5200
Text Label 5450 4450 0    50   ~ 0
OUT6
Wire Wire Line
	5350 4450 5850 4450
Text Label 5450 3700 0    50   ~ 0
OUT7
Wire Wire Line
	5350 3700 5850 3700
Text Label 5450 2950 0    50   ~ 0
OUT8
Wire Wire Line
	5350 2950 5850 2950
Text Label 5450 2300 0    50   ~ 0
OUT9
Wire Wire Line
	5350 2300 5850 2300
Text Label 5450 1600 0    50   ~ 0
OUT10
Wire Wire Line
	5350 1600 5850 1600
Entry Wire Line
	5850 1600 5950 1700
Entry Wire Line
	5850 2300 5950 2400
Entry Wire Line
	5850 2950 5950 3050
Entry Wire Line
	5850 3700 5950 3800
Entry Wire Line
	5850 4450 5950 4550
Entry Wire Line
	5850 5200 5950 5300
Connection ~ 2850 6100
Wire Wire Line
	6350 6000 1250 6000
Connection ~ 6350 6000
Connection ~ 6450 4450
Wire Bus Line
	1750 6100 2850 6100
Text Label 10450 5850 0    50   ~ 0
OUT15
Wire Wire Line
	10350 5850 10850 5850
Text Label 10450 5000 0    50   ~ 0
OUT0
Wire Wire Line
	10350 5000 10850 5000
Text Label 10450 4050 0    50   ~ 0
OUT1
Wire Wire Line
	10350 4050 10850 4050
Text Label 10450 3100 0    50   ~ 0
OUT2
Wire Wire Line
	10350 3100 10850 3100
Text Label 10450 2100 0    50   ~ 0
OUT3
Wire Wire Line
	10350 2100 10850 2100
Text Label 10450 1050 0    50   ~ 0
OUT4
Wire Wire Line
	10350 1050 10850 1050
Entry Wire Line
	10850 1050 10950 1150
Entry Wire Line
	10850 2100 10950 2200
Entry Wire Line
	10850 3100 10950 3200
Entry Wire Line
	10850 4050 10950 4150
Entry Wire Line
	10850 5000 10950 5100
Entry Wire Line
	10850 5850 10950 5950
Wire Bus Line
	10950 6300 5950 6300
Wire Wire Line
	1250 5900 1450 5900
Wire Wire Line
	1450 5650 1450 5900
Connection ~ 1450 5900
Wire Wire Line
	1450 5900 3850 5900
Wire Wire Line
	3850 5350 3850 5900
Connection ~ 3850 5900
Wire Wire Line
	3850 5900 6450 5900
Wire Wire Line
	6450 4450 6450 5900
Connection ~ 5950 6300
Connection ~ 4150 6100
Wire Bus Line
	4150 6100 7700 6100
Wire Bus Line
	2850 6100 4150 6100
Wire Bus Line
	3550 6300 5950 6300
Text HLabel 1250 5900 0    50   Input ~ 0
~REG8-R
Text HLabel 1250 6000 0    50   Input ~ 0
~REG9-R
Text HLabel 1250 6100 0    50   Input ~ 0
IN[0..15]
Text HLabel 1250 6200 0    50   Input ~ 0
REG9-D[0..4]
Text HLabel 1250 6300 0    50   Output ~ 0
OUT[0..15]
Text HLabel 1250 650  0    50   Input ~ 0
REG8-D[0..10]
Connection ~ 3550 6300
Connection ~ 1750 6100
Wire Bus Line
	1250 6100 1750 6100
Wire Bus Line
	1250 6200 7850 6200
Wire Bus Line
	3550 6300 1250 6300
Wire Bus Line
	3000 650  1250 650 
Connection ~ 3000 650 
Wire Bus Line
	5950 6300 5950 7300
Wire Bus Line
	3550 6300 3550 7300
Wire Bus Line
	4150 6100 4150 7300
Wire Bus Line
	1750 6100 1750 7300
Wire Bus Line
	7850 1400 7850 6200
Wire Bus Line
	7550 650  7550 4750
Wire Bus Line
	7700 1200 7700 6100
Wire Bus Line
	3000 650  3000 4950
Wire Bus Line
	2850 1650 2850 6100
Wire Bus Line
	5950 1700 5950 6300
Wire Bus Line
	10950 1150 10950 6300
$EndSCHEMATC
