EESchema Schematic File Version 4
EELAYER 30 0
EELAYER END
$Descr A4 11693 8268
encoding utf-8
Sheet 63 83
Title "CPS Reverse Engineering: DL-0311"
Date "2021-09-12"
Rev ""
Comp ""
Comment1 ""
Comment2 ""
Comment3 "Licence: CC-BY"
Comment4 "Author: Loïc *WydD* Petit"
$EndDescr
Connection ~ 3200 2900
Connection ~ 4350 4050
Connection ~ 3300 4500
Connection ~ 4350 5750
Connection ~ 3200 4600
Connection ~ 4350 2300
Connection ~ 3300 2800
Connection ~ 4350 7450
Connection ~ 4350 6650
Connection ~ 3200 6300
Connection ~ 3300 5900
Entry Wire Line
	2700 1500 2800 1600
Entry Wire Line
	2700 1950 2800 2050
Entry Wire Line
	2700 3250 2800 3350
Entry Wire Line
	2700 3700 2800 3800
Entry Wire Line
	2850 1300 2950 1400
Entry Wire Line
	2850 1750 2950 1850
Entry Wire Line
	2850 3050 2950 3150
Entry Wire Line
	2850 3500 2950 3600
Entry Wire Line
	2850 4750 2950 4850
Entry Wire Line
	2850 5200 2950 5300
Entry Wire Line
	2950 6800 3050 6900
Entry Wire Line
	2950 6900 3050 7000
Entry Wire Line
	2950 7100 3050 7200
Entry Wire Line
	3000 1200 3100 1300
Entry Wire Line
	3000 1650 3100 1750
Entry Wire Line
	3000 2950 3100 3050
Entry Wire Line
	3000 3400 3100 3500
Entry Wire Line
	3000 4650 3100 4750
Entry Wire Line
	3000 5100 3100 5200
Entry Wire Line
	5900 1450 6000 1350
Entry Wire Line
	5900 1900 6000 1800
Entry Wire Line
	5900 3200 6000 3100
Entry Wire Line
	5900 3650 6000 3550
Entry Wire Line
	5900 4900 6000 4800
Entry Wire Line
	5900 5350 6000 5250
Entry Wire Line
	5900 6600 6000 6500
Entry Wire Line
	5900 7050 6000 6950
Wire Wire Line
	2600 5900 3300 5900
Wire Wire Line
	2800 1600 4350 1600
Wire Wire Line
	2800 2050 4350 2050
Wire Wire Line
	2800 3350 4350 3350
Wire Wire Line
	2800 3800 4350 3800
Wire Wire Line
	2950 1400 4350 1400
Wire Wire Line
	2950 1850 4350 1850
Wire Wire Line
	2950 3150 4350 3150
Wire Wire Line
	2950 3600 4350 3600
Wire Wire Line
	2950 4850 4350 4850
Wire Wire Line
	2950 5300 4350 5300
Wire Wire Line
	3100 1300 4350 1300
Wire Wire Line
	3100 1750 4350 1750
Wire Wire Line
	3100 3050 4350 3050
Wire Wire Line
	3100 3500 4350 3500
Wire Wire Line
	3100 4750 4350 4750
Wire Wire Line
	3100 5200 4350 5200
Wire Wire Line
	3200 1150 3200 2900
Wire Wire Line
	3200 1150 4350 1150
Wire Wire Line
	3200 2900 3200 4600
Wire Wire Line
	3200 2900 4350 2900
Wire Wire Line
	3200 4600 3200 6300
Wire Wire Line
	3200 4600 4350 4600
Wire Wire Line
	3200 6300 4350 6300
Wire Wire Line
	3300 1050 3300 2800
Wire Wire Line
	3300 1050 4350 1050
Wire Wire Line
	3300 2800 3300 4500
Wire Wire Line
	3300 2800 4350 2800
Wire Wire Line
	3300 4500 3300 5900
Wire Wire Line
	3300 4500 4350 4500
Wire Wire Line
	3300 5900 3300 6200
Wire Wire Line
	3300 6200 4350 6200
Wire Wire Line
	3400 7200 3050 7200
Wire Wire Line
	3850 6650 4000 6650
Wire Wire Line
	4000 5050 4350 5050
Wire Wire Line
	4000 5500 4350 5500
Wire Wire Line
	4000 6650 4350 6650
Wire Wire Line
	4000 7100 4000 6650
Wire Wire Line
	4000 7200 4350 7200
Wire Wire Line
	4100 1500 4350 1500
Wire Wire Line
	4100 1950 4350 1950
Wire Wire Line
	4100 3250 4350 3250
Wire Wire Line
	4100 3700 4350 3700
Wire Wire Line
	4100 4950 4350 4950
Wire Wire Line
	4100 5400 4350 5400
Wire Wire Line
	4100 6450 4350 6450
Wire Wire Line
	4250 2300 4350 2300
Wire Wire Line
	4250 4050 4350 4050
Wire Wire Line
	4250 5750 4350 5750
Wire Wire Line
	4250 7450 4350 7450
Wire Wire Line
	4350 2300 4350 2200
Wire Wire Line
	4350 4050 4350 3950
Wire Wire Line
	4350 5750 4350 5650
Wire Wire Line
	4350 6650 4350 6550
Wire Wire Line
	4350 6750 4350 6650
Wire Wire Line
	4350 6900 3050 6900
Wire Wire Line
	4350 7000 3050 7000
Wire Wire Line
	4350 7100 4000 7100
Wire Wire Line
	4350 7350 4350 7450
Wire Wire Line
	4950 1450 5900 1450
Wire Wire Line
	4950 1900 5900 1900
Wire Wire Line
	4950 3200 5900 3200
Wire Wire Line
	4950 3650 5900 3650
Wire Wire Line
	4950 4900 5900 4900
Wire Wire Line
	4950 5350 5900 5350
Wire Wire Line
	4950 6600 5900 6600
Wire Wire Line
	5550 7050 5900 7050
Wire Bus Line
	2700 1300 2600 1300
Wire Bus Line
	2850 1200 2600 1200
Wire Bus Line
	2950 6700 2800 6700
Wire Bus Line
	3000 1100 2600 1100
Wire Bus Line
	6000 1200 6100 1200
Text Notes 7250 4150 0    50   ~ 0
SCROLL1\n~Y3\n0\nX5\nX4\nX3\nX2\nX1\nX0
Text Notes 7700 4150 0    50   ~ 0
SCROLL2\n~Y4\n1\nX5\nX4\nX3\nX2\nX1\nX0
Text Notes 8150 4150 0    50   ~ 0
SCROLL3\nY5\n1\n1\n1\nX3\nX2\nX1\nX0
Text Label 3400 6900 2    50   ~ 0
Y-OUT3
Text Label 3400 7000 2    50   ~ 0
Y-OUT4
Text Label 3400 7200 2    50   ~ 0
Y-OUT5
Text Label 3500 1300 0    50   ~ 0
SCROLL1-X0
Text Label 3500 1400 0    50   ~ 0
SCROLL2-X0
Text Label 3500 1600 0    50   ~ 0
SCROLL3-X0
Text Label 3500 1750 0    50   ~ 0
SCROLL1-X1
Text Label 3500 1850 0    50   ~ 0
SCROLL2-X1
Text Label 3500 2050 0    50   ~ 0
SCROLL3-X1
Text Label 3500 3050 0    50   ~ 0
SCROLL1-X2
Text Label 3500 3350 0    50   ~ 0
SCROLL3-X2
Text Label 3500 3500 0    50   ~ 0
SCROLL1-X3
Text Label 3500 3600 0    50   ~ 0
SCROLL2-X3
Text Label 3500 3800 0    50   ~ 0
SCROLL3-X3
Text Label 3500 4750 0    50   ~ 0
SCROLL1-X4
Text Label 3500 4850 0    50   ~ 0
SCROLL2-X4
Text Label 3500 5200 0    50   ~ 0
SCROLL1-X5
Text Label 3500 5300 0    50   ~ 0
SCROLL2-X5
Text Label 5600 1450 0    50   ~ 0
ADDR0
Text Label 5600 1900 0    50   ~ 0
ADDR1
Text Label 5600 3200 0    50   ~ 0
ADDR2
Text Label 5600 3650 0    50   ~ 0
ADDR3
Text Label 5600 4900 0    50   ~ 0
ADDR4
Text Label 5600 5350 0    50   ~ 0
ADDR5
Text Label 5600 6600 0    50   ~ 0
ADDR6
Text Label 5600 7050 0    50   ~ 0
ADDR7
Text HLabel 2600 1100 0    50   Input ~ 0
SCROLL1-X[0..5]
Text HLabel 2600 1200 0    50   Input ~ 0
SCROLL2-X[0..5]
Text HLabel 2600 1300 0    50   Input ~ 0
SCROLL3-X[0..3]
Text HLabel 2600 5900 0    50   Input ~ 0
~SCROLL1-T
Text HLabel 2600 6300 0    50   Input ~ 0
~SCROLL3-T
Text HLabel 2800 6700 0    50   Input ~ 0
Y-OUT[3..5]
Text HLabel 6100 1200 2    50   Output ~ 0
ADDR[0..7]
$Comp
L power:VCC #PWR0139
U 1 1 61118D44
P 3850 6650
F 0 "#PWR0139" H 3850 6500 50  0001 C CNN
F 1 "VCC" H 3865 6823 50  0000 C CNN
F 2 "" H 3850 6650 50  0001 C CNN
F 3 "" H 3850 6650 50  0001 C CNN
	1    3850 6650
	1    0    0    -1  
$EndComp
$Comp
L power:VCC #PWR0159
U 1 1 61118D55
P 4000 5050
F 0 "#PWR0159" H 4000 4900 50  0001 C CNN
F 1 "VCC" H 4015 5223 50  0001 C CNN
F 2 "" H 4000 5050 50  0001 C CNN
F 3 "" H 4000 5050 50  0001 C CNN
	1    4000 5050
	1    0    0    -1  
$EndComp
$Comp
L power:VCC #PWR0138
U 1 1 61118D58
P 4000 5500
F 0 "#PWR0138" H 4000 5350 50  0001 C CNN
F 1 "VCC" H 4015 5673 50  0001 C CNN
F 2 "" H 4000 5500 50  0001 C CNN
F 3 "" H 4000 5500 50  0001 C CNN
	1    4000 5500
	1    0    0    -1  
$EndComp
$Comp
L power:GND #PWR0163
U 1 1 61118D52
P 4100 1500
F 0 "#PWR0163" H 4100 1250 50  0001 C CNN
F 1 "GND" H 4105 1327 50  0001 C CNN
F 2 "" H 4100 1500 50  0001 C CNN
F 3 "" H 4100 1500 50  0001 C CNN
	1    4100 1500
	1    0    0    -1  
$EndComp
$Comp
L power:GND #PWR0162
U 1 1 61118D4F
P 4100 1950
F 0 "#PWR0162" H 4100 1700 50  0001 C CNN
F 1 "GND" H 4105 1777 50  0001 C CNN
F 2 "" H 4100 1950 50  0001 C CNN
F 3 "" H 4100 1950 50  0001 C CNN
	1    4100 1950
	1    0    0    -1  
$EndComp
$Comp
L power:GND #PWR0165
U 1 1 61118D50
P 4100 3250
F 0 "#PWR0165" H 4100 3000 50  0001 C CNN
F 1 "GND" H 4105 3077 50  0001 C CNN
F 2 "" H 4100 3250 50  0001 C CNN
F 3 "" H 4100 3250 50  0001 C CNN
	1    4100 3250
	1    0    0    -1  
$EndComp
$Comp
L power:GND #PWR0164
U 1 1 61118D51
P 4100 3700
F 0 "#PWR0164" H 4100 3450 50  0001 C CNN
F 1 "GND" H 4105 3527 50  0001 C CNN
F 2 "" H 4100 3700 50  0001 C CNN
F 3 "" H 4100 3700 50  0001 C CNN
	1    4100 3700
	1    0    0    -1  
$EndComp
$Comp
L power:GND #PWR0161
U 1 1 61118D54
P 4100 4950
F 0 "#PWR0161" H 4100 4700 50  0001 C CNN
F 1 "GND" H 4105 4777 50  0001 C CNN
F 2 "" H 4100 4950 50  0001 C CNN
F 3 "" H 4100 4950 50  0001 C CNN
	1    4100 4950
	1    0    0    -1  
$EndComp
$Comp
L power:GND #PWR0160
U 1 1 61118D57
P 4100 5400
F 0 "#PWR0160" H 4100 5150 50  0001 C CNN
F 1 "GND" H 4105 5227 50  0001 C CNN
F 2 "" H 4100 5400 50  0001 C CNN
F 3 "" H 4100 5400 50  0001 C CNN
	1    4100 5400
	1    0    0    -1  
$EndComp
$Comp
L power:GND #PWR0154
U 1 1 61118D47
P 4100 6450
F 0 "#PWR0154" H 4100 6200 50  0001 C CNN
F 1 "GND" H 4105 6277 50  0001 C CNN
F 2 "" H 4100 6450 50  0001 C CNN
F 3 "" H 4100 6450 50  0001 C CNN
	1    4100 6450
	1    0    0    -1  
$EndComp
$Comp
L power:GND #PWR0157
U 1 1 61118D4D
P 4250 2300
F 0 "#PWR0157" H 4250 2050 50  0001 C CNN
F 1 "GND" H 4255 2127 50  0001 C CNN
F 2 "" H 4250 2300 50  0001 C CNN
F 3 "" H 4250 2300 50  0001 C CNN
	1    4250 2300
	1    0    0    -1  
$EndComp
$Comp
L power:GND #PWR0156
U 1 1 61118D4E
P 4250 4050
F 0 "#PWR0156" H 4250 3800 50  0001 C CNN
F 1 "GND" H 4255 3877 50  0001 C CNN
F 2 "" H 4250 4050 50  0001 C CNN
F 3 "" H 4250 4050 50  0001 C CNN
	1    4250 4050
	1    0    0    -1  
$EndComp
$Comp
L power:GND #PWR0155
U 1 1 61118D56
P 4250 5750
F 0 "#PWR0155" H 4250 5500 50  0001 C CNN
F 1 "GND" H 4255 5577 50  0001 C CNN
F 2 "" H 4250 5750 50  0001 C CNN
F 3 "" H 4250 5750 50  0001 C CNN
	1    4250 5750
	1    0    0    -1  
$EndComp
$Comp
L power:GND #PWR0158
U 1 1 61118D46
P 4250 7450
F 0 "#PWR0158" H 4250 7200 50  0001 C CNN
F 1 "GND" H 4255 7277 50  0001 C CNN
F 2 "" H 4250 7450 50  0001 C CNN
F 3 "" H 4250 7450 50  0001 C CNN
	1    4250 7450
	1    0    0    -1  
$EndComp
$Comp
L A5C:INV01 UEE74
U 1 1 61118CD1
P 2900 6300
AR Path="/61116467/6119F3EF/61118CD1" Ref="UEE74"  Part="1" 
AR Path="/6112ED71/61118CD1" Ref="UEE74"  Part="1" 
AR Path="/612E497E/612E4DF5/61118CD1" Ref="UEE74"  Part="1" 
F 0 "UEE74" H 2900 6617 50  0000 C CNN
F 1 "INV01" H 2900 6526 50  0000 C CNN
F 2 "" H 2900 6100 50  0001 C CNN
F 3 "" H 2900 6100 50  0001 C CNN
	1    2900 6300
	1    0    0    -1  
$EndComp
$Comp
L A5C:INV01 UEB16
U 1 1 61118D43
P 3700 7200
AR Path="/61116467/6119F3EF/61118D43" Ref="UEB16"  Part="1" 
AR Path="/6112ED71/61118D43" Ref="UEB16"  Part="1" 
AR Path="/612E497E/612E4DF5/61118D43" Ref="UEB16"  Part="1" 
F 0 "UEB16" H 3700 7517 50  0000 C CNN
F 1 "INV01" H 3700 7426 50  0000 C CNN
F 2 "" H 3700 7000 50  0001 C CNN
F 3 "" H 3700 7000 50  0001 C CNN
	1    3700 7200
	1    0    0    1   
$EndComp
$Comp
L A5C:INV01 UCC188
U 1 1 612BEC2A
P 5250 7050
AR Path="/61116467/6119F3EF/612BEC2A" Ref="UCC188"  Part="1" 
AR Path="/6112ED71/612BEC2A" Ref="UCC188"  Part="1" 
AR Path="/612E497E/612E4DF5/612BEC2A" Ref="UCC188"  Part="1" 
F 0 "UCC188" H 5250 7367 50  0000 C CNN
F 1 "INV01" H 5250 7276 50  0000 C CNN
F 2 "" H 5250 6850 50  0001 C CNN
F 3 "" H 5250 6850 50  0001 C CNN
	1    5250 7050
	1    0    0    -1  
$EndComp
$Comp
L A5C:MUX42H UEJ142
U 1 1 61118D4B
P 4650 1600
AR Path="/61116467/6119F3EF/61118D4B" Ref="UEJ142"  Part="1" 
AR Path="/6112ED71/61118D4B" Ref="UEJ142"  Part="1" 
AR Path="/612E497E/612E4DF5/61118D4B" Ref="UEJ142"  Part="1" 
F 0 "UEJ142" H 4650 2415 50  0000 C CNN
F 1 "MUX42H" H 4650 2324 50  0000 C CNN
F 2 "" H 4700 1650 50  0001 C CNN
F 3 "" H 4700 1650 50  0001 C CNN
	1    4650 1600
	1    0    0    -1  
$EndComp
$Comp
L A5C:MUX42H UEF113
U 1 1 61118D4C
P 4650 3350
AR Path="/61116467/6119F3EF/61118D4C" Ref="UEF113"  Part="1" 
AR Path="/6112ED71/61118D4C" Ref="UEF113"  Part="1" 
AR Path="/612E497E/612E4DF5/61118D4C" Ref="UEF113"  Part="1" 
F 0 "UEF113" H 4650 4165 50  0000 C CNN
F 1 "MUX42H" H 4650 4074 50  0000 C CNN
F 2 "" H 4700 3400 50  0001 C CNN
F 3 "" H 4700 3400 50  0001 C CNN
	1    4650 3350
	1    0    0    -1  
$EndComp
$Comp
L A5C:MUX42H UED53
U 1 1 61118D53
P 4650 5050
AR Path="/61116467/6119F3EF/61118D53" Ref="UED53"  Part="1" 
AR Path="/6112ED71/61118D53" Ref="UED53"  Part="1" 
AR Path="/612E497E/612E4DF5/61118D53" Ref="UED53"  Part="1" 
F 0 "UED53" H 4650 5865 50  0000 C CNN
F 1 "MUX42H" H 4650 5774 50  0000 C CNN
F 2 "" H 4700 5100 50  0001 C CNN
F 3 "" H 4700 5100 50  0001 C CNN
	1    4650 5050
	1    0    0    -1  
$EndComp
$Comp
L A5C:MUX42H UEA0
U 1 1 61118D45
P 4650 6750
AR Path="/61116467/6119F3EF/61118D45" Ref="UEA0"  Part="1" 
AR Path="/6112ED71/61118D45" Ref="UEA0"  Part="1" 
AR Path="/612E497E/612E4DF5/61118D45" Ref="UEA0"  Part="1" 
F 0 "UEA0" H 4650 7565 50  0000 C CNN
F 1 "MUX42H" H 4650 7474 50  0000 C CNN
F 2 "" H 4700 6800 50  0001 C CNN
F 3 "" H 4700 6800 50  0001 C CNN
	1    4650 6750
	1    0    0    -1  
$EndComp
Text Label 3500 3150 0    50   ~ 0
SCROLL2-X2
Connection ~ 4000 6650
Wire Bus Line
	2950 6700 2950 7100
Wire Bus Line
	2700 1300 2700 3700
Wire Bus Line
	2850 1200 2850 5200
Wire Bus Line
	3000 1100 3000 5100
Wire Bus Line
	6000 1200 6000 6950
$EndSCHEMATC
