EESchema Schematic File Version 4
EELAYER 30 0
EELAYER END
$Descr A2 16535 23386 portrait
encoding utf-8
Sheet 44 83
Title "CPS Reverse Engineering: DL-0311"
Date "2021-09-12"
Rev ""
Comp ""
Comment1 ""
Comment2 ""
Comment3 "Licence: CC-BY"
Comment4 "Author: Loïc *WydD* Petit"
$EndDescr
Connection ~ 4650 13250
Connection ~ 5350 13350
Connection ~ 6850 14800
Connection ~ 5350 15950
Connection ~ 4650 15850
Connection ~ 6950 14900
Connection ~ 8100 15950
Connection ~ 6850 13200
Connection ~ 6950 13300
Connection ~ 9250 13250
Connection ~ 9100 13350
Connection ~ 7050 14300
Connection ~ 6850 14000
Connection ~ 6950 14100
Connection ~ 8100 13550
Connection ~ 9100 13750
Connection ~ 9250 13850
Connection ~ 8900 14850
Connection ~ 8900 14550
Connection ~ 8100 14350
Connection ~ 9000 13950
Connection ~ 9000 14150
Connection ~ 9000 14250
Connection ~ 9100 14350
Connection ~ 9250 14450
Connection ~ 9250 15150
Connection ~ 9100 15050
Connection ~ 8900 14950
Connection ~ 8200 12150
Connection ~ 8200 11700
Connection ~ 8800 4800
Connection ~ 8800 4300
Connection ~ 8900 3900
Connection ~ 8800 4600
Connection ~ 8100 4200
Connection ~ 8100 5000
Connection ~ 8900 4000
Connection ~ 9250 4200
Connection ~ 9000 4000
Connection ~ 9100 4100
Connection ~ 7350 4050
Connection ~ 7350 4850
Connection ~ 4650 4800
Connection ~ 7350 3250
Connection ~ 8100 3400
Connection ~ 9000 3300
Connection ~ 8900 3600
Connection ~ 9000 3200
Connection ~ 9250 3500
Connection ~ 9100 3400
Connection ~ 9000 3000
Connection ~ 9250 2900
Connection ~ 9100 2800
Connection ~ 9100 2400
Connection ~ 9000 4800
Connection ~ 8900 4700
Connection ~ 9100 4900
Connection ~ 9250 5000
Connection ~ 7050 15900
Connection ~ 9100 15850
Connection ~ 9000 15750
Connection ~ 8800 15750
Connection ~ 9250 19400
Connection ~ 9100 19300
Connection ~ 8200 17250
Connection ~ 8200 17700
Connection ~ 9000 19800
Connection ~ 9000 19500
Connection ~ 9250 20000
Connection ~ 9100 18900
Connection ~ 9250 18800
Connection ~ 9000 19700
Connection ~ 8100 19100
Connection ~ 8100 19900
Connection ~ 7050 19850
Connection ~ 6950 19650
Connection ~ 9100 19900
Connection ~ 8900 20400
Connection ~ 6850 19550
Connection ~ 5350 21500
Connection ~ 9000 21300
Connection ~ 8900 21200
Connection ~ 8800 21300
Connection ~ 6950 20450
Connection ~ 6850 20350
Connection ~ 7050 21450
Connection ~ 7050 20650
Connection ~ 8100 21500
Connection ~ 8100 20700
Connection ~ 9000 14950
Connection ~ 8800 15550
Connection ~ 8800 15250
Connection ~ 5350 18900
Connection ~ 4650 18800
Connection ~ 6950 18850
Connection ~ 6850 18750
Connection ~ 7050 15100
Connection ~ 6850 15600
Connection ~ 8100 15150
Connection ~ 8900 15650
Connection ~ 8800 20800
Connection ~ 9100 21400
Connection ~ 9100 20600
Connection ~ 8900 20500
Connection ~ 9000 20500
Connection ~ 9250 20700
Connection ~ 8800 21100
Connection ~ 8900 20100
Connection ~ 9000 10200
Connection ~ 8900 10100
Connection ~ 9100 10300
Connection ~ 8100 10400
Connection ~ 7050 10350
Connection ~ 6850 10050
Connection ~ 8800 10200
Connection ~ 8100 8800
Connection ~ 8100 9600
Connection ~ 8900 9300
Connection ~ 9250 9600
Connection ~ 8800 9700
Connection ~ 8800 10000
Connection ~ 8900 9000
Connection ~ 7050 9550
Connection ~ 6950 9350
Connection ~ 6850 9250
Connection ~ 6850 7650
Connection ~ 6950 7750
Connection ~ 5350 10400
Connection ~ 4650 10300
Connection ~ 4650 7700
Connection ~ 5350 7800
Connection ~ 6850 8450
Connection ~ 6950 8550
Connection ~ 7050 8750
Connection ~ 9100 7800
Connection ~ 9250 7700
Connection ~ 9100 8200
Connection ~ 8200 6800
Connection ~ 8200 6350
Connection ~ 8900 9400
Connection ~ 9100 9500
Connection ~ 9000 9400
Connection ~ 9100 8800
Connection ~ 9000 8700
Connection ~ 9000 8600
Connection ~ 9250 8900
Connection ~ 9000 8400
Connection ~ 8100 8000
Connection ~ 9250 8300
Connection ~ 8550 1000
Connection ~ 11650 10650
Connection ~ 11650 16200
Connection ~ 11650 5200
NoConn ~ 8700 4900
NoConn ~ 8700 4100
NoConn ~ 8700 3300
NoConn ~ 8700 2500
Entry Wire Line
	9950 5450 10050 5350
Entry Wire Line
	9950 5550 10050 5450
Entry Wire Line
	9950 5650 10050 5550
Entry Wire Line
	9950 5750 10050 5650
Entry Wire Line
	9950 10850 10050 10750
Entry Wire Line
	9950 10950 10050 10850
Entry Wire Line
	9950 11050 10050 10950
Entry Wire Line
	9950 11150 10050 11050
Entry Wire Line
	9950 16400 10050 16300
Entry Wire Line
	9950 16500 10050 16400
Entry Wire Line
	9950 16600 10050 16500
Entry Wire Line
	9950 16700 10050 16600
Entry Wire Line
	9950 22000 10050 21900
Entry Wire Line
	9950 22100 10050 22000
Entry Wire Line
	9950 22200 10050 22100
Entry Wire Line
	9950 22300 10050 22200
Entry Wire Line
	10050 21500 10150 21400
Entry Wire Line
	10050 21600 10150 21500
Wire Wire Line
	4650 4800 4650 7700
Wire Wire Line
	4650 10300 4650 7700
Wire Wire Line
	4650 10300 5450 10300
Wire Wire Line
	4650 13250 4650 10300
Wire Wire Line
	4650 13250 4650 15850
Wire Wire Line
	4650 15850 4650 18800
Wire Wire Line
	4650 15850 5450 15850
Wire Wire Line
	4650 21400 4650 18800
Wire Wire Line
	4650 21400 5450 21400
Wire Wire Line
	4700 21500 5350 21500
Wire Wire Line
	5250 7700 5450 7700
Wire Wire Line
	5250 13250 5450 13250
Wire Wire Line
	5250 18800 5450 18800
Wire Wire Line
	5350 4800 4650 4800
Wire Wire Line
	5350 7800 5350 4900
Wire Wire Line
	5350 7800 5350 10400
Wire Wire Line
	5350 10400 5450 10400
Wire Wire Line
	5350 13350 5350 10400
Wire Wire Line
	5350 13350 5350 15950
Wire Wire Line
	5350 15950 5450 15950
Wire Wire Line
	5350 18900 5350 15950
Wire Wire Line
	5350 18900 5350 21500
Wire Wire Line
	5350 21500 5450 21500
Wire Wire Line
	5450 7800 5350 7800
Wire Wire Line
	5450 13350 5350 13350
Wire Wire Line
	5450 18900 5350 18900
Wire Wire Line
	5900 4850 7350 4850
Wire Wire Line
	6000 7750 6950 7750
Wire Wire Line
	6000 10350 7050 10350
Wire Wire Line
	6000 13300 6950 13300
Wire Wire Line
	6000 15900 7050 15900
Wire Wire Line
	6000 18850 6950 18850
Wire Wire Line
	6000 21450 7050 21450
Wire Wire Line
	6150 7000 6150 10250
Wire Wire Line
	6150 10250 7150 10250
Wire Wire Line
	6150 12550 6150 15800
Wire Wire Line
	6150 15800 7150 15800
Wire Wire Line
	6150 18100 6150 21350
Wire Wire Line
	6150 21350 7150 21350
Wire Wire Line
	6250 7100 6250 9450
Wire Wire Line
	6250 9450 7150 9450
Wire Wire Line
	6250 12650 6250 15000
Wire Wire Line
	6250 15000 7150 15000
Wire Wire Line
	6250 18200 6250 20550
Wire Wire Line
	6250 20550 7150 20550
Wire Wire Line
	6350 7200 6350 8650
Wire Wire Line
	6350 8650 7150 8650
Wire Wire Line
	6350 12750 6350 14200
Wire Wire Line
	6350 14200 7150 14200
Wire Wire Line
	6350 18300 6350 19750
Wire Wire Line
	6350 19750 7150 19750
Wire Wire Line
	6450 7300 10750 7300
Wire Wire Line
	6450 7850 6450 7300
Wire Wire Line
	6450 12850 10750 12850
Wire Wire Line
	6450 13400 6450 12850
Wire Wire Line
	6450 18400 10750 18400
Wire Wire Line
	6450 18950 6450 18400
Wire Wire Line
	6550 6650 6850 6650
Wire Wire Line
	6850 6650 6850 7650
Wire Wire Line
	6850 8450 6850 7650
Wire Wire Line
	6850 8450 6850 9250
Wire Wire Line
	6850 9250 6850 10050
Wire Wire Line
	6850 10050 6850 13200
Wire Wire Line
	6850 14000 6850 13200
Wire Wire Line
	6850 14000 6850 14800
Wire Wire Line
	6850 14800 6850 15600
Wire Wire Line
	6850 15600 6850 18750
Wire Wire Line
	6850 19550 6850 18750
Wire Wire Line
	6850 19550 6850 20350
Wire Wire Line
	6850 20350 6850 21150
Wire Wire Line
	6950 1600 6950 4750
Wire Wire Line
	6950 1600 11050 1600
Wire Wire Line
	6950 4750 7450 4750
Wire Wire Line
	6950 8550 6950 7750
Wire Wire Line
	6950 9350 6950 8550
Wire Wire Line
	6950 9350 6950 10150
Wire Wire Line
	6950 14100 6950 13300
Wire Wire Line
	6950 14900 6950 14100
Wire Wire Line
	6950 14900 6950 15700
Wire Wire Line
	6950 19650 6950 18850
Wire Wire Line
	6950 20450 6950 19650
Wire Wire Line
	6950 20450 6950 21250
Wire Wire Line
	7050 1700 7050 3950
Wire Wire Line
	7050 1700 10950 1700
Wire Wire Line
	7050 3950 7450 3950
Wire Wire Line
	7050 8750 7050 7950
Wire Wire Line
	7050 9550 7050 8750
Wire Wire Line
	7050 10350 7050 9550
Wire Wire Line
	7050 14300 7050 13500
Wire Wire Line
	7050 15100 7050 14300
Wire Wire Line
	7050 15900 7050 15100
Wire Wire Line
	7050 19850 7050 19050
Wire Wire Line
	7050 20650 7050 19850
Wire Wire Line
	7050 21450 7050 20650
Wire Wire Line
	7150 1800 7150 3150
Wire Wire Line
	7150 1800 10850 1800
Wire Wire Line
	7150 3150 7450 3150
Wire Wire Line
	7150 7650 6850 7650
Wire Wire Line
	7150 7750 6950 7750
Wire Wire Line
	7150 7850 6450 7850
Wire Wire Line
	7150 7950 7050 7950
Wire Wire Line
	7150 8450 6850 8450
Wire Wire Line
	7150 8550 6950 8550
Wire Wire Line
	7150 8750 7050 8750
Wire Wire Line
	7150 9250 6850 9250
Wire Wire Line
	7150 9350 6950 9350
Wire Wire Line
	7150 9550 7050 9550
Wire Wire Line
	7150 10050 6850 10050
Wire Wire Line
	7150 10150 6950 10150
Wire Wire Line
	7150 10350 7050 10350
Wire Wire Line
	7150 13200 6850 13200
Wire Wire Line
	7150 13300 6950 13300
Wire Wire Line
	7150 13400 6450 13400
Wire Wire Line
	7150 13500 7050 13500
Wire Wire Line
	7150 14000 6850 14000
Wire Wire Line
	7150 14100 6950 14100
Wire Wire Line
	7150 14300 7050 14300
Wire Wire Line
	7150 14800 6850 14800
Wire Wire Line
	7150 14900 6950 14900
Wire Wire Line
	7150 15100 7050 15100
Wire Wire Line
	7150 15600 6850 15600
Wire Wire Line
	7150 15700 6950 15700
Wire Wire Line
	7150 15900 7050 15900
Wire Wire Line
	7150 18750 6850 18750
Wire Wire Line
	7150 18850 6950 18850
Wire Wire Line
	7150 18950 6450 18950
Wire Wire Line
	7150 19050 7050 19050
Wire Wire Line
	7150 19550 6850 19550
Wire Wire Line
	7150 19650 6950 19650
Wire Wire Line
	7150 19850 7050 19850
Wire Wire Line
	7150 20350 6850 20350
Wire Wire Line
	7150 20450 6950 20450
Wire Wire Line
	7150 20650 7050 20650
Wire Wire Line
	7150 21150 6850 21150
Wire Wire Line
	7150 21250 6950 21250
Wire Wire Line
	7150 21450 7050 21450
Wire Wire Line
	7250 1900 10750 1900
Wire Wire Line
	7250 2350 7250 1900
Wire Wire Line
	7250 2350 7450 2350
Wire Wire Line
	7350 2450 7350 3250
Wire Wire Line
	7350 3250 7350 4050
Wire Wire Line
	7350 4050 7350 4850
Wire Wire Line
	7350 4850 7450 4850
Wire Wire Line
	7450 2450 7350 2450
Wire Wire Line
	7450 3250 7350 3250
Wire Wire Line
	7450 4050 7350 4050
Wire Wire Line
	7750 1000 8550 1000
Wire Wire Line
	8000 2400 8200 2400
Wire Wire Line
	8000 3200 8200 3200
Wire Wire Line
	8000 4000 8200 4000
Wire Wire Line
	8000 4800 8200 4800
Wire Wire Line
	8000 7800 8200 7800
Wire Wire Line
	8000 8600 8200 8600
Wire Wire Line
	8000 9400 8200 9400
Wire Wire Line
	8000 10200 8200 10200
Wire Wire Line
	8000 13350 8200 13350
Wire Wire Line
	8000 14150 8200 14150
Wire Wire Line
	8000 14950 8200 14950
Wire Wire Line
	8000 15750 8200 15750
Wire Wire Line
	8000 18900 8200 18900
Wire Wire Line
	8000 19700 8200 19700
Wire Wire Line
	8000 20500 8200 20500
Wire Wire Line
	8000 21300 8200 21300
Wire Wire Line
	8100 3400 8100 2600
Wire Wire Line
	8100 4200 8100 3400
Wire Wire Line
	8100 4200 8200 4200
Wire Wire Line
	8100 5000 8100 4200
Wire Wire Line
	8100 5000 8100 8000
Wire Wire Line
	8100 8800 8100 8000
Wire Wire Line
	8100 9600 8100 8800
Wire Wire Line
	8100 9600 8200 9600
Wire Wire Line
	8100 10400 8100 9600
Wire Wire Line
	8100 10400 8100 13550
Wire Wire Line
	8100 14350 8100 13550
Wire Wire Line
	8100 15150 8100 14350
Wire Wire Line
	8100 15150 8200 15150
Wire Wire Line
	8100 15950 8100 15150
Wire Wire Line
	8100 15950 8100 19100
Wire Wire Line
	8100 19900 8100 19100
Wire Wire Line
	8100 20700 8100 19900
Wire Wire Line
	8100 20700 8200 20700
Wire Wire Line
	8100 21500 8100 20700
Wire Wire Line
	8100 21500 8100 21950
Wire Wire Line
	8100 21950 7650 21950
Wire Wire Line
	8200 2600 8100 2600
Wire Wire Line
	8200 3400 8100 3400
Wire Wire Line
	8200 5000 8100 5000
Wire Wire Line
	8200 5950 10200 5950
Wire Wire Line
	8200 6350 8200 5950
Wire Wire Line
	8200 6350 8200 6800
Wire Wire Line
	8200 6350 8250 6350
Wire Wire Line
	8200 6900 8200 6800
Wire Wire Line
	8200 6900 8250 6900
Wire Wire Line
	8200 8000 8100 8000
Wire Wire Line
	8200 8800 8100 8800
Wire Wire Line
	8200 10400 8100 10400
Wire Wire Line
	8200 11300 10250 11300
Wire Wire Line
	8200 11700 8200 11300
Wire Wire Line
	8200 11700 8200 12150
Wire Wire Line
	8200 11700 8250 11700
Wire Wire Line
	8200 12250 8200 12150
Wire Wire Line
	8200 12250 8250 12250
Wire Wire Line
	8200 13550 8100 13550
Wire Wire Line
	8200 14350 8100 14350
Wire Wire Line
	8200 15950 8100 15950
Wire Wire Line
	8200 16850 10250 16850
Wire Wire Line
	8200 17250 8200 16850
Wire Wire Line
	8200 17250 8200 17700
Wire Wire Line
	8200 17250 8250 17250
Wire Wire Line
	8200 17800 8200 17700
Wire Wire Line
	8200 17800 8250 17800
Wire Wire Line
	8200 19100 8100 19100
Wire Wire Line
	8200 19900 8100 19900
Wire Wire Line
	8200 21500 8100 21500
Wire Wire Line
	8250 6800 8200 6800
Wire Wire Line
	8250 12150 8200 12150
Wire Wire Line
	8250 17700 8200 17700
Wire Wire Line
	8550 1000 8550 1400
Wire Wire Line
	8700 2400 9100 2400
Wire Wire Line
	8700 3200 9000 3200
Wire Wire Line
	8700 4000 8900 4000
Wire Wire Line
	8700 4800 8800 4800
Wire Wire Line
	8700 7800 9100 7800
Wire Wire Line
	8700 8600 9000 8600
Wire Wire Line
	8700 9400 8900 9400
Wire Wire Line
	8700 10200 8800 10200
Wire Wire Line
	8700 13350 9100 13350
Wire Wire Line
	8700 14150 9000 14150
Wire Wire Line
	8700 14950 8900 14950
Wire Wire Line
	8700 15750 8800 15750
Wire Wire Line
	8700 18900 9100 18900
Wire Wire Line
	8700 19700 9000 19700
Wire Wire Line
	8700 20500 8900 20500
Wire Wire Line
	8700 21300 8800 21300
Wire Wire Line
	8800 2150 8800 4300
Wire Wire Line
	8800 4300 8800 4600
Wire Wire Line
	8800 4300 10100 4300
Wire Wire Line
	8800 4600 8800 4800
Wire Wire Line
	8800 4800 8800 5750
Wire Wire Line
	8800 5750 9950 5750
Wire Wire Line
	8800 6850 9250 6850
Wire Wire Line
	8800 7550 8800 9700
Wire Wire Line
	8800 9700 8800 10000
Wire Wire Line
	8800 9700 10100 9700
Wire Wire Line
	8800 10000 8800 10200
Wire Wire Line
	8800 10200 8800 11150
Wire Wire Line
	8800 11150 9950 11150
Wire Wire Line
	8800 12200 9250 12200
Wire Wire Line
	8800 13100 8800 15250
Wire Wire Line
	8800 15250 8800 15550
Wire Wire Line
	8800 15250 10100 15250
Wire Wire Line
	8800 15550 8800 15750
Wire Wire Line
	8800 15750 8800 16700
Wire Wire Line
	8800 16700 9950 16700
Wire Wire Line
	8800 17750 9250 17750
Wire Wire Line
	8800 18650 8800 20800
Wire Wire Line
	8800 20800 8800 21100
Wire Wire Line
	8800 20800 10100 20800
Wire Wire Line
	8800 21100 8800 21300
Wire Wire Line
	8800 21300 8800 22300
Wire Wire Line
	8800 22300 9950 22300
Wire Wire Line
	8900 2150 8900 3600
Wire Wire Line
	8900 3600 8900 3900
Wire Wire Line
	8900 3600 10100 3600
Wire Wire Line
	8900 3900 8900 4000
Wire Wire Line
	8900 4000 8900 4700
Wire Wire Line
	8900 4700 8900 5650
Wire Wire Line
	8900 5650 9950 5650
Wire Wire Line
	8900 7550 8900 9000
Wire Wire Line
	8900 9000 8900 9300
Wire Wire Line
	8900 9000 10100 9000
Wire Wire Line
	8900 9300 8900 9400
Wire Wire Line
	8900 9400 8900 10100
Wire Wire Line
	8900 10100 8900 11050
Wire Wire Line
	8900 11050 9950 11050
Wire Wire Line
	8900 13100 8900 14550
Wire Wire Line
	8900 14550 8900 14850
Wire Wire Line
	8900 14550 10100 14550
Wire Wire Line
	8900 14850 8900 14950
Wire Wire Line
	8900 14950 8900 15650
Wire Wire Line
	8900 15650 8900 16600
Wire Wire Line
	8900 16600 9950 16600
Wire Wire Line
	8900 18650 8900 20100
Wire Wire Line
	8900 20100 8900 20400
Wire Wire Line
	8900 20100 10100 20100
Wire Wire Line
	8900 20400 8900 20500
Wire Wire Line
	8900 20500 8900 21200
Wire Wire Line
	8900 21200 8900 22200
Wire Wire Line
	8900 22200 9950 22200
Wire Wire Line
	9000 2150 9000 3000
Wire Wire Line
	9000 3000 9000 3200
Wire Wire Line
	9000 3000 10100 3000
Wire Wire Line
	9000 3200 9000 3300
Wire Wire Line
	9000 3300 9000 4000
Wire Wire Line
	9000 4000 9000 4800
Wire Wire Line
	9000 4800 9000 5550
Wire Wire Line
	9000 5550 9950 5550
Wire Wire Line
	9000 7550 9000 8400
Wire Wire Line
	9000 8400 9000 8600
Wire Wire Line
	9000 8400 10100 8400
Wire Wire Line
	9000 8600 9000 8700
Wire Wire Line
	9000 8700 9000 9400
Wire Wire Line
	9000 9400 9000 10200
Wire Wire Line
	9000 10200 9000 10950
Wire Wire Line
	9000 10950 9950 10950
Wire Wire Line
	9000 13100 9000 13950
Wire Wire Line
	9000 13950 9000 14150
Wire Wire Line
	9000 13950 10100 13950
Wire Wire Line
	9000 14150 9000 14250
Wire Wire Line
	9000 14250 9000 14950
Wire Wire Line
	9000 14950 9000 15750
Wire Wire Line
	9000 15750 9000 16500
Wire Wire Line
	9000 16500 9950 16500
Wire Wire Line
	9000 18650 9000 19500
Wire Wire Line
	9000 19500 9000 19700
Wire Wire Line
	9000 19500 10100 19500
Wire Wire Line
	9000 19700 9000 19800
Wire Wire Line
	9000 19800 9000 20500
Wire Wire Line
	9000 20500 9000 21300
Wire Wire Line
	9000 21300 9000 22100
Wire Wire Line
	9000 22100 9950 22100
Wire Wire Line
	9100 2150 9100 2400
Wire Wire Line
	9100 2400 9100 2800
Wire Wire Line
	9100 2800 9100 3400
Wire Wire Line
	9100 3400 9100 4100
Wire Wire Line
	9100 4100 9100 4900
Wire Wire Line
	9100 4900 9100 5450
Wire Wire Line
	9100 5450 9950 5450
Wire Wire Line
	9100 7550 9100 7800
Wire Wire Line
	9100 7800 9100 8200
Wire Wire Line
	9100 8200 9100 8800
Wire Wire Line
	9100 8800 9100 9500
Wire Wire Line
	9100 9500 9100 10300
Wire Wire Line
	9100 10300 9100 10850
Wire Wire Line
	9100 10850 9950 10850
Wire Wire Line
	9100 13100 9100 13350
Wire Wire Line
	9100 13350 9100 13750
Wire Wire Line
	9100 13750 9100 14350
Wire Wire Line
	9100 14350 9100 15050
Wire Wire Line
	9100 15050 9100 15850
Wire Wire Line
	9100 15850 9100 16400
Wire Wire Line
	9100 16400 9950 16400
Wire Wire Line
	9100 18650 9100 18900
Wire Wire Line
	9100 18900 9100 19300
Wire Wire Line
	9100 19300 9100 19900
Wire Wire Line
	9100 19900 9100 20600
Wire Wire Line
	9100 20600 9100 21400
Wire Wire Line
	9100 21400 9100 22000
Wire Wire Line
	9100 22000 9950 22000
Wire Wire Line
	9150 1400 9250 1400
Wire Wire Line
	9250 1400 9250 2900
Wire Wire Line
	9250 2900 9250 3500
Wire Wire Line
	9250 2900 9350 2900
Wire Wire Line
	9250 3500 9250 4200
Wire Wire Line
	9250 3500 9350 3500
Wire Wire Line
	9250 4200 9250 5000
Wire Wire Line
	9250 4200 9350 4200
Wire Wire Line
	9250 5000 9250 5350
Wire Wire Line
	9250 5000 9350 5000
Wire Wire Line
	9250 6850 9250 7700
Wire Wire Line
	9250 7700 9250 8300
Wire Wire Line
	9250 7700 10100 7700
Wire Wire Line
	9250 8300 9250 8900
Wire Wire Line
	9250 8300 9350 8300
Wire Wire Line
	9250 8900 9250 9600
Wire Wire Line
	9250 8900 9350 8900
Wire Wire Line
	9250 9600 9250 10750
Wire Wire Line
	9250 9600 9350 9600
Wire Wire Line
	9250 12200 9250 13250
Wire Wire Line
	9250 13250 9250 13850
Wire Wire Line
	9250 13250 10100 13250
Wire Wire Line
	9250 13850 9250 14450
Wire Wire Line
	9250 13850 9350 13850
Wire Wire Line
	9250 14450 9250 15150
Wire Wire Line
	9250 14450 9350 14450
Wire Wire Line
	9250 15150 9250 16300
Wire Wire Line
	9250 15150 9350 15150
Wire Wire Line
	9250 17750 9250 18800
Wire Wire Line
	9250 18800 9250 19400
Wire Wire Line
	9250 18800 10100 18800
Wire Wire Line
	9250 19400 9250 20000
Wire Wire Line
	9250 19400 9350 19400
Wire Wire Line
	9250 20000 9250 20700
Wire Wire Line
	9250 20000 9350 20000
Wire Wire Line
	9250 20700 9250 21850
Wire Wire Line
	9250 20700 9350 20700
Wire Wire Line
	9300 6350 8850 6350
Wire Wire Line
	9300 6350 9300 10400
Wire Wire Line
	9300 10400 9350 10400
Wire Wire Line
	9300 11700 8850 11700
Wire Wire Line
	9300 11700 9300 15950
Wire Wire Line
	9300 15950 9350 15950
Wire Wire Line
	9300 17250 8850 17250
Wire Wire Line
	9300 17250 9300 21500
Wire Wire Line
	9300 21500 9350 21500
Wire Wire Line
	9350 1000 8550 1000
Wire Wire Line
	9350 1000 9350 2300
Wire Wire Line
	9350 2300 10100 2300
Wire Wire Line
	9350 2800 9100 2800
Wire Wire Line
	9350 3300 9000 3300
Wire Wire Line
	9350 3400 9100 3400
Wire Wire Line
	9350 3900 8900 3900
Wire Wire Line
	9350 4000 9000 4000
Wire Wire Line
	9350 4100 9100 4100
Wire Wire Line
	9350 4600 8800 4600
Wire Wire Line
	9350 4700 8900 4700
Wire Wire Line
	9350 4800 9000 4800
Wire Wire Line
	9350 4900 9100 4900
Wire Wire Line
	9350 8200 9100 8200
Wire Wire Line
	9350 8700 9000 8700
Wire Wire Line
	9350 8800 9100 8800
Wire Wire Line
	9350 9300 8900 9300
Wire Wire Line
	9350 9400 9000 9400
Wire Wire Line
	9350 9500 9100 9500
Wire Wire Line
	9350 10000 8800 10000
Wire Wire Line
	9350 10100 8900 10100
Wire Wire Line
	9350 10200 9000 10200
Wire Wire Line
	9350 10300 9100 10300
Wire Wire Line
	9350 13750 9100 13750
Wire Wire Line
	9350 14250 9000 14250
Wire Wire Line
	9350 14350 9100 14350
Wire Wire Line
	9350 14850 8900 14850
Wire Wire Line
	9350 14950 9000 14950
Wire Wire Line
	9350 15050 9100 15050
Wire Wire Line
	9350 15550 8800 15550
Wire Wire Line
	9350 15650 8900 15650
Wire Wire Line
	9350 15750 9000 15750
Wire Wire Line
	9350 15850 9100 15850
Wire Wire Line
	9350 19300 9100 19300
Wire Wire Line
	9350 19800 9000 19800
Wire Wire Line
	9350 19900 9100 19900
Wire Wire Line
	9350 20400 8900 20400
Wire Wire Line
	9350 20500 9000 20500
Wire Wire Line
	9350 20600 9100 20600
Wire Wire Line
	9350 21100 8800 21100
Wire Wire Line
	9350 21200 8900 21200
Wire Wire Line
	9350 21300 9000 21300
Wire Wire Line
	9350 21400 9100 21400
Wire Wire Line
	9900 2850 9900 2900
Wire Wire Line
	9900 2900 10100 2900
Wire Wire Line
	9900 8250 9900 8300
Wire Wire Line
	9900 8300 10100 8300
Wire Wire Line
	9900 13800 9900 13850
Wire Wire Line
	9900 13850 10100 13850
Wire Wire Line
	9900 19350 9900 19400
Wire Wire Line
	9900 19400 10100 19400
Wire Wire Line
	9950 3500 9950 3400
Wire Wire Line
	9950 4200 9950 4050
Wire Wire Line
	9950 8900 9950 8800
Wire Wire Line
	9950 9600 9950 9450
Wire Wire Line
	9950 14450 9950 14350
Wire Wire Line
	9950 15150 9950 15000
Wire Wire Line
	9950 20000 9950 19900
Wire Wire Line
	9950 20700 9950 20550
Wire Wire Line
	10100 2400 9100 2400
Wire Wire Line
	10100 3500 9950 3500
Wire Wire Line
	10100 4200 9950 4200
Wire Wire Line
	10100 7800 9100 7800
Wire Wire Line
	10100 8900 9950 8900
Wire Wire Line
	10100 9600 9950 9600
Wire Wire Line
	10100 13350 9100 13350
Wire Wire Line
	10100 14450 9950 14450
Wire Wire Line
	10100 15150 9950 15150
Wire Wire Line
	10100 18900 9100 18900
Wire Wire Line
	10100 20000 9950 20000
Wire Wire Line
	10100 20700 9950 20700
Wire Wire Line
	10150 21400 10400 21400
Wire Wire Line
	10150 21500 10400 21500
Wire Wire Line
	10200 4800 10100 4800
Wire Wire Line
	10200 5950 10200 4800
Wire Wire Line
	10250 10200 10100 10200
Wire Wire Line
	10250 11300 10250 10200
Wire Wire Line
	10250 15750 10100 15750
Wire Wire Line
	10250 16850 10250 15750
Wire Wire Line
	10400 21300 10100 21300
Wire Wire Line
	10650 2950 10850 2950
Wire Wire Line
	10650 3550 10950 3550
Wire Wire Line
	10650 4250 11050 4250
Wire Wire Line
	10650 8350 10850 8350
Wire Wire Line
	10650 8950 10950 8950
Wire Wire Line
	10650 9650 11050 9650
Wire Wire Line
	10650 13900 10850 13900
Wire Wire Line
	10650 14500 10950 14500
Wire Wire Line
	10650 15200 11050 15200
Wire Wire Line
	10650 19450 10850 19450
Wire Wire Line
	10650 20050 10950 20050
Wire Wire Line
	10650 20750 11050 20750
Wire Wire Line
	10750 1900 10750 2350
Wire Wire Line
	10750 2350 10650 2350
Wire Wire Line
	10750 7300 10750 7750
Wire Wire Line
	10750 7750 10650 7750
Wire Wire Line
	10750 12850 10750 13300
Wire Wire Line
	10750 13300 10650 13300
Wire Wire Line
	10750 18400 10750 18850
Wire Wire Line
	10750 18850 10650 18850
Wire Wire Line
	10850 2950 10850 1800
Wire Wire Line
	10850 7200 6350 7200
Wire Wire Line
	10850 8350 10850 7200
Wire Wire Line
	10850 12750 6350 12750
Wire Wire Line
	10850 13900 10850 12750
Wire Wire Line
	10850 18300 6350 18300
Wire Wire Line
	10850 19450 10850 18300
Wire Wire Line
	10950 3550 10950 1700
Wire Wire Line
	10950 7100 6250 7100
Wire Wire Line
	10950 8950 10950 7100
Wire Wire Line
	10950 12650 6250 12650
Wire Wire Line
	10950 14500 10950 12650
Wire Wire Line
	10950 18200 6250 18200
Wire Wire Line
	10950 20050 10950 18200
Wire Wire Line
	11050 1600 11050 4250
Wire Wire Line
	11050 7000 6150 7000
Wire Wire Line
	11050 7000 11050 9650
Wire Wire Line
	11050 12550 6150 12550
Wire Wire Line
	11050 12550 11050 15200
Wire Wire Line
	11050 18100 6150 18100
Wire Wire Line
	11050 18100 11050 20750
Wire Bus Line
	10050 10650 11650 10650
Wire Bus Line
	10050 16200 11650 16200
Wire Bus Line
	10050 21700 9950 21700
Wire Bus Line
	10050 21800 11650 21800
Wire Bus Line
	11650 5200 10050 5200
Wire Bus Line
	11650 5200 11800 5200
Wire Bus Line
	11650 10650 11650 5200
Wire Bus Line
	11650 16200 11650 10650
Wire Bus Line
	11650 21800 11650 16200
Text Label 7050 21950 2    50   ~ 0
COL2
Text Label 9300 5450 0    50   ~ 0
~WSTROM-CNT0
Text Label 9300 5550 0    50   ~ 0
~WSTROM-CNT1
Text Label 9300 5650 0    50   ~ 0
~WSTROM-CNT2
Text Label 9300 5750 0    50   ~ 0
~WSTROM-CNT3
Text Label 9300 10850 0    50   ~ 0
~WSTROM-CNT4
Text Label 9300 10950 0    50   ~ 0
~WSTROM-CNT5
Text Label 9300 11050 0    50   ~ 0
~WSTROM-CNT6
Text Label 9300 11150 0    50   ~ 0
~WSTROM-CNT7
Text Label 9300 16400 0    50   ~ 0
~WSTROM-CNT8
Text Label 9300 16500 0    50   ~ 0
~WSTROM-CNT9
Text Label 9300 16600 0    50   ~ 0
~WSTROM-CNT10
Text Label 9300 16700 0    50   ~ 0
~WSTROM-CNT11
Text Label 9300 22000 0    50   ~ 0
~WSTROM-CNT12
Text Label 9300 22100 0    50   ~ 0
~WSTROM-CNT13
Text Label 9300 22200 0    50   ~ 0
~WSTROM-CNT14
Text Label 9300 22300 0    50   ~ 0
~WSTROM-CNT15
Text Label 10400 21400 2    50   ~ 0
COL2
Text Label 10400 21500 2    50   ~ 0
COL1
Text HLabel 4100 4750 0    50   Input ~ 0
~DEBUG6
Text HLabel 4100 4850 0    50   Input ~ 0
~WSTROM-RESET
Text HLabel 4100 21500 0    50   Input ~ 0
MAIN-RESET
Text HLabel 5950 6650 0    50   Input ~ 0
~DEBUG6
Text HLabel 7750 1000 0    50   Input ~ 0
WSTROM
Text HLabel 9950 21700 0    50   Input ~ 0
COL[1..2]
Text HLabel 10950 21400 2    50   Output ~ 0
WSTROM-END
Text HLabel 11800 5200 2    50   Output ~ 0
~WSTROM-CNT[0..15]
$Comp
L A5C:AND02 UAC246
U 1 1 61118F95
P 4350 4800
AR Path="/60F602ED/61118F95" Ref="UAC246"  Part="1" 
AR Path="/612E58BE/612EE466/61118F95" Ref="UAC246"  Part="1" 
F 0 "UAC246" H 4375 5067 50  0000 C CNN
F 1 "AND02" H 4375 4976 50  0000 C CNN
F 2 "" H 4350 4800 50  0001 C CNN
F 3 "" H 4350 4800 50  0001 C CNN
	1    4350 4800
	1    0    0    -1  
$EndComp
$Comp
L A5C:AND02 UBB84
U 1 1 61118F96
P 5600 4850
AR Path="/60F602ED/61118F96" Ref="UBB84"  Part="1" 
AR Path="/612E58BE/612EE466/61118F96" Ref="UBB84"  Part="1" 
F 0 "UBB84" H 5625 5117 50  0000 C CNN
F 1 "AND02" H 5625 5026 50  0000 C CNN
F 2 "" H 5600 4850 50  0001 C CNN
F 3 "" H 5600 4850 50  0001 C CNN
	1    5600 4850
	1    0    0    -1  
$EndComp
$Comp
L A5C:AND02 UBF105
U 1 1 61118F72
P 5700 7750
AR Path="/60F602ED/61118F72" Ref="UBF105"  Part="1" 
AR Path="/612E58BE/612EE466/61118F72" Ref="UBF105"  Part="1" 
F 0 "UBF105" H 5725 8017 50  0000 C CNN
F 1 "AND02" H 5725 7926 50  0000 C CNN
F 2 "" H 5700 7750 50  0001 C CNN
F 3 "" H 5700 7750 50  0001 C CNN
	1    5700 7750
	1    0    0    -1  
$EndComp
$Comp
L A5C:AND02 UBD92
U 1 1 61118F6C
P 5700 10350
AR Path="/60F602ED/61118F6C" Ref="UBD92"  Part="1" 
AR Path="/612E58BE/612EE466/61118F6C" Ref="UBD92"  Part="1" 
F 0 "UBD92" H 5725 10617 50  0000 C CNN
F 1 "AND02" H 5725 10526 50  0000 C CNN
F 2 "" H 5700 10350 50  0001 C CNN
F 3 "" H 5700 10350 50  0001 C CNN
	1    5700 10350
	1    0    0    -1  
$EndComp
$Comp
L A5C:AND02 UCC467
U 1 1 61118F6D
P 5700 13300
AR Path="/60F602ED/61118F6D" Ref="UCC467"  Part="1" 
AR Path="/612E58BE/612EE466/61118F6D" Ref="UCC467"  Part="1" 
F 0 "UCC467" H 5725 13567 50  0000 C CNN
F 1 "AND02" H 5725 13476 50  0000 C CNN
F 2 "" H 5700 13300 50  0001 C CNN
F 3 "" H 5700 13300 50  0001 C CNN
	1    5700 13300
	1    0    0    -1  
$EndComp
$Comp
L A5C:AND02 UBI100
U 1 1 61118FA7
P 5700 15900
AR Path="/60F602ED/61118FA7" Ref="UBI100"  Part="1" 
AR Path="/612E58BE/612EE466/61118FA7" Ref="UBI100"  Part="1" 
F 0 "UBI100" H 5725 16167 50  0000 C CNN
F 1 "AND02" H 5725 16076 50  0000 C CNN
F 2 "" H 5700 15900 50  0001 C CNN
F 3 "" H 5700 15900 50  0001 C CNN
	1    5700 15900
	1    0    0    -1  
$EndComp
$Comp
L A5C:AND02 UBF120
U 1 1 61118FA8
P 5700 18850
AR Path="/60F602ED/61118FA8" Ref="UBF120"  Part="1" 
AR Path="/612E58BE/612EE466/61118FA8" Ref="UBF120"  Part="1" 
F 0 "UBF120" H 5725 19117 50  0000 C CNN
F 1 "AND02" H 5725 19026 50  0000 C CNN
F 2 "" H 5700 18850 50  0001 C CNN
F 3 "" H 5700 18850 50  0001 C CNN
	1    5700 18850
	1    0    0    -1  
$EndComp
$Comp
L A5C:AND02 UBI106
U 1 1 61118FAA
P 5700 21450
AR Path="/60F602ED/61118FAA" Ref="UBI106"  Part="1" 
AR Path="/612E58BE/612EE466/61118FAA" Ref="UBI106"  Part="1" 
F 0 "UBI106" H 5725 21717 50  0000 C CNN
F 1 "AND02" H 5725 21626 50  0000 C CNN
F 2 "" H 5700 21450 50  0001 C CNN
F 3 "" H 5700 21450 50  0001 C CNN
	1    5700 21450
	1    0    0    -1  
$EndComp
$Comp
L A5C:NAND02 UBB105
U 1 1 61118F9A
P 7700 2400
AR Path="/60F602ED/61118F9A" Ref="UBB105"  Part="1" 
AR Path="/612E58BE/612EE466/61118F9A" Ref="UBB105"  Part="1" 
F 0 "UBB105" H 7725 2667 50  0000 C CNN
F 1 "NAND02" H 7725 2576 50  0000 C CNN
F 2 "" H 7700 2400 50  0001 C CNN
F 3 "" H 7700 2400 50  0001 C CNN
	1    7700 2400
	1    0    0    -1  
$EndComp
$Comp
L A5C:NAND02 UBB141
U 1 1 61118F99
P 7700 3200
AR Path="/60F602ED/61118F99" Ref="UBB141"  Part="1" 
AR Path="/612E58BE/612EE466/61118F99" Ref="UBB141"  Part="1" 
F 0 "UBB141" H 7725 3467 50  0000 C CNN
F 1 "NAND02" H 7725 3376 50  0000 C CNN
F 2 "" H 7700 3200 50  0001 C CNN
F 3 "" H 7700 3200 50  0001 C CNN
	1    7700 3200
	1    0    0    -1  
$EndComp
$Comp
L A5C:NAND02 UBB143
U 1 1 61118FA1
P 7700 4000
AR Path="/60F602ED/61118FA1" Ref="UBB143"  Part="1" 
AR Path="/612E58BE/612EE466/61118FA1" Ref="UBB143"  Part="1" 
F 0 "UBB143" H 7725 4267 50  0000 C CNN
F 1 "NAND02" H 7725 4176 50  0000 C CNN
F 2 "" H 7700 4000 50  0001 C CNN
F 3 "" H 7700 4000 50  0001 C CNN
	1    7700 4000
	1    0    0    -1  
$EndComp
$Comp
L A5C:NAND02 UBB179
U 1 1 61118FA0
P 7700 4800
AR Path="/60F602ED/61118FA0" Ref="UBB179"  Part="1" 
AR Path="/612E58BE/612EE466/61118FA0" Ref="UBB179"  Part="1" 
F 0 "UBB179" H 7725 5067 50  0000 C CNN
F 1 "NAND02" H 7725 4976 50  0000 C CNN
F 2 "" H 7700 4800 50  0001 C CNN
F 3 "" H 7700 4800 50  0001 C CNN
	1    7700 4800
	1    0    0    -1  
$EndComp
$Comp
L A5C:NAND02 UEB319
U 1 1 61118F82
P 8500 6850
AR Path="/60F602ED/61118F82" Ref="UEB319"  Part="1" 
AR Path="/612E58BE/612EE466/61118F82" Ref="UEB319"  Part="1" 
F 0 "UEB319" H 8525 7117 50  0000 C CNN
F 1 "NAND02" H 8525 7026 50  0000 C CNN
F 2 "" H 8500 6850 50  0001 C CNN
F 3 "" H 8500 6850 50  0001 C CNN
	1    8500 6850
	1    0    0    -1  
$EndComp
$Comp
L A5C:NAND02 UEF295
U 1 1 61118F85
P 8500 12200
AR Path="/60F602ED/61118F85" Ref="UEF295"  Part="1" 
AR Path="/612E58BE/612EE466/61118F85" Ref="UEF295"  Part="1" 
F 0 "UEF295" H 8525 12467 50  0000 C CNN
F 1 "NAND02" H 8525 12376 50  0000 C CNN
F 2 "" H 8500 12200 50  0001 C CNN
F 3 "" H 8500 12200 50  0001 C CNN
	1    8500 12200
	1    0    0    -1  
$EndComp
$Comp
L A5C:NAND02 UED274
U 1 1 61118FB9
P 8500 17750
AR Path="/60F602ED/61118FB9" Ref="UED274"  Part="1" 
AR Path="/612E58BE/612EE466/61118FB9" Ref="UED274"  Part="1" 
F 0 "UED274" H 8525 18017 50  0000 C CNN
F 1 "NAND02" H 8525 17926 50  0000 C CNN
F 2 "" H 8500 17750 50  0001 C CNN
F 3 "" H 8500 17750 50  0001 C CNN
	1    8500 17750
	1    0    0    -1  
$EndComp
$Comp
L A5C:NOR02 UBB147
U 1 1 61118F9D
P 9600 2850
AR Path="/60F602ED/61118F9D" Ref="UBB147"  Part="1" 
AR Path="/612E58BE/612EE466/61118F9D" Ref="UBB147"  Part="1" 
F 0 "UBB147" H 9625 3117 50  0000 C CNN
F 1 "NOR02" H 9625 3026 50  0000 C CNN
F 2 "" H 9600 2850 50  0001 C CNN
F 3 "" H 9600 2850 50  0001 C CNN
	1    9600 2850
	1    0    0    -1  
$EndComp
$Comp
L A5C:NOR02 UBD157
U 1 1 61118F6F
P 9600 8250
AR Path="/60F602ED/61118F6F" Ref="UBD157"  Part="1" 
AR Path="/612E58BE/612EE466/61118F6F" Ref="UBD157"  Part="1" 
F 0 "UBD157" H 9625 8517 50  0000 C CNN
F 1 "NOR02" H 9625 8426 50  0000 C CNN
F 2 "" H 9600 8250 50  0001 C CNN
F 3 "" H 9600 8250 50  0001 C CNN
	1    9600 8250
	1    0    0    -1  
$EndComp
$Comp
L A5C:NOR02 UEK303
U 1 1 61118F86
P 9600 13800
AR Path="/60F602ED/61118F86" Ref="UEK303"  Part="1" 
AR Path="/612E58BE/612EE466/61118F86" Ref="UEK303"  Part="1" 
F 0 "UEK303" H 9625 14067 50  0000 C CNN
F 1 "NOR02" H 9625 13976 50  0000 C CNN
F 2 "" H 9600 13800 50  0001 C CNN
F 3 "" H 9600 13800 50  0001 C CNN
	1    9600 13800
	1    0    0    -1  
$EndComp
$Comp
L A5C:NOR02 UEK330
U 1 1 61118FBC
P 9600 19350
AR Path="/60F602ED/61118FBC" Ref="UEK330"  Part="1" 
AR Path="/612E58BE/612EE466/61118FBC" Ref="UEK330"  Part="1" 
F 0 "UEK330" H 9625 19617 50  0000 C CNN
F 1 "NOR02" H 9625 19526 50  0000 C CNN
F 2 "" H 9600 19350 50  0001 C CNN
F 3 "" H 9600 19350 50  0001 C CNN
	1    9600 19350
	1    0    0    -1  
$EndComp
$Comp
L A5C:XNOR02 UBB109
U 1 1 71BBDF01
P 10350 2350
AR Path="/60F602ED/71BBDF01" Ref="UBB109"  Part="1" 
AR Path="/612E58BE/612EE466/71BBDF01" Ref="UBB109"  Part="1" 
F 0 "UBB109" H 10375 2617 50  0000 C CNN
F 1 "XNOR02" H 10375 2526 50  0000 C CNN
F 2 "" H 10375 2350 50  0001 C CNN
F 3 "" H 10375 2350 50  0001 C CNN
	1    10350 2350
	1    0    0    -1  
$EndComp
$Comp
L A5C:XNOR02 UBB144
U 1 1 61118F9E
P 10350 2950
AR Path="/60F602ED/61118F9E" Ref="UBB144"  Part="1" 
AR Path="/612E58BE/612EE466/61118F9E" Ref="UBB144"  Part="1" 
F 0 "UBB144" H 10375 3217 50  0000 C CNN
F 1 "XNOR02" H 10375 3126 50  0000 C CNN
F 2 "" H 10375 2950 50  0001 C CNN
F 3 "" H 10375 2950 50  0001 C CNN
	1    10350 2950
	1    0    0    -1  
$EndComp
$Comp
L A5C:XNOR02 UBB138
U 1 1 61118FA5
P 10350 3550
AR Path="/60F602ED/61118FA5" Ref="UBB138"  Part="1" 
AR Path="/612E58BE/612EE466/61118FA5" Ref="UBB138"  Part="1" 
F 0 "UBB138" H 10375 3817 50  0000 C CNN
F 1 "XNOR02" H 10375 3726 50  0000 C CNN
F 2 "" H 10375 3550 50  0001 C CNN
F 3 "" H 10375 3550 50  0001 C CNN
	1    10350 3550
	1    0    0    -1  
$EndComp
$Comp
L A5C:XNOR02 UBB181
U 1 1 61118FA6
P 10350 4250
AR Path="/60F602ED/61118FA6" Ref="UBB181"  Part="1" 
AR Path="/612E58BE/612EE466/61118FA6" Ref="UBB181"  Part="1" 
F 0 "UBB181" H 10375 4517 50  0000 C CNN
F 1 "XNOR02" H 10375 4426 50  0000 C CNN
F 2 "" H 10375 4250 50  0001 C CNN
F 3 "" H 10375 4250 50  0001 C CNN
	1    10350 4250
	1    0    0    -1  
$EndComp
$Comp
L A5C:XOR02 UBD147
U 1 1 61118F7F
P 10350 7750
AR Path="/60F602ED/61118F7F" Ref="UBD147"  Part="1" 
AR Path="/612E58BE/612EE466/61118F7F" Ref="UBD147"  Part="1" 
F 0 "UBD147" H 10375 8017 50  0000 C CNN
F 1 "XOR02" H 10375 7926 50  0000 C CNN
F 2 "" H 10350 7750 50  0001 C CNN
F 3 "" H 10350 7750 50  0001 C CNN
	1    10350 7750
	1    0    0    -1  
$EndComp
$Comp
L A5C:XNOR02 UCA501
U 1 1 61118F7D
P 10350 8350
AR Path="/60F602ED/61118F7D" Ref="UCA501"  Part="1" 
AR Path="/612E58BE/612EE466/61118F7D" Ref="UCA501"  Part="1" 
F 0 "UCA501" H 10375 8617 50  0000 C CNN
F 1 "XNOR02" H 10375 8526 50  0000 C CNN
F 2 "" H 10375 8350 50  0001 C CNN
F 3 "" H 10375 8350 50  0001 C CNN
	1    10350 8350
	1    0    0    -1  
$EndComp
$Comp
L A5C:XNOR02 UEI325
U 1 1 61118F7E
P 10350 8950
AR Path="/60F602ED/61118F7E" Ref="UEI325"  Part="1" 
AR Path="/612E58BE/612EE466/61118F7E" Ref="UEI325"  Part="1" 
F 0 "UEI325" H 10375 9217 50  0000 C CNN
F 1 "XNOR02" H 10375 9126 50  0000 C CNN
F 2 "" H 10375 8950 50  0001 C CNN
F 3 "" H 10375 8950 50  0001 C CNN
	1    10350 8950
	1    0    0    -1  
$EndComp
$Comp
L A5C:XNOR02 UEJ317
U 1 1 61118F7C
P 10350 9650
AR Path="/60F602ED/61118F7C" Ref="UEJ317"  Part="1" 
AR Path="/612E58BE/612EE466/61118F7C" Ref="UEJ317"  Part="1" 
F 0 "UEJ317" H 10375 9917 50  0000 C CNN
F 1 "XNOR02" H 10375 9826 50  0000 C CNN
F 2 "" H 10375 9650 50  0001 C CNN
F 3 "" H 10375 9650 50  0001 C CNN
	1    10350 9650
	1    0    0    -1  
$EndComp
$Comp
L A5C:XOR02 UEK293
U 1 1 61118F88
P 10350 13300
AR Path="/60F602ED/61118F88" Ref="UEK293"  Part="1" 
AR Path="/612E58BE/612EE466/61118F88" Ref="UEK293"  Part="1" 
F 0 "UEK293" H 10375 13567 50  0000 C CNN
F 1 "XOR02" H 10375 13476 50  0000 C CNN
F 2 "" H 10350 13300 50  0001 C CNN
F 3 "" H 10350 13300 50  0001 C CNN
	1    10350 13300
	1    0    0    -1  
$EndComp
$Comp
L A5C:XNOR02 UEK311
U 1 1 61118F89
P 10350 13900
AR Path="/60F602ED/61118F89" Ref="UEK311"  Part="1" 
AR Path="/612E58BE/612EE466/61118F89" Ref="UEK311"  Part="1" 
F 0 "UEK311" H 10375 14167 50  0000 C CNN
F 1 "XNOR02" H 10375 14076 50  0000 C CNN
F 2 "" H 10375 13900 50  0001 C CNN
F 3 "" H 10375 13900 50  0001 C CNN
	1    10350 13900
	1    0    0    -1  
$EndComp
$Comp
L A5C:XNOR02 UEH303
U 1 1 61118F8A
P 10350 14500
AR Path="/60F602ED/61118F8A" Ref="UEH303"  Part="1" 
AR Path="/612E58BE/612EE466/61118F8A" Ref="UEH303"  Part="1" 
F 0 "UEH303" H 10375 14767 50  0000 C CNN
F 1 "XNOR02" H 10375 14676 50  0000 C CNN
F 2 "" H 10375 14500 50  0001 C CNN
F 3 "" H 10375 14500 50  0001 C CNN
	1    10350 14500
	1    0    0    -1  
$EndComp
$Comp
L A5C:XNOR02 UEI311
U 1 1 61118F8B
P 10350 15200
AR Path="/60F602ED/61118F8B" Ref="UEI311"  Part="1" 
AR Path="/612E58BE/612EE466/61118F8B" Ref="UEI311"  Part="1" 
F 0 "UEI311" H 10375 15467 50  0000 C CNN
F 1 "XNOR02" H 10375 15376 50  0000 C CNN
F 2 "" H 10375 15200 50  0001 C CNN
F 3 "" H 10375 15200 50  0001 C CNN
	1    10350 15200
	1    0    0    -1  
$EndComp
$Comp
L A5C:XOR02 UEJ295
U 1 1 61118FBE
P 10350 18850
AR Path="/60F602ED/61118FBE" Ref="UEJ295"  Part="1" 
AR Path="/612E58BE/612EE466/61118FBE" Ref="UEJ295"  Part="1" 
F 0 "UEJ295" H 10375 19117 50  0000 C CNN
F 1 "XOR02" H 10375 19026 50  0000 C CNN
F 2 "" H 10350 18850 50  0001 C CNN
F 3 "" H 10350 18850 50  0001 C CNN
	1    10350 18850
	1    0    0    -1  
$EndComp
$Comp
L A5C:XNOR02 UEK314
U 1 1 61118FBD
P 10350 19450
AR Path="/60F602ED/61118FBD" Ref="UEK314"  Part="1" 
AR Path="/612E58BE/612EE466/61118FBD" Ref="UEK314"  Part="1" 
F 0 "UEK314" H 10375 19717 50  0000 C CNN
F 1 "XNOR02" H 10375 19626 50  0000 C CNN
F 2 "" H 10375 19450 50  0001 C CNN
F 3 "" H 10375 19450 50  0001 C CNN
	1    10350 19450
	1    0    0    -1  
$EndComp
$Comp
L A5C:XNOR02 UEJ325
U 1 1 61118FB6
P 10350 20050
AR Path="/60F602ED/61118FB6" Ref="UEJ325"  Part="1" 
AR Path="/612E58BE/612EE466/61118FB6" Ref="UEJ325"  Part="1" 
F 0 "UEJ325" H 10375 20317 50  0000 C CNN
F 1 "XNOR02" H 10375 20226 50  0000 C CNN
F 2 "" H 10375 20050 50  0001 C CNN
F 3 "" H 10375 20050 50  0001 C CNN
	1    10350 20050
	1    0    0    -1  
$EndComp
$Comp
L A5C:XNOR02 UEG270
U 1 1 61118FB7
P 10350 20750
AR Path="/60F602ED/61118FB7" Ref="UEG270"  Part="1" 
AR Path="/612E58BE/612EE466/61118FB7" Ref="UEG270"  Part="1" 
F 0 "UEG270" H 10375 21017 50  0000 C CNN
F 1 "XNOR02" H 10375 20926 50  0000 C CNN
F 2 "" H 10375 20750 50  0001 C CNN
F 3 "" H 10375 20750 50  0001 C CNN
	1    10350 20750
	1    0    0    -1  
$EndComp
$Comp
L A5C:AND03 UBF86
U 1 1 61118FB5
P 10650 21400
AR Path="/60F602ED/61118FB5" Ref="UBF86"  Part="1" 
AR Path="/612E58BE/612EE466/61118FB5" Ref="UBF86"  Part="1" 
F 0 "UBF86" H 10675 21692 50  0000 C CNN
F 1 "AND03" H 10675 21601 50  0000 C CNN
F 2 "" H 10650 21400 50  0001 C CNN
F 3 "" H 10650 21400 50  0001 C CNN
	1    10650 21400
	1    0    0    -1  
$EndComp
$Comp
L A5C:INV01 UBB94
U 1 1 602B8C9F
P 4400 21500
AR Path="/60F602ED/602B8C9F" Ref="UBB94"  Part="1" 
AR Path="/612E58BE/612EE466/602B8C9F" Ref="UBB94"  Part="1" 
F 0 "UBB94" H 4400 21817 50  0000 C CNN
F 1 "INV01" H 4400 21726 50  0000 C CNN
F 2 "" H 4400 21300 50  0001 C CNN
F 3 "" H 4400 21300 50  0001 C CNN
	1    4400 21500
	1    0    0    -1  
$EndComp
$Comp
L A5C:INV01 UBF84
U 1 1 61118F70
P 4950 7700
AR Path="/60F602ED/61118F70" Ref="UBF84"  Part="1" 
AR Path="/612E58BE/612EE466/61118F70" Ref="UBF84"  Part="1" 
F 0 "UBF84" H 4950 8017 50  0000 C CNN
F 1 "INV01" H 4950 7926 50  0000 C CNN
F 2 "" H 4950 7500 50  0001 C CNN
F 3 "" H 4950 7500 50  0001 C CNN
	1    4950 7700
	1    0    0    -1  
$EndComp
$Comp
L A5C:INV01 UBF133
U 1 1 61118F83
P 4950 13250
AR Path="/60F602ED/61118F83" Ref="UBF133"  Part="1" 
AR Path="/612E58BE/612EE466/61118F83" Ref="UBF133"  Part="1" 
F 0 "UBF133" H 4950 13567 50  0000 C CNN
F 1 "INV01" H 4950 13476 50  0000 C CNN
F 2 "" H 4950 13050 50  0001 C CNN
F 3 "" H 4950 13050 50  0001 C CNN
	1    4950 13250
	1    0    0    -1  
$EndComp
$Comp
L A5C:INV01 UBE84
U 1 1 61118FA9
P 4950 18800
AR Path="/60F602ED/61118FA9" Ref="UBE84"  Part="1" 
AR Path="/612E58BE/612EE466/61118FA9" Ref="UBE84"  Part="1" 
F 0 "UBE84" H 4950 19117 50  0000 C CNN
F 1 "INV01" H 4950 19026 50  0000 C CNN
F 2 "" H 4950 18600 50  0001 C CNN
F 3 "" H 4950 18600 50  0001 C CNN
	1    4950 18800
	1    0    0    -1  
$EndComp
$Comp
L A5C:NBUF02 UAD423
U 1 1 61118F71
P 6250 6650
AR Path="/60F602ED/61118F71" Ref="UAD423"  Part="1" 
AR Path="/612E58BE/612EE466/61118F71" Ref="UAD423"  Part="1" 
F 0 "UAD423" H 6250 6967 50  0000 C CNN
F 1 "NBUF02" H 6250 6876 50  0000 C CNN
F 2 "" H 6250 6450 50  0001 C CNN
F 3 "" H 6250 6450 50  0001 C CNN
	1    6250 6650
	1    0    0    -1  
$EndComp
$Comp
L A5C:NBUF02 UEG265
U 1 1 61118FB1
P 7350 21950
AR Path="/60F602ED/61118FB1" Ref="UEG265"  Part="1" 
AR Path="/612E58BE/612EE466/61118FB1" Ref="UEG265"  Part="1" 
F 0 "UEG265" H 7350 22267 50  0000 C CNN
F 1 "NBUF02" H 7350 22176 50  0000 C CNN
F 2 "" H 7350 21750 50  0001 C CNN
F 3 "" H 7350 21750 50  0001 C CNN
	1    7350 21950
	1    0    0    -1  
$EndComp
$Comp
L A5C:INV01 UEB314
U 1 1 61118F6E
P 8550 6350
AR Path="/60F602ED/61118F6E" Ref="UEB314"  Part="1" 
AR Path="/612E58BE/612EE466/61118F6E" Ref="UEB314"  Part="1" 
F 0 "UEB314" H 8550 6667 50  0000 C CNN
F 1 "INV01" H 8550 6576 50  0000 C CNN
F 2 "" H 8550 6150 50  0001 C CNN
F 3 "" H 8550 6150 50  0001 C CNN
	1    8550 6350
	1    0    0    -1  
$EndComp
$Comp
L A5C:INV01 UEC282
U 1 1 61118F6B
P 8550 11700
AR Path="/60F602ED/61118F6B" Ref="UEC282"  Part="1" 
AR Path="/612E58BE/612EE466/61118F6B" Ref="UEC282"  Part="1" 
F 0 "UEC282" H 8550 12017 50  0000 C CNN
F 1 "INV01" H 8550 11926 50  0000 C CNN
F 2 "" H 8550 11500 50  0001 C CNN
F 3 "" H 8550 11500 50  0001 C CNN
	1    8550 11700
	1    0    0    -1  
$EndComp
$Comp
L A5C:INV01 UEB312
U 1 1 61118FB8
P 8550 17250
AR Path="/60F602ED/61118FB8" Ref="UEB312"  Part="1" 
AR Path="/612E58BE/612EE466/61118FB8" Ref="UEB312"  Part="1" 
F 0 "UEB312" H 8550 17567 50  0000 C CNN
F 1 "INV01" H 8550 17476 50  0000 C CNN
F 2 "" H 8550 17050 50  0001 C CNN
F 3 "" H 8550 17050 50  0001 C CNN
	1    8550 17250
	1    0    0    -1  
$EndComp
$Comp
L A5C:INV01 UBD136
U 1 1 61118F9C
P 8850 1400
AR Path="/60F602ED/61118F9C" Ref="UBD136"  Part="1" 
AR Path="/612E58BE/612EE466/61118F9C" Ref="UBD136"  Part="1" 
F 0 "UBD136" H 8850 1717 50  0000 C CNN
F 1 "INV01" H 8850 1626 50  0000 C CNN
F 2 "" H 8850 1200 50  0001 C CNN
F 3 "" H 8850 1200 50  0001 C CNN
	1    8850 1400
	1    0    0    -1  
$EndComp
$Comp
L A5C:NOR03 UBB135
U 1 1 61118F9B
P 9650 3400
AR Path="/60F602ED/61118F9B" Ref="UBB135"  Part="1" 
AR Path="/612E58BE/612EE466/61118F9B" Ref="UBB135"  Part="1" 
F 0 "UBB135" H 9650 3717 50  0000 C CNN
F 1 "NOR03" H 9650 3626 50  0000 C CNN
F 2 "" H 9650 3400 50  0001 C CNN
F 3 "" H 9650 3400 50  0001 C CNN
	1    9650 3400
	1    0    0    -1  
$EndComp
$Comp
L A5C:NOR03 UEI322
U 1 1 61118F7A
P 9650 8800
AR Path="/60F602ED/61118F7A" Ref="UEI322"  Part="1" 
AR Path="/612E58BE/612EE466/61118F7A" Ref="UEI322"  Part="1" 
F 0 "UEI322" H 9650 9117 50  0000 C CNN
F 1 "NOR03" H 9650 9026 50  0000 C CNN
F 2 "" H 9650 8800 50  0001 C CNN
F 3 "" H 9650 8800 50  0001 C CNN
	1    9650 8800
	1    0    0    -1  
$EndComp
$Comp
L A5C:NOR03 UEH268
U 1 1 61118F87
P 9650 14350
AR Path="/60F602ED/61118F87" Ref="UEH268"  Part="1" 
AR Path="/612E58BE/612EE466/61118F87" Ref="UEH268"  Part="1" 
F 0 "UEH268" H 9650 14667 50  0000 C CNN
F 1 "NOR03" H 9650 14576 50  0000 C CNN
F 2 "" H 9650 14350 50  0001 C CNN
F 3 "" H 9650 14350 50  0001 C CNN
	1    9650 14350
	1    0    0    -1  
$EndComp
$Comp
L A5C:NOR03 UEK327
U 1 1 61118FB4
P 9650 19900
AR Path="/60F602ED/61118FB4" Ref="UEK327"  Part="1" 
AR Path="/612E58BE/612EE466/61118FB4" Ref="UEK327"  Part="1" 
F 0 "UEK327" H 9650 20217 50  0000 C CNN
F 1 "NOR03" H 9650 20126 50  0000 C CNN
F 2 "" H 9650 19900 50  0001 C CNN
F 3 "" H 9650 19900 50  0001 C CNN
	1    9650 19900
	1    0    0    -1  
$EndComp
$Comp
L A5C:DFFCOO UBE114
U 1 1 61118F98
P 8450 2500
AR Path="/60F602ED/61118F98" Ref="UBE114"  Part="1" 
AR Path="/612E58BE/612EE466/61118F98" Ref="UBE114"  Part="1" 
F 0 "UBE114" H 8450 2865 50  0000 C CNN
F 1 "DFFCOO" H 8450 2774 50  0000 C CNN
F 2 "" H 8450 2500 50  0001 C CNN
F 3 "" H 8450 2500 50  0001 C CNN
	1    8450 2500
	1    0    0    -1  
$EndComp
$Comp
L A5C:DFFCOO UBE156
U 1 1 61118F97
P 8450 3300
AR Path="/60F602ED/61118F97" Ref="UBE156"  Part="1" 
AR Path="/612E58BE/612EE466/61118F97" Ref="UBE156"  Part="1" 
F 0 "UBE156" H 8450 3665 50  0000 C CNN
F 1 "DFFCOO" H 8450 3574 50  0000 C CNN
F 2 "" H 8450 3300 50  0001 C CNN
F 3 "" H 8450 3300 50  0001 C CNN
	1    8450 3300
	1    0    0    -1  
$EndComp
$Comp
L A5C:DFFCOO UBC153
U 1 1 61118FA2
P 8450 4100
AR Path="/60F602ED/61118FA2" Ref="UBC153"  Part="1" 
AR Path="/612E58BE/612EE466/61118FA2" Ref="UBC153"  Part="1" 
F 0 "UBC153" H 8450 4465 50  0000 C CNN
F 1 "DFFCOO" H 8450 4374 50  0000 C CNN
F 2 "" H 8450 4100 50  0001 C CNN
F 3 "" H 8450 4100 50  0001 C CNN
	1    8450 4100
	1    0    0    -1  
$EndComp
$Comp
L A5C:DFFCOO UBD180
U 1 1 61118F9F
P 8450 4900
AR Path="/60F602ED/61118F9F" Ref="UBD180"  Part="1" 
AR Path="/612E58BE/612EE466/61118F9F" Ref="UBD180"  Part="1" 
F 0 "UBD180" H 8450 5265 50  0000 C CNN
F 1 "DFFCOO" H 8450 5174 50  0000 C CNN
F 2 "" H 8450 4900 50  0001 C CNN
F 3 "" H 8450 4900 50  0001 C CNN
	1    8450 4900
	1    0    0    -1  
$EndComp
$Comp
L A5C:DFFCOO UBE127
U 1 1 61118F81
P 8450 7900
AR Path="/60F602ED/61118F81" Ref="UBE127"  Part="1" 
AR Path="/612E58BE/612EE466/61118F81" Ref="UBE127"  Part="1" 
F 0 "UBE127" H 8450 8265 50  0000 C CNN
F 1 "DFFCOO" H 8450 8174 50  0000 C CNN
F 2 "" H 8450 7900 50  0001 C CNN
F 3 "" H 8450 7900 50  0001 C CNN
	1    8450 7900
	1    0    0    -1  
$EndComp
$Comp
L A5C:DFFCOO UEI314
U 1 1 61118F73
P 8450 8700
AR Path="/60F602ED/61118F73" Ref="UEI314"  Part="1" 
AR Path="/612E58BE/612EE466/61118F73" Ref="UEI314"  Part="1" 
F 0 "UEI314" H 8450 9065 50  0000 C CNN
F 1 "DFFCOO" H 8450 8974 50  0000 C CNN
F 2 "" H 8450 8700 50  0001 C CNN
F 3 "" H 8450 8700 50  0001 C CNN
	1    8450 8700
	1    0    0    -1  
$EndComp
$Comp
L A5C:DFFCOO UEJ320
U 1 1 61118F80
P 8450 9500
AR Path="/60F602ED/61118F80" Ref="UEJ320"  Part="1" 
AR Path="/612E58BE/612EE466/61118F80" Ref="UEJ320"  Part="1" 
F 0 "UEJ320" H 8450 9865 50  0000 C CNN
F 1 "DFFCOO" H 8450 9774 50  0000 C CNN
F 2 "" H 8450 9500 50  0001 C CNN
F 3 "" H 8450 9500 50  0001 C CNN
	1    8450 9500
	1    0    0    -1  
$EndComp
$Comp
L A5C:DFFCOO UEJ306
U 1 1 61118F78
P 8450 10300
AR Path="/60F602ED/61118F78" Ref="UEJ306"  Part="1" 
AR Path="/612E58BE/612EE466/61118F78" Ref="UEJ306"  Part="1" 
F 0 "UEJ306" H 8450 10665 50  0000 C CNN
F 1 "DFFCOO" H 8450 10574 50  0000 C CNN
F 2 "" H 8450 10300 50  0001 C CNN
F 3 "" H 8450 10300 50  0001 C CNN
	1    8450 10300
	1    0    0    -1  
$EndComp
$Comp
L A5C:DFFCOO UEK288
U 1 1 61118F92
P 8450 13450
AR Path="/60F602ED/61118F92" Ref="UEK288"  Part="1" 
AR Path="/612E58BE/612EE466/61118F92" Ref="UEK288"  Part="1" 
F 0 "UEK288" H 8450 13815 50  0000 C CNN
F 1 "DFFCOO" H 8450 13724 50  0000 C CNN
F 2 "" H 8450 13450 50  0001 C CNN
F 3 "" H 8450 13450 50  0001 C CNN
	1    8450 13450
	1    0    0    -1  
$EndComp
$Comp
L A5C:DFFCOO UEG275
U 1 1 61118F93
P 8450 14250
AR Path="/60F602ED/61118F93" Ref="UEG275"  Part="1" 
AR Path="/612E58BE/612EE466/61118F93" Ref="UEG275"  Part="1" 
F 0 "UEG275" H 8450 14615 50  0000 C CNN
F 1 "DFFCOO" H 8450 14524 50  0000 C CNN
F 2 "" H 8450 14250 50  0001 C CNN
F 3 "" H 8450 14250 50  0001 C CNN
	1    8450 14250
	1    0    0    -1  
$EndComp
$Comp
L A5C:DFFCOO UEI259
U 1 1 61118F8E
P 8450 15050
AR Path="/60F602ED/61118F8E" Ref="UEI259"  Part="1" 
AR Path="/612E58BE/612EE466/61118F8E" Ref="UEI259"  Part="1" 
F 0 "UEI259" H 8450 15415 50  0000 C CNN
F 1 "DFFCOO" H 8450 15324 50  0000 C CNN
F 2 "" H 8450 15050 50  0001 C CNN
F 3 "" H 8450 15050 50  0001 C CNN
	1    8450 15050
	1    0    0    -1  
$EndComp
$Comp
L A5C:DFFCOO UEI283
U 1 1 61118F8F
P 8450 15850
AR Path="/60F602ED/61118F8F" Ref="UEI283"  Part="1" 
AR Path="/612E58BE/612EE466/61118F8F" Ref="UEI283"  Part="1" 
F 0 "UEI283" H 8450 16215 50  0000 C CNN
F 1 "DFFCOO" H 8450 16124 50  0000 C CNN
F 2 "" H 8450 15850 50  0001 C CNN
F 3 "" H 8450 15850 50  0001 C CNN
	1    8450 15850
	1    0    0    -1  
$EndComp
$Comp
L A5C:DFFCOO UEK307
U 1 1 61118FBB
P 8450 19000
AR Path="/60F602ED/61118FBB" Ref="UEK307"  Part="1" 
AR Path="/612E58BE/612EE466/61118FBB" Ref="UEK307"  Part="1" 
F 0 "UEK307" H 8450 19365 50  0000 C CNN
F 1 "DFFCOO" H 8450 19274 50  0000 C CNN
F 2 "" H 8450 19000 50  0001 C CNN
F 3 "" H 8450 19000 50  0001 C CNN
	1    8450 19000
	1    0    0    -1  
$EndComp
$Comp
L A5C:DFFCOO UEK317
U 1 1 61118FAB
P 8450 19800
AR Path="/60F602ED/61118FAB" Ref="UEK317"  Part="1" 
AR Path="/612E58BE/612EE466/61118FAB" Ref="UEK317"  Part="1" 
F 0 "UEK317" H 8450 20165 50  0000 C CNN
F 1 "DFFCOO" H 8450 20074 50  0000 C CNN
F 2 "" H 8450 19800 50  0001 C CNN
F 3 "" H 8450 19800 50  0001 C CNN
	1    8450 19800
	1    0    0    -1  
$EndComp
$Comp
L A5C:DFFCOO UEJ291
U 1 1 61118FAC
P 8450 20600
AR Path="/60F602ED/61118FAC" Ref="UEJ291"  Part="1" 
AR Path="/612E58BE/612EE466/61118FAC" Ref="UEJ291"  Part="1" 
F 0 "UEJ291" H 8450 20965 50  0000 C CNN
F 1 "DFFCOO" H 8450 20874 50  0000 C CNN
F 2 "" H 8450 20600 50  0001 C CNN
F 3 "" H 8450 20600 50  0001 C CNN
	1    8450 20600
	1    0    0    -1  
$EndComp
$Comp
L A5C:DFFCOO UEH277
U 1 1 61118FB0
P 8450 21400
AR Path="/60F602ED/61118FB0" Ref="UEH277"  Part="1" 
AR Path="/612E58BE/612EE466/61118FB0" Ref="UEH277"  Part="1" 
F 0 "UEH277" H 8450 21765 50  0000 C CNN
F 1 "DFFCOO" H 8450 21674 50  0000 C CNN
F 2 "" H 8450 21400 50  0001 C CNN
F 3 "" H 8450 21400 50  0001 C CNN
	1    8450 21400
	1    0    0    -1  
$EndComp
$Comp
L A5C:NOR04 UBB154
U 1 1 61118FA3
P 9650 4050
AR Path="/60F602ED/61118FA3" Ref="UBB154"  Part="1" 
AR Path="/612E58BE/612EE466/61118FA3" Ref="UBB154"  Part="1" 
F 0 "UBB154" H 9650 4392 50  0000 C CNN
F 1 "NOR04" H 9650 4301 50  0000 C CNN
F 2 "" H 9650 4050 50  0001 C CNN
F 3 "" H 9650 4050 50  0001 C CNN
	1    9650 4050
	1    0    0    -1  
$EndComp
$Comp
L A5C:NOR04 UEJ314
U 1 1 61118F7B
P 9650 9450
AR Path="/60F602ED/61118F7B" Ref="UEJ314"  Part="1" 
AR Path="/612E58BE/612EE466/61118F7B" Ref="UEJ314"  Part="1" 
F 0 "UEJ314" H 9650 9792 50  0000 C CNN
F 1 "NOR04" H 9650 9701 50  0000 C CNN
F 2 "" H 9650 9450 50  0001 C CNN
F 3 "" H 9650 9450 50  0001 C CNN
	1    9650 9450
	1    0    0    -1  
$EndComp
$Comp
L A5C:NOR04 UEI301
U 1 1 61118F84
P 9650 15000
AR Path="/60F602ED/61118F84" Ref="UEI301"  Part="1" 
AR Path="/612E58BE/612EE466/61118F84" Ref="UEI301"  Part="1" 
F 0 "UEI301" H 9650 15342 50  0000 C CNN
F 1 "NOR04" H 9650 15251 50  0000 C CNN
F 2 "" H 9650 15000 50  0001 C CNN
F 3 "" H 9650 15000 50  0001 C CNN
	1    9650 15000
	1    0    0    -1  
$EndComp
$Comp
L A5C:NOR04 UEG279
U 1 1 61118FB3
P 9650 20550
AR Path="/60F602ED/61118FB3" Ref="UEG279"  Part="1" 
AR Path="/612E58BE/612EE466/61118FB3" Ref="UEG279"  Part="1" 
F 0 "UEG279" H 9650 20892 50  0000 C CNN
F 1 "NOR04" H 9650 20801 50  0000 C CNN
F 2 "" H 9650 20550 50  0001 C CNN
F 3 "" H 9650 20550 50  0001 C CNN
	1    9650 20550
	1    0    0    -1  
$EndComp
$Comp
L A5C:AOI22 UBD128
U 1 1 61118F76
P 7550 7750
AR Path="/60F602ED/61118F76" Ref="UBD128"  Part="1" 
AR Path="/612E58BE/612EE466/61118F76" Ref="UBD128"  Part="1" 
F 0 "UBD128" H 7575 8067 50  0000 C CNN
F 1 "AOI22" H 7575 7976 50  0000 C CNN
F 2 "" H 7700 7750 50  0001 C CNN
F 3 "" H 7700 7750 50  0001 C CNN
	1    7550 7750
	1    0    0    -1  
$EndComp
$Comp
L A5C:AOI22 UEB320
U 1 1 61118F75
P 7550 8550
AR Path="/60F602ED/61118F75" Ref="UEB320"  Part="1" 
AR Path="/612E58BE/612EE466/61118F75" Ref="UEB320"  Part="1" 
F 0 "UEB320" H 7575 8867 50  0000 C CNN
F 1 "AOI22" H 7575 8776 50  0000 C CNN
F 2 "" H 7700 8550 50  0001 C CNN
F 3 "" H 7700 8550 50  0001 C CNN
	1    7550 8550
	1    0    0    -1  
$EndComp
$Comp
L A5C:AOI22 UEI319
U 1 1 61118F74
P 7550 9350
AR Path="/60F602ED/61118F74" Ref="UEI319"  Part="1" 
AR Path="/612E58BE/612EE466/61118F74" Ref="UEI319"  Part="1" 
F 0 "UEI319" H 7575 9667 50  0000 C CNN
F 1 "AOI22" H 7575 9576 50  0000 C CNN
F 2 "" H 7700 9350 50  0001 C CNN
F 3 "" H 7700 9350 50  0001 C CNN
	1    7550 9350
	1    0    0    -1  
$EndComp
$Comp
L A5C:AOI22 UEI304
U 1 1 61118F77
P 7550 10150
AR Path="/60F602ED/61118F77" Ref="UEI304"  Part="1" 
AR Path="/612E58BE/612EE466/61118F77" Ref="UEI304"  Part="1" 
F 0 "UEI304" H 7575 10467 50  0000 C CNN
F 1 "AOI22" H 7575 10376 50  0000 C CNN
F 2 "" H 7700 10150 50  0001 C CNN
F 3 "" H 7700 10150 50  0001 C CNN
	1    7550 10150
	1    0    0    -1  
$EndComp
$Comp
L A5C:AOI22 UEJ287
U 1 1 61118F94
P 7550 13300
AR Path="/60F602ED/61118F94" Ref="UEJ287"  Part="1" 
AR Path="/612E58BE/612EE466/61118F94" Ref="UEJ287"  Part="1" 
F 0 "UEJ287" H 7575 13617 50  0000 C CNN
F 1 "AOI22" H 7575 13526 50  0000 C CNN
F 2 "" H 7700 13300 50  0001 C CNN
F 3 "" H 7700 13300 50  0001 C CNN
	1    7550 13300
	1    0    0    -1  
$EndComp
$Comp
L A5C:AOI22 UEG303
U 1 1 61118F91
P 7550 14100
AR Path="/60F602ED/61118F91" Ref="UEG303"  Part="1" 
AR Path="/612E58BE/612EE466/61118F91" Ref="UEG303"  Part="1" 
F 0 "UEG303" H 7575 14417 50  0000 C CNN
F 1 "AOI22" H 7575 14326 50  0000 C CNN
F 2 "" H 7700 14100 50  0001 C CNN
F 3 "" H 7700 14100 50  0001 C CNN
	1    7550 14100
	1    0    0    -1  
$EndComp
$Comp
L A5C:AOI22 UEH274
U 1 1 61118F8C
P 7550 14900
AR Path="/60F602ED/61118F8C" Ref="UEH274"  Part="1" 
AR Path="/612E58BE/612EE466/61118F8C" Ref="UEH274"  Part="1" 
F 0 "UEH274" H 7575 15217 50  0000 C CNN
F 1 "AOI22" H 7575 15126 50  0000 C CNN
F 2 "" H 7700 14900 50  0001 C CNN
F 3 "" H 7700 14900 50  0001 C CNN
	1    7550 14900
	1    0    0    -1  
$EndComp
$Comp
L A5C:AOI22 UEI298
U 1 1 61118F8D
P 7550 15700
AR Path="/60F602ED/61118F8D" Ref="UEI298"  Part="1" 
AR Path="/612E58BE/612EE466/61118F8D" Ref="UEI298"  Part="1" 
F 0 "UEI298" H 7575 16017 50  0000 C CNN
F 1 "AOI22" H 7575 15926 50  0000 C CNN
F 2 "" H 7700 15700 50  0001 C CNN
F 3 "" H 7700 15700 50  0001 C CNN
	1    7550 15700
	1    0    0    -1  
$EndComp
$Comp
L A5C:AOI22 UEJ303
U 1 1 61118FBA
P 7550 18850
AR Path="/60F602ED/61118FBA" Ref="UEJ303"  Part="1" 
AR Path="/612E58BE/612EE466/61118FBA" Ref="UEJ303"  Part="1" 
F 0 "UEJ303" H 7575 19167 50  0000 C CNN
F 1 "AOI22" H 7575 19076 50  0000 C CNN
F 2 "" H 7700 18850 50  0001 C CNN
F 3 "" H 7700 18850 50  0001 C CNN
	1    7550 18850
	1    0    0    -1  
$EndComp
$Comp
L A5C:AOI22 UEJ311
U 1 1 61118FAD
P 7550 19650
AR Path="/60F602ED/61118FAD" Ref="UEJ311"  Part="1" 
AR Path="/612E58BE/612EE466/61118FAD" Ref="UEJ311"  Part="1" 
F 0 "UEJ311" H 7575 19967 50  0000 C CNN
F 1 "AOI22" H 7575 19876 50  0000 C CNN
F 2 "" H 7700 19650 50  0001 C CNN
F 3 "" H 7700 19650 50  0001 C CNN
	1    7550 19650
	1    0    0    -1  
$EndComp
$Comp
L A5C:AOI22 UEJ298
U 1 1 61118FAF
P 7550 20450
AR Path="/60F602ED/61118FAF" Ref="UEJ298"  Part="1" 
AR Path="/612E58BE/612EE466/61118FAF" Ref="UEJ298"  Part="1" 
F 0 "UEJ298" H 7575 20767 50  0000 C CNN
F 1 "AOI22" H 7575 20676 50  0000 C CNN
F 2 "" H 7700 20450 50  0001 C CNN
F 3 "" H 7700 20450 50  0001 C CNN
	1    7550 20450
	1    0    0    -1  
$EndComp
$Comp
L A5C:AOI22 UEH271
U 1 1 61118FAE
P 7550 21250
AR Path="/60F602ED/61118FAE" Ref="UEH271"  Part="1" 
AR Path="/612E58BE/612EE466/61118FAE" Ref="UEH271"  Part="1" 
F 0 "UEH271" H 7575 21567 50  0000 C CNN
F 1 "AOI22" H 7575 21476 50  0000 C CNN
F 2 "" H 7700 21250 50  0001 C CNN
F 3 "" H 7700 21250 50  0001 C CNN
	1    7550 21250
	1    0    0    -1  
$EndComp
$Comp
L A5C:NOR05 UBD154
U 1 1 61118FA4
P 9650 4800
AR Path="/60F602ED/61118FA4" Ref="UBD154"  Part="1" 
AR Path="/612E58BE/612EE466/61118FA4" Ref="UBD154"  Part="1" 
F 0 "UBD154" H 9725 5215 50  0000 C CNN
F 1 "NOR05" H 9725 5124 50  0000 C CNN
F 2 "" H 9650 4850 50  0001 C CNN
F 3 "" H 9650 4850 50  0001 C CNN
	1    9650 4800
	1    0    0    -1  
$EndComp
$Comp
L A5C:NOR05 UED312
U 1 1 61118F79
P 9650 10200
AR Path="/60F602ED/61118F79" Ref="UED312"  Part="1" 
AR Path="/612E58BE/612EE466/61118F79" Ref="UED312"  Part="1" 
F 0 "UED312" H 9725 10615 50  0000 C CNN
F 1 "NOR05" H 9725 10524 50  0000 C CNN
F 2 "" H 9650 10250 50  0001 C CNN
F 3 "" H 9650 10250 50  0001 C CNN
	1    9650 10200
	1    0    0    -1  
$EndComp
$Comp
L A5C:NOR05 UEC274
U 1 1 61118F90
P 9650 15750
AR Path="/60F602ED/61118F90" Ref="UEC274"  Part="1" 
AR Path="/612E58BE/612EE466/61118F90" Ref="UEC274"  Part="1" 
F 0 "UEC274" H 9725 16165 50  0000 C CNN
F 1 "NOR05" H 9725 16074 50  0000 C CNN
F 2 "" H 9650 15800 50  0001 C CNN
F 3 "" H 9650 15800 50  0001 C CNN
	1    9650 15750
	1    0    0    -1  
$EndComp
$Comp
L A5C:NOR05 UEC298
U 1 1 61118FB2
P 9650 21300
AR Path="/60F602ED/61118FB2" Ref="UEC298"  Part="1" 
AR Path="/612E58BE/612EE466/61118FB2" Ref="UEC298"  Part="1" 
F 0 "UEC298" H 9725 21715 50  0000 C CNN
F 1 "NOR05" H 9725 21624 50  0000 C CNN
F 2 "" H 9650 21350 50  0001 C CNN
F 3 "" H 9650 21350 50  0001 C CNN
	1    9650 21300
	1    0    0    -1  
$EndComp
NoConn ~ 8700 7900
NoConn ~ 8700 8700
NoConn ~ 8700 9500
NoConn ~ 8700 10300
NoConn ~ 8700 13450
NoConn ~ 8700 14250
NoConn ~ 8700 15050
NoConn ~ 8700 15850
NoConn ~ 8700 19000
NoConn ~ 8700 19800
NoConn ~ 8700 20600
NoConn ~ 8700 21400
Wire Bus Line
	10050 21500 10050 21700
Wire Bus Line
	10050 5200 10050 5650
Wire Bus Line
	10050 10650 10050 11050
Wire Bus Line
	10050 16200 10050 16600
Wire Bus Line
	10050 21800 10050 22200
$EndSCHEMATC
