EESchema Schematic File Version 4
EELAYER 30 0
EELAYER END
$Descr A4 11693 8268
encoding utf-8
Sheet 11 20
Title "DL-1727"
Date "2020-04-26"
Rev ""
Comp ""
Comment1 ""
Comment2 "Licence: CC-BY"
Comment3 "Author: Loic *WydD* Petit"
Comment4 "Project: CPS2 Reverse Engineering: DL-1727"
$EndDescr
Wire Wire Line
	3350 3200 3600 3200
Wire Wire Line
	8050 5800 8050 5500
Wire Wire Line
	3600 3200 3600 2600
Wire Wire Line
	3600 3200 3750 3200
Wire Wire Line
	8600 6300 8600 5950
Wire Wire Line
	9400 5500 8050 5500
Wire Wire Line
	5900 3450 5900 3300
Wire Wire Line
	5900 4150 5900 4000
Wire Wire Line
	5900 4850 5900 4700
Text Notes 6550 4200 2    50   ~ 0
Low if\nIN AND /DEBUG
Text Label 7000 5900 2    50   ~ 0
IN-ENABLE
Text Label 3650 6750 0    50   ~ 0
~OUT-DEBUG
Text Label 8750 5500 0    50   ~ 0
26R164
Text Label 8050 6300 0    50   ~ 0
DEBUG
Text Label 5300 6300 2    50   ~ 0
DEBUG
Text Label 8750 4950 0    50   ~ 0
12R164
Text Label 5300 4600 2    50   ~ 0
IN-ENABLE
Text Label 5300 3900 2    50   ~ 0
IN-ENABLE
Text Label 5300 3450 2    50   ~ 0
DEBUG
Text Label 5300 4150 2    50   ~ 0
DEBUG
Text Label 5300 4850 2    50   ~ 0
DEBUG
Text Label 5300 5300 2    50   ~ 0
DEBUG
Text Label 5300 5200 2    50   ~ 0
IN-ENABLE
$Comp
L CG24-cells:R2N U19R164
U 1 1 6B5BAC3F
P 8300 5850
F 0 "U19R164" H 8325 6117 50  0000 C CNN
F 1 "R2N" H 8325 6026 50  0000 C CNN
F 2 "" H 8300 5850 50  0001 C CNN
F 3 "" H 8300 5850 50  0001 C CNN
	1    8300 5850
	1    0    0    -1  
$EndComp
$Comp
L CG24-cells:R2P U18R163
U 1 1 6B5BB913
P 8850 5900
F 0 "U18R163" H 8875 6167 50  0000 C CNN
F 1 "R2P" H 8875 6076 50  0000 C CNN
F 2 "" H 8900 5900 50  0001 C CNN
F 3 "" H 8900 5900 50  0001 C CNN
	1    8850 5900
	1    0    0    1   
$EndComp
$Comp
L CG24-cells:R2P U16R60
U 1 1 73F56569
P 6150 3250
F 0 "U16R60" H 6175 3517 50  0000 C CNN
F 1 "R2P" H 6175 3426 50  0000 C CNN
F 2 "" H 6200 3250 50  0001 C CNN
F 3 "" H 6200 3250 50  0001 C CNN
	1    6150 3250
	1    0    0    -1  
$EndComp
$Comp
L CG24-cells:R2P U14R132
U 1 1 69A95D9D
P 6150 3950
F 0 "U14R132" H 6175 4217 50  0000 C CNN
F 1 "R2P" H 6175 4126 50  0000 C CNN
F 2 "" H 6200 3950 50  0001 C CNN
F 3 "" H 6200 3950 50  0001 C CNN
	1    6150 3950
	1    0    0    -1  
$EndComp
$Comp
L CG24-cells:R2P U16R71
U 1 1 5EC696C7
P 6150 4650
F 0 "U16R71" H 6175 4917 50  0000 C CNN
F 1 "R2P" H 6175 4826 50  0000 C CNN
F 2 "" H 6200 4650 50  0001 C CNN
F 3 "" H 6200 4650 50  0001 C CNN
	1    6150 4650
	1    0    0    -1  
$EndComp
$Comp
L CG24-cells:R2P U14R153
U 1 1 6B4369ED
P 6150 5250
F 0 "U14R153" H 6175 5517 50  0000 C CNN
F 1 "R2P" H 6175 5426 50  0000 C CNN
F 2 "" H 6200 5250 50  0001 C CNN
F 3 "" H 6200 5250 50  0001 C CNN
	1    6150 5250
	1    0    0    -1  
$EndComp
$Comp
L CG24-cells:I2S U2R170
U 1 1 5E9C5935
P 2450 6300
F 0 "U2R170" H 2450 6617 50  0000 C CNN
F 1 "I2S" H 2450 6526 50  0000 C CNN
F 2 "" H 2450 6300 50  0001 C CNN
F 3 "" H 2450 6300 50  0001 C CNN
	1    2450 6300
	1    0    0    -1  
$EndComp
$Comp
L CG24-cells:I2R U16R178
U 1 1 5E9C5933
P 2450 3200
F 0 "U16R178" H 2450 3517 50  0000 C CNN
F 1 "I2R" H 2450 3426 50  0000 C CNN
F 2 "" H 2450 3200 50  0001 C CNN
F 3 "" H 2450 3200 50  0001 C CNN
	1    2450 3200
	1    0    0    -1  
$EndComp
$Comp
L CG24-cells:V1N U4R154
U 1 1 6C238D4F
P 3050 6300
F 0 "U4R154" H 3050 6617 50  0000 C CNN
F 1 "V1N" H 3050 6526 50  0000 C CNN
F 2 "" H 3050 6100 50  0001 C CNN
F 3 "" H 3050 6100 50  0001 C CNN
	1    3050 6300
	1    0    0    -1  
$EndComp
$Comp
L CG24-cells:V2B U26R164
U 1 1 6C92487E
P 7750 5500
F 0 "U26R164" H 7750 5817 50  0000 C CNN
F 1 "V2B" H 7750 5726 50  0000 C CNN
F 2 "" H 7750 5300 50  0001 C CNN
F 3 "" H 7750 5300 50  0001 C CNN
	1    7750 5500
	1    0    0    -1  
$EndComp
$Comp
L CG24-cells:V1N U18R184
U 1 1 6BAE04FA
P 3050 3200
F 0 "U18R184" H 3050 3517 50  0000 C CNN
F 1 "V1N" H 3050 3426 50  0000 C CNN
F 2 "" H 3050 3000 50  0001 C CNN
F 3 "" H 3050 3000 50  0001 C CNN
	1    3050 3200
	1    0    0    -1  
$EndComp
$Comp
L CG24-cells:V1N U19R154
U 1 1 6B434E14
P 7750 5900
F 0 "U19R154" H 7750 6217 50  0000 C CNN
F 1 "V1N" H 7750 6126 50  0000 C CNN
F 2 "" H 7750 5700 50  0001 C CNN
F 3 "" H 7750 5700 50  0001 C CNN
	1    7750 5900
	1    0    0    1   
$EndComp
$Comp
L CG24-cells:V2B U14R102
U 1 1 5EC6F2FE
P 4050 6300
F 0 "U14R102" H 4050 6617 50  0000 C CNN
F 1 "V2B" H 4050 6526 50  0000 C CNN
F 2 "" H 4050 6100 50  0001 C CNN
F 3 "" H 4050 6100 50  0001 C CNN
	1    4050 6300
	1    0    0    -1  
$EndComp
$Comp
L CG24-cells:V2B U20R154
U 1 1 6B3B2486
P 4050 3200
F 0 "U20R154" H 4050 3517 50  0000 C CNN
F 1 "V2B" H 4050 3426 50  0000 C CNN
F 2 "" H 4050 3000 50  0001 C CNN
F 3 "" H 4050 3000 50  0001 C CNN
	1    4050 3200
	1    0    0    -1  
$EndComp
$Comp
L CG24-cells:V1N U26R184
U 1 1 6BAE0CDD
P 4050 2600
F 0 "U26R184" H 4050 2917 50  0000 C CNN
F 1 "V1N" H 4050 2826 50  0000 C CNN
F 2 "" H 4050 2400 50  0001 C CNN
F 3 "" H 4050 2400 50  0001 C CNN
	1    4050 2600
	1    0    0    -1  
$EndComp
$Comp
L CG24-cells:O1B U28R180
U 1 1 5E9C5965
P 4650 2600
F 0 "U28R180" H 4650 2917 50  0000 C CNN
F 1 "O1B" H 4650 2826 50  0000 C CNN
F 2 "" H 4650 2600 50  0001 C CNN
F 3 "" H 4650 2600 50  0001 C CNN
	1    4650 2600
	1    0    0    -1  
$EndComp
$Comp
L CG24-cells:V1N U17R61
U 1 1 67944DE8
P 5600 3200
F 0 "U17R61" H 5600 3517 50  0000 C CNN
F 1 "V1N" H 5600 3426 50  0000 C CNN
F 2 "" H 5600 3000 50  0001 C CNN
F 3 "" H 5600 3000 50  0001 C CNN
	1    5600 3200
	1    0    0    -1  
$EndComp
$Comp
L CG24-cells:V1N U14R131
U 1 1 69A95DA3
P 5600 3900
F 0 "U14R131" H 5600 4217 50  0000 C CNN
F 1 "V1N" H 5600 4126 50  0000 C CNN
F 2 "" H 5600 3700 50  0001 C CNN
F 3 "" H 5600 3700 50  0001 C CNN
	1    5600 3900
	1    0    0    -1  
$EndComp
$Comp
L CG24-cells:V1N U17R72
U 1 1 5EC6BF18
P 5600 4600
F 0 "U17R72" H 5600 4917 50  0000 C CNN
F 1 "V1N" H 5600 4826 50  0000 C CNN
F 2 "" H 5600 4400 50  0001 C CNN
F 3 "" H 5600 4400 50  0001 C CNN
	1    5600 4600
	1    0    0    -1  
$EndComp
Wire Wire Line
	3350 6300 3600 6300
Wire Wire Line
	3600 6300 3600 6750
Connection ~ 3600 6300
Wire Wire Line
	3600 6300 3750 6300
Wire Wire Line
	3600 6750 4300 6750
Wire Wire Line
	4350 3200 4600 3200
Wire Wire Line
	4600 3200 4600 3900
Wire Wire Line
	4600 5200 5900 5200
Wire Wire Line
	4700 3450 5900 3450
Wire Wire Line
	4350 6300 4700 6300
Wire Wire Line
	4700 4850 5900 4850
Wire Wire Line
	4700 4150 5900 4150
Wire Wire Line
	4700 3450 4700 4150
Wire Wire Line
	4600 3200 5300 3200
Connection ~ 4600 3200
Wire Wire Line
	4600 3900 5300 3900
Wire Wire Line
	4600 4600 5300 4600
Wire Wire Line
	4700 5300 5900 5300
Text HLabel 7000 5500 0    50   Input ~ 0
ENABLE-ADDR
Text HLabel 9400 4950 2    50   Output ~ 0
~ADDR-BUS-HI
Text HLabel 9400 5500 2    50   Output ~ 0
~ADDR-BUS-LO
Wire Wire Line
	4600 5900 7450 5900
Wire Wire Line
	4700 6300 8600 6300
Connection ~ 4700 6300
Connection ~ 3600 3200
Wire Wire Line
	3750 2600 3600 2600
Connection ~ 3600 2600
Wire Wire Line
	3600 2600 3600 2150
Wire Wire Line
	3750 2150 3600 2150
Text HLabel 3750 2150 2    50   Output ~ 0
~VCC-OK
Connection ~ 4600 3900
Connection ~ 4600 4600
Connection ~ 4700 4150
Connection ~ 4700 4850
Wire Wire Line
	4700 4150 4700 4850
Wire Wire Line
	4600 3900 4600 4600
Wire Wire Line
	7450 4950 7450 5500
Wire Wire Line
	4700 4850 4700 5300
Wire Wire Line
	4600 4600 4600 5200
Connection ~ 4600 5200
Connection ~ 4700 5300
Wire Wire Line
	4600 5200 4600 5900
Wire Wire Line
	4700 5300 4700 6300
Connection ~ 8050 5500
$Comp
L CG24-cells:V2B U12R164
U 1 1 5EDF8573
P 7750 4950
F 0 "U12R164" H 7750 5267 50  0000 C CNN
F 1 "V2B" H 7750 5176 50  0000 C CNN
F 2 "" H 7750 4750 50  0001 C CNN
F 3 "" H 7750 4750 50  0001 C CNN
	1    7750 4950
	1    0    0    -1  
$EndComp
Wire Wire Line
	8050 4950 9400 4950
Wire Wire Line
	7000 5500 7450 5500
Connection ~ 7450 5500
Text Label 5300 3200 2    50   ~ 0
IN-ENABLE
Text HLabel 4300 6750 2    50   Output ~ 0
~OUT-DEBUG
Text HLabel 4950 2600 2    50   Output ~ 0
~RESET
Text HLabel 2150 3200 0    50   Input ~ 0
_VCC-OK
Text HLabel 9150 5900 2    50   Output ~ 0
ENABLE-ADDR-OUT
Text HLabel 6450 3250 2    50   Output ~ 0
~ENABLE1
Text HLabel 6450 4650 2    50   Output ~ 0
~ENABLE3
Text HLabel 6450 3950 2    50   Output ~ 0
~ENABLE2
Text HLabel 6450 5250 2    50   Output ~ 0
ENABLE-CLK
Text HLabel 2150 6300 0    50   Input ~ 0
_DEBUG
Text HLabel 4800 2950 2    50   Output ~ 0
IN-ENABLE
Wire Wire Line
	4800 2950 4600 2950
Wire Wire Line
	4600 2950 4600 3200
$EndSCHEMATC
