EESchema Schematic File Version 4
EELAYER 30 0
EELAYER END
$Descr A3 16535 11693
encoding utf-8
Sheet 78 83
Title "CPS Reverse Engineering: DL-0311"
Date "2021-09-12"
Rev ""
Comp ""
Comment1 ""
Comment2 ""
Comment3 "Licence: CC-BY"
Comment4 "Author: Loïc *WydD* Petit"
$EndDescr
Connection ~ 9800 10450
Connection ~ 9800 8600
Connection ~ 9800 3650
Connection ~ 9800 7050
Connection ~ 9800 5200
Connection ~ 9800 1800
Connection ~ 4200 6050
Connection ~ 4300 6350
Connection ~ 4100 6150
Connection ~ 4100 9550
Connection ~ 4100 2750
Connection ~ 5800 6400
Connection ~ 5800 9800
Connection ~ 9100 3750
Connection ~ 9100 5400
Connection ~ 9100 7150
Connection ~ 9100 8800
Connection ~ 9100 10550
Connection ~ 5800 11000
Connection ~ 1550 9500
Connection ~ 3750 6150
Connection ~ 3850 6700
Connection ~ 3850 10100
Connection ~ 3750 9550
Connection ~ 4200 8950
Connection ~ 4300 9200
Connection ~ 2950 10050
Connection ~ 2900 8950
Connection ~ 1950 5800
Connection ~ 1950 6250
NoConn ~ 6400 9600
NoConn ~ 9700 10350
NoConn ~ 9700 6950
NoConn ~ 9700 3550
NoConn ~ 6400 2800
NoConn ~ 6400 6200
NoConn ~ 9700 1900
NoConn ~ 9700 5300
NoConn ~ 9700 8700
Entry Wire Line
	1400 4700 1500 4800
Entry Wire Line
	1400 4800 1500 4900
Entry Wire Line
	1400 4900 1500 5000
Entry Wire Line
	1400 5600 1500 5700
Entry Wire Line
	1400 6050 1500 6150
Entry Wire Line
	1400 6500 1500 6600
Entry Wire Line
	10400 3650 10500 3550
Entry Wire Line
	10400 7050 10500 6950
Entry Wire Line
	10400 10450 10500 10350
Entry Wire Line
	10650 1800 10750 1700
Entry Wire Line
	10650 5200 10750 5100
Entry Wire Line
	10650 8600 10750 8500
Wire Wire Line
	1450 9500 1550 9500
Wire Wire Line
	1500 4800 2100 4800
Wire Wire Line
	1500 4900 2100 4900
Wire Wire Line
	1500 5000 2100 5000
Wire Wire Line
	1500 5700 2050 5700
Wire Wire Line
	1500 6150 2050 6150
Wire Wire Line
	1500 6600 2050 6600
Wire Wire Line
	1550 9500 2950 9500
Wire Wire Line
	1550 10550 1550 9500
Wire Wire Line
	1950 5450 1850 5450
Wire Wire Line
	1950 5800 1950 5450
Wire Wire Line
	1950 6250 1950 5800
Wire Wire Line
	1950 6700 1950 6250
Wire Wire Line
	2050 5800 1950 5800
Wire Wire Line
	2050 6250 1950 6250
Wire Wire Line
	2050 6700 1950 6700
Wire Wire Line
	2350 10550 1550 10550
Wire Wire Line
	2900 8950 2800 8950
Wire Wire Line
	2900 9200 2900 8950
Wire Wire Line
	2900 9200 4300 9200
Wire Wire Line
	2950 9600 2950 10050
Wire Wire Line
	2950 10150 2950 10550
Wire Wire Line
	3500 8950 4200 8950
Wire Wire Line
	3500 9550 3750 9550
Wire Wire Line
	3500 10100 3850 10100
Wire Wire Line
	3750 2750 3750 6150
Wire Wire Line
	3750 6150 3750 9550
Wire Wire Line
	3750 9550 4100 9550
Wire Wire Line
	3850 3300 8050 3300
Wire Wire Line
	3850 6700 3850 3300
Wire Wire Line
	3850 6700 3850 10100
Wire Wire Line
	3850 6700 8050 6700
Wire Wire Line
	3850 10100 8050 10100
Wire Wire Line
	4100 2750 3750 2750
Wire Wire Line
	4100 2750 4800 2750
Wire Wire Line
	4100 3050 4100 2750
Wire Wire Line
	4100 3050 4800 3050
Wire Wire Line
	4100 6150 3750 6150
Wire Wire Line
	4100 6150 4800 6150
Wire Wire Line
	4100 6450 4100 6150
Wire Wire Line
	4100 6450 4800 6450
Wire Wire Line
	4100 9550 4800 9550
Wire Wire Line
	4100 9850 4100 9550
Wire Wire Line
	4100 9850 4800 9850
Wire Wire Line
	4200 2650 4200 6050
Wire Wire Line
	4200 2650 4800 2650
Wire Wire Line
	4200 6050 4200 8950
Wire Wire Line
	4200 6050 4800 6050
Wire Wire Line
	4200 8950 4200 9450
Wire Wire Line
	4200 9450 4800 9450
Wire Wire Line
	4300 2950 4300 6350
Wire Wire Line
	4300 2950 4800 2950
Wire Wire Line
	4300 6350 4300 9200
Wire Wire Line
	4300 6350 4800 6350
Wire Wire Line
	4300 9200 4300 9750
Wire Wire Line
	4300 9750 4800 9750
Wire Wire Line
	5700 11000 5800 11000
Wire Wire Line
	5800 3000 5900 3000
Wire Wire Line
	5800 6400 5800 3000
Wire Wire Line
	5800 9800 5800 6400
Wire Wire Line
	5800 11000 5800 9800
Wire Wire Line
	5900 2800 5700 2800
Wire Wire Line
	5900 6200 5700 6200
Wire Wire Line
	5900 6400 5800 6400
Wire Wire Line
	5900 9600 5700 9600
Wire Wire Line
	5900 9800 5800 9800
Wire Wire Line
	6400 2900 7050 2900
Wire Wire Line
	6400 6300 7050 6300
Wire Wire Line
	6400 9700 7050 9700
Wire Wire Line
	7050 3200 7050 2900
Wire Wire Line
	7050 6600 7050 6300
Wire Wire Line
	7050 10000 7050 9700
Wire Wire Line
	7250 2750 7350 2750
Wire Wire Line
	7250 2900 7250 2750
Wire Wire Line
	7300 5350 8050 5350
Wire Wire Line
	7300 8550 8050 8550
Wire Wire Line
	7900 900  8100 900 
Wire Wire Line
	7900 1800 8300 1800
Wire Wire Line
	7900 2700 8100 2700
Wire Wire Line
	7950 3800 7950 4050
Wire Wire Line
	7950 4050 9800 4050
Wire Wire Line
	7950 5450 7950 5700
Wire Wire Line
	7950 5700 9800 5700
Wire Wire Line
	7950 7200 7950 7450
Wire Wire Line
	7950 7450 9800 7450
Wire Wire Line
	7950 8850 7950 9000
Wire Wire Line
	7950 9000 9800 9000
Wire Wire Line
	7950 10600 7950 10850
Wire Wire Line
	7950 10850 9800 10850
Wire Wire Line
	8000 1350 7900 1350
Wire Wire Line
	8000 1700 8000 1350
Wire Wire Line
	8000 1900 8000 2250
Wire Wire Line
	8000 2250 7900 2250
Wire Wire Line
	8050 3200 7050 3200
Wire Wire Line
	8050 3800 7950 3800
Wire Wire Line
	8050 3900 7450 3900
Wire Wire Line
	8050 5450 7950 5450
Wire Wire Line
	8050 5550 7450 5550
Wire Wire Line
	8050 6600 7050 6600
Wire Wire Line
	8050 7200 7950 7200
Wire Wire Line
	8050 7300 7450 7300
Wire Wire Line
	8050 8750 7450 8750
Wire Wire Line
	8050 8850 7950 8850
Wire Wire Line
	8050 10000 7050 10000
Wire Wire Line
	8050 10600 7950 10600
Wire Wire Line
	8050 10700 7450 10700
Wire Wire Line
	8100 900  8100 1600
Wire Wire Line
	8100 1600 8300 1600
Wire Wire Line
	8100 2000 8300 2000
Wire Wire Line
	8100 2700 8100 2000
Wire Wire Line
	8300 1700 8000 1700
Wire Wire Line
	8300 1900 8000 1900
Wire Wire Line
	8950 1800 9200 1800
Wire Wire Line
	8950 3550 9200 3550
Wire Wire Line
	8950 5200 9200 5200
Wire Wire Line
	8950 6950 9200 6950
Wire Wire Line
	8950 8600 9200 8600
Wire Wire Line
	8950 10350 9200 10350
Wire Wire Line
	9100 2000 9100 3750
Wire Wire Line
	9100 3750 9100 5400
Wire Wire Line
	9100 3750 9200 3750
Wire Wire Line
	9100 5400 9100 7150
Wire Wire Line
	9100 7150 9100 8800
Wire Wire Line
	9100 8800 9100 10550
Wire Wire Line
	9100 10550 9100 11000
Wire Wire Line
	9100 11000 5800 11000
Wire Wire Line
	9200 2000 9100 2000
Wire Wire Line
	9200 5400 9100 5400
Wire Wire Line
	9200 7150 9100 7150
Wire Wire Line
	9200 8800 9100 8800
Wire Wire Line
	9200 10550 9100 10550
Wire Wire Line
	9700 3650 9800 3650
Wire Wire Line
	9700 7050 9800 7050
Wire Wire Line
	9700 8600 9800 8600
Wire Wire Line
	9700 10450 9800 10450
Wire Wire Line
	9800 1800 9700 1800
Wire Wire Line
	9800 1800 9800 2900
Wire Wire Line
	9800 1800 10650 1800
Wire Wire Line
	9800 2900 7250 2900
Wire Wire Line
	9800 3650 9800 4050
Wire Wire Line
	9800 3650 10400 3650
Wire Wire Line
	9800 5200 9700 5200
Wire Wire Line
	9800 5200 9800 5700
Wire Wire Line
	9800 5200 10650 5200
Wire Wire Line
	9800 7050 9800 7450
Wire Wire Line
	9800 7050 10400 7050
Wire Wire Line
	9800 8600 9800 9000
Wire Wire Line
	9800 8600 10650 8600
Wire Wire Line
	9800 10450 9800 10850
Wire Wire Line
	9800 10450 10400 10450
Wire Bus Line
	1400 4600 1300 4600
Wire Bus Line
	1400 5450 1300 5450
Wire Bus Line
	10500 1200 10950 1200
Wire Bus Line
	10750 1350 10950 1350
Text Notes 9900 1700 0    50   ~ 0
GFX-CHNL
Text Notes 9900 3550 0    50   ~ 0
~GFX-CHNL
Text Notes 9900 5100 0    50   ~ 0
GFX-CHNL
Text Notes 9900 6950 0    50   ~ 0
~GFX-CHNL
Text Notes 9900 8500 0    50   ~ 0
GFX-CHNL
Text Notes 9900 10350 0    50   ~ 0
~GFX-CHNL
Text Label 1500 5700 0    50   ~ 0
ROMA-Y5
Text Label 1500 6150 0    50   ~ 0
ROMA-Y4
Text Label 1500 6600 0    50   ~ 0
ROMA-Y3
Text Label 1550 4800 0    50   ~ 0
GFX-ADDR4
Text Label 1550 4900 0    50   ~ 0
GFX-ADDR5
Text Label 1550 5000 0    50   ~ 0
GFX-ADDR6
Text Label 2600 5750 0    50   ~ 0
Y5
Text Label 2600 6200 0    50   ~ 0
Y4
Text Label 2600 6650 0    50   ~ 0
Y3
Text Label 4800 2550 2    50   ~ 0
GFX-ADDR6
Text Label 4800 2850 2    50   ~ 0
GFX-ADDR4
Text Label 4800 5950 2    50   ~ 0
GFX-ADDR5
Text Label 4800 6250 2    50   ~ 0
Y4
Text Label 4800 9350 2    50   ~ 0
GFX-ADDR4
Text Label 4800 9650 2    50   ~ 0
Y3
Text Label 6700 8450 2    50   ~ 0
ELSE.GFX-CHNL
Text Label 6700 8550 2    50   ~ 0
SCROLL3.GFX-CHNL
Text Label 6700 8650 2    50   ~ 0
STARS.GFX-CHNL
Text Label 6750 5300 2    50   ~ 0
STARS.GFX-CHNL
Text Label 6750 5400 2    50   ~ 0
SCROLL3.GFX-CHNL
Text Label 7350 850  2    50   ~ 0
GFX-ADDR6
Text Label 7350 1300 2    50   ~ 0
GFX-ADDR5
Text Label 7350 1750 2    50   ~ 0
GFX-ADDR4
Text Label 7350 2200 2    50   ~ 0
Y5
Text Label 7350 2650 2    50   ~ 0
~GFX-CHNL
Text Label 7450 3900 0    50   ~ 0
~GFX-CHNL
Text Label 7450 5550 0    50   ~ 0
~GFX-CHNL
Text Label 7450 7300 0    50   ~ 0
~GFX-CHNL
Text Label 7450 8750 0    50   ~ 0
~GFX-CHNL
Text Label 7450 10700 0    50   ~ 0
~GFX-CHNL
Text Label 8050 3400 2    50   ~ 0
GFX-ADDR5
Text Label 8050 3500 2    50   ~ 0
ELSE.GFX-CHNL
Text Label 8050 3600 2    50   ~ 0
Y5
Text Label 8050 3700 2    50   ~ 0
SCROLL3.GFX-CHNL
Text Label 8050 4850 2    50   ~ 0
GFX-ADDR5
Text Label 8050 4950 2    50   ~ 0
SCROLL1.GFX-CHNL
Text Label 8050 5050 2    50   ~ 0
GFX-ADDR4
Text Label 8050 5150 2    50   ~ 0
ELSE.GFX-CHNL
Text Label 8050 5250 2    50   ~ 0
Y4
Text Label 8050 6800 2    50   ~ 0
GFX-ADDR4
Text Label 8050 6900 2    50   ~ 0
ELSE.GFX-CHNL
Text Label 8050 7000 2    50   ~ 0
Y4
Text Label 8050 7100 2    50   ~ 0
SCROLL3.GFX-CHNL
Text Label 8050 8350 2    50   ~ 0
GFX-ADDR4
Text Label 8050 8450 2    50   ~ 0
SCROLL1.GFX-CHNL
Text Label 8050 8650 2    50   ~ 0
Y3
Text Label 8050 10200 2    50   ~ 0
Y3
Text Label 8050 10300 2    50   ~ 0
ELSE.GFX-CHNL
Text Label 8050 10400 2    50   ~ 0
Y3
Text Label 8050 10500 2    50   ~ 0
SCROLL3.GFX-CHNL
Text Label 9900 1800 0    50   ~ 0
B-ROMA5
Text Label 9900 3650 0    50   ~ 0
A-ROMA5
Text Label 9900 5200 0    50   ~ 0
B-ROMA4
Text Label 9900 7050 0    50   ~ 0
A-ROMA4
Text Label 9900 8600 0    50   ~ 0
B-ROMA3
Text Label 9900 10450 0    50   ~ 0
A-ROMA3
Text HLabel 1300 4600 0    50   Input ~ 0
GFX-ADDR[4..9]
Text HLabel 1300 5450 0    50   Input ~ 0
ROMA-Y[3..5]
Text HLabel 1450 9500 0    50   Input ~ 0
~GFX-CHNL
Text HLabel 1850 5450 0    50   Input ~ 0
~YFLIP
Text HLabel 2350 10050 0    50   Input ~ 0
~SCROLL1-STARS
Text HLabel 2800 8950 0    50   Input ~ 0
SCROLL3-STARS
Text HLabel 5700 11000 0    50   Input ~ 0
~CLK4M
Text HLabel 7350 950  0    50   Input ~ 0
SCROLL1.GFX-CHNL
Text HLabel 7350 1400 0    50   Input ~ 0
ELSE.GFX-CHNL
Text HLabel 7350 1850 0    50   Input ~ 0
STARS.GFX-CHNL
Text HLabel 7350 2300 0    50   Input ~ 0
SCROLL3.GFX-CHNL
Text HLabel 10950 1200 2    50   Output ~ 0
A-ROMA[3..5]
Text HLabel 10950 1350 2    50   Output ~ 0
B-ROMA[3..5]
$Comp
L A5C:XNOR02 UED47
U 1 1 66D2CE12
P 2300 5750
F 0 "UED47" H 2325 6017 50  0000 C CNN
F 1 "XNOR02" H 2325 5926 50  0000 C CNN
F 2 "" H 2325 5750 50  0001 C CNN
F 3 "" H 2325 5750 50  0001 C CNN
	1    2300 5750
	1    0    0    -1  
$EndComp
$Comp
L A5C:XNOR02 UEE31
U 1 1 65A92E36
P 2300 6200
F 0 "UEE31" H 2325 6467 50  0000 C CNN
F 1 "XNOR02" H 2325 6376 50  0000 C CNN
F 2 "" H 2325 6200 50  0001 C CNN
F 3 "" H 2325 6200 50  0001 C CNN
	1    2300 6200
	1    0    0    -1  
$EndComp
$Comp
L A5C:XNOR02 UEG5
U 1 1 647F899C
P 2300 6650
F 0 "UEG5" H 2325 6917 50  0000 C CNN
F 1 "XNOR02" H 2325 6826 50  0000 C CNN
F 2 "" H 2325 6650 50  0001 C CNN
F 3 "" H 2325 6650 50  0001 C CNN
	1    2300 6650
	1    0    0    -1  
$EndComp
$Comp
L A5C:AND02 UEH130
U 1 1 65BCCE92
P 3200 9550
F 0 "UEH130" H 3225 9817 50  0000 C CNN
F 1 "AND02" H 3225 9726 50  0000 C CNN
F 2 "" H 3200 9550 50  0001 C CNN
F 3 "" H 3200 9550 50  0001 C CNN
	1    3200 9550
	1    0    0    -1  
$EndComp
$Comp
L A5C:AND02 UEH117
U 1 1 61F1D233
P 3200 10100
F 0 "UEH117" H 3225 10367 50  0000 C CNN
F 1 "AND02" H 3225 10276 50  0000 C CNN
F 2 "" H 3200 10100 50  0001 C CNN
F 3 "" H 3200 10100 50  0001 C CNN
	1    3200 10100
	1    0    0    -1  
$EndComp
$Comp
L A5C:OR02 UEE164
U 1 1 61118E55
P 7000 5350
F 0 "UEE164" H 7025 5617 50  0000 C CNN
F 1 "OR02" H 7025 5526 50  0000 C CNN
F 2 "" H 7050 5350 50  0001 C CNN
F 3 "" H 7050 5350 50  0001 C CNN
	1    7000 5350
	1    0    0    -1  
$EndComp
$Comp
L A5C:NAND02 UEG41
U 1 1 61118E51
P 7600 900
F 0 "UEG41" H 7625 1167 50  0000 C CNN
F 1 "NAND02" H 7625 1076 50  0000 C CNN
F 2 "" H 7600 900 50  0001 C CNN
F 3 "" H 7600 900 50  0001 C CNN
	1    7600 900 
	1    0    0    -1  
$EndComp
$Comp
L A5C:NAND02 UEF34
U 1 1 61118E50
P 7600 1350
F 0 "UEF34" H 7625 1617 50  0000 C CNN
F 1 "NAND02" H 7625 1526 50  0000 C CNN
F 2 "" H 7600 1350 50  0001 C CNN
F 3 "" H 7600 1350 50  0001 C CNN
	1    7600 1350
	1    0    0    -1  
$EndComp
$Comp
L A5C:NAND02 UEG48
U 1 1 61118E5A
P 7600 1800
F 0 "UEG48" H 7625 2067 50  0000 C CNN
F 1 "NAND02" H 7625 1976 50  0000 C CNN
F 2 "" H 7600 1800 50  0001 C CNN
F 3 "" H 7600 1800 50  0001 C CNN
	1    7600 1800
	1    0    0    -1  
$EndComp
$Comp
L A5C:NAND02 UEF47
U 1 1 61118E59
P 7600 2250
F 0 "UEF47" H 7625 2517 50  0000 C CNN
F 1 "NAND02" H 7625 2426 50  0000 C CNN
F 2 "" H 7600 2250 50  0001 C CNN
F 3 "" H 7600 2250 50  0001 C CNN
	1    7600 2250
	1    0    0    -1  
$EndComp
$Comp
L A5C:NAND02 UEF42
U 1 1 61118E58
P 7600 2700
F 0 "UEF42" H 7625 2967 50  0000 C CNN
F 1 "NAND02" H 7625 2876 50  0000 C CNN
F 2 "" H 7600 2700 50  0001 C CNN
F 3 "" H 7600 2700 50  0001 C CNN
	1    7600 2700
	1    0    0    -1  
$EndComp
$Comp
L A5C:INV01 UEH128
U 1 1 65413521
P 2650 10050
F 0 "UEH128" H 2650 10367 50  0000 C CNN
F 1 "INV01" H 2650 10276 50  0000 C CNN
F 2 "" H 2650 9850 50  0001 C CNN
F 3 "" H 2650 9850 50  0001 C CNN
	1    2650 10050
	1    0    0    -1  
$EndComp
$Comp
L A5C:INV01 UEH87
U 1 1 653DAB08
P 2650 10550
F 0 "UEH87" H 2650 10867 50  0000 C CNN
F 1 "INV01" H 2650 10776 50  0000 C CNN
F 2 "" H 2650 10350 50  0001 C CNN
F 3 "" H 2650 10350 50  0001 C CNN
	1    2650 10550
	1    0    0    -1  
$EndComp
$Comp
L A5C:INV01 UEG142
U 1 1 663927C7
P 3200 8950
F 0 "UEG142" H 3200 9267 50  0000 C CNN
F 1 "INV01" H 3200 9176 50  0000 C CNN
F 2 "" H 3200 8750 50  0001 C CNN
F 3 "" H 3200 8750 50  0001 C CNN
	1    3200 8950
	1    0    0    -1  
$EndComp
$Comp
L A5C:OR03 UEH13
U 1 1 64B6A69E
P 7000 8550
F 0 "UEH13" H 7000 8867 50  0000 C CNN
F 1 "OR03" H 7000 8776 50  0000 C CNN
F 2 "" H 7000 8550 50  0001 C CNN
F 3 "" H 7000 8550 50  0001 C CNN
	1    7000 8550
	1    0    0    -1  
$EndComp
$Comp
L A5C:DFFCOO UEF100
U 1 1 61118E4E
P 6150 2900
F 0 "UEF100" H 6150 3265 50  0000 C CNN
F 1 "DFFCOO" H 6150 3174 50  0000 C CNN
F 2 "" H 6150 2900 50  0001 C CNN
F 3 "" H 6150 2900 50  0001 C CNN
	1    6150 2900
	1    0    0    -1  
$EndComp
$Comp
L A5C:DFFCOO UEG148
U 1 1 61118E40
P 6150 6300
F 0 "UEG148" H 6150 6665 50  0000 C CNN
F 1 "DFFCOO" H 6150 6574 50  0000 C CNN
F 2 "" H 6150 6300 50  0001 C CNN
F 3 "" H 6150 6300 50  0001 C CNN
	1    6150 6300
	1    0    0    -1  
$EndComp
$Comp
L A5C:DFFCOO UEH78
U 1 1 61EEE694
P 6150 9700
F 0 "UEH78" H 6150 10065 50  0000 C CNN
F 1 "DFFCOO" H 6150 9974 50  0000 C CNN
F 2 "" H 6150 9700 50  0001 C CNN
F 3 "" H 6150 9700 50  0001 C CNN
	1    6150 9700
	1    0    0    -1  
$EndComp
$Comp
L A5C:DFFCOO UEF38
U 1 1 61118E52
P 9450 1900
F 0 "UEF38" H 9450 2265 50  0000 C CNN
F 1 "DFFCOO" H 9450 2174 50  0000 C CNN
F 2 "" H 9450 1900 50  0001 C CNN
F 3 "" H 9450 1900 50  0001 C CNN
	1    9450 1900
	1    0    0    -1  
$EndComp
$Comp
L A5C:DFFCOO UEF133
U 1 1 61118E57
P 9450 3650
F 0 "UEF133" H 9450 4015 50  0000 C CNN
F 1 "DFFCOO" H 9450 3924 50  0000 C CNN
F 2 "" H 9450 3650 50  0001 C CNN
F 3 "" H 9450 3650 50  0001 C CNN
	1    9450 3650
	1    0    0    -1  
$EndComp
$Comp
L A5C:DFFCOO UEF161
U 1 1 61118E54
P 9450 5300
F 0 "UEF161" H 9450 5665 50  0000 C CNN
F 1 "DFFCOO" H 9450 5574 50  0000 C CNN
F 2 "" H 9450 5300 50  0001 C CNN
F 3 "" H 9450 5300 50  0001 C CNN
	1    9450 5300
	1    0    0    -1  
$EndComp
$Comp
L A5C:DFFCOO UEG158
U 1 1 61118E41
P 9450 7050
F 0 "UEG158" H 9450 7415 50  0000 C CNN
F 1 "DFFCOO" H 9450 7324 50  0000 C CNN
F 2 "" H 9450 7050 50  0001 C CNN
F 3 "" H 9450 7050 50  0001 C CNN
	1    9450 7050
	1    0    0    -1  
$EndComp
$Comp
L A5C:DFFCOO UEH5
U 1 1 61E803F4
P 9450 8700
F 0 "UEH5" H 9450 9065 50  0000 C CNN
F 1 "DFFCOO" H 9450 8974 50  0000 C CNN
F 2 "" H 9450 8700 50  0001 C CNN
F 3 "" H 9450 8700 50  0001 C CNN
	1    9450 8700
	1    0    0    -1  
$EndComp
$Comp
L A5C:DFFCOO UEH23
U 1 1 6181FE30
P 9450 10450
F 0 "UEH23" H 9450 10815 50  0000 C CNN
F 1 "DFFCOO" H 9450 10724 50  0000 C CNN
F 2 "" H 9450 10450 50  0001 C CNN
F 3 "" H 9450 10450 50  0001 C CNN
	1    9450 10450
	1    0    0    -1  
$EndComp
$Comp
L A5C:NAND05 UEF44
U 1 1 61118E5B
P 8600 1800
F 0 "UEF44" H 8625 2190 50  0000 C CNN
F 1 "NAND05" H 8625 2099 50  0000 C CNN
F 2 "" H 8600 1500 50  0001 C CNN
F 3 "" H 8600 1500 50  0001 C CNN
	1    8600 1800
	1    0    0    -1  
$EndComp
$Comp
L A5C:AOI32 UEG106
U 1 1 61118E4F
P 5250 2800
F 0 "UEG106" H 5250 3242 50  0000 C CNN
F 1 "AOI32" H 5250 3151 50  0000 C CNN
F 2 "" H 5400 2800 50  0001 C CNN
F 3 "" H 5400 2800 50  0001 C CNN
	1    5250 2800
	1    0    0    -1  
$EndComp
$Comp
L A5C:AOI32 UEG139
U 1 1 61118E3F
P 5250 6200
F 0 "UEG139" H 5250 6642 50  0000 C CNN
F 1 "AOI32" H 5250 6551 50  0000 C CNN
F 2 "" H 5400 6200 50  0001 C CNN
F 3 "" H 5400 6200 50  0001 C CNN
	1    5250 6200
	1    0    0    -1  
$EndComp
$Comp
L A5C:AOI32 UEG93
U 1 1 61F973E0
P 5250 9600
F 0 "UEG93" H 5250 10042 50  0000 C CNN
F 1 "AOI32" H 5250 9951 50  0000 C CNN
F 2 "" H 5400 9600 50  0001 C CNN
F 3 "" H 5400 9600 50  0001 C CNN
	1    5250 9600
	1    0    0    -1  
$EndComp
$Comp
L A5C:AOI23 UEH9
U 1 1 61EABB25
P 8500 8450
F 0 "UEH9" H 8500 8767 50  0000 C CNN
F 1 "AOI23" H 8500 8676 50  0000 C CNN
F 2 "" H 8650 8450 50  0001 C CNN
F 3 "" H 8650 8450 50  0001 C CNN
	1    8500 8450
	1    0    0    -1  
$EndComp
$Comp
L A5C:AOI24 UEF105
U 1 1 61118E56
P 8500 3550
F 0 "UEF105" H 8500 4117 50  0000 C CNN
F 1 "AOI24" H 8500 4026 50  0000 C CNN
F 2 "" H 8700 3850 50  0001 C CNN
F 3 "" H 8700 3850 50  0001 C CNN
	1    8500 3550
	1    0    0    -1  
$EndComp
$Comp
L A5C:AOI24 UEE166
U 1 1 61118E53
P 8500 5200
F 0 "UEE166" H 8500 5767 50  0000 C CNN
F 1 "AOI24" H 8500 5676 50  0000 C CNN
F 2 "" H 8700 5500 50  0001 C CNN
F 3 "" H 8700 5500 50  0001 C CNN
	1    8500 5200
	1    0    0    -1  
$EndComp
$Comp
L A5C:AOI24 UEG152
U 1 1 61118E42
P 8500 6950
F 0 "UEG152" H 8500 7517 50  0000 C CNN
F 1 "AOI24" H 8500 7426 50  0000 C CNN
F 2 "" H 8700 7250 50  0001 C CNN
F 3 "" H 8700 7250 50  0001 C CNN
	1    8500 6950
	1    0    0    -1  
$EndComp
$Comp
L A5C:AOI24 UEH27
U 1 1 61B70EEF
P 8500 10350
F 0 "UEH27" H 8500 10917 50  0000 C CNN
F 1 "AOI24" H 8500 10826 50  0000 C CNN
F 2 "" H 8700 10650 50  0001 C CNN
F 3 "" H 8700 10650 50  0001 C CNN
	1    8500 10350
	1    0    0    -1  
$EndComp
Wire Bus Line
	1400 4600 1400 4900
Wire Bus Line
	1400 5450 1400 6500
Wire Bus Line
	10500 1200 10500 10350
Wire Bus Line
	10750 1350 10750 8500
$EndSCHEMATC
