EESchema Schematic File Version 4
EELAYER 30 0
EELAYER END
$Descr A3 16535 11693
encoding utf-8
Sheet 1 20
Title "DL-1727"
Date "2020-04-26"
Rev ""
Comp ""
Comment1 ""
Comment2 "Licence: CC-BY"
Comment3 "Author: Loic *WydD* Petit"
Comment4 "Project: CPS2 Reverse Engineering: DL-1727"
$EndDescr
$Sheet
S 3350 1650 1150 600 
U 5EB56025
F0 "addr-bus-enable" 50
F1 "addr-bus-enable.sch" 50
F2 "OUT[1..23]" O R 4500 1800 50 
F3 "IN[1..23]" I L 3350 1800 50 
F4 "~ENABLE-HI" I L 3350 2000 50 
F5 "~ENABLE-LO" I L 3350 2100 50 
$EndSheet
$Sheet
S 5200 4000 1500 500 
U 5EB97401
F0 "addr-decoder-high" 50
F1 "addr-decoder-high.sch" 50
F2 "ADDR[14..23]" I L 5200 4150 50 
F3 "~BUS-AS" I L 5200 4350 50 
F4 "~EXPANSION-RANGE" O R 6700 4150 50 
F5 "~REGISTER-RANGE-HI" O R 6700 4250 50 
$EndSheet
$Sheet
S 5200 4950 1500 950 
U 5EB97AFA
F0 "addr-decoder-low" 50
F1 "addr-decoder-low.sch" 50
F2 "ADDR[4..8]" I L 5200 5150 50 
F3 "~REGISTER-RANGE-LO" O R 6700 5150 50 
F4 "0x08x" O R 6700 5300 50 
F5 "0x0Ex" O R 6700 5700 50 
F6 "0x0Ax" O R 6700 5500 50 
F7 "0x0Bx" O R 6700 5600 50 
F8 "0x09x" O R 6700 5400 50 
$EndSheet
$Sheet
S 10900 3600 1650 1500
U 5EBEBBD5
F0 "bus-control" 50
F1 "bus-control.sch" 50
F2 "REGA" I L 10900 4950 50 
F3 "REG9-OUT" O R 12550 4950 50 
F4 "~A-BOARD-CONNECTED" I L 10900 4550 50 
F5 "BUS-DIR" I L 10900 3750 50 
F6 "~BUS-E" I L 10900 3850 50 
F7 "~REGISTER-RANGE-LO" I L 10900 4350 50 
F8 "~REGISTER-RANGE-HI" I L 10900 4250 50 
F9 "~EXPANSION-RANGE" I L 10900 4150 50 
F10 "~EXPANSION-E" O R 12550 4200 50 
F11 "~ENABLE" I L 10900 4750 50 
F12 "CBUS-DATA-DIR" O R 12550 4100 50 
F13 "~CBUS-ADDR-E" O R 12550 3900 50 
F14 "BUS-DATA-E" O R 12550 4550 50 
F15 "CPU-DATA-E" O R 12550 4650 50 
F16 "CBUS-ADDR-DIR" O R 12550 3800 50 
F17 "~ENABLE-DATA" I L 10900 4050 50 
F18 "ENABLE-ADDR" I L 10900 4650 50 
$EndSheet
$Sheet
S 1200 6600 1700 1500
U 5EDF0382
F0 "bus-control-in" 50
F1 "bus-control-in.sch" 50
F2 "_CLK2M" I L 1200 6800 50 
F3 "_CLK16M" I L 1200 6900 50 
F4 "_~BUS-E" I L 1200 7050 50 
F5 "_~BUS-AS" I L 1200 7150 50 
F6 "_~BUS-R" I L 1200 7250 50 
F7 "_~BUS-LDSW" I L 1200 7350 50 
F8 "_~BUS-UDSW" I L 1200 7450 50 
F9 "CLK2M" O R 2900 6800 50 
F10 "CLK16M" O R 2900 6900 50 
F11 "~BUS-E" O R 2900 7050 50 
F12 "~BUS-AS" O R 2900 7150 50 
F13 "~BUS-R" O R 2900 7250 50 
F14 "~BUS-LDSW" O R 2900 7350 50 
F15 "~BUS-UDSW" O R 2900 7450 50 
F16 "~ENABLE" I L 1200 7800 50 
F17 "~RESET-REGISTERS" O R 2900 7600 50 
F18 "_~RESET-REGISTERS" I L 1200 7600 50 
F19 "DEBUG-H[0..7]" O L 1200 7950 50 
$EndSheet
$Sheet
S 1200 8400 1050 2350
U 5EAF1100
F0 "bus-data" 50
F1 "bus-data-output.sch" 50
F2 "DATA0" B L 1200 8550 50 
F3 "DATA1" B L 1200 8650 50 
F4 "DATA2" B L 1200 8750 50 
F5 "DATA3" B L 1200 8850 50 
F6 "DATA4" B L 1200 8950 50 
F7 "DATA5" B L 1200 9050 50 
F8 "DATA6" B L 1200 9150 50 
F9 "DATA7" B L 1200 9250 50 
F10 "DATA8" B L 1200 9350 50 
F11 "DATA9" B L 1200 9450 50 
F12 "DATA10" B L 1200 9550 50 
F13 "DATA11" B L 1200 9650 50 
F14 "DATA12" B L 1200 9750 50 
F15 "DATA13" B L 1200 9850 50 
F16 "DATA14" B L 1200 9950 50 
F17 "DATA15" B L 1200 10050 50 
F18 "IN-ENABLE" I L 1200 10500 50 
F19 "OUT-ENABLE" I L 1200 10600 50 
F20 "IN[0..15]" O R 2250 8900 50 
F21 "OUT[0..15]" I R 2250 9300 50 
F22 "D[0..7]" O R 2250 9750 50 
F23 "C[0..7]" O R 2250 9650 50 
$EndSheet
$Sheet
S 7500 9050 1100 650 
U 5EA485B1
F0 "cpu-bus-data-buffer" 50
F1 "cpu-bus-data-buffer.sch" 50
F2 "IN[0..15]" I R 8600 9300 50 
F3 "OUT[0..15]" O L 7500 9300 50 
F4 "DATA[0..15]" O L 7500 9200 50 
F5 "B[0..7]" O R 8600 9600 50 
F6 "A[0..7]" O R 8600 9500 50 
$EndSheet
$Sheet
S 14200 7650 1050 2100
U 5EA35F5E
F0 "cpu-data-input" 50
F1 "cpu-data-input.sch" 50
F2 "DATA0" B R 15250 7800 50 
F3 "DATA1" B R 15250 7900 50 
F4 "DATA2" B R 15250 8000 50 
F5 "DATA3" B R 15250 8100 50 
F6 "DATA4" B R 15250 8200 50 
F7 "DATA5" B R 15250 8300 50 
F8 "DATA6" B R 15250 8400 50 
F9 "DATA7" B R 15250 8500 50 
F10 "DATA8" B R 15250 8600 50 
F11 "DATA9" B R 15250 8700 50 
F12 "DATA10" B R 15250 8800 50 
F13 "DATA11" B R 15250 8900 50 
F14 "DATA12" B R 15250 9000 50 
F15 "DATA13" B R 15250 9100 50 
F16 "DATA14" B R 15250 9200 50 
F17 "DATA15" B R 15250 9300 50 
F18 "IN-ENABLE" I R 15250 9500 50 
F19 "OUT-ENABLE" I R 15250 9600 50 
F20 "IN[0..15]" O L 14200 9300 50 
F21 "OUT[0..15]" I L 14200 8900 50 
$EndSheet
$Sheet
S 10400 9450 850  1650
U 5EC30FEB
F0 "debug-mux" 50
F1 "debug-mux.sch" 50
F2 "Q4" O R 11250 10000 50 
F3 "Q5" O R 11250 10100 50 
F4 "Q6" O R 11250 10200 50 
F5 "Q7" O R 11250 10300 50 
F6 "~OUT" I L 10400 9600 50 
F7 "S0" I L 10400 9800 50 
F8 "S1" I L 10400 9900 50 
F9 "S2" I L 10400 10000 50 
F10 "A[0..7]" I L 10400 10200 50 
F11 "B[0..7]" I L 10400 10300 50 
F12 "C[0..7]" I L 10400 10400 50 
F13 "D[0..7]" I L 10400 10500 50 
F14 "E[0..7]" I L 10400 10600 50 
F15 "F[0..7]" I L 10400 10700 50 
F16 "G[0..7]" I L 10400 10800 50 
F17 "H[0..7]" I L 10400 10900 50 
F18 "Q0" O R 11250 9600 50 
F19 "Q1" O R 11250 9700 50 
F20 "Q2" O R 11250 9800 50 
F21 "Q3" O R 11250 9900 50 
$EndSheet
$Sheet
S 1200 4200 1400 1650
U 5ED98457
F0 "enable" 50
F1 "enable.sch" 50
F2 "ENABLE-ADDR" I L 1200 4650 50 
F3 "~ADDR-BUS-HI" O R 2600 4650 50 
F4 "~ADDR-BUS-LO" O R 2600 4750 50 
F5 "~VCC-OK" O R 2600 4500 50 
F6 "~OUT-DEBUG" O R 2600 5700 50 
F7 "~RESET" O R 2600 4350 50 
F8 "_VCC-OK" I L 1200 4350 50 
F9 "ENABLE-CLK" O R 2600 5500 50 
F10 "_DEBUG" I L 1200 5700 50 
F11 "IN-ENABLE" O R 2600 5400 50 
F12 "~ENABLE1" O R 2600 5050 50 
F13 "~ENABLE3" O R 2600 5250 50 
F14 "~ENABLE2" O R 2600 5150 50 
F15 "ENABLE-ADDR-OUT" O R 2600 4850 50 
$EndSheet
$Sheet
S 10450 7050 800  600 
U 5EBFD97C
F0 "reg9-mux" 50
F1 "reg9-mux.sch" 50
F2 "Q[0..4]" O R 11250 7350 50 
F3 "B[0..4]" I L 10450 7500 50 
F4 "A[0..4]" I L 10450 7350 50 
F5 "~A~B" I L 10450 7150 50 
$EndSheet
Text Label 15300 9600 0    50   ~ 0
CPU-DATA-E
Text Label 15300 9500 0    50   ~ 0
IN-ENABLE
Text GLabel 15350 9300 2    50   BiDi ~ 0
2
Text GLabel 15350 9200 2    50   BiDi ~ 0
3
Text GLabel 15350 9100 2    50   BiDi ~ 0
4
Text GLabel 15350 9000 2    50   BiDi ~ 0
5
Text GLabel 15350 8900 2    50   BiDi ~ 0
6
Text GLabel 15350 8800 2    50   BiDi ~ 0
7
Text GLabel 15350 8700 2    50   BiDi ~ 0
8
Text GLabel 15350 8600 2    50   BiDi ~ 0
9
Text GLabel 15350 8300 2    50   BiDi ~ 0
13
Text GLabel 15350 8200 2    50   BiDi ~ 0
14
Text GLabel 15350 8100 2    50   BiDi ~ 0
15
Text GLabel 15350 8000 2    50   BiDi ~ 0
16
Text GLabel 15350 7900 2    50   BiDi ~ 0
17
Text GLabel 15350 7800 2    50   BiDi ~ 0
18
Wire Wire Line
	15350 8600 15250 8600
Wire Wire Line
	15350 8700 15250 8700
Wire Wire Line
	15350 8800 15250 8800
Wire Wire Line
	15350 8900 15250 8900
Wire Wire Line
	15350 9000 15250 9000
Wire Wire Line
	15350 9100 15250 9100
Wire Wire Line
	15350 9200 15250 9200
Wire Wire Line
	15350 9300 15250 9300
Text GLabel 15350 8400 2    50   BiDi ~ 0
12
Text GLabel 15350 8500 2    50   BiDi ~ 0
11
Wire Wire Line
	15350 7800 15250 7800
Wire Wire Line
	15350 7900 15250 7900
Wire Wire Line
	15350 8000 15250 8000
Wire Wire Line
	15350 8100 15250 8100
Wire Wire Line
	15350 8200 15250 8200
Wire Wire Line
	15350 8300 15250 8300
Wire Wire Line
	15350 8400 15250 8400
Wire Wire Line
	15350 8500 15250 8500
Wire Wire Line
	15250 9500 15850 9500
Wire Wire Line
	15250 9600 15850 9600
Text Notes 15700 7700 2    50   ~ 0
CPU-DATA
Text Label 1150 10600 2    50   ~ 0
BUS-DATA-E
Text Label 1150 10500 2    50   ~ 0
IN-ENABLE
Wire Wire Line
	1200 9350 1100 9350
Wire Wire Line
	1200 9450 1100 9450
Wire Wire Line
	1200 9550 1100 9550
Wire Wire Line
	1200 9650 1100 9650
Wire Wire Line
	1200 9750 1100 9750
Wire Wire Line
	1200 9850 1100 9850
Wire Wire Line
	1200 9950 1100 9950
Wire Wire Line
	1200 10050 1100 10050
Wire Wire Line
	1200 8550 1100 8550
Wire Wire Line
	1200 8650 1100 8650
Wire Wire Line
	1200 8750 1100 8750
Wire Wire Line
	1200 8850 1100 8850
Wire Wire Line
	1200 8950 1100 8950
Wire Wire Line
	1200 9050 1100 9050
Wire Wire Line
	1200 9150 1100 9150
Wire Wire Line
	1200 9250 1100 9250
Text GLabel 1100 10050 0    50   BiDi ~ 0
112
Text GLabel 1100 9950 0    50   BiDi ~ 0
113
Text GLabel 1100 9850 0    50   BiDi ~ 0
116
Text GLabel 1100 9750 0    50   BiDi ~ 0
117
Text GLabel 1100 9650 0    50   BiDi ~ 0
118
Text GLabel 1100 9550 0    50   BiDi ~ 0
119
Text GLabel 1100 9450 0    50   BiDi ~ 0
122
Text GLabel 1100 9350 0    50   BiDi ~ 0
123
Text GLabel 1100 9250 0    50   BiDi ~ 0
124
Text GLabel 1100 9150 0    50   BiDi ~ 0
126
Text GLabel 1100 9050 0    50   BiDi ~ 0
127
Text GLabel 1100 8950 0    50   BiDi ~ 0
128
Text GLabel 1100 8850 0    50   BiDi ~ 0
129
Text GLabel 1100 8750 0    50   BiDi ~ 0
131
Text GLabel 1100 8650 0    50   BiDi ~ 0
132
Text GLabel 1100 8550 0    50   BiDi ~ 0
133
$Sheet
S 14050 1100 1200 1700
U 5ED34A44
F0 "misc-data-bus" 50
F1 "misc-data-bus.sch" 50
F2 "DATA7" B R 15250 1950 50 
F3 "DATA6" B R 15250 1850 50 
F4 "DATA5" B R 15250 1750 50 
F5 "DATA4" B R 15250 1650 50 
F6 "DATA3" B R 15250 1550 50 
F7 "DATA2" B R 15250 1450 50 
F8 "DATA1" B R 15250 1350 50 
F9 "DATA0" B R 15250 1250 50 
F10 "S2" I L 14050 2350 50 
F11 "S1" I L 14050 2250 50 
F12 "S0" I L 14050 2150 50 
F13 "~OUT-ENABLE" I R 15250 2150 50 
F14 "IN-ENABLE" I R 15250 2250 50 
F15 "REG8-D[0..10]" O R 15250 2450 50 
F16 "DF[0..7]" O R 15250 2650 50 
$EndSheet
$Sheet
S 13650 3250 1600 1800
U 5EDE5EB8
F0 "bus-control-out" 50
F1 "bus-control-out.sch" 50
F2 "_CLK2M" O R 15250 3500 50 
F3 "_CLK16M" O R 15250 3600 50 
F4 "_~RESETI" O R 15250 3400 50 
F5 "CLK2M" I L 13650 3500 50 
F6 "CLK16M" I L 13650 3600 50 
F7 "~RESETI" I L 13650 3400 50 
F8 "~ENABLE" I R 15250 4750 50 
F9 "_REGA" O R 15250 4400 50 
F10 "REGA" I L 13650 4400 50 
F11 "REG8" I L 13650 4500 50 
F12 "_REG8" O R 15250 4500 50 
F13 "~OBJRAM-BANK-W" I L 13650 4300 50 
F14 "_~OBJRAM-BANK-W" O R 15250 4300 50 
F15 "_~EXPANSION-E" O R 15250 4200 50 
F16 "~EXPANSION-E" I L 13650 4200 50 
F17 "_~REGB-R" O R 15250 4000 50 
F18 "_CBUS-DATA-DIR" O R 15250 4100 50 
F19 "CBUS-ADDR-DIR" I L 13650 3800 50 
F20 "~CBUS-ADDR-E" I L 13650 3900 50 
F21 "~REGB-R" I L 13650 4000 50 
F22 "CBUS-DATA-DIR" I L 13650 4100 50 
F23 "_~CBUS-ADDR-E" O R 15250 3900 50 
F24 "_CBUS-ADDR-DIR" O R 15250 3800 50 
F25 "ENABLE-CLK" I R 15250 4850 50 
$EndSheet
Text GLabel 10300 9800 0    50   Input ~ 0
87
Text GLabel 10300 9900 0    50   Input ~ 0
86
Text GLabel 10300 10000 0    50   Input ~ 0
85
Wire Wire Line
	10300 9800 10400 9800
Wire Wire Line
	10300 9900 10400 9900
Wire Wire Line
	10300 10000 10400 10000
Text GLabel 11350 10300 2    50   3State ~ 0
74
Text GLabel 11350 10200 2    50   3State ~ 0
92
Text GLabel 11350 10100 2    50   3State ~ 0
114
Text GLabel 11350 10000 2    50   3State ~ 0
115
Text GLabel 11350 9900 2    50   3State ~ 0
125
Text GLabel 11350 9800 2    50   3State ~ 0
134
Text GLabel 11350 9700 2    50   3State ~ 0
155
Text GLabel 11350 9600 2    50   3State ~ 0
156
Wire Wire Line
	11250 9600 11350 9600
Wire Wire Line
	11250 9700 11350 9700
Wire Wire Line
	11250 9800 11350 9800
Wire Wire Line
	11250 9900 11350 9900
Wire Wire Line
	11250 10000 11350 10000
Wire Wire Line
	11250 10100 11350 10100
Wire Wire Line
	11250 10200 11350 10200
Wire Wire Line
	11250 10300 11350 10300
Text Label 9850 9600 0    50   ~ 0
~OUT-DEBUG
Wire Wire Line
	9800 9600 10400 9600
Text Label 2000 3700 2    50   ~ 0
~VCC-OK
Text GLabel 1150 3000 0    50   Input ~ 0
47
Text GLabel 1150 2900 0    50   Input ~ 0
48
Text GLabel 1150 2800 0    50   Input ~ 0
49
Text GLabel 1150 2700 0    50   Input ~ 0
52
Text GLabel 1150 2600 0    50   Input ~ 0
53
Text GLabel 1150 2500 0    50   Input ~ 0
55
Text GLabel 1150 2400 0    50   Input ~ 0
57
Text GLabel 1150 2300 0    50   Input ~ 0
62
Text GLabel 1150 2200 0    50   Input ~ 0
63
Text GLabel 1150 2100 0    50   Input ~ 0
64
Text GLabel 1150 2000 0    50   Input ~ 0
93
Text GLabel 1150 1900 0    50   Input ~ 0
94
Text GLabel 1150 1800 0    50   Input ~ 0
95
Text GLabel 1150 1700 0    50   Input ~ 0
96
Text GLabel 1150 1600 0    50   Input ~ 0
97
Text GLabel 1150 1500 0    50   Input ~ 0
98
Text GLabel 1150 1400 0    50   Input ~ 0
99
Text GLabel 1150 1300 0    50   Input ~ 0
101
Text GLabel 1150 1200 0    50   Input ~ 0
102
Text GLabel 1150 1100 0    50   Input ~ 0
103
Text GLabel 1150 1000 0    50   Input ~ 0
104
Text GLabel 1150 900  0    50   Input ~ 0
105
Text GLabel 1150 800  0    50   Input ~ 0
106
Wire Wire Line
	1150 800  1250 800 
Wire Wire Line
	1150 900  1250 900 
Wire Wire Line
	1150 1000 1250 1000
Wire Wire Line
	1150 1100 1250 1100
Wire Wire Line
	1150 1200 1250 1200
Wire Wire Line
	1150 1300 1250 1300
Wire Wire Line
	1150 1400 1250 1400
Wire Wire Line
	1150 1500 1250 1500
Wire Wire Line
	1150 1600 1250 1600
Wire Wire Line
	1150 1700 1250 1700
Wire Wire Line
	1150 1800 1250 1800
Wire Wire Line
	1150 1900 1250 1900
Wire Wire Line
	1150 2000 1250 2000
Wire Wire Line
	1150 2100 1250 2100
Wire Wire Line
	1150 2200 1250 2200
Wire Wire Line
	1150 2300 1250 2300
Wire Wire Line
	1150 2400 1250 2400
Wire Wire Line
	1150 2500 1250 2500
Wire Wire Line
	1150 2600 1250 2600
Wire Wire Line
	1150 2700 1250 2700
Wire Wire Line
	1150 2800 1250 2800
Wire Wire Line
	1150 2900 1250 2900
Wire Wire Line
	1150 3000 1250 3000
$Sheet
S 1250 650  1150 2800
U 5EB448DF
F0 "cpu-addr-input" 50
F1 "cpu-addr-input.sch" 50
F2 "~ENABLE" I L 1250 3300 50 
F3 "IN[1..23]" O R 2400 1800 50 
F4 "ADDR1" I L 1250 800 50 
F5 "ADDR2" I L 1250 900 50 
F6 "ADDR3" I L 1250 1000 50 
F7 "ADDR4" I L 1250 1100 50 
F8 "ADDR5" I L 1250 1200 50 
F9 "ADDR6" I L 1250 1300 50 
F10 "ADDR7" I L 1250 1400 50 
F11 "ADDR8" I L 1250 1500 50 
F12 "ADDR9" I L 1250 1600 50 
F13 "ADDR10" I L 1250 1700 50 
F14 "ADDR11" I L 1250 1800 50 
F15 "ADDR12" I L 1250 1900 50 
F16 "ADDR13" I L 1250 2000 50 
F17 "ADDR14" I L 1250 2100 50 
F18 "ADDR15" I L 1250 2200 50 
F19 "ADDR16" I L 1250 2300 50 
F20 "ADDR17" I L 1250 2400 50 
F21 "ADDR18" I L 1250 2500 50 
F22 "ADDR19" I L 1250 2600 50 
F23 "ADDR20" I L 1250 2700 50 
F24 "ADDR21" I L 1250 2800 50 
F25 "ADDR22" I L 1250 2900 50 
F26 "ADDR23" I L 1250 3000 50 
$EndSheet
Text GLabel 6450 3000 2    50   3State ~ 0
21
Text GLabel 6450 2900 2    50   3State ~ 0
22
Text GLabel 6450 2800 2    50   3State ~ 0
27
Text GLabel 6450 2700 2    50   3State ~ 0
28
Text GLabel 6450 2600 2    50   3State ~ 0
29
Text GLabel 6450 2500 2    50   3State ~ 0
37
Text GLabel 6450 2400 2    50   3State ~ 0
38
Text GLabel 6450 2300 2    50   3State ~ 0
39
Text GLabel 6450 2200 2    50   3State ~ 0
42
Text GLabel 6450 2100 2    50   3State ~ 0
43
Text GLabel 6450 2000 2    50   3State ~ 0
68
Text GLabel 6450 1900 2    50   3State ~ 0
69
Text GLabel 6450 1800 2    50   3State ~ 0
71
Text GLabel 6450 1700 2    50   3State ~ 0
72
Text GLabel 6450 1600 2    50   3State ~ 0
73
Text GLabel 6450 1500 2    50   3State ~ 0
78
Text GLabel 6450 1400 2    50   3State ~ 0
79
Text GLabel 6450 1300 2    50   3State ~ 0
82
Text GLabel 6450 1200 2    50   3State ~ 0
83
Text GLabel 6450 1100 2    50   3State ~ 0
84
Text GLabel 6450 1000 2    50   3State ~ 0
88
Text GLabel 6450 900  2    50   3State ~ 0
89
Text GLabel 6450 800  2    50   3State ~ 0
91
$Sheet
S 5200 650  1150 2800
U 5EB62C91
F0 "bus-addr-output" 50
F1 "bus-addr-output.sch" 50
F2 "OUT[1..23]" I L 5200 1800 50 
F3 "ENABLE" I R 6350 3250 50 
F4 "ADDR1" O R 6350 800 50 
F5 "ADDR2" O R 6350 900 50 
F6 "ADDR3" O R 6350 1000 50 
F7 "ADDR4" O R 6350 1100 50 
F8 "ADDR5" O R 6350 1200 50 
F9 "ADDR6" O R 6350 1300 50 
F10 "ADDR7" O R 6350 1400 50 
F11 "ADDR8" O R 6350 1500 50 
F12 "ADDR9" O R 6350 1600 50 
F13 "ADDR10" O R 6350 1700 50 
F14 "ADDR11" O R 6350 1800 50 
F15 "ADDR12" O R 6350 1900 50 
F16 "ADDR13" O R 6350 2000 50 
F17 "ADDR14" O R 6350 2100 50 
F18 "ADDR15" O R 6350 2200 50 
F19 "ADDR16" O R 6350 2300 50 
F20 "ADDR17" O R 6350 2400 50 
F21 "ADDR18" O R 6350 2500 50 
F22 "ADDR19" O R 6350 2600 50 
F23 "ADDR20" O R 6350 2700 50 
F24 "ADDR21" O R 6350 2800 50 
F25 "ADDR22" O R 6350 2900 50 
F26 "ADDR23" O R 6350 3000 50 
$EndSheet
Wire Wire Line
	6350 800  6450 800 
Wire Wire Line
	6350 900  6450 900 
Wire Wire Line
	6350 1000 6450 1000
Wire Wire Line
	6350 1100 6450 1100
Wire Wire Line
	6350 1200 6450 1200
Wire Wire Line
	6350 1300 6450 1300
Wire Wire Line
	6350 1400 6450 1400
Wire Wire Line
	6350 1500 6450 1500
Wire Wire Line
	6350 1600 6450 1600
Wire Wire Line
	6350 1700 6450 1700
Wire Wire Line
	6350 1800 6450 1800
Wire Wire Line
	6350 1900 6450 1900
Wire Wire Line
	6350 2000 6450 2000
Wire Wire Line
	6350 2100 6450 2100
Wire Wire Line
	6350 2200 6450 2200
Wire Wire Line
	6350 2300 6450 2300
Wire Wire Line
	6350 2400 6450 2400
Wire Wire Line
	6350 2500 6450 2500
Wire Wire Line
	6350 2600 6450 2600
Wire Wire Line
	6350 2700 6450 2700
Wire Wire Line
	6350 2800 6450 2800
Wire Wire Line
	6350 2900 6450 2900
Wire Wire Line
	6350 3000 6450 3000
Wire Bus Line
	5200 4150 4750 4150
Wire Bus Line
	4750 1800 5200 1800
Wire Bus Line
	4750 5150 5200 5150
Text GLabel 7600 2150 0    50   Input ~ 0
77
Text GLabel 7600 2250 0    50   Input ~ 0
76
Text GLabel 7600 2350 0    50   Input ~ 0
75
Text GLabel 7600 2800 0    50   Input ~ 0
24
Text GLabel 7600 2500 0    50   Input ~ 0
54
Text GLabel 7600 2650 0    50   Input ~ 0
141
Text GLabel 7600 2950 0    50   Input ~ 0
25
Wire Wire Line
	7600 2800 7700 2800
Wire Wire Line
	7600 2950 7700 2950
Wire Wire Line
	7600 2500 7700 2500
Wire Wire Line
	7600 2350 7700 2350
Wire Wire Line
	7600 2250 7700 2250
Wire Wire Line
	7600 2150 7700 2150
Wire Wire Line
	7600 2650 7700 2650
Text GLabel 7600 3050 0    50   Input ~ 0
34
Wire Wire Line
	7600 3050 7700 3050
Text GLabel 1100 7050 0    50   Input ~ 0
142
Text GLabel 1100 6800 0    50   Input ~ 0
51
Text GLabel 1100 6900 0    50   Input ~ 0
58
Text GLabel 1100 7150 0    50   Input ~ 0
143
Text GLabel 1100 7450 0    50   Input ~ 0
146
Text GLabel 1100 7250 0    50   Input ~ 0
144
Text GLabel 1100 7350 0    50   Input ~ 0
145
Text GLabel 1100 7600 0    50   Input ~ 0
61
Wire Wire Line
	1100 6800 1200 6800
Wire Wire Line
	1100 6900 1200 6900
Wire Wire Line
	1100 7600 1200 7600
Wire Wire Line
	1100 7050 1200 7050
Wire Wire Line
	1100 7150 1200 7150
Wire Wire Line
	1100 7250 1200 7250
Wire Wire Line
	1100 7350 1200 7350
Wire Wire Line
	1100 7450 1200 7450
Wire Wire Line
	6700 5300 7550 5300
Wire Wire Line
	6700 5400 7550 5400
Wire Wire Line
	6700 5500 7550 5500
Wire Wire Line
	6700 5600 7550 5600
Wire Wire Line
	6700 5700 7550 5700
Wire Wire Line
	7400 5150 7550 5150
Text Label 8050 8050 2    50   ~ 0
IN-ENABLE
Text Label 8050 7950 2    50   ~ 0
~ENABLE3
Wire Wire Line
	8100 7950 7500 7950
Wire Wire Line
	8100 8050 7500 8050
Text GLabel 8000 7300 0    50   BiDi ~ 0
107
Text GLabel 8000 7400 0    50   BiDi ~ 0
108
Text GLabel 8000 7500 0    50   BiDi ~ 0
109
Text GLabel 8000 7600 0    50   BiDi ~ 0
111
Text GLabel 8000 7100 0    50   BiDi ~ 0
32
Text GLabel 8000 7200 0    50   BiDi ~ 0
31
Wire Wire Line
	8100 7100 8000 7100
Wire Wire Line
	8100 7200 8000 7200
Wire Wire Line
	8100 7300 8000 7300
Wire Wire Line
	8100 7400 8000 7400
Wire Wire Line
	8100 7500 8000 7500
Wire Wire Line
	8100 7600 8000 7600
Wire Bus Line
	9250 7500 10450 7500
Wire Wire Line
	9250 5600 10350 5600
Wire Wire Line
	10450 7150 10350 7150
$Sheet
S 8100 6950 1150 1400
U 5EE26DF9
F0 "reg9-io" 50
F1 "reg9-io.sch" 50
F2 "DATA0" B L 8100 7100 50 
F3 "DATA1" B L 8100 7200 50 
F4 "DATA2" B L 8100 7300 50 
F5 "DATA3" B L 8100 7400 50 
F6 "DATA4" B L 8100 7500 50 
F7 "DATA15" B L 8100 7600 50 
F8 "~ENABLE-OUT15" I L 8100 7950 50 
F9 "ENABLE-OUT-LO" I L 8100 7850 50 
F10 "OUT[0..4]" I R 9250 7350 50 
F11 "ENABLE-IN" I L 8100 8050 50 
F12 "IN[0..4]" O R 9250 7500 50 
F13 "OUT15" I R 9250 7100 50 
F14 "IN15" O R 9250 7800 50 
F15 "_IN15" O R 9250 7900 50 
F16 "DE[3..7]" O R 9250 8200 50 
$EndSheet
Wire Wire Line
	7300 5150 6700 5150
Wire Bus Line
	11850 7350 11250 7350
Text GLabel 15350 4500 2    50   3State ~ 0
147
Text GLabel 15350 4400 2    50   3State ~ 0
137
Text Label 15350 4750 0    50   ~ 0
~ENABLE2
Text GLabel 15350 4000 2    50   3State ~ 0
46
Text GLabel 15350 4300 2    50   3State ~ 0
136
Text GLabel 15350 3800 2    50   3State ~ 0
44
Text GLabel 15350 3900 2    50   3State ~ 0
45
Text GLabel 15350 4100 2    50   3State ~ 0
65
Text GLabel 15350 4200 2    50   3State ~ 0
67
Wire Wire Line
	15250 3800 15350 3800
Wire Wire Line
	15250 3900 15350 3900
Wire Wire Line
	15250 4000 15350 4000
Wire Wire Line
	15250 4100 15350 4100
Wire Wire Line
	15250 4200 15350 4200
Wire Wire Line
	15250 4300 15350 4300
Wire Wire Line
	15250 4400 15350 4400
Wire Wire Line
	15250 4500 15350 4500
Text GLabel 15400 3500 2    50   Output ~ 0
135
Text GLabel 15400 3600 2    50   Output ~ 0
138
Wire Wire Line
	15250 3400 15400 3400
Wire Wire Line
	15250 3500 15400 3500
Wire Wire Line
	15250 3600 15400 3600
Text GLabel 1100 4350 0    50   Input ~ 0
56
Text GLabel 2700 4350 2    50   Output ~ 0
66
Wire Wire Line
	1100 4350 1200 4350
Text GLabel 1100 5700 0    50   Input ~ 0
35
Wire Wire Line
	1100 5700 1200 5700
Wire Wire Line
	2600 4350 2700 4350
Text GLabel 15350 1250 2    50   BiDi ~ 0
159
Text GLabel 15350 1350 2    50   BiDi ~ 0
158
Text GLabel 15350 1450 2    50   BiDi ~ 0
157
Text GLabel 15350 1550 2    50   BiDi ~ 0
153
Text GLabel 15350 1650 2    50   BiDi ~ 0
152
Text GLabel 15350 1750 2    50   BiDi ~ 0
151
Text GLabel 15350 1850 2    50   BiDi ~ 0
149
Text GLabel 15350 1950 2    50   BiDi ~ 0
148
Wire Wire Line
	15250 1250 15350 1250
Wire Wire Line
	15250 1350 15350 1350
Wire Wire Line
	15250 1450 15350 1450
Wire Wire Line
	15250 1550 15350 1550
Wire Wire Line
	15250 1650 15350 1650
Wire Wire Line
	15250 1750 15350 1750
Wire Wire Line
	15250 1850 15350 1850
Wire Wire Line
	15250 1950 15350 1950
Wire Wire Line
	9400 6350 9400 7100
Wire Bus Line
	9500 6250 9500 7350
Wire Wire Line
	6700 4250 7400 4250
Wire Wire Line
	7400 4250 7400 5150
Wire Wire Line
	7300 4350 7300 5150
Wire Wire Line
	10900 4950 10350 4950
Wire Wire Line
	10900 4350 7300 4350
Wire Wire Line
	10900 4250 7400 4250
Connection ~ 7400 4250
Wire Wire Line
	10900 4150 6700 4150
Wire Wire Line
	12550 4200 13650 4200
Wire Wire Line
	13650 4100 12550 4100
Wire Wire Line
	12550 3800 13650 3800
Wire Wire Line
	13650 3900 12550 3900
Wire Wire Line
	9250 7800 11850 7800
Text GLabel 15400 3400 2    50   Output ~ 0
154
Wire Wire Line
	10250 4650 10250 3050
Wire Wire Line
	9650 3050 10250 3050
Wire Wire Line
	9650 2950 10350 2950
Wire Bus Line
	2250 9300 7500 9300
Wire Wire Line
	2900 7050 3950 7050
Wire Wire Line
	3950 3850 10900 3850
Wire Wire Line
	3950 3850 3950 7050
Wire Wire Line
	3150 2000 3350 2000
Wire Wire Line
	3250 2100 3350 2100
Wire Wire Line
	2600 4650 3150 4650
Wire Wire Line
	2600 4750 3250 4750
Wire Wire Line
	2600 4500 3050 4500
Wire Bus Line
	4750 1800 4750 4150
Connection ~ 4750 4150
Wire Bus Line
	4750 4150 4750 5150
Wire Wire Line
	3150 2000 3150 4650
Wire Wire Line
	3250 2100 3250 4750
Wire Bus Line
	2400 1800 3350 1800
Wire Bus Line
	4500 1800 4750 1800
Connection ~ 4750 1800
Wire Wire Line
	2600 4850 3350 4850
Wire Wire Line
	3350 4850 3350 3600
Wire Wire Line
	3350 3600 6450 3600
Wire Wire Line
	6450 3600 6450 3250
Wire Wire Line
	6450 3250 6350 3250
Wire Wire Line
	6550 3700 3050 3700
Wire Wire Line
	6550 3250 7700 3250
Connection ~ 3050 3700
Wire Wire Line
	3050 3700 3050 4500
Wire Wire Line
	2900 6800 3350 6800
Text Label 3000 6800 0    50   ~ 0
CLK2M
Wire Wire Line
	2900 6900 3350 6900
Text Label 3000 6900 0    50   ~ 0
CLK16M
Wire Wire Line
	13650 3500 13200 3500
Text Label 13550 3500 2    50   ~ 0
CLK2M
Wire Wire Line
	13650 3600 13200 3600
Text Label 13550 3600 2    50   ~ 0
CLK16M
Wire Wire Line
	1200 10500 600  10500
Wire Wire Line
	600  10600 1200 10600
Text Label 2700 5400 0    50   ~ 0
IN-ENABLE
Wire Wire Line
	2600 5400 3200 5400
Text Label 13100 4550 2    50   ~ 0
BUS-DATA-E
Wire Wire Line
	12550 4550 13150 4550
Text Label 12600 4650 0    50   ~ 0
CPU-DATA-E
Wire Wire Line
	12550 4650 13150 4650
Wire Bus Line
	15950 2450 15250 2450
$Sheet
S 7700 2000 1950 1400
U 5EA5C281
F0 "misc-in" 50
F1 "misc-in.sch" 50
F2 "_~A-BOARD-CONNECTED" I L 7700 2950 50 
F3 "_~RESETI" I L 7700 2500 50 
F4 "_MISC-S2" I L 7700 2350 50 
F5 "_MISC-S1" I L 7700 2250 50 
F6 "_MISC-S0" I L 7700 2150 50 
F7 "_BUS-DIR" I L 7700 2650 50 
F8 "~A-BOARD-CONNECTED" O R 9650 2950 50 
F9 "~RESETI" O R 9650 2500 50 
F10 "MISC-S2" O R 9650 2350 50 
F11 "MISC-S1" O R 9650 2250 50 
F12 "MISC-S0" O R 9650 2150 50 
F13 "BUS-DIR" O R 9650 2650 50 
F14 "~ENABLE" I L 7700 3250 50 
F15 "_~ENABLE-DATA" I L 7700 2800 50 
F16 "~ENABLE-DATA" O R 9650 2800 50 
F17 "ENABLE-ADDR" O R 9650 3050 50 
F18 "_ENABLE-ADDR" I L 7700 3050 50 
$EndSheet
Wire Wire Line
	10350 4950 10350 5600
Wire Wire Line
	9250 5700 13550 5700
Wire Wire Line
	13550 5700 13550 4500
Wire Wire Line
	13550 4500 13650 4500
Wire Wire Line
	13650 4400 13450 4400
Wire Wire Line
	13450 4400 13450 5600
Wire Wire Line
	13450 5600 10350 5600
Connection ~ 10350 5600
Wire Wire Line
	9250 5500 13350 5500
Wire Wire Line
	13350 5500 13350 4300
Wire Wire Line
	13350 4300 13650 4300
Wire Wire Line
	13650 4000 13250 4000
Wire Wire Line
	13250 4000 13250 5400
Wire Wire Line
	13250 5400 9250 5400
Wire Wire Line
	12550 4950 13150 4950
Text Label 12600 4950 0    50   ~ 0
REG9-OUT
Wire Wire Line
	8100 7850 7500 7850
Text Label 8050 7850 2    50   ~ 0
REG9-OUT
Text Label 15350 2150 0    50   ~ 0
~ENABLE1
Wire Wire Line
	15250 2150 15750 2150
Text Label 15350 2250 0    50   ~ 0
IN-ENABLE
Wire Wire Line
	15250 2250 15750 2250
Text Label 2700 5500 0    50   ~ 0
ENABLE-CLK
Wire Wire Line
	2600 5500 3200 5500
Wire Wire Line
	2600 5050 3200 5050
Text Label 2700 5050 0    50   ~ 0
~ENABLE1
Text Label 2700 5150 0    50   ~ 0
~ENABLE2
Text Label 2700 5250 0    50   ~ 0
~ENABLE3
Wire Wire Line
	2600 5150 3200 5150
Wire Wire Line
	2600 5250 3200 5250
Wire Bus Line
	15950 2450 15950 5850
Wire Wire Line
	9250 6050 11350 6050
Wire Wire Line
	11450 7000 11850 7000
$Sheet
S 7550 4950 1700 1800
U 5EBD13AD
F0 "registry" 50
F1 "registry.sch" 50
F2 "OBJRAM-BANK-RANGE" I L 7550 5700 50 
F3 "~REGISTER-RANGE-HI" I L 7550 5150 50 
F4 "~RESET-REGISTERS" I L 7550 6400 50 
F5 "~OBJRAM-BANK-W" O R 9250 5500 50 
F6 "DATA[0..15]" I L 7550 6600 50 
F7 "REG9-HI" O R 9250 6350 50 
F8 "REGA" O R 9250 5600 50 
F9 "REG8" O R 9250 5700 50 
F10 "REG9-LO[0..4]" O R 9250 6250 50 
F11 "~BUS-UDSW" I L 7550 6250 50 
F12 "~BUS-R" I L 7550 6050 50 
F13 "~BUS-LDSW" I L 7550 6150 50 
F14 "~REGB-R" O R 9250 5400 50 
F15 "~REG8-R" O R 9250 5950 50 
F16 "~REG9-R" O R 9250 6050 50 
F17 "REG8-RANGE" I L 7550 5300 50 
F18 "REGA-RANGE" I L 7550 5500 50 
F19 "REGB-RANGE" I L 7550 5600 50 
F20 "REG9-RANGE" I L 7550 5400 50 
F21 "ENABLE-ADDR" I R 9250 5150 50 
$EndSheet
Wire Wire Line
	11350 7100 11850 7100
$Sheet
S 11850 6850 950  2200
U 5EC1E85D
F0 "bus-cpu-mux" 50
F1 "bus-cpu-mux.sch" 50
F2 "REG9-D15" I L 11850 7800 50 
F3 "~REG8-R" I L 11850 7000 50 
F4 "~REG9-R" I L 11850 7100 50 
F5 "IN[0..15]" I L 11850 8900 50 
F6 "OUT[0..15]" O R 12800 8900 50 
F7 "REG9-D[0..4]" I L 11850 7350 50 
F8 "REG8-D[0..10]" I L 11850 7250 50 
$EndSheet
Wire Bus Line
	11850 7250 11550 7250
Wire Bus Line
	11550 7250 11550 5850
Wire Bus Line
	11550 5850 15950 5850
Text Label 15350 4850 0    50   ~ 0
ENABLE-CLK
Wire Wire Line
	15250 4750 15850 4750
Wire Wire Line
	15250 4850 15850 4850
Wire Bus Line
	7500 9200 7300 9200
Wire Bus Line
	2250 8900 11850 8900
Wire Bus Line
	7300 9200 7300 6600
Wire Wire Line
	9400 6350 9250 6350
Wire Wire Line
	9400 7100 9250 7100
Wire Bus Line
	9500 6250 9250 6250
Connection ~ 9500 7350
Wire Bus Line
	9500 7350 9250 7350
Wire Bus Line
	9500 7350 10450 7350
Wire Wire Line
	2900 7450 4350 7450
Wire Wire Line
	2900 7350 4250 7350
Wire Wire Line
	2900 7250 4150 7250
Wire Wire Line
	2900 7150 4050 7150
Wire Wire Line
	4150 6050 7550 6050
Wire Wire Line
	4250 6150 7550 6150
Wire Wire Line
	4350 6250 7550 6250
Wire Wire Line
	4050 4350 4050 7150
Wire Wire Line
	7550 6400 4450 6400
Wire Wire Line
	4450 6400 4450 7600
Wire Wire Line
	4450 7600 2900 7600
Wire Wire Line
	4350 6250 4350 7450
Wire Wire Line
	4250 6150 4250 7350
Wire Wire Line
	4150 6050 4150 7250
Wire Wire Line
	4050 4350 5200 4350
Wire Wire Line
	10350 5600 10350 7150
Wire Wire Line
	11350 6050 11350 7100
Wire Wire Line
	11450 5950 11450 7000
Wire Wire Line
	9250 5950 11450 5950
Text Notes 1050 8450 2    50   ~ 0
BUS-DATA
Text Label 2700 5700 0    50   ~ 0
~OUT-DEBUG
Wire Wire Line
	2600 5700 3200 5700
Wire Bus Line
	9300 9500 9300 10200
Wire Wire Line
	6550 3250 6550 3700
Wire Wire Line
	10350 2950 10350 4550
Wire Wire Line
	9650 2800 10450 2800
Wire Wire Line
	9650 2500 10650 2500
Wire Wire Line
	10650 2500 10650 3400
Wire Wire Line
	10550 2650 10550 3750
Text Notes 6750 4350 0    50   ~ 0
0x804xxx
Text Notes 11600 9650 0    50   ~ 0
NC
Text Notes 11600 9750 0    50   ~ 0
NC
Text Notes 11600 9850 0    50   ~ 0
NC
Text Notes 11600 9950 0    50   ~ 0
NC
Text Notes 15600 4550 0    50   ~ 0
NC
Text Notes 15600 4450 0    50   ~ 0
NC
Text Notes 11600 10050 0    50   ~ 0
NC
Text Notes 11600 10150 0    50   ~ 0
NC
Text Notes 11600 10250 0    50   ~ 0
NC
Text Notes 11600 10350 0    50   ~ 0
NC
Text Notes 15550 4050 0    50   ~ 0
NC
Text GLabel 11800 1600 0    50   UnSpc ~ 0
19
Text GLabel 11800 1700 0    50   UnSpc ~ 0
23
Text GLabel 11800 1800 0    50   UnSpc ~ 0
26
Text GLabel 11800 1900 0    50   UnSpc ~ 0
33
Text GLabel 11800 2000 0    50   UnSpc ~ 0
36
Wire Wire Line
	11800 1600 11900 1600
Wire Wire Line
	11800 1700 11900 1700
Wire Wire Line
	11800 1800 11900 1800
Wire Wire Line
	11800 1900 11900 1900
Wire Wire Line
	11800 2000 11900 2000
NoConn ~ 11900 1600
NoConn ~ 11900 1700
NoConn ~ 11900 1800
NoConn ~ 11900 1900
NoConn ~ 11900 2000
Text GLabel 11300 1300 0    50   Input ~ 0
20
Text GLabel 11300 1400 0    50   Input ~ 0
40
Text GLabel 11300 1500 0    50   Input ~ 0
60
Text GLabel 11300 1600 0    50   Input ~ 0
80
Text GLabel 11300 1700 0    50   Input ~ 0
100
Text GLabel 11300 1800 0    50   Input ~ 0
120
Text GLabel 11300 1900 0    50   Input ~ 0
140
Text GLabel 11300 2000 0    50   Input ~ 0
160
Text GLabel 10800 700  0    50   Input ~ 0
1
Text GLabel 10800 800  0    50   Input ~ 0
10
Text GLabel 10800 900  0    50   Input ~ 0
30
Text GLabel 10800 1000 0    50   Input ~ 0
41
Text GLabel 10800 1100 0    50   Input ~ 0
50
Text GLabel 10800 1300 0    50   Input ~ 0
70
Text GLabel 10800 1400 0    50   Input ~ 0
81
Text GLabel 10800 1500 0    50   Input ~ 0
90
Text GLabel 10800 1600 0    50   Input ~ 0
110
Text GLabel 10800 1700 0    50   Input ~ 0
121
Text GLabel 10800 1800 0    50   Input ~ 0
130
Text GLabel 10800 1900 0    50   Input ~ 0
139
Text GLabel 10800 2000 0    50   Input ~ 0
150
Wire Wire Line
	10800 700  10900 700 
Wire Wire Line
	10800 800  10900 800 
Wire Wire Line
	10800 900  10900 900 
Wire Wire Line
	10800 1000 10900 1000
Wire Wire Line
	10800 1100 10900 1100
Wire Wire Line
	10800 1300 10900 1300
Wire Wire Line
	10800 1400 10900 1400
Wire Wire Line
	10800 1500 10900 1500
Wire Wire Line
	10800 1600 10900 1600
Wire Wire Line
	10800 1700 10900 1700
Wire Wire Line
	10800 1800 10900 1800
Wire Wire Line
	10800 1900 10900 1900
Wire Wire Line
	10800 2000 10900 2000
Wire Wire Line
	10900 700  10900 800 
Connection ~ 10900 800 
Wire Wire Line
	10900 800  10900 900 
Connection ~ 10900 900 
Wire Wire Line
	10900 900  10900 1000
Connection ~ 10900 1000
Wire Wire Line
	10900 1000 10900 1100
Connection ~ 10900 1100
Connection ~ 10900 1300
Wire Wire Line
	10900 1300 10900 1400
Connection ~ 10900 1400
Wire Wire Line
	10900 1400 10900 1500
Connection ~ 10900 1500
Wire Wire Line
	10900 1500 10900 1600
Connection ~ 10900 1600
Wire Wire Line
	10900 1600 10900 1700
Connection ~ 10900 1700
Wire Wire Line
	10900 1700 10900 1800
Connection ~ 10900 1800
Wire Wire Line
	10900 1800 10900 1900
Wire Wire Line
	11300 1300 11400 1300
Wire Wire Line
	11300 1400 11400 1400
Wire Wire Line
	11300 1500 11400 1500
Wire Wire Line
	11300 1600 11400 1600
Wire Wire Line
	11300 1700 11400 1700
Wire Wire Line
	11300 1800 11400 1800
Wire Wire Line
	11300 1900 11400 1900
Wire Wire Line
	11300 2000 11400 2000
Wire Wire Line
	11400 1300 11400 1400
Connection ~ 11400 1400
Wire Wire Line
	11400 1400 11400 1500
Connection ~ 11400 1500
Wire Wire Line
	11400 1500 11400 1600
Connection ~ 11400 1600
Wire Wire Line
	11400 1600 11400 1700
Connection ~ 11400 1700
Wire Wire Line
	11400 1700 11400 1800
Connection ~ 11400 1800
Wire Wire Line
	11400 1800 11400 1900
Connection ~ 11400 1900
Wire Wire Line
	11400 1900 11400 2000
$Comp
L power:VCC #PWR0101
U 1 1 634FDCC4
P 11400 1300
F 0 "#PWR0101" H 11400 1150 50  0001 C CNN
F 1 "VCC" H 11417 1473 50  0000 C CNN
F 2 "" H 11400 1300 50  0001 C CNN
F 3 "" H 11400 1300 50  0001 C CNN
	1    11400 1300
	1    0    0    -1  
$EndComp
Connection ~ 11400 1300
$Comp
L power:GND #PWR0102
U 1 1 634FE27B
P 10900 2000
F 0 "#PWR0102" H 10900 1750 50  0001 C CNN
F 1 "GND" H 10905 1827 50  0001 C CNN
F 2 "" H 10900 2000 50  0001 C CNN
F 3 "" H 10900 2000 50  0001 C CNN
	1    10900 2000
	1    0    0    -1  
$EndComp
$Comp
L power:PWR_FLAG #FLG0101
U 1 1 634FE36A
P 10900 700
F 0 "#FLG0101" H 10900 775 50  0001 C CNN
F 1 "PWR_FLAG" H 10900 873 50  0001 C CNN
F 2 "" H 10900 700 50  0001 C CNN
F 3 "~" H 10900 700 50  0001 C CNN
	1    10900 700 
	1    0    0    -1  
$EndComp
Connection ~ 10900 700 
$Comp
L power:PWR_FLAG #FLG0102
U 1 1 634FE4A2
P 11400 2000
F 0 "#FLG0102" H 11400 2075 50  0001 C CNN
F 1 "PWR_FLAG" H 11400 2173 50  0001 C CNN
F 2 "" H 11400 2000 50  0001 C CNN
F 3 "~" H 11400 2000 50  0001 C CNN
	1    11400 2000
	-1   0    0    1   
$EndComp
Connection ~ 11400 2000
Text Label 9350 7900 0    50   ~ 0
DG7
Wire Wire Line
	9250 7900 9750 7900
Text Label 3000 7250 0    50   ~ 0
DG0
Text Label 3000 7350 0    50   ~ 0
DG1
Text Label 3000 7450 0    50   ~ 0
DG2
Text Label 9700 2650 0    50   ~ 0
DG3
Text Label 9700 2800 0    50   ~ 0
DG4
Text Label 9700 2950 0    50   ~ 0
DG5
Text Label 9700 3050 0    50   ~ 0
DG6
Text Label 6600 9900 0    50   ~ 0
DG0
Text Label 6600 10000 0    50   ~ 0
DG1
Text Label 6600 10100 0    50   ~ 0
DG2
Text Label 6600 10200 0    50   ~ 0
DG3
Text Label 6600 10300 0    50   ~ 0
DG4
Text Label 6600 10400 0    50   ~ 0
DG5
Text Label 6600 10500 0    50   ~ 0
DG6
Text Label 6600 10600 0    50   ~ 0
DG7
Wire Wire Line
	6500 9900 6800 9900
Wire Wire Line
	6500 10000 6800 10000
Wire Wire Line
	6500 10100 6800 10100
Wire Wire Line
	6500 10200 6800 10200
Wire Wire Line
	6500 10300 6800 10300
Wire Wire Line
	6500 10400 6800 10400
Wire Wire Line
	6500 10500 6800 10500
Wire Wire Line
	6500 10600 6800 10600
Entry Wire Line
	6800 9900 6900 10000
Entry Wire Line
	6800 10000 6900 10100
Entry Wire Line
	6800 10100 6900 10200
Entry Wire Line
	6800 10200 6900 10300
Entry Wire Line
	6800 10300 6900 10400
Entry Wire Line
	6800 10400 6900 10500
Entry Wire Line
	6800 10500 6900 10600
Entry Wire Line
	6800 10600 6900 10700
Wire Wire Line
	9800 8200 9500 8200
Wire Wire Line
	9800 8300 9500 8300
Wire Wire Line
	9800 8400 9500 8400
Entry Wire Line
	9500 8200 9400 8300
Entry Wire Line
	9500 8300 9400 8400
Entry Wire Line
	9500 8400 9400 8500
Text Label 9700 8200 2    50   ~ 0
DE0
Text Label 9700 8300 2    50   ~ 0
DE1
Text Label 9700 8400 2    50   ~ 0
DE2
Wire Bus Line
	10400 10600 9400 10600
Wire Wire Line
	9650 2350 14050 2350
Wire Wire Line
	9650 2250 14050 2250
Wire Wire Line
	9650 2150 14050 2150
Text Label 9700 2150 0    50   ~ 0
DE0
Text Label 9700 2250 0    50   ~ 0
DE1
Text Label 9700 2350 0    50   ~ 0
DE2
Wire Bus Line
	8600 9500 9300 9500
Wire Bus Line
	9200 9600 9200 10300
Wire Bus Line
	8600 9600 9200 9600
Wire Bus Line
	9250 8200 9400 8200
Wire Wire Line
	10900 4750 10350 4750
Text Label 10450 4750 0    50   ~ 0
~ENABLE2
Wire Wire Line
	10250 4650 10250 5150
Text GLabel 10800 1200 0    50   Input ~ 0
59
Wire Wire Line
	10900 2000 10900 1900
Connection ~ 10900 1900
Connection ~ 10900 2000
Wire Wire Line
	10900 1100 10900 1200
Wire Wire Line
	10800 1200 10900 1200
Connection ~ 10900 1200
Wire Wire Line
	10900 1200 10900 1300
Text Label 10050 10600 0    50   ~ 0
DE[0..7]
Text Label 10050 10800 0    50   ~ 0
DG[0..7]
Text Label 9400 5150 0    50   ~ 0
ENABLE-ADDR
Text Label 1150 4650 2    50   ~ 0
ENABLE-ADDR
Wire Wire Line
	550  3300 550  3700
Wire Wire Line
	550  3700 3050 3700
Connection ~ 550  3700
Wire Wire Line
	550  3700 550  7800
Wire Wire Line
	550  3300 1250 3300
Wire Wire Line
	550  7800 1200 7800
Wire Wire Line
	600  4650 1200 4650
Wire Bus Line
	550  10900 10400 10900
Wire Bus Line
	9200 10300 10400 10300
Wire Bus Line
	9300 10200 10400 10200
Wire Bus Line
	6900 10800 10400 10800
Wire Bus Line
	2250 9750 7000 9750
Wire Bus Line
	7000 9750 7000 10500
Wire Bus Line
	7000 10500 10400 10500
Wire Bus Line
	10400 10400 7100 10400
Wire Bus Line
	7100 10400 7100 9650
Wire Bus Line
	7100 9650 2250 9650
Wire Bus Line
	1200 7950 550  7950
Wire Bus Line
	550  7950 550  10900
Wire Bus Line
	8600 9300 14200 9300
Wire Bus Line
	12800 8900 14200 8900
Text Notes 700  4100 0    50   ~ 0
~VCC-OK~ is connected to a voltage detector on VCC\nIt's HIGH if VCC is above 4.2V\nThe ~RESET~ signal will distribute HIGH to all DLs on CPS2\nSignals are shown assuming CPS2 wiring (DEBUG excluded)
Text Notes 900  6150 0    50   ~ 0
DEBUG is connected to GND on the actual CPS2,\nit is surely connected to other things on the dev board
Text Notes 2700 4500 0    50   ~ 0
LOW
Text Notes 3250 5400 0    50   ~ 0
HIGH
Text Notes 2700 4650 0    50   ~ 0
LOW
Text Notes 600  4550 0    50   ~ 0
HIGH
Text Notes 2700 4750 0    50   ~ 0
LOW
Text Notes 2700 4850 0    50   ~ 0
HIGH
Text Notes 3250 5050 0    50   ~ 0
LOW if ~DEBUG
Text Notes 3250 5150 0    50   ~ 0
LOW if ~DEBUG
Text Notes 3250 5250 0    50   ~ 0
LOW if ~DEBUG
Text Notes 3250 5500 0    50   ~ 0
HIGH
Text Notes 3250 5700 0    50   ~ 0
~DEBUG
Text Notes 2550 1300 0    50   ~ 0
CPU > BUS address bus is always on without alteration\n  (unless ENABLE-ADDR is inactive but this is not normal operations)
Text Notes 2550 9200 0    50   ~ 0
CPU > BUS data bus is on if ~ENABLE-DATA~ is active\nBUS > CPU data bus is on if ~ENABLE-DATA~ is active and no register is read\n  in that case, the multiplexer activates itself
Wire Bus Line
	15250 2650 15650 2650
Text Label 15300 2650 0    50   ~ 0
DF[0..7]
Wire Bus Line
	10000 10700 10400 10700
Text Label 10050 10700 0    50   ~ 0
DF[0..7]
Text Notes 11700 1150 0    50   ~ 0
This unused I/O is a 3bit decoder.\nSay if 011 is the input of S[0..2], all outputs will be Hi-Z except pin 153 (= 3)\nOn CPS2 those are just bound to a pull-up resistor array.\nThe state of this IO can be read using the REG8 address.\n  MSB will contain the S[0..2] data
Text Notes 12950 7400 0    50   ~ 0
REG9 is ununsed on the CPS2\n  they are only connected to a pull-up resistor array\nIt is split in two, LSB[0..4] and MSB[15]\nIt is possible to override the bus content by setting REGA to 1\nIt will override the output of REG9 internal value using the pins as input.\nBy default the value of this register is 0 except for the MSB
Text Notes 6950 1850 0    50   ~ 0
ENABLE-ADDR is C25 on CN3. When A-board is connected it is HIGH.\nIt controls the permission to transmit the ADDR bus and enable transceivers.\n\n~A-BOARD-CONNECTED~ is C26 on CN3 when the A-board is connected it is LOW.\n  Useless in normal operations. If ENABLE-ADDR is low, controls the direction of the data.\n\n~ENABLE-DATA~ is connected to PAL B2 which control if data output is available.\n  Typically used to exclude OBJRAM range
Text Notes 7750 4800 0    50   ~ 0
REGA disables the bus transceivers using ~CBUS-ADDR-E~\n  and also overrides the REG9 output.\nIt is by default at 1\nIt MUST be deactivated to use the A-board properly.\nMaybe used to inject some boot setting using REG9 I/O?
Wire Bus Line
	7300 6600 7550 6600
Text Notes 4500 7400 0    50   ~ 0
The core contains 8 bits of registers.\nThey can be written on using the bus,\n   hence the presence of an address decoding logic.\nRead operations may not read the registers by itself.\n\nThe (simplified) range is 0x804xxx\n  - 08x [rw]: 1bit on pin 147, read is muxed on the bus (see notes)\n  - 09x [rw]: 5+1 bits of reg, read is muxed on the bus (see notes)\n  - 0Ax [w]: 1bit, changes the behaviour of the bus (see notes)\n  - 0Bx [r]: empty, read signal redirected outside via pin 46 (NC)\n  - 0Ex [w]: Objram bank selection, signal transmitted to the CIF
Wire Wire Line
	9250 5150 10250 5150
Text Notes 7250 11100 0    50   ~ 0
This debug multiplexer is a way to see various inputs after buffers.\nOn CPS2, the output is disabled, pins are NC and input pins are bound to GND
Connection ~ 10250 4650
Wire Wire Line
	10250 4650 10900 4650
Wire Wire Line
	10450 2800 10450 4050
Wire Wire Line
	10350 4550 10900 4550
Wire Wire Line
	10450 4050 10900 4050
Wire Wire Line
	10550 2650 9650 2650
Wire Wire Line
	10550 3750 10900 3750
Wire Wire Line
	10650 3400 13650 3400
Text Notes 6800 4100 0    50   ~ 0
~EXPANSION-RANGE~ points to ROM and working RAM range and goes to PAL B2 as input.\nMaybe used on the dev board where a bunch of additional SRAM is available
Text Notes 15600 4350 0    50   ~ 0
To CIF
Text Notes 15550 4250 0    50   ~ 0
To PAL B2
Text Notes 15350 3350 0    50   ~ 0
To CPU
Wire Bus Line
	9400 8200 9400 10600
Wire Bus Line
	6900 10000 6900 10800
$EndSCHEMATC
