EESchema Schematic File Version 4
EELAYER 30 0
EELAYER END
$Descr A3 16535 11693
encoding utf-8
Sheet 66 69
Title ""
Date "2020-11-26"
Rev ""
Comp ""
Comment1 "Licence: CC-BY"
Comment2 "Author: Loïc *WydD* Petit"
Comment3 ""
Comment4 ""
$EndDescr
Connection ~ 3600 3050
Connection ~ 3600 8050
Connection ~ 9100 3050
Connection ~ 6350 3050
Connection ~ 9100 8050
Connection ~ 6350 8050
Connection ~ 9100 8150
Connection ~ 3600 8150
Connection ~ 6350 8150
Connection ~ 9100 3150
Connection ~ 3600 3150
Connection ~ 6350 3150
Connection ~ 1600 2650
Connection ~ 9850 2650
Connection ~ 9850 2550
Connection ~ 1600 2550
Connection ~ 4350 2650
Connection ~ 4350 2550
Connection ~ 7100 2650
Connection ~ 7100 2550
Entry Wire Line
	850  1100 950  1000
Entry Wire Line
	850  1200 950  1100
Entry Wire Line
	850  1300 950  1200
Entry Wire Line
	850  1400 950  1300
Entry Wire Line
	850  1500 950  1400
Entry Wire Line
	850  1600 950  1500
Entry Wire Line
	850  2250 950  2150
Entry Wire Line
	850  2350 950  2250
Entry Wire Line
	850  2450 950  2350
Entry Wire Line
	850  3400 950  3500
Entry Wire Line
	850  3500 950  3600
Entry Wire Line
	850  3600 950  3700
Entry Wire Line
	850  3700 950  3800
Entry Wire Line
	850  3800 950  3900
Entry Wire Line
	850  3900 950  4000
Entry Wire Line
	850  4550 950  4650
Entry Wire Line
	850  4650 950  4750
Entry Wire Line
	850  4750 950  4850
Entry Wire Line
	850  4850 950  4950
Entry Wire Line
	850  4950 950  5050
Entry Wire Line
	850  5050 950  5150
Entry Wire Line
	850  6100 950  6000
Entry Wire Line
	850  6200 950  6100
Entry Wire Line
	850  6300 950  6200
Entry Wire Line
	850  6400 950  6300
Entry Wire Line
	850  6500 950  6400
Entry Wire Line
	850  6600 950  6500
Entry Wire Line
	850  7250 950  7150
Entry Wire Line
	850  7350 950  7250
Entry Wire Line
	850  7450 950  7350
Entry Wire Line
	850  7550 950  7450
Entry Wire Line
	850  7650 950  7550
Entry Wire Line
	850  7750 950  7650
Entry Wire Line
	850  8400 950  8500
Entry Wire Line
	850  8500 950  8600
Entry Wire Line
	850  8600 950  8700
Entry Wire Line
	850  8700 950  8800
Entry Wire Line
	850  8800 950  8900
Entry Wire Line
	850  8900 950  9000
Entry Wire Line
	850  9550 950  9650
Entry Wire Line
	850  9650 950  9750
Entry Wire Line
	850  9750 950  9850
Entry Wire Line
	850  9850 950  9950
Entry Wire Line
	850  9950 950  10050
Entry Wire Line
	850  10050 950  10150
Entry Wire Line
	3350 1100 3250 1000
Entry Wire Line
	3350 1200 3250 1100
Entry Wire Line
	3350 1300 3250 1200
Entry Wire Line
	3350 1400 3250 1300
Entry Wire Line
	3350 1500 3250 1400
Entry Wire Line
	3350 1600 3250 1500
Entry Wire Line
	3350 2250 3250 2150
Entry Wire Line
	3350 2350 3250 2250
Entry Wire Line
	3350 2450 3250 2350
Entry Wire Line
	3350 2550 3250 2450
Entry Wire Line
	3350 2650 3250 2550
Entry Wire Line
	3350 2750 3250 2650
Entry Wire Line
	3350 3600 3250 3500
Entry Wire Line
	3350 3700 3250 3600
Entry Wire Line
	3350 3800 3250 3700
Entry Wire Line
	3350 3900 3250 3800
Entry Wire Line
	3350 4000 3250 3900
Entry Wire Line
	3350 4100 3250 4000
Entry Wire Line
	3350 4750 3250 4650
Entry Wire Line
	3350 4850 3250 4750
Entry Wire Line
	3350 4950 3250 4850
Entry Wire Line
	3350 5050 3250 4950
Entry Wire Line
	3350 5150 3250 5050
Entry Wire Line
	3350 5250 3250 5150
Entry Wire Line
	3350 6100 3250 6000
Entry Wire Line
	3350 6200 3250 6100
Entry Wire Line
	3350 6300 3250 6200
Entry Wire Line
	3350 6400 3250 6300
Entry Wire Line
	3350 6500 3250 6400
Entry Wire Line
	3350 6600 3250 6500
Entry Wire Line
	3350 7250 3250 7150
Entry Wire Line
	3350 7350 3250 7250
Entry Wire Line
	3350 7450 3250 7350
Entry Wire Line
	3350 7550 3250 7450
Entry Wire Line
	3350 7650 3250 7550
Entry Wire Line
	3350 7750 3250 7650
Entry Wire Line
	3350 8600 3250 8500
Entry Wire Line
	3350 8700 3250 8600
Entry Wire Line
	3350 8800 3250 8700
Entry Wire Line
	3350 8900 3250 8800
Entry Wire Line
	3350 9000 3250 8900
Entry Wire Line
	3350 9100 3250 9000
Entry Wire Line
	3350 9750 3250 9650
Entry Wire Line
	3350 9850 3250 9750
Entry Wire Line
	3350 9950 3250 9850
Entry Wire Line
	3350 10050 3250 9950
Entry Wire Line
	3350 10150 3250 10050
Entry Wire Line
	3350 10250 3250 10150
Entry Wire Line
	3600 1100 3700 1000
Entry Wire Line
	3600 1200 3700 1100
Entry Wire Line
	3600 1300 3700 1200
Entry Wire Line
	3600 1400 3700 1300
Entry Wire Line
	3600 1500 3700 1400
Entry Wire Line
	3600 1600 3700 1500
Entry Wire Line
	3600 2250 3700 2150
Entry Wire Line
	3600 2350 3700 2250
Entry Wire Line
	3600 2450 3700 2350
Entry Wire Line
	3600 3400 3700 3500
Entry Wire Line
	3600 3500 3700 3600
Entry Wire Line
	3600 3600 3700 3700
Entry Wire Line
	3600 3700 3700 3800
Entry Wire Line
	3600 3800 3700 3900
Entry Wire Line
	3600 3900 3700 4000
Entry Wire Line
	3600 4550 3700 4650
Entry Wire Line
	3600 4650 3700 4750
Entry Wire Line
	3600 4750 3700 4850
Entry Wire Line
	3600 4850 3700 4950
Entry Wire Line
	3600 4950 3700 5050
Entry Wire Line
	3600 5050 3700 5150
Entry Wire Line
	3600 6100 3700 6000
Entry Wire Line
	3600 6200 3700 6100
Entry Wire Line
	3600 6300 3700 6200
Entry Wire Line
	3600 6400 3700 6300
Entry Wire Line
	3600 6500 3700 6400
Entry Wire Line
	3600 6600 3700 6500
Entry Wire Line
	3600 7250 3700 7150
Entry Wire Line
	3600 7350 3700 7250
Entry Wire Line
	3600 7450 3700 7350
Entry Wire Line
	3600 7550 3700 7450
Entry Wire Line
	3600 7650 3700 7550
Entry Wire Line
	3600 7750 3700 7650
Entry Wire Line
	3600 8400 3700 8500
Entry Wire Line
	3600 8500 3700 8600
Entry Wire Line
	3600 8600 3700 8700
Entry Wire Line
	3600 8700 3700 8800
Entry Wire Line
	3600 8800 3700 8900
Entry Wire Line
	3600 8900 3700 9000
Entry Wire Line
	3600 9550 3700 9650
Entry Wire Line
	3600 9650 3700 9750
Entry Wire Line
	3600 9750 3700 9850
Entry Wire Line
	3600 9850 3700 9950
Entry Wire Line
	3600 9950 3700 10050
Entry Wire Line
	3600 10050 3700 10150
Entry Wire Line
	6100 1100 6000 1000
Entry Wire Line
	6100 1200 6000 1100
Entry Wire Line
	6100 1300 6000 1200
Entry Wire Line
	6100 1400 6000 1300
Entry Wire Line
	6100 1500 6000 1400
Entry Wire Line
	6100 1600 6000 1500
Entry Wire Line
	6100 2250 6000 2150
Entry Wire Line
	6100 2350 6000 2250
Entry Wire Line
	6100 2450 6000 2350
Entry Wire Line
	6100 2550 6000 2450
Entry Wire Line
	6100 2650 6000 2550
Entry Wire Line
	6100 2750 6000 2650
Entry Wire Line
	6100 3600 6000 3500
Entry Wire Line
	6100 3700 6000 3600
Entry Wire Line
	6100 3800 6000 3700
Entry Wire Line
	6100 3900 6000 3800
Entry Wire Line
	6100 4000 6000 3900
Entry Wire Line
	6100 4100 6000 4000
Entry Wire Line
	6100 4750 6000 4650
Entry Wire Line
	6100 4850 6000 4750
Entry Wire Line
	6100 4950 6000 4850
Entry Wire Line
	6100 5050 6000 4950
Entry Wire Line
	6100 5150 6000 5050
Entry Wire Line
	6100 5250 6000 5150
Entry Wire Line
	6100 6100 6000 6000
Entry Wire Line
	6100 6200 6000 6100
Entry Wire Line
	6100 6300 6000 6200
Entry Wire Line
	6100 6400 6000 6300
Entry Wire Line
	6100 6500 6000 6400
Entry Wire Line
	6100 6600 6000 6500
Entry Wire Line
	6100 7250 6000 7150
Entry Wire Line
	6100 7350 6000 7250
Entry Wire Line
	6100 7450 6000 7350
Entry Wire Line
	6100 7550 6000 7450
Entry Wire Line
	6100 7650 6000 7550
Entry Wire Line
	6100 7750 6000 7650
Entry Wire Line
	6100 8600 6000 8500
Entry Wire Line
	6100 8700 6000 8600
Entry Wire Line
	6100 8800 6000 8700
Entry Wire Line
	6100 8900 6000 8800
Entry Wire Line
	6100 9000 6000 8900
Entry Wire Line
	6100 9100 6000 9000
Entry Wire Line
	6100 9750 6000 9650
Entry Wire Line
	6100 9850 6000 9750
Entry Wire Line
	6100 9950 6000 9850
Entry Wire Line
	6100 10050 6000 9950
Entry Wire Line
	6100 10150 6000 10050
Entry Wire Line
	6100 10250 6000 10150
Entry Wire Line
	6350 1100 6450 1000
Entry Wire Line
	6350 1200 6450 1100
Entry Wire Line
	6350 1300 6450 1200
Entry Wire Line
	6350 1400 6450 1300
Entry Wire Line
	6350 1500 6450 1400
Entry Wire Line
	6350 1600 6450 1500
Entry Wire Line
	6350 2250 6450 2150
Entry Wire Line
	6350 2350 6450 2250
Entry Wire Line
	6350 2450 6450 2350
Entry Wire Line
	6350 3400 6450 3500
Entry Wire Line
	6350 3500 6450 3600
Entry Wire Line
	6350 3600 6450 3700
Entry Wire Line
	6350 3700 6450 3800
Entry Wire Line
	6350 3800 6450 3900
Entry Wire Line
	6350 3900 6450 4000
Entry Wire Line
	6350 4550 6450 4650
Entry Wire Line
	6350 4650 6450 4750
Entry Wire Line
	6350 4750 6450 4850
Entry Wire Line
	6350 4850 6450 4950
Entry Wire Line
	6350 4950 6450 5050
Entry Wire Line
	6350 5050 6450 5150
Entry Wire Line
	6350 6100 6450 6000
Entry Wire Line
	6350 6200 6450 6100
Entry Wire Line
	6350 6300 6450 6200
Entry Wire Line
	6350 6400 6450 6300
Entry Wire Line
	6350 6500 6450 6400
Entry Wire Line
	6350 6600 6450 6500
Entry Wire Line
	6350 7250 6450 7150
Entry Wire Line
	6350 7350 6450 7250
Entry Wire Line
	6350 7450 6450 7350
Entry Wire Line
	6350 7550 6450 7450
Entry Wire Line
	6350 7650 6450 7550
Entry Wire Line
	6350 7750 6450 7650
Entry Wire Line
	6350 8400 6450 8500
Entry Wire Line
	6350 8500 6450 8600
Entry Wire Line
	6350 8600 6450 8700
Entry Wire Line
	6350 8700 6450 8800
Entry Wire Line
	6350 8800 6450 8900
Entry Wire Line
	6350 8900 6450 9000
Entry Wire Line
	6350 9550 6450 9650
Entry Wire Line
	6350 9650 6450 9750
Entry Wire Line
	6350 9750 6450 9850
Entry Wire Line
	6350 9850 6450 9950
Entry Wire Line
	6350 9950 6450 10050
Entry Wire Line
	6350 10050 6450 10150
Entry Wire Line
	8850 1100 8750 1000
Entry Wire Line
	8850 1200 8750 1100
Entry Wire Line
	8850 1300 8750 1200
Entry Wire Line
	8850 1400 8750 1300
Entry Wire Line
	8850 1500 8750 1400
Entry Wire Line
	8850 1600 8750 1500
Entry Wire Line
	8850 2250 8750 2150
Entry Wire Line
	8850 2350 8750 2250
Entry Wire Line
	8850 2450 8750 2350
Entry Wire Line
	8850 2550 8750 2450
Entry Wire Line
	8850 2650 8750 2550
Entry Wire Line
	8850 2750 8750 2650
Entry Wire Line
	8850 3600 8750 3500
Entry Wire Line
	8850 3700 8750 3600
Entry Wire Line
	8850 3800 8750 3700
Entry Wire Line
	8850 3900 8750 3800
Entry Wire Line
	8850 4000 8750 3900
Entry Wire Line
	8850 4100 8750 4000
Entry Wire Line
	8850 4750 8750 4650
Entry Wire Line
	8850 4850 8750 4750
Entry Wire Line
	8850 4950 8750 4850
Entry Wire Line
	8850 5050 8750 4950
Entry Wire Line
	8850 5150 8750 5050
Entry Wire Line
	8850 5250 8750 5150
Entry Wire Line
	8850 6100 8750 6000
Entry Wire Line
	8850 6200 8750 6100
Entry Wire Line
	8850 6300 8750 6200
Entry Wire Line
	8850 6400 8750 6300
Entry Wire Line
	8850 6500 8750 6400
Entry Wire Line
	8850 6600 8750 6500
Entry Wire Line
	8850 7250 8750 7150
Entry Wire Line
	8850 7350 8750 7250
Entry Wire Line
	8850 7450 8750 7350
Entry Wire Line
	8850 7550 8750 7450
Entry Wire Line
	8850 7650 8750 7550
Entry Wire Line
	8850 7750 8750 7650
Entry Wire Line
	8850 8600 8750 8500
Entry Wire Line
	8850 8700 8750 8600
Entry Wire Line
	8850 8800 8750 8700
Entry Wire Line
	8850 8900 8750 8800
Entry Wire Line
	8850 9000 8750 8900
Entry Wire Line
	8850 9100 8750 9000
Entry Wire Line
	8850 9750 8750 9650
Entry Wire Line
	8850 9850 8750 9750
Entry Wire Line
	8850 9950 8750 9850
Entry Wire Line
	8850 10050 8750 9950
Entry Wire Line
	8850 10150 8750 10050
Entry Wire Line
	8850 10250 8750 10150
Entry Wire Line
	9100 1100 9200 1000
Entry Wire Line
	9100 1200 9200 1100
Entry Wire Line
	9100 1300 9200 1200
Entry Wire Line
	9100 1400 9200 1300
Entry Wire Line
	9100 1500 9200 1400
Entry Wire Line
	9100 1600 9200 1500
Entry Wire Line
	9100 2250 9200 2150
Entry Wire Line
	9100 2350 9200 2250
Entry Wire Line
	9100 2450 9200 2350
Entry Wire Line
	9100 3400 9200 3500
Entry Wire Line
	9100 3500 9200 3600
Entry Wire Line
	9100 3600 9200 3700
Entry Wire Line
	9100 3700 9200 3800
Entry Wire Line
	9100 3800 9200 3900
Entry Wire Line
	9100 3900 9200 4000
Entry Wire Line
	9100 4550 9200 4650
Entry Wire Line
	9100 4650 9200 4750
Entry Wire Line
	9100 4750 9200 4850
Entry Wire Line
	9100 4850 9200 4950
Entry Wire Line
	9100 4950 9200 5050
Entry Wire Line
	9100 5050 9200 5150
Entry Wire Line
	9100 6100 9200 6000
Entry Wire Line
	9100 6200 9200 6100
Entry Wire Line
	9100 6300 9200 6200
Entry Wire Line
	9100 6400 9200 6300
Entry Wire Line
	9100 6500 9200 6400
Entry Wire Line
	9100 6600 9200 6500
Entry Wire Line
	9100 7250 9200 7150
Entry Wire Line
	9100 7350 9200 7250
Entry Wire Line
	9100 7450 9200 7350
Entry Wire Line
	9100 7550 9200 7450
Entry Wire Line
	9100 7650 9200 7550
Entry Wire Line
	9100 7750 9200 7650
Entry Wire Line
	9100 8400 9200 8500
Entry Wire Line
	9100 8500 9200 8600
Entry Wire Line
	9100 8600 9200 8700
Entry Wire Line
	9100 8700 9200 8800
Entry Wire Line
	9100 8800 9200 8900
Entry Wire Line
	9100 8900 9200 9000
Entry Wire Line
	9100 9550 9200 9650
Entry Wire Line
	9100 9650 9200 9750
Entry Wire Line
	9100 9750 9200 9850
Entry Wire Line
	9100 9850 9200 9950
Entry Wire Line
	9100 9950 9200 10050
Entry Wire Line
	9100 10050 9200 10150
Entry Wire Line
	11600 1100 11500 1000
Entry Wire Line
	11600 1200 11500 1100
Entry Wire Line
	11600 1300 11500 1200
Entry Wire Line
	11600 1400 11500 1300
Entry Wire Line
	11600 1500 11500 1400
Entry Wire Line
	11600 1600 11500 1500
Entry Wire Line
	11600 2250 11500 2150
Entry Wire Line
	11600 2350 11500 2250
Entry Wire Line
	11600 2450 11500 2350
Entry Wire Line
	11600 2550 11500 2450
Entry Wire Line
	11600 2650 11500 2550
Entry Wire Line
	11600 2750 11500 2650
Entry Wire Line
	11600 3600 11500 3500
Entry Wire Line
	11600 3700 11500 3600
Entry Wire Line
	11600 3800 11500 3700
Entry Wire Line
	11600 3900 11500 3800
Entry Wire Line
	11600 4000 11500 3900
Entry Wire Line
	11600 4100 11500 4000
Entry Wire Line
	11600 4750 11500 4650
Entry Wire Line
	11600 4850 11500 4750
Entry Wire Line
	11600 4950 11500 4850
Entry Wire Line
	11600 5050 11500 4950
Entry Wire Line
	11600 5150 11500 5050
Entry Wire Line
	11600 5250 11500 5150
Entry Wire Line
	11600 6100 11500 6000
Entry Wire Line
	11600 6200 11500 6100
Entry Wire Line
	11600 6300 11500 6200
Entry Wire Line
	11600 6400 11500 6300
Entry Wire Line
	11600 6500 11500 6400
Entry Wire Line
	11600 6600 11500 6500
Entry Wire Line
	11600 7250 11500 7150
Entry Wire Line
	11600 7350 11500 7250
Entry Wire Line
	11600 7450 11500 7350
Entry Wire Line
	11600 7550 11500 7450
Entry Wire Line
	11600 7650 11500 7550
Entry Wire Line
	11600 7750 11500 7650
Entry Wire Line
	11600 8600 11500 8500
Entry Wire Line
	11600 8700 11500 8600
Entry Wire Line
	11600 8800 11500 8700
Entry Wire Line
	11600 8900 11500 8800
Entry Wire Line
	11600 9000 11500 8900
Entry Wire Line
	11600 9100 11500 9000
Entry Wire Line
	11600 9750 11500 9650
Entry Wire Line
	11600 9850 11500 9750
Entry Wire Line
	11600 9950 11500 9850
Entry Wire Line
	11600 10050 11500 9950
Entry Wire Line
	11600 10150 11500 10050
Entry Wire Line
	11600 10250 11500 10150
Entry Wire Line
	13350 4450 13250 4550
Entry Wire Line
	13350 4550 13250 4650
Entry Wire Line
	13350 5200 13250 5300
Entry Wire Line
	13350 5300 13250 5400
Entry Wire Line
	13350 5950 13250 6050
Entry Wire Line
	13350 6050 13250 6150
Entry Wire Line
	13350 6700 13250 6800
Entry Wire Line
	13350 6800 13250 6900
Entry Wire Line
	14350 7650 14450 7750
Entry Wire Line
	14350 7750 14450 7850
Entry Wire Line
	14350 7850 14450 7950
Entry Wire Line
	14350 7950 14450 8050
Wire Wire Line
	950  1000 1600 1000
Wire Wire Line
	950  1100 1600 1100
Wire Wire Line
	950  1200 1600 1200
Wire Wire Line
	950  1300 1600 1300
Wire Wire Line
	950  1400 1600 1400
Wire Wire Line
	950  1500 1600 1500
Wire Wire Line
	950  2150 1600 2150
Wire Wire Line
	950  2250 1600 2250
Wire Wire Line
	950  2350 1600 2350
Wire Wire Line
	950  3500 1600 3500
Wire Wire Line
	950  3600 1600 3600
Wire Wire Line
	950  3700 1600 3700
Wire Wire Line
	950  3800 1600 3800
Wire Wire Line
	950  3900 1600 3900
Wire Wire Line
	950  4000 1600 4000
Wire Wire Line
	950  4650 1600 4650
Wire Wire Line
	950  4750 1600 4750
Wire Wire Line
	950  4850 1600 4850
Wire Wire Line
	950  4950 1600 4950
Wire Wire Line
	950  5050 1600 5050
Wire Wire Line
	950  5150 1600 5150
Wire Wire Line
	950  6000 1600 6000
Wire Wire Line
	950  6100 1600 6100
Wire Wire Line
	950  6200 1600 6200
Wire Wire Line
	950  6300 1600 6300
Wire Wire Line
	950  6400 1600 6400
Wire Wire Line
	950  6500 1600 6500
Wire Wire Line
	950  7150 1600 7150
Wire Wire Line
	950  7250 1600 7250
Wire Wire Line
	950  7350 1600 7350
Wire Wire Line
	950  7450 1600 7450
Wire Wire Line
	950  7550 1600 7550
Wire Wire Line
	950  7650 1600 7650
Wire Wire Line
	950  8500 1600 8500
Wire Wire Line
	950  8600 1600 8600
Wire Wire Line
	950  8700 1600 8700
Wire Wire Line
	950  8800 1600 8800
Wire Wire Line
	950  8900 1600 8900
Wire Wire Line
	950  9000 1600 9000
Wire Wire Line
	950  9650 1600 9650
Wire Wire Line
	950  9750 1600 9750
Wire Wire Line
	950  9850 1600 9850
Wire Wire Line
	950  9950 1600 9950
Wire Wire Line
	950  10050 1600 10050
Wire Wire Line
	950  10150 1600 10150
Wire Wire Line
	1500 1700 1500 2850
Wire Wire Line
	1500 1700 1600 1700
Wire Wire Line
	1500 4200 1600 4200
Wire Wire Line
	1500 5350 1500 4200
Wire Wire Line
	1500 6700 1600 6700
Wire Wire Line
	1500 7850 1500 6700
Wire Wire Line
	1500 9200 1600 9200
Wire Wire Line
	1500 10350 1500 9200
Wire Wire Line
	1600 2450 1600 2550
Wire Wire Line
	1600 2550 1600 2650
Wire Wire Line
	1600 2850 1500 2850
Wire Wire Line
	1600 5350 1500 5350
Wire Wire Line
	1600 7850 1500 7850
Wire Wire Line
	1600 10350 1500 10350
Wire Wire Line
	3250 1000 2600 1000
Wire Wire Line
	3250 1100 2600 1100
Wire Wire Line
	3250 1200 2600 1200
Wire Wire Line
	3250 1300 2600 1300
Wire Wire Line
	3250 1400 2600 1400
Wire Wire Line
	3250 1500 2600 1500
Wire Wire Line
	3250 2150 2600 2150
Wire Wire Line
	3250 2250 2600 2250
Wire Wire Line
	3250 2350 2600 2350
Wire Wire Line
	3250 2450 2600 2450
Wire Wire Line
	3250 2550 2600 2550
Wire Wire Line
	3250 2650 2600 2650
Wire Wire Line
	3250 3500 2600 3500
Wire Wire Line
	3250 3600 2600 3600
Wire Wire Line
	3250 3700 2600 3700
Wire Wire Line
	3250 3800 2600 3800
Wire Wire Line
	3250 3900 2600 3900
Wire Wire Line
	3250 4000 2600 4000
Wire Wire Line
	3250 4650 2600 4650
Wire Wire Line
	3250 4750 2600 4750
Wire Wire Line
	3250 4850 2600 4850
Wire Wire Line
	3250 4950 2600 4950
Wire Wire Line
	3250 5050 2600 5050
Wire Wire Line
	3250 5150 2600 5150
Wire Wire Line
	3250 6000 2600 6000
Wire Wire Line
	3250 6100 2600 6100
Wire Wire Line
	3250 6200 2600 6200
Wire Wire Line
	3250 6300 2600 6300
Wire Wire Line
	3250 6400 2600 6400
Wire Wire Line
	3250 6500 2600 6500
Wire Wire Line
	3250 7150 2600 7150
Wire Wire Line
	3250 7250 2600 7250
Wire Wire Line
	3250 7350 2600 7350
Wire Wire Line
	3250 7450 2600 7450
Wire Wire Line
	3250 7550 2600 7550
Wire Wire Line
	3250 7650 2600 7650
Wire Wire Line
	3250 8500 2600 8500
Wire Wire Line
	3250 8600 2600 8600
Wire Wire Line
	3250 8700 2600 8700
Wire Wire Line
	3250 8800 2600 8800
Wire Wire Line
	3250 8900 2600 8900
Wire Wire Line
	3250 9000 2600 9000
Wire Wire Line
	3250 9650 2600 9650
Wire Wire Line
	3250 9750 2600 9750
Wire Wire Line
	3250 9850 2600 9850
Wire Wire Line
	3250 9950 2600 9950
Wire Wire Line
	3250 10050 2600 10050
Wire Wire Line
	3250 10150 2600 10150
Wire Wire Line
	3700 1000 4350 1000
Wire Wire Line
	3700 1100 4350 1100
Wire Wire Line
	3700 1200 4350 1200
Wire Wire Line
	3700 1300 4350 1300
Wire Wire Line
	3700 1400 4350 1400
Wire Wire Line
	3700 1500 4350 1500
Wire Wire Line
	3700 2150 4350 2150
Wire Wire Line
	3700 2250 4350 2250
Wire Wire Line
	3700 2350 4350 2350
Wire Wire Line
	3700 3500 4350 3500
Wire Wire Line
	3700 3600 4350 3600
Wire Wire Line
	3700 3700 4350 3700
Wire Wire Line
	3700 3800 4350 3800
Wire Wire Line
	3700 3900 4350 3900
Wire Wire Line
	3700 4000 4350 4000
Wire Wire Line
	3700 4650 4350 4650
Wire Wire Line
	3700 4750 4350 4750
Wire Wire Line
	3700 4850 4350 4850
Wire Wire Line
	3700 4950 4350 4950
Wire Wire Line
	3700 5050 4350 5050
Wire Wire Line
	3700 5150 4350 5150
Wire Wire Line
	3700 6000 4350 6000
Wire Wire Line
	3700 6100 4350 6100
Wire Wire Line
	3700 6200 4350 6200
Wire Wire Line
	3700 6300 4350 6300
Wire Wire Line
	3700 6400 4350 6400
Wire Wire Line
	3700 6500 4350 6500
Wire Wire Line
	3700 7150 4350 7150
Wire Wire Line
	3700 7250 4350 7250
Wire Wire Line
	3700 7350 4350 7350
Wire Wire Line
	3700 7450 4350 7450
Wire Wire Line
	3700 7550 4350 7550
Wire Wire Line
	3700 7650 4350 7650
Wire Wire Line
	3700 8500 4350 8500
Wire Wire Line
	3700 8600 4350 8600
Wire Wire Line
	3700 8700 4350 8700
Wire Wire Line
	3700 8800 4350 8800
Wire Wire Line
	3700 8900 4350 8900
Wire Wire Line
	3700 9000 4350 9000
Wire Wire Line
	3700 9650 4350 9650
Wire Wire Line
	3700 9750 4350 9750
Wire Wire Line
	3700 9850 4350 9850
Wire Wire Line
	3700 9950 4350 9950
Wire Wire Line
	3700 10050 4350 10050
Wire Wire Line
	3700 10150 4350 10150
Wire Wire Line
	4250 1700 4250 2850
Wire Wire Line
	4250 1700 4350 1700
Wire Wire Line
	4250 4200 4250 5350
Wire Wire Line
	4250 5350 4350 5350
Wire Wire Line
	4250 6700 4350 6700
Wire Wire Line
	4250 7850 4250 6700
Wire Wire Line
	4250 9200 4350 9200
Wire Wire Line
	4250 10350 4250 9200
Wire Wire Line
	4350 2550 4350 2450
Wire Wire Line
	4350 2550 4350 2650
Wire Wire Line
	4350 2850 4250 2850
Wire Wire Line
	4350 4200 4250 4200
Wire Wire Line
	4350 7850 4250 7850
Wire Wire Line
	4350 10350 4250 10350
Wire Wire Line
	6000 1000 5350 1000
Wire Wire Line
	6000 1100 5350 1100
Wire Wire Line
	6000 1200 5350 1200
Wire Wire Line
	6000 1300 5350 1300
Wire Wire Line
	6000 1400 5350 1400
Wire Wire Line
	6000 1500 5350 1500
Wire Wire Line
	6000 2150 5350 2150
Wire Wire Line
	6000 2250 5350 2250
Wire Wire Line
	6000 2350 5350 2350
Wire Wire Line
	6000 2450 5350 2450
Wire Wire Line
	6000 2550 5350 2550
Wire Wire Line
	6000 2650 5350 2650
Wire Wire Line
	6000 3500 5350 3500
Wire Wire Line
	6000 3600 5350 3600
Wire Wire Line
	6000 3700 5350 3700
Wire Wire Line
	6000 3800 5350 3800
Wire Wire Line
	6000 3900 5350 3900
Wire Wire Line
	6000 4000 5350 4000
Wire Wire Line
	6000 4650 5350 4650
Wire Wire Line
	6000 4750 5350 4750
Wire Wire Line
	6000 4850 5350 4850
Wire Wire Line
	6000 4950 5350 4950
Wire Wire Line
	6000 5050 5350 5050
Wire Wire Line
	6000 5150 5350 5150
Wire Wire Line
	6000 6000 5350 6000
Wire Wire Line
	6000 6100 5350 6100
Wire Wire Line
	6000 6200 5350 6200
Wire Wire Line
	6000 6300 5350 6300
Wire Wire Line
	6000 6400 5350 6400
Wire Wire Line
	6000 6500 5350 6500
Wire Wire Line
	6000 7150 5350 7150
Wire Wire Line
	6000 7250 5350 7250
Wire Wire Line
	6000 7350 5350 7350
Wire Wire Line
	6000 7450 5350 7450
Wire Wire Line
	6000 7550 5350 7550
Wire Wire Line
	6000 7650 5350 7650
Wire Wire Line
	6000 8500 5350 8500
Wire Wire Line
	6000 8600 5350 8600
Wire Wire Line
	6000 8700 5350 8700
Wire Wire Line
	6000 8800 5350 8800
Wire Wire Line
	6000 8900 5350 8900
Wire Wire Line
	6000 9000 5350 9000
Wire Wire Line
	6000 9650 5350 9650
Wire Wire Line
	6000 9750 5350 9750
Wire Wire Line
	6000 9850 5350 9850
Wire Wire Line
	6000 9950 5350 9950
Wire Wire Line
	6000 10050 5350 10050
Wire Wire Line
	6000 10150 5350 10150
Wire Wire Line
	6450 1000 7100 1000
Wire Wire Line
	6450 1100 7100 1100
Wire Wire Line
	6450 1200 7100 1200
Wire Wire Line
	6450 1300 7100 1300
Wire Wire Line
	6450 1400 7100 1400
Wire Wire Line
	6450 1500 7100 1500
Wire Wire Line
	6450 2150 7100 2150
Wire Wire Line
	6450 2250 7100 2250
Wire Wire Line
	6450 2350 7100 2350
Wire Wire Line
	6450 3500 7100 3500
Wire Wire Line
	6450 3600 7100 3600
Wire Wire Line
	6450 3700 7100 3700
Wire Wire Line
	6450 3800 7100 3800
Wire Wire Line
	6450 3900 7100 3900
Wire Wire Line
	6450 4000 7100 4000
Wire Wire Line
	6450 4650 7100 4650
Wire Wire Line
	6450 4750 7100 4750
Wire Wire Line
	6450 4850 7100 4850
Wire Wire Line
	6450 4950 7100 4950
Wire Wire Line
	6450 5050 7100 5050
Wire Wire Line
	6450 5150 7100 5150
Wire Wire Line
	6450 6000 7100 6000
Wire Wire Line
	6450 6100 7100 6100
Wire Wire Line
	6450 6200 7100 6200
Wire Wire Line
	6450 6300 7100 6300
Wire Wire Line
	6450 6400 7100 6400
Wire Wire Line
	6450 6500 7100 6500
Wire Wire Line
	6450 7150 7100 7150
Wire Wire Line
	6450 7250 7100 7250
Wire Wire Line
	6450 7350 7100 7350
Wire Wire Line
	6450 7450 7100 7450
Wire Wire Line
	6450 7550 7100 7550
Wire Wire Line
	6450 7650 7100 7650
Wire Wire Line
	6450 8500 7100 8500
Wire Wire Line
	6450 8600 7100 8600
Wire Wire Line
	6450 8700 7100 8700
Wire Wire Line
	6450 8800 7100 8800
Wire Wire Line
	6450 8900 7100 8900
Wire Wire Line
	6450 9000 7100 9000
Wire Wire Line
	6450 9650 7100 9650
Wire Wire Line
	6450 9750 7100 9750
Wire Wire Line
	6450 9850 7100 9850
Wire Wire Line
	6450 9950 7100 9950
Wire Wire Line
	6450 10050 7100 10050
Wire Wire Line
	6450 10150 7100 10150
Wire Wire Line
	7000 1700 7000 2850
Wire Wire Line
	7000 1700 7100 1700
Wire Wire Line
	7000 4200 7000 5350
Wire Wire Line
	7000 5350 7100 5350
Wire Wire Line
	7000 6700 7100 6700
Wire Wire Line
	7000 7850 7000 6700
Wire Wire Line
	7000 9200 7100 9200
Wire Wire Line
	7000 10350 7000 9200
Wire Wire Line
	7100 2550 7100 2450
Wire Wire Line
	7100 2550 7100 2650
Wire Wire Line
	7100 2850 7000 2850
Wire Wire Line
	7100 4200 7000 4200
Wire Wire Line
	7100 7850 7000 7850
Wire Wire Line
	7100 10350 7000 10350
Wire Wire Line
	8750 1000 8100 1000
Wire Wire Line
	8750 1100 8100 1100
Wire Wire Line
	8750 1200 8100 1200
Wire Wire Line
	8750 1300 8100 1300
Wire Wire Line
	8750 1400 8100 1400
Wire Wire Line
	8750 1500 8100 1500
Wire Wire Line
	8750 2150 8100 2150
Wire Wire Line
	8750 2250 8100 2250
Wire Wire Line
	8750 2350 8100 2350
Wire Wire Line
	8750 2450 8100 2450
Wire Wire Line
	8750 2550 8100 2550
Wire Wire Line
	8750 2650 8100 2650
Wire Wire Line
	8750 3500 8100 3500
Wire Wire Line
	8750 3600 8100 3600
Wire Wire Line
	8750 3700 8100 3700
Wire Wire Line
	8750 3800 8100 3800
Wire Wire Line
	8750 3900 8100 3900
Wire Wire Line
	8750 4000 8100 4000
Wire Wire Line
	8750 4650 8100 4650
Wire Wire Line
	8750 4750 8100 4750
Wire Wire Line
	8750 4850 8100 4850
Wire Wire Line
	8750 4950 8100 4950
Wire Wire Line
	8750 5050 8100 5050
Wire Wire Line
	8750 5150 8100 5150
Wire Wire Line
	8750 6000 8100 6000
Wire Wire Line
	8750 6100 8100 6100
Wire Wire Line
	8750 6200 8100 6200
Wire Wire Line
	8750 6300 8100 6300
Wire Wire Line
	8750 6400 8100 6400
Wire Wire Line
	8750 6500 8100 6500
Wire Wire Line
	8750 7150 8100 7150
Wire Wire Line
	8750 7250 8100 7250
Wire Wire Line
	8750 7350 8100 7350
Wire Wire Line
	8750 7450 8100 7450
Wire Wire Line
	8750 7550 8100 7550
Wire Wire Line
	8750 7650 8100 7650
Wire Wire Line
	8750 8500 8100 8500
Wire Wire Line
	8750 8600 8100 8600
Wire Wire Line
	8750 8700 8100 8700
Wire Wire Line
	8750 8800 8100 8800
Wire Wire Line
	8750 8900 8100 8900
Wire Wire Line
	8750 9000 8100 9000
Wire Wire Line
	8750 9650 8100 9650
Wire Wire Line
	8750 9750 8100 9750
Wire Wire Line
	8750 9850 8100 9850
Wire Wire Line
	8750 9950 8100 9950
Wire Wire Line
	8750 10050 8100 10050
Wire Wire Line
	8750 10150 8100 10150
Wire Wire Line
	9200 1000 9850 1000
Wire Wire Line
	9200 1100 9850 1100
Wire Wire Line
	9200 1200 9850 1200
Wire Wire Line
	9200 1300 9850 1300
Wire Wire Line
	9200 1400 9850 1400
Wire Wire Line
	9200 1500 9850 1500
Wire Wire Line
	9200 2150 9850 2150
Wire Wire Line
	9200 2250 9850 2250
Wire Wire Line
	9200 2350 9850 2350
Wire Wire Line
	9200 3500 9850 3500
Wire Wire Line
	9200 3600 9850 3600
Wire Wire Line
	9200 3700 9850 3700
Wire Wire Line
	9200 3800 9850 3800
Wire Wire Line
	9200 3900 9850 3900
Wire Wire Line
	9200 4000 9850 4000
Wire Wire Line
	9200 4650 9850 4650
Wire Wire Line
	9200 4750 9850 4750
Wire Wire Line
	9200 4850 9850 4850
Wire Wire Line
	9200 4950 9850 4950
Wire Wire Line
	9200 5050 9850 5050
Wire Wire Line
	9200 5150 9850 5150
Wire Wire Line
	9200 6000 9850 6000
Wire Wire Line
	9200 6100 9850 6100
Wire Wire Line
	9200 6200 9850 6200
Wire Wire Line
	9200 6300 9850 6300
Wire Wire Line
	9200 6400 9850 6400
Wire Wire Line
	9200 6500 9850 6500
Wire Wire Line
	9200 7150 9850 7150
Wire Wire Line
	9200 7250 9850 7250
Wire Wire Line
	9200 7350 9850 7350
Wire Wire Line
	9200 7450 9850 7450
Wire Wire Line
	9200 7550 9850 7550
Wire Wire Line
	9200 7650 9850 7650
Wire Wire Line
	9200 8500 9850 8500
Wire Wire Line
	9200 8600 9850 8600
Wire Wire Line
	9200 8700 9850 8700
Wire Wire Line
	9200 8800 9850 8800
Wire Wire Line
	9200 8900 9850 8900
Wire Wire Line
	9200 9000 9850 9000
Wire Wire Line
	9200 9650 9850 9650
Wire Wire Line
	9200 9750 9850 9750
Wire Wire Line
	9200 9850 9850 9850
Wire Wire Line
	9200 9950 9850 9950
Wire Wire Line
	9200 10050 9850 10050
Wire Wire Line
	9200 10150 9850 10150
Wire Wire Line
	9750 1700 9850 1700
Wire Wire Line
	9750 2850 9750 1700
Wire Wire Line
	9750 4200 9750 5350
Wire Wire Line
	9750 5350 9850 5350
Wire Wire Line
	9750 6700 9850 6700
Wire Wire Line
	9750 7850 9750 6700
Wire Wire Line
	9750 9200 9850 9200
Wire Wire Line
	9750 10350 9750 9200
Wire Wire Line
	9850 2550 9850 2450
Wire Wire Line
	9850 2550 9850 2650
Wire Wire Line
	9850 2850 9750 2850
Wire Wire Line
	9850 4200 9750 4200
Wire Wire Line
	9850 7850 9750 7850
Wire Wire Line
	9850 10350 9750 10350
Wire Wire Line
	11500 1000 10850 1000
Wire Wire Line
	11500 1100 10850 1100
Wire Wire Line
	11500 1200 10850 1200
Wire Wire Line
	11500 1300 10850 1300
Wire Wire Line
	11500 1400 10850 1400
Wire Wire Line
	11500 1500 10850 1500
Wire Wire Line
	11500 2150 10850 2150
Wire Wire Line
	11500 2250 10850 2250
Wire Wire Line
	11500 2350 10850 2350
Wire Wire Line
	11500 2450 10850 2450
Wire Wire Line
	11500 2550 10850 2550
Wire Wire Line
	11500 2650 10850 2650
Wire Wire Line
	11500 3500 10850 3500
Wire Wire Line
	11500 3600 10850 3600
Wire Wire Line
	11500 3700 10850 3700
Wire Wire Line
	11500 3800 10850 3800
Wire Wire Line
	11500 3900 10850 3900
Wire Wire Line
	11500 4000 10850 4000
Wire Wire Line
	11500 4650 10850 4650
Wire Wire Line
	11500 4750 10850 4750
Wire Wire Line
	11500 4850 10850 4850
Wire Wire Line
	11500 4950 10850 4950
Wire Wire Line
	11500 5050 10850 5050
Wire Wire Line
	11500 5150 10850 5150
Wire Wire Line
	11500 6000 10850 6000
Wire Wire Line
	11500 6100 10850 6100
Wire Wire Line
	11500 6200 10850 6200
Wire Wire Line
	11500 6300 10850 6300
Wire Wire Line
	11500 6400 10850 6400
Wire Wire Line
	11500 6500 10850 6500
Wire Wire Line
	11500 7150 10850 7150
Wire Wire Line
	11500 7250 10850 7250
Wire Wire Line
	11500 7350 10850 7350
Wire Wire Line
	11500 7450 10850 7450
Wire Wire Line
	11500 7550 10850 7550
Wire Wire Line
	11500 7650 10850 7650
Wire Wire Line
	11500 8500 10850 8500
Wire Wire Line
	11500 8600 10850 8600
Wire Wire Line
	11500 8700 10850 8700
Wire Wire Line
	11500 8800 10850 8800
Wire Wire Line
	11500 8900 10850 8900
Wire Wire Line
	11500 9000 10850 9000
Wire Wire Line
	11500 9650 10850 9650
Wire Wire Line
	11500 9750 10850 9750
Wire Wire Line
	11500 9850 10850 9850
Wire Wire Line
	11500 9950 10850 9950
Wire Wire Line
	11500 10050 10850 10050
Wire Wire Line
	11500 10150 10850 10150
Wire Wire Line
	13400 7650 14350 7650
Wire Wire Line
	13400 7750 14350 7750
Wire Wire Line
	13400 7850 14350 7850
Wire Wire Line
	13400 7950 14350 7950
Wire Wire Line
	13850 4450 13350 4450
Wire Wire Line
	13850 4550 13350 4550
Wire Wire Line
	13850 5200 13350 5200
Wire Wire Line
	13850 5300 13350 5300
Wire Wire Line
	13850 5950 13350 5950
Wire Wire Line
	13850 6050 13350 6050
Wire Wire Line
	13850 6700 13350 6700
Wire Wire Line
	13850 6800 13350 6800
Wire Wire Line
	14700 4450 15200 4450
Wire Wire Line
	14700 4550 15200 4550
Wire Wire Line
	14700 4650 15200 4650
Wire Wire Line
	14700 4750 15200 4750
Wire Wire Line
	14700 5200 15200 5200
Wire Wire Line
	14700 5300 15200 5300
Wire Wire Line
	14700 5400 15200 5400
Wire Wire Line
	14700 5500 15200 5500
Wire Wire Line
	14700 5950 15200 5950
Wire Wire Line
	14700 6050 15200 6050
Wire Wire Line
	14700 6150 15200 6150
Wire Wire Line
	14700 6250 15200 6250
Wire Wire Line
	14700 6700 15200 6700
Wire Wire Line
	14700 6800 15200 6800
Wire Wire Line
	14700 6900 15200 6900
Wire Wire Line
	14700 7000 15200 7000
Wire Bus Line
	850  3050 3600 3050
Wire Bus Line
	850  3150 3600 3150
Wire Bus Line
	850  8050 3600 8050
Wire Bus Line
	3200 10700 3350 10700
Wire Bus Line
	3600 3050 6350 3050
Wire Bus Line
	3600 3150 6350 3150
Wire Bus Line
	3600 8050 6350 8050
Wire Bus Line
	3600 8150 850  8150
Wire Bus Line
	5950 10700 6100 10700
Wire Bus Line
	6350 3050 9100 3050
Wire Bus Line
	6350 3150 9100 3150
Wire Bus Line
	6350 8050 9100 8050
Wire Bus Line
	6350 8150 3600 8150
Wire Bus Line
	8700 10700 8850 10700
Wire Bus Line
	9100 3050 11850 3050
Wire Bus Line
	9100 3150 11850 3150
Wire Bus Line
	9100 8050 11850 8050
Wire Bus Line
	9100 8150 6350 8150
Wire Bus Line
	9100 8150 11850 8150
Wire Bus Line
	11450 10700 11600 10700
Wire Bus Line
	13250 4750 13150 4750
Wire Bus Line
	13250 5500 13150 5500
Wire Bus Line
	13250 6250 13150 6250
Wire Bus Line
	13250 7000 13150 7000
Wire Bus Line
	14450 8150 14550 8150
Text Label 1050 1000 0    50   ~ 0
COL1-D0
Text Label 1050 1100 0    50   ~ 0
COL1-D1
Text Label 1050 1200 0    50   ~ 0
COL1-D2
Text Label 1050 1300 0    50   ~ 0
COL1-D3
Text Label 1050 1400 0    50   ~ 0
COL1-D4
Text Label 1050 1500 0    50   ~ 0
COL1-D5
Text Label 1050 2150 0    50   ~ 0
COL1-D6
Text Label 1050 2250 0    50   ~ 0
COL1-D7
Text Label 1050 2350 0    50   ~ 0
COL1-D8
Text Label 1050 3500 0    50   ~ 0
COL2-D0
Text Label 1050 3600 0    50   ~ 0
COL2-D1
Text Label 1050 3700 0    50   ~ 0
COL2-D2
Text Label 1050 3800 0    50   ~ 0
COL2-D3
Text Label 1050 3900 0    50   ~ 0
COL2-D4
Text Label 1050 4000 0    50   ~ 0
COL2-D5
Text Label 1050 4650 0    50   ~ 0
COL2-D6
Text Label 1050 4750 0    50   ~ 0
COL2-D7
Text Label 1050 4850 0    50   ~ 0
COL2-D8
Text Label 1050 4950 0    50   ~ 0
COL2-D9
Text Label 1050 5050 0    50   ~ 0
COL2-D10
Text Label 1050 5150 0    50   ~ 0
COL2-D11
Text Label 1050 6000 0    50   ~ 0
COL3-D0
Text Label 1050 6100 0    50   ~ 0
COL3-D1
Text Label 1050 6200 0    50   ~ 0
COL3-D2
Text Label 1050 6300 0    50   ~ 0
COL3-D3
Text Label 1050 6400 0    50   ~ 0
COL3-D4
Text Label 1050 6500 0    50   ~ 0
COL3-D5
Text Label 1050 7150 0    50   ~ 0
COL3-D6
Text Label 1050 7250 0    50   ~ 0
COL3-D7
Text Label 1050 7350 0    50   ~ 0
COL3-D8
Text Label 1050 7450 0    50   ~ 0
COL3-D9
Text Label 1050 7550 0    50   ~ 0
COL3-D10
Text Label 1050 7650 0    50   ~ 0
COL3-D11
Text Label 1050 8500 0    50   ~ 0
COL4-D0
Text Label 1050 8600 0    50   ~ 0
COL4-D1
Text Label 1050 8700 0    50   ~ 0
COL4-D2
Text Label 1050 8800 0    50   ~ 0
COL4-D3
Text Label 1050 8900 0    50   ~ 0
COL4-D4
Text Label 1050 9000 0    50   ~ 0
COL4-D5
Text Label 1050 9650 0    50   ~ 0
COL4-D6
Text Label 1050 9750 0    50   ~ 0
COL4-D7
Text Label 1050 9850 0    50   ~ 0
COL4-D8
Text Label 1050 9950 0    50   ~ 0
COL4-D9
Text Label 1050 10050 0    50   ~ 0
COL4-D10
Text Label 1050 10150 0    50   ~ 0
COL4-D11
Text Label 1500 1700 2    50   ~ 0
~R1C1
Text Label 1500 4200 2    50   ~ 0
~R1C2
Text Label 1500 6700 2    50   ~ 0
~R1C3
Text Label 1500 9200 2    50   ~ 0
~R1C4
Text Label 2700 1000 0    50   ~ 0
ROW1-D0
Text Label 2700 1100 0    50   ~ 0
ROW1-D1
Text Label 2700 1200 0    50   ~ 0
ROW1-D2
Text Label 2700 1300 0    50   ~ 0
ROW1-D3
Text Label 2700 1400 0    50   ~ 0
ROW1-D4
Text Label 2700 1500 0    50   ~ 0
ROW1-D5
Text Label 2700 2150 0    50   ~ 0
ROW1-D6
Text Label 2700 2250 0    50   ~ 0
ROW1-D7
Text Label 2700 2350 0    50   ~ 0
ROW1-D8
Text Label 2700 2450 0    50   ~ 0
ROW1-D9
Text Label 2700 2550 0    50   ~ 0
ROW1-D10
Text Label 2700 2650 0    50   ~ 0
ROW1-D11
Text Label 2700 3500 0    50   ~ 0
ROW1-D0
Text Label 2700 3600 0    50   ~ 0
ROW1-D1
Text Label 2700 3700 0    50   ~ 0
ROW1-D2
Text Label 2700 3800 0    50   ~ 0
ROW1-D3
Text Label 2700 3900 0    50   ~ 0
ROW1-D4
Text Label 2700 4000 0    50   ~ 0
ROW1-D5
Text Label 2700 4650 0    50   ~ 0
ROW1-D6
Text Label 2700 4750 0    50   ~ 0
ROW1-D7
Text Label 2700 4850 0    50   ~ 0
ROW1-D8
Text Label 2700 4950 0    50   ~ 0
ROW1-D9
Text Label 2700 5050 0    50   ~ 0
ROW1-D10
Text Label 2700 5150 0    50   ~ 0
ROW1-D11
Text Label 2700 6000 0    50   ~ 0
ROW1-D0
Text Label 2700 6100 0    50   ~ 0
ROW1-D1
Text Label 2700 6200 0    50   ~ 0
ROW1-D2
Text Label 2700 6300 0    50   ~ 0
ROW1-D3
Text Label 2700 6400 0    50   ~ 0
ROW1-D4
Text Label 2700 6500 0    50   ~ 0
ROW1-D5
Text Label 2700 7150 0    50   ~ 0
ROW1-D6
Text Label 2700 7250 0    50   ~ 0
ROW1-D7
Text Label 2700 7350 0    50   ~ 0
ROW1-D8
Text Label 2700 7450 0    50   ~ 0
ROW1-D9
Text Label 2700 7550 0    50   ~ 0
ROW1-D10
Text Label 2700 7650 0    50   ~ 0
ROW1-D11
Text Label 2700 8500 0    50   ~ 0
ROW1-D0
Text Label 2700 8600 0    50   ~ 0
ROW1-D1
Text Label 2700 8700 0    50   ~ 0
ROW1-D2
Text Label 2700 8800 0    50   ~ 0
ROW1-D3
Text Label 2700 8900 0    50   ~ 0
ROW1-D4
Text Label 2700 9000 0    50   ~ 0
ROW1-D5
Text Label 2700 9650 0    50   ~ 0
ROW1-D6
Text Label 2700 9750 0    50   ~ 0
ROW1-D7
Text Label 2700 9850 0    50   ~ 0
ROW1-D8
Text Label 2700 9950 0    50   ~ 0
ROW1-D9
Text Label 2700 10050 0    50   ~ 0
ROW1-D10
Text Label 2700 10150 0    50   ~ 0
ROW1-D11
Text Label 3800 1000 0    50   ~ 0
COL1-D0
Text Label 3800 1100 0    50   ~ 0
COL1-D1
Text Label 3800 1200 0    50   ~ 0
COL1-D2
Text Label 3800 1300 0    50   ~ 0
COL1-D3
Text Label 3800 1400 0    50   ~ 0
COL1-D4
Text Label 3800 1500 0    50   ~ 0
COL1-D5
Text Label 3800 2150 0    50   ~ 0
COL1-D6
Text Label 3800 2250 0    50   ~ 0
COL1-D7
Text Label 3800 2350 0    50   ~ 0
COL1-D8
Text Label 3800 3500 0    50   ~ 0
COL2-D0
Text Label 3800 3600 0    50   ~ 0
COL2-D1
Text Label 3800 3700 0    50   ~ 0
COL2-D2
Text Label 3800 3800 0    50   ~ 0
COL2-D3
Text Label 3800 3900 0    50   ~ 0
COL2-D4
Text Label 3800 4000 0    50   ~ 0
COL2-D5
Text Label 3800 4650 0    50   ~ 0
COL2-D6
Text Label 3800 4750 0    50   ~ 0
COL2-D7
Text Label 3800 4850 0    50   ~ 0
COL2-D8
Text Label 3800 4950 0    50   ~ 0
COL2-D9
Text Label 3800 5050 0    50   ~ 0
COL2-D10
Text Label 3800 5150 0    50   ~ 0
COL2-D11
Text Label 3800 6000 0    50   ~ 0
COL3-D0
Text Label 3800 6100 0    50   ~ 0
COL3-D1
Text Label 3800 6200 0    50   ~ 0
COL3-D2
Text Label 3800 6300 0    50   ~ 0
COL3-D3
Text Label 3800 6400 0    50   ~ 0
COL3-D4
Text Label 3800 6500 0    50   ~ 0
COL3-D5
Text Label 3800 7150 0    50   ~ 0
COL3-D6
Text Label 3800 7250 0    50   ~ 0
COL3-D7
Text Label 3800 7350 0    50   ~ 0
COL3-D8
Text Label 3800 7450 0    50   ~ 0
COL3-D9
Text Label 3800 7550 0    50   ~ 0
COL3-D10
Text Label 3800 7650 0    50   ~ 0
COL3-D11
Text Label 3800 8500 0    50   ~ 0
COL4-D0
Text Label 3800 8600 0    50   ~ 0
COL4-D1
Text Label 3800 8700 0    50   ~ 0
COL4-D2
Text Label 3800 8800 0    50   ~ 0
COL4-D3
Text Label 3800 8900 0    50   ~ 0
COL4-D4
Text Label 3800 9000 0    50   ~ 0
COL4-D5
Text Label 3800 9650 0    50   ~ 0
COL4-D6
Text Label 3800 9750 0    50   ~ 0
COL4-D7
Text Label 3800 9850 0    50   ~ 0
COL4-D8
Text Label 3800 9950 0    50   ~ 0
COL4-D9
Text Label 3800 10050 0    50   ~ 0
COL4-D10
Text Label 3800 10150 0    50   ~ 0
COL4-D11
Text Label 4250 1700 2    50   ~ 0
~R2C1
Text Label 4250 4200 2    50   ~ 0
~R2C2
Text Label 4250 6700 2    50   ~ 0
~R2C3
Text Label 4250 9200 2    50   ~ 0
~R2C4
Text Label 5450 1000 0    50   ~ 0
ROW2-D0
Text Label 5450 1100 0    50   ~ 0
ROW2-D1
Text Label 5450 1200 0    50   ~ 0
ROW2-D2
Text Label 5450 1300 0    50   ~ 0
ROW2-D3
Text Label 5450 1400 0    50   ~ 0
ROW2-D4
Text Label 5450 1500 0    50   ~ 0
ROW2-D5
Text Label 5450 2150 0    50   ~ 0
ROW2-D6
Text Label 5450 2250 0    50   ~ 0
ROW2-D7
Text Label 5450 2350 0    50   ~ 0
ROW2-D8
Text Label 5450 2450 0    50   ~ 0
ROW2-D9
Text Label 5450 2550 0    50   ~ 0
ROW2-D10
Text Label 5450 2650 0    50   ~ 0
ROW2-D11
Text Label 5450 3500 0    50   ~ 0
ROW2-D0
Text Label 5450 3600 0    50   ~ 0
ROW2-D1
Text Label 5450 3700 0    50   ~ 0
ROW2-D2
Text Label 5450 3800 0    50   ~ 0
ROW2-D3
Text Label 5450 3900 0    50   ~ 0
ROW2-D4
Text Label 5450 4000 0    50   ~ 0
ROW2-D5
Text Label 5450 4650 0    50   ~ 0
ROW2-D6
Text Label 5450 4750 0    50   ~ 0
ROW2-D7
Text Label 5450 4850 0    50   ~ 0
ROW2-D8
Text Label 5450 4950 0    50   ~ 0
ROW2-D9
Text Label 5450 5050 0    50   ~ 0
ROW2-D10
Text Label 5450 5150 0    50   ~ 0
ROW2-D11
Text Label 5450 6000 0    50   ~ 0
ROW2-D0
Text Label 5450 6100 0    50   ~ 0
ROW2-D1
Text Label 5450 6200 0    50   ~ 0
ROW2-D2
Text Label 5450 6300 0    50   ~ 0
ROW2-D3
Text Label 5450 6400 0    50   ~ 0
ROW2-D4
Text Label 5450 6500 0    50   ~ 0
ROW2-D5
Text Label 5450 7150 0    50   ~ 0
ROW2-D6
Text Label 5450 7250 0    50   ~ 0
ROW2-D7
Text Label 5450 7350 0    50   ~ 0
ROW2-D8
Text Label 5450 7450 0    50   ~ 0
ROW2-D9
Text Label 5450 7550 0    50   ~ 0
ROW2-D10
Text Label 5450 7650 0    50   ~ 0
ROW2-D11
Text Label 5450 8500 0    50   ~ 0
ROW2-D0
Text Label 5450 8600 0    50   ~ 0
ROW2-D1
Text Label 5450 8700 0    50   ~ 0
ROW2-D2
Text Label 5450 8800 0    50   ~ 0
ROW2-D3
Text Label 5450 8900 0    50   ~ 0
ROW2-D4
Text Label 5450 9000 0    50   ~ 0
ROW2-D5
Text Label 5450 9650 0    50   ~ 0
ROW2-D6
Text Label 5450 9750 0    50   ~ 0
ROW2-D7
Text Label 5450 9850 0    50   ~ 0
ROW2-D8
Text Label 5450 9950 0    50   ~ 0
ROW2-D9
Text Label 5450 10050 0    50   ~ 0
ROW2-D10
Text Label 5450 10150 0    50   ~ 0
ROW2-D11
Text Label 6550 1000 0    50   ~ 0
COL1-D0
Text Label 6550 1100 0    50   ~ 0
COL1-D1
Text Label 6550 1200 0    50   ~ 0
COL1-D2
Text Label 6550 1300 0    50   ~ 0
COL1-D3
Text Label 6550 1400 0    50   ~ 0
COL1-D4
Text Label 6550 1500 0    50   ~ 0
COL1-D5
Text Label 6550 2150 0    50   ~ 0
COL1-D6
Text Label 6550 2250 0    50   ~ 0
COL1-D7
Text Label 6550 2350 0    50   ~ 0
COL1-D8
Text Label 6550 3500 0    50   ~ 0
COL2-D0
Text Label 6550 3600 0    50   ~ 0
COL2-D1
Text Label 6550 3700 0    50   ~ 0
COL2-D2
Text Label 6550 3800 0    50   ~ 0
COL2-D3
Text Label 6550 3900 0    50   ~ 0
COL2-D4
Text Label 6550 4000 0    50   ~ 0
COL2-D5
Text Label 6550 4650 0    50   ~ 0
COL2-D6
Text Label 6550 4750 0    50   ~ 0
COL2-D7
Text Label 6550 4850 0    50   ~ 0
COL2-D8
Text Label 6550 4950 0    50   ~ 0
COL2-D9
Text Label 6550 5050 0    50   ~ 0
COL2-D10
Text Label 6550 5150 0    50   ~ 0
COL2-D11
Text Label 6550 6000 0    50   ~ 0
COL3-D0
Text Label 6550 6100 0    50   ~ 0
COL3-D1
Text Label 6550 6200 0    50   ~ 0
COL3-D2
Text Label 6550 6300 0    50   ~ 0
COL3-D3
Text Label 6550 6400 0    50   ~ 0
COL3-D4
Text Label 6550 6500 0    50   ~ 0
COL3-D5
Text Label 6550 7150 0    50   ~ 0
COL3-D6
Text Label 6550 7250 0    50   ~ 0
COL3-D7
Text Label 6550 7350 0    50   ~ 0
COL3-D8
Text Label 6550 7450 0    50   ~ 0
COL3-D9
Text Label 6550 7550 0    50   ~ 0
COL3-D10
Text Label 6550 7650 0    50   ~ 0
COL3-D11
Text Label 6550 8500 0    50   ~ 0
COL4-D0
Text Label 6550 8600 0    50   ~ 0
COL4-D1
Text Label 6550 8700 0    50   ~ 0
COL4-D2
Text Label 6550 8800 0    50   ~ 0
COL4-D3
Text Label 6550 8900 0    50   ~ 0
COL4-D4
Text Label 6550 9000 0    50   ~ 0
COL4-D5
Text Label 6550 9650 0    50   ~ 0
COL4-D6
Text Label 6550 9750 0    50   ~ 0
COL4-D7
Text Label 6550 9850 0    50   ~ 0
COL4-D8
Text Label 6550 9950 0    50   ~ 0
COL4-D9
Text Label 6550 10050 0    50   ~ 0
COL4-D10
Text Label 6550 10150 0    50   ~ 0
COL4-D11
Text Label 7000 1700 2    50   ~ 0
~R3C1
Text Label 7000 4200 2    50   ~ 0
~R3C2
Text Label 7000 6700 2    50   ~ 0
~R3C3
Text Label 7000 9200 2    50   ~ 0
~R3C4
Text Label 8200 1000 0    50   ~ 0
ROW3-D0
Text Label 8200 1100 0    50   ~ 0
ROW3-D1
Text Label 8200 1200 0    50   ~ 0
ROW3-D2
Text Label 8200 1300 0    50   ~ 0
ROW3-D3
Text Label 8200 1400 0    50   ~ 0
ROW3-D4
Text Label 8200 1500 0    50   ~ 0
ROW3-D5
Text Label 8200 2150 0    50   ~ 0
ROW3-D6
Text Label 8200 2250 0    50   ~ 0
ROW3-D7
Text Label 8200 2350 0    50   ~ 0
ROW3-D8
Text Label 8200 2450 0    50   ~ 0
ROW3-D9
Text Label 8200 2550 0    50   ~ 0
ROW3-D10
Text Label 8200 2650 0    50   ~ 0
ROW3-D11
Text Label 8200 3500 0    50   ~ 0
ROW3-D0
Text Label 8200 3600 0    50   ~ 0
ROW3-D1
Text Label 8200 3700 0    50   ~ 0
ROW3-D2
Text Label 8200 3800 0    50   ~ 0
ROW3-D3
Text Label 8200 3900 0    50   ~ 0
ROW3-D4
Text Label 8200 4000 0    50   ~ 0
ROW3-D5
Text Label 8200 4650 0    50   ~ 0
ROW3-D6
Text Label 8200 4750 0    50   ~ 0
ROW3-D7
Text Label 8200 4850 0    50   ~ 0
ROW3-D8
Text Label 8200 4950 0    50   ~ 0
ROW3-D9
Text Label 8200 5050 0    50   ~ 0
ROW3-D10
Text Label 8200 5150 0    50   ~ 0
ROW3-D11
Text Label 8200 6000 0    50   ~ 0
ROW3-D0
Text Label 8200 6100 0    50   ~ 0
ROW3-D1
Text Label 8200 6200 0    50   ~ 0
ROW3-D2
Text Label 8200 6300 0    50   ~ 0
ROW3-D3
Text Label 8200 6400 0    50   ~ 0
ROW3-D4
Text Label 8200 6500 0    50   ~ 0
ROW3-D5
Text Label 8200 7150 0    50   ~ 0
ROW3-D6
Text Label 8200 7250 0    50   ~ 0
ROW3-D7
Text Label 8200 7350 0    50   ~ 0
ROW3-D8
Text Label 8200 7450 0    50   ~ 0
ROW3-D9
Text Label 8200 7550 0    50   ~ 0
ROW3-D10
Text Label 8200 7650 0    50   ~ 0
ROW3-D11
Text Label 8200 8500 0    50   ~ 0
ROW3-D0
Text Label 8200 8600 0    50   ~ 0
ROW3-D1
Text Label 8200 8700 0    50   ~ 0
ROW3-D2
Text Label 8200 8800 0    50   ~ 0
ROW3-D3
Text Label 8200 8900 0    50   ~ 0
ROW3-D4
Text Label 8200 9000 0    50   ~ 0
ROW3-D5
Text Label 8200 9650 0    50   ~ 0
ROW3-D6
Text Label 8200 9750 0    50   ~ 0
ROW3-D7
Text Label 8200 9850 0    50   ~ 0
ROW3-D8
Text Label 8200 9950 0    50   ~ 0
ROW3-D9
Text Label 8200 10050 0    50   ~ 0
ROW3-D10
Text Label 8200 10150 0    50   ~ 0
ROW3-D11
Text Label 9300 1000 0    50   ~ 0
COL1-D0
Text Label 9300 1100 0    50   ~ 0
COL1-D1
Text Label 9300 1200 0    50   ~ 0
COL1-D2
Text Label 9300 1300 0    50   ~ 0
COL1-D3
Text Label 9300 1400 0    50   ~ 0
COL1-D4
Text Label 9300 1500 0    50   ~ 0
COL1-D5
Text Label 9300 2150 0    50   ~ 0
COL1-D6
Text Label 9300 2250 0    50   ~ 0
COL1-D7
Text Label 9300 2350 0    50   ~ 0
COL1-D8
Text Label 9300 3500 0    50   ~ 0
COL2-D0
Text Label 9300 3600 0    50   ~ 0
COL2-D1
Text Label 9300 3700 0    50   ~ 0
COL2-D2
Text Label 9300 3800 0    50   ~ 0
COL2-D3
Text Label 9300 3900 0    50   ~ 0
COL2-D4
Text Label 9300 4000 0    50   ~ 0
COL2-D5
Text Label 9300 4650 0    50   ~ 0
COL2-D6
Text Label 9300 4750 0    50   ~ 0
COL2-D7
Text Label 9300 4850 0    50   ~ 0
COL2-D8
Text Label 9300 4950 0    50   ~ 0
COL2-D9
Text Label 9300 5050 0    50   ~ 0
COL2-D10
Text Label 9300 5150 0    50   ~ 0
COL2-D11
Text Label 9300 6000 0    50   ~ 0
COL3-D0
Text Label 9300 6100 0    50   ~ 0
COL3-D1
Text Label 9300 6200 0    50   ~ 0
COL3-D2
Text Label 9300 6300 0    50   ~ 0
COL3-D3
Text Label 9300 6400 0    50   ~ 0
COL3-D4
Text Label 9300 6500 0    50   ~ 0
COL3-D5
Text Label 9300 7150 0    50   ~ 0
COL3-D6
Text Label 9300 7250 0    50   ~ 0
COL3-D7
Text Label 9300 7350 0    50   ~ 0
COL3-D8
Text Label 9300 7450 0    50   ~ 0
COL3-D9
Text Label 9300 7550 0    50   ~ 0
COL3-D10
Text Label 9300 7650 0    50   ~ 0
COL3-D11
Text Label 9300 8500 0    50   ~ 0
COL4-D0
Text Label 9300 8600 0    50   ~ 0
COL4-D1
Text Label 9300 8700 0    50   ~ 0
COL4-D2
Text Label 9300 8800 0    50   ~ 0
COL4-D3
Text Label 9300 8900 0    50   ~ 0
COL4-D4
Text Label 9300 9000 0    50   ~ 0
COL4-D5
Text Label 9300 9650 0    50   ~ 0
COL4-D6
Text Label 9300 9750 0    50   ~ 0
COL4-D7
Text Label 9300 9850 0    50   ~ 0
COL4-D8
Text Label 9300 9950 0    50   ~ 0
COL4-D9
Text Label 9300 10050 0    50   ~ 0
COL4-D10
Text Label 9300 10150 0    50   ~ 0
COL4-D11
Text Label 9750 1700 2    50   ~ 0
~R4C1
Text Label 9750 4200 2    50   ~ 0
~R4C2
Text Label 9750 6700 2    50   ~ 0
~R4C3
Text Label 9750 9200 2    50   ~ 0
~R4C4
Text Label 10950 1000 0    50   ~ 0
ROW4-D0
Text Label 10950 1100 0    50   ~ 0
ROW4-D1
Text Label 10950 1200 0    50   ~ 0
ROW4-D2
Text Label 10950 1300 0    50   ~ 0
ROW4-D3
Text Label 10950 1400 0    50   ~ 0
ROW4-D4
Text Label 10950 1500 0    50   ~ 0
ROW4-D5
Text Label 10950 2150 0    50   ~ 0
ROW4-D6
Text Label 10950 2250 0    50   ~ 0
ROW4-D7
Text Label 10950 2350 0    50   ~ 0
ROW4-D8
Text Label 10950 2450 0    50   ~ 0
ROW4-D9
Text Label 10950 2550 0    50   ~ 0
ROW4-D10
Text Label 10950 2650 0    50   ~ 0
ROW4-D11
Text Label 10950 3500 0    50   ~ 0
ROW4-D0
Text Label 10950 3600 0    50   ~ 0
ROW4-D1
Text Label 10950 3700 0    50   ~ 0
ROW4-D2
Text Label 10950 3800 0    50   ~ 0
ROW4-D3
Text Label 10950 3900 0    50   ~ 0
ROW4-D4
Text Label 10950 4000 0    50   ~ 0
ROW4-D5
Text Label 10950 4650 0    50   ~ 0
ROW4-D6
Text Label 10950 4750 0    50   ~ 0
ROW4-D7
Text Label 10950 4850 0    50   ~ 0
ROW4-D8
Text Label 10950 4950 0    50   ~ 0
ROW4-D9
Text Label 10950 5050 0    50   ~ 0
ROW4-D10
Text Label 10950 5150 0    50   ~ 0
ROW4-D11
Text Label 10950 6000 0    50   ~ 0
ROW4-D0
Text Label 10950 6100 0    50   ~ 0
ROW4-D1
Text Label 10950 6200 0    50   ~ 0
ROW4-D2
Text Label 10950 6300 0    50   ~ 0
ROW4-D3
Text Label 10950 6400 0    50   ~ 0
ROW4-D4
Text Label 10950 6500 0    50   ~ 0
ROW4-D5
Text Label 10950 7150 0    50   ~ 0
ROW4-D6
Text Label 10950 7250 0    50   ~ 0
ROW4-D7
Text Label 10950 7350 0    50   ~ 0
ROW4-D8
Text Label 10950 7450 0    50   ~ 0
ROW4-D9
Text Label 10950 7550 0    50   ~ 0
ROW4-D10
Text Label 10950 7650 0    50   ~ 0
ROW4-D11
Text Label 10950 8500 0    50   ~ 0
ROW4-D0
Text Label 10950 8600 0    50   ~ 0
ROW4-D1
Text Label 10950 8700 0    50   ~ 0
ROW4-D2
Text Label 10950 8800 0    50   ~ 0
ROW4-D3
Text Label 10950 8900 0    50   ~ 0
ROW4-D4
Text Label 10950 9000 0    50   ~ 0
ROW4-D5
Text Label 10950 9650 0    50   ~ 0
ROW4-D6
Text Label 10950 9750 0    50   ~ 0
ROW4-D7
Text Label 10950 9850 0    50   ~ 0
ROW4-D8
Text Label 10950 9950 0    50   ~ 0
ROW4-D9
Text Label 10950 10050 0    50   ~ 0
ROW4-D10
Text Label 10950 10150 0    50   ~ 0
ROW4-D11
Text Label 13500 7650 0    50   ~ 0
~R1C1
Text Label 13500 7750 0    50   ~ 0
~R2C1
Text Label 13500 7850 0    50   ~ 0
~R3C1
Text Label 13500 7950 0    50   ~ 0
~R4C1
Text Label 13800 4450 2    50   ~ 0
ROW4-S0
Text Label 13800 4550 2    50   ~ 0
ROW4-S1
Text Label 13800 5200 2    50   ~ 0
ROW3-S0
Text Label 13800 5300 2    50   ~ 0
ROW3-S1
Text Label 13800 5950 2    50   ~ 0
ROW2-S0
Text Label 13800 6050 2    50   ~ 0
ROW2-S1
Text Label 13800 6700 2    50   ~ 0
ROW1-S0
Text Label 13800 6800 2    50   ~ 0
ROW1-S1
Text Label 13900 7650 0    50   ~ 0
~SPRITE-R1
Text Label 13900 7750 0    50   ~ 0
~SPRITE-R2
Text Label 13900 7850 0    50   ~ 0
~SPRITE-R3
Text Label 13900 7950 0    50   ~ 0
~SPRITE-R4
Text Label 14800 4450 0    50   ~ 0
~R4C1
Text Label 14800 4550 0    50   ~ 0
~R4C2
Text Label 14800 4650 0    50   ~ 0
~R4C3
Text Label 14800 4750 0    50   ~ 0
~R4C4
Text Label 14800 5200 0    50   ~ 0
~R3C1
Text Label 14800 5300 0    50   ~ 0
~R3C2
Text Label 14800 5400 0    50   ~ 0
~R3C3
Text Label 14800 5500 0    50   ~ 0
~R3C4
Text Label 14800 5950 0    50   ~ 0
~R2C1
Text Label 14800 6050 0    50   ~ 0
~R2C2
Text Label 14800 6150 0    50   ~ 0
~R2C3
Text Label 14800 6250 0    50   ~ 0
~R2C4
Text Label 14800 6700 0    50   ~ 0
~R1C1
Text Label 14800 6800 0    50   ~ 0
~R1C2
Text Label 14800 6900 0    50   ~ 0
~R1C3
Text Label 14800 7000 0    50   ~ 0
~R1C4
Text HLabel 3200 10700 0    50   Output ~ 0
ROW1-D[0..11]
Text HLabel 5950 10700 0    50   Output ~ 0
ROW2-D[0..11]
Text HLabel 8700 10700 0    50   Output ~ 0
ROW3-D[0..11]
Text HLabel 11450 10700 0    50   Output ~ 0
ROW4-D[0..11]
Text HLabel 11850 3050 2    50   Input ~ 0
COL1-D[0..8]
Text HLabel 11850 3150 2    50   Input ~ 0
COL2-D[0..11]
Text HLabel 11850 8050 2    50   Input ~ 0
COL3-D[0..11]
Text HLabel 11850 8150 2    50   Input ~ 0
COL4-D[0..11]
Text HLabel 13150 4750 0    50   Input ~ 0
ROW4-S[0..1]
Text HLabel 13150 5500 0    50   Input ~ 0
ROW3-S[0..1]
Text HLabel 13150 6250 0    50   Input ~ 0
ROW2-S[0..1]
Text HLabel 13150 7000 0    50   Input ~ 0
ROW1-S[0..1]
Text HLabel 14550 8150 2    50   Output ~ 0
~SPRITE-R[1..4]
$Comp
L power:GND #PWR?
U 1 1 60C6649D
P 1600 2650
AR Path="/5F75F22B/60C6649D" Ref="#PWR?"  Part="1" 
AR Path="/5FBEEC97/5FC01C0B/60C6649D" Ref="#PWR0218"  Part="1" 
F 0 "#PWR0218" H 1600 2400 50  0001 C CNN
F 1 "GND" H 1605 2477 50  0001 C CNN
F 2 "" H 1600 2650 50  0001 C CNN
F 3 "" H 1600 2650 50  0001 C CNN
	1    1600 2650
	1    0    0    -1  
$EndComp
$Comp
L power:GND #PWR?
U 1 1 60C66E28
P 4350 2650
AR Path="/5F75F22B/60C66E28" Ref="#PWR?"  Part="1" 
AR Path="/5FBEEC97/5FC01C0B/60C66E28" Ref="#PWR0219"  Part="1" 
F 0 "#PWR0219" H 4350 2400 50  0001 C CNN
F 1 "GND" H 4355 2477 50  0001 C CNN
F 2 "" H 4350 2650 50  0001 C CNN
F 3 "" H 4350 2650 50  0001 C CNN
	1    4350 2650
	1    0    0    -1  
$EndComp
$Comp
L power:GND #PWR?
U 1 1 60C66D22
P 7100 2650
AR Path="/5F75F22B/60C66D22" Ref="#PWR?"  Part="1" 
AR Path="/5FBEEC97/5FC01C0B/60C66D22" Ref="#PWR0220"  Part="1" 
F 0 "#PWR0220" H 7100 2400 50  0001 C CNN
F 1 "GND" H 7105 2477 50  0001 C CNN
F 2 "" H 7100 2650 50  0001 C CNN
F 3 "" H 7100 2650 50  0001 C CNN
	1    7100 2650
	1    0    0    -1  
$EndComp
$Comp
L power:GND #PWR?
U 1 1 60C66BDA
P 9850 2650
AR Path="/5F75F22B/60C66BDA" Ref="#PWR?"  Part="1" 
AR Path="/5FBEEC97/5FC01C0B/60C66BDA" Ref="#PWR0221"  Part="1" 
F 0 "#PWR0221" H 9850 2400 50  0001 C CNN
F 1 "GND" H 9855 2477 50  0001 C CNN
F 2 "" H 9850 2650 50  0001 C CNN
F 3 "" H 9850 2650 50  0001 C CNN
	1    9850 2650
	1    0    0    -1  
$EndComp
$Comp
L A5C:D24L UBF?
U 1 1 60416F1A
P 14250 4600
AR Path="/5F84D673/60416F1A" Ref="UBF?"  Part="1" 
AR Path="/5F75F22B/60416F1A" Ref="UBF19"  Part="1" 
AR Path="/5FBEEC97/5FC01C0B/60416F1A" Ref="UBF19"  Part="1" 
F 0 "UBF19" H 14275 4986 50  0000 C CNN
F 1 "D24L" H 14275 4895 50  0000 C CNN
F 2 "" H 14250 4875 50  0001 C CNN
F 3 "" H 14250 4875 50  0001 C CNN
	1    14250 4600
	1    0    0    -1  
$EndComp
$Comp
L A5C:D24L UBF?
U 1 1 603B35EB
P 14250 5350
AR Path="/5F84D673/603B35EB" Ref="UBF?"  Part="1" 
AR Path="/5F75F22B/603B35EB" Ref="UBF26"  Part="1" 
AR Path="/5FBEEC97/5FC01C0B/603B35EB" Ref="UBF26"  Part="1" 
F 0 "UBF26" H 14275 5736 50  0000 C CNN
F 1 "D24L" H 14275 5645 50  0000 C CNN
F 2 "" H 14250 5625 50  0001 C CNN
F 3 "" H 14250 5625 50  0001 C CNN
	1    14250 5350
	1    0    0    -1  
$EndComp
$Comp
L A5C:D24L UBF?
U 1 1 602FA62E
P 14250 6100
AR Path="/5F84D673/602FA62E" Ref="UBF?"  Part="1" 
AR Path="/5F75F22B/602FA62E" Ref="UBF33"  Part="1" 
AR Path="/5FBEEC97/5FC01C0B/602FA62E" Ref="UBF33"  Part="1" 
F 0 "UBF33" H 14275 6486 50  0000 C CNN
F 1 "D24L" H 14275 6395 50  0000 C CNN
F 2 "" H 14250 6375 50  0001 C CNN
F 3 "" H 14250 6375 50  0001 C CNN
	1    14250 6100
	1    0    0    -1  
$EndComp
$Comp
L A5C:D24L UBF?
U 1 1 6029BA19
P 14250 6850
AR Path="/5F84D673/6029BA19" Ref="UBF?"  Part="1" 
AR Path="/5F75F22B/6029BA19" Ref="UBF40"  Part="1" 
AR Path="/5FBEEC97/5FC01C0B/6029BA19" Ref="UBF40"  Part="1" 
F 0 "UBF40" H 14275 7236 50  0000 C CNN
F 1 "D24L" H 14275 7145 50  0000 C CNN
F 2 "" H 14250 7125 50  0001 C CNN
F 3 "" H 14250 7125 50  0001 C CNN
	1    14250 6850
	1    0    0    -1  
$EndComp
$Comp
L A5C:M125C-X6 UBN0
U 1 1 5F6A0FB0
P 2100 1450
AR Path="/5F75F22B/5F6A0FB0" Ref="UBN0"  Part="1" 
AR Path="/5FBEEC97/5FC01C0B/5F6A0FB0" Ref="UBN0"  Part="1" 
F 0 "UBN0" H 2100 2161 50  0000 C CNN
F 1 "M125C-X6" H 2100 2070 50  0000 C CNN
F 2 "" H 2400 1450 50  0001 C CNN
F 3 "" H 2400 1450 50  0001 C CNN
	1    2100 1450
	1    0    0    -1  
$EndComp
$Comp
L A5C:M125C-X6 UBN12
U 1 1 5F6A107D
P 2100 2600
AR Path="/5F75F22B/5F6A107D" Ref="UBN12"  Part="1" 
AR Path="/5FBEEC97/5FC01C0B/5F6A107D" Ref="UBN12"  Part="1" 
F 0 "UBN12" H 2100 3311 50  0000 C CNN
F 1 "M125C-X6" H 2100 3220 50  0000 C CNN
F 2 "" H 2400 2600 50  0001 C CNN
F 3 "" H 2400 2600 50  0001 C CNN
	1    2100 2600
	1    0    0    -1  
$EndComp
$Comp
L A5C:M125C-X6 UBN21
U 1 1 5F6A1044
P 2100 3950
AR Path="/5F75F22B/5F6A1044" Ref="UBN21"  Part="1" 
AR Path="/5FBEEC97/5FC01C0B/5F6A1044" Ref="UBN21"  Part="1" 
F 0 "UBN21" H 2100 4661 50  0000 C CNN
F 1 "M125C-X6" H 2100 4570 50  0000 C CNN
F 2 "" H 2400 3950 50  0001 C CNN
F 3 "" H 2400 3950 50  0001 C CNN
	1    2100 3950
	1    0    0    -1  
$EndComp
$Comp
L A5C:M125C-X6 UBN33
U 1 1 5F6A0F50
P 2100 5100
AR Path="/5F75F22B/5F6A0F50" Ref="UBN33"  Part="1" 
AR Path="/5FBEEC97/5FC01C0B/5F6A0F50" Ref="UBN33"  Part="1" 
F 0 "UBN33" H 2100 5811 50  0000 C CNN
F 1 "M125C-X6" H 2100 5720 50  0000 C CNN
F 2 "" H 2400 5100 50  0001 C CNN
F 3 "" H 2400 5100 50  0001 C CNN
	1    2100 5100
	1    0    0    -1  
$EndComp
$Comp
L A5C:M125C-X6 UBN43
U 1 1 5F6A48A7
P 2100 6450
AR Path="/5F75F22B/5F6A48A7" Ref="UBN43"  Part="1" 
AR Path="/5FBEEC97/5FC01C0B/5F6A48A7" Ref="UBN43"  Part="1" 
F 0 "UBN43" H 2100 7161 50  0000 C CNN
F 1 "M125C-X6" H 2100 7070 50  0000 C CNN
F 2 "" H 2400 6450 50  0001 C CNN
F 3 "" H 2400 6450 50  0001 C CNN
	1    2100 6450
	1    0    0    -1  
$EndComp
$Comp
L A5C:M125C-X6 UBN55
U 1 1 5F6A4974
P 2100 7600
AR Path="/5F75F22B/5F6A4974" Ref="UBN55"  Part="1" 
AR Path="/5FBEEC97/5FC01C0B/5F6A4974" Ref="UBN55"  Part="1" 
F 0 "UBN55" H 2100 8311 50  0000 C CNN
F 1 "M125C-X6" H 2100 8220 50  0000 C CNN
F 2 "" H 2400 7600 50  0001 C CNN
F 3 "" H 2400 7600 50  0001 C CNN
	1    2100 7600
	1    0    0    -1  
$EndComp
$Comp
L A5C:M125C-X6 UBN65
U 1 1 5F6A493B
P 2100 8950
AR Path="/5F75F22B/5F6A493B" Ref="UBN65"  Part="1" 
AR Path="/5FBEEC97/5FC01C0B/5F6A493B" Ref="UBN65"  Part="1" 
F 0 "UBN65" H 2100 9661 50  0000 C CNN
F 1 "M125C-X6" H 2100 9570 50  0000 C CNN
F 2 "" H 2400 8950 50  0001 C CNN
F 3 "" H 2400 8950 50  0001 C CNN
	1    2100 8950
	1    0    0    -1  
$EndComp
$Comp
L A5C:M125C-X6 UBN77
U 1 1 5F6A4847
P 2100 10100
AR Path="/5F75F22B/5F6A4847" Ref="UBN77"  Part="1" 
AR Path="/5FBEEC97/5FC01C0B/5F6A4847" Ref="UBN77"  Part="1" 
F 0 "UBN77" H 2100 10811 50  0000 C CNN
F 1 "M125C-X6" H 2100 10720 50  0000 C CNN
F 2 "" H 2400 10100 50  0001 C CNN
F 3 "" H 2400 10100 50  0001 C CNN
	1    2100 10100
	1    0    0    -1  
$EndComp
$Comp
L A5C:M125C-X6 UBM0
U 1 1 5F6A0EDD
P 4850 1450
AR Path="/5F75F22B/5F6A0EDD" Ref="UBM0"  Part="1" 
AR Path="/5FBEEC97/5FC01C0B/5F6A0EDD" Ref="UBM0"  Part="1" 
F 0 "UBM0" H 4850 2161 50  0000 C CNN
F 1 "M125C-X6" H 4850 2070 50  0000 C CNN
F 2 "" H 5150 1450 50  0001 C CNN
F 3 "" H 5150 1450 50  0001 C CNN
	1    4850 1450
	1    0    0    -1  
$EndComp
$Comp
L A5C:M125C-X6 UBM12
U 1 1 5F6A0EAD
P 4850 2600
AR Path="/5F75F22B/5F6A0EAD" Ref="UBM12"  Part="1" 
AR Path="/5FBEEC97/5FC01C0B/5F6A0EAD" Ref="UBM12"  Part="1" 
F 0 "UBM12" H 4850 3311 50  0000 C CNN
F 1 "M125C-X6" H 4850 3220 50  0000 C CNN
F 2 "" H 5150 2600 50  0001 C CNN
F 3 "" H 5150 2600 50  0001 C CNN
	1    4850 2600
	1    0    0    -1  
$EndComp
$Comp
L A5C:M125C-X6 UBM21
U 1 1 5F6A0E70
P 4850 3950
AR Path="/5F75F22B/5F6A0E70" Ref="UBM21"  Part="1" 
AR Path="/5FBEEC97/5FC01C0B/5F6A0E70" Ref="UBM21"  Part="1" 
F 0 "UBM21" H 4850 4661 50  0000 C CNN
F 1 "M125C-X6" H 4850 4570 50  0000 C CNN
F 2 "" H 5150 3950 50  0001 C CNN
F 3 "" H 5150 3950 50  0001 C CNN
	1    4850 3950
	1    0    0    -1  
$EndComp
$Comp
L A5C:M125C-X6 UBM33
U 1 1 5F6A0E0E
P 4850 5100
AR Path="/5F75F22B/5F6A0E0E" Ref="UBM33"  Part="1" 
AR Path="/5FBEEC97/5FC01C0B/5F6A0E0E" Ref="UBM33"  Part="1" 
F 0 "UBM33" H 4850 5811 50  0000 C CNN
F 1 "M125C-X6" H 4850 5720 50  0000 C CNN
F 2 "" H 5150 5100 50  0001 C CNN
F 3 "" H 5150 5100 50  0001 C CNN
	1    4850 5100
	1    0    0    -1  
$EndComp
$Comp
L A5C:M125C-X6 UBM43
U 1 1 5F6A47D4
P 4850 6450
AR Path="/5F75F22B/5F6A47D4" Ref="UBM43"  Part="1" 
AR Path="/5FBEEC97/5FC01C0B/5F6A47D4" Ref="UBM43"  Part="1" 
F 0 "UBM43" H 4850 7161 50  0000 C CNN
F 1 "M125C-X6" H 4850 7070 50  0000 C CNN
F 2 "" H 5150 6450 50  0001 C CNN
F 3 "" H 5150 6450 50  0001 C CNN
	1    4850 6450
	1    0    0    -1  
$EndComp
$Comp
L A5C:M125C-X6 UBM55
U 1 1 5F6A47A4
P 4850 7600
AR Path="/5F75F22B/5F6A47A4" Ref="UBM55"  Part="1" 
AR Path="/5FBEEC97/5FC01C0B/5F6A47A4" Ref="UBM55"  Part="1" 
F 0 "UBM55" H 4850 8311 50  0000 C CNN
F 1 "M125C-X6" H 4850 8220 50  0000 C CNN
F 2 "" H 5150 7600 50  0001 C CNN
F 3 "" H 5150 7600 50  0001 C CNN
	1    4850 7600
	1    0    0    -1  
$EndComp
$Comp
L A5C:M125C-X6 UBM65
U 1 1 5F6A4767
P 4850 8950
AR Path="/5F75F22B/5F6A4767" Ref="UBM65"  Part="1" 
AR Path="/5FBEEC97/5FC01C0B/5F6A4767" Ref="UBM65"  Part="1" 
F 0 "UBM65" H 4850 9661 50  0000 C CNN
F 1 "M125C-X6" H 4850 9570 50  0000 C CNN
F 2 "" H 5150 8950 50  0001 C CNN
F 3 "" H 5150 8950 50  0001 C CNN
	1    4850 8950
	1    0    0    -1  
$EndComp
$Comp
L A5C:M125C-X6 UBM77
U 1 1 5F6A4705
P 4850 10100
AR Path="/5F75F22B/5F6A4705" Ref="UBM77"  Part="1" 
AR Path="/5FBEEC97/5FC01C0B/5F6A4705" Ref="UBM77"  Part="1" 
F 0 "UBM77" H 4850 10811 50  0000 C CNN
F 1 "M125C-X6" H 4850 10720 50  0000 C CNN
F 2 "" H 5150 10100 50  0001 C CNN
F 3 "" H 5150 10100 50  0001 C CNN
	1    4850 10100
	1    0    0    -1  
$EndComp
$Comp
L A5C:M125C-X6 UBK0
U 1 1 5F765742
P 7600 1450
AR Path="/5F75F22B/5F765742" Ref="UBK0"  Part="1" 
AR Path="/5FBEEC97/5FC01C0B/5F765742" Ref="UBK0"  Part="1" 
F 0 "UBK0" H 7600 2161 50  0000 C CNN
F 1 "M125C-X6" H 7600 2070 50  0000 C CNN
F 2 "" H 7900 1450 50  0001 C CNN
F 3 "" H 7900 1450 50  0001 C CNN
	1    7600 1450
	1    0    0    -1  
$EndComp
$Comp
L A5C:M125C-X6 UBK12
U 1 1 5F765772
P 7600 2600
AR Path="/5F75F22B/5F765772" Ref="UBK12"  Part="1" 
AR Path="/5FBEEC97/5FC01C0B/5F765772" Ref="UBK12"  Part="1" 
F 0 "UBK12" H 7600 3311 50  0000 C CNN
F 1 "M125C-X6" H 7600 3220 50  0000 C CNN
F 2 "" H 7900 2600 50  0001 C CNN
F 3 "" H 7900 2600 50  0001 C CNN
	1    7600 2600
	1    0    0    -1  
$EndComp
$Comp
L A5C:M125C-X6 UBK21
U 1 1 5F7656E2
P 7600 3950
AR Path="/5F75F22B/5F7656E2" Ref="UBK21"  Part="1" 
AR Path="/5FBEEC97/5FC01C0B/5F7656E2" Ref="UBK21"  Part="1" 
F 0 "UBK21" H 7600 4661 50  0000 C CNN
F 1 "M125C-X6" H 7600 4570 50  0000 C CNN
F 2 "" H 7900 3950 50  0001 C CNN
F 3 "" H 7900 3950 50  0001 C CNN
	1    7600 3950
	1    0    0    -1  
$EndComp
$Comp
L A5C:M125C-X6 UBK33
U 1 1 5F765712
P 7600 5100
AR Path="/5F75F22B/5F765712" Ref="UBK33"  Part="1" 
AR Path="/5FBEEC97/5FC01C0B/5F765712" Ref="UBK33"  Part="1" 
F 0 "UBK33" H 7600 5811 50  0000 C CNN
F 1 "M125C-X6" H 7600 5720 50  0000 C CNN
F 2 "" H 7900 5100 50  0001 C CNN
F 3 "" H 7900 5100 50  0001 C CNN
	1    7600 5100
	1    0    0    -1  
$EndComp
$Comp
L A5C:M125C-X6 UBK43
U 1 1 5F69D83B
P 7600 6450
AR Path="/5F75F22B/5F69D83B" Ref="UBK43"  Part="1" 
AR Path="/5FBEEC97/5FC01C0B/5F69D83B" Ref="UBK43"  Part="1" 
F 0 "UBK43" H 7600 7161 50  0000 C CNN
F 1 "M125C-X6" H 7600 7070 50  0000 C CNN
F 2 "" H 7900 6450 50  0001 C CNN
F 3 "" H 7900 6450 50  0001 C CNN
	1    7600 6450
	1    0    0    -1  
$EndComp
$Comp
L A5C:M125C-X6 UBK55
U 1 1 5F69D908
P 7600 7600
AR Path="/5F75F22B/5F69D908" Ref="UBK55"  Part="1" 
AR Path="/5FBEEC97/5FC01C0B/5F69D908" Ref="UBK55"  Part="1" 
F 0 "UBK55" H 7600 8311 50  0000 C CNN
F 1 "M125C-X6" H 7600 8220 50  0000 C CNN
F 2 "" H 7900 7600 50  0001 C CNN
F 3 "" H 7900 7600 50  0001 C CNN
	1    7600 7600
	1    0    0    -1  
$EndComp
$Comp
L A5C:M125C-X6 UBK65
U 1 1 5F69D8CF
P 7600 8950
AR Path="/5F75F22B/5F69D8CF" Ref="UBK65"  Part="1" 
AR Path="/5FBEEC97/5FC01C0B/5F69D8CF" Ref="UBK65"  Part="1" 
F 0 "UBK65" H 7600 9661 50  0000 C CNN
F 1 "M125C-X6" H 7600 9570 50  0000 C CNN
F 2 "" H 7900 8950 50  0001 C CNN
F 3 "" H 7900 8950 50  0001 C CNN
	1    7600 8950
	1    0    0    -1  
$EndComp
$Comp
L A5C:M125C-X6 UBK77
U 1 1 5F69D7DB
P 7600 10100
AR Path="/5F75F22B/5F69D7DB" Ref="UBK77"  Part="1" 
AR Path="/5FBEEC97/5FC01C0B/5F69D7DB" Ref="UBK77"  Part="1" 
F 0 "UBK77" H 7600 10811 50  0000 C CNN
F 1 "M125C-X6" H 7600 10720 50  0000 C CNN
F 2 "" H 7900 10100 50  0001 C CNN
F 3 "" H 7900 10100 50  0001 C CNN
	1    7600 10100
	1    0    0    -1  
$EndComp
$Comp
L A5C:M125C-X6 UBI0
U 1 1 5F755C0C
P 10350 1450
AR Path="/5F75F22B/5F755C0C" Ref="UBI0"  Part="1" 
AR Path="/5FBEEC97/5FC01C0B/5F755C0C" Ref="UBI0"  Part="1" 
F 0 "UBI0" H 10350 2161 50  0000 C CNN
F 1 "M125C-X6" H 10350 2070 50  0000 C CNN
F 2 "" H 10650 1450 50  0001 C CNN
F 3 "" H 10650 1450 50  0001 C CNN
F 4 "UBI1;UBI2;UBI3;UBI4;UBI5;UBI6;UBI7;UBI8;UBI9;UBI10;UBI11;UBI13;UBI14;UBI15;UBI16;UBI17;UBI18;UBI19;UBI20;UBI22;UBI23;UBI24;UBI25;UBI26;UBI27;UBI28;UBI29;UBI30;UBI31;UBI32;UBI34;UBI35;UBI36;UBI37;UBI38;UBI39;UBI40;UBI41;UBI42;UBI44;UBI45;UBI46;UBI47;UBI48;UBI49;UBI50;UBI51;UBI52;UBI53;UBI54;UBI56;UBI57;UBI58;UBI59;UBI60;UBI61;UBI62;UBI63;UBI64;UBI66;UBI67;UBI68;UBI69;UBI70;UBI71;UBI72;UBI73;UBI74;UBI75;UBI76;UBI78;UBI79;UBI80;UBI81;UBI82;UBI83;UBI84;UBI85;UBI86;UBI88;UBI89;UBI90;UBI91;UBI92;UBI93;UBI94;UBI95;UBI96;UBI97;UBI98;UBI100;UBI101;UBI102;UBI103;UBI104;UBI105;UBI106;UBI107;UBK1;UBK2;UBK3;UBK4;UBK5;UBK6;UBK7;UBK8;UBK9;UBK10;UBK11;UBK13;UBK14;UBK15;UBK16;UBK17;UBK18;UBK19;UBK20;UBK22;UBK23;UBK24;UBK25;UBK26;UBK27;UBK28;UBK29;UBK30;UBK31;UBK32;UBK34;UBK35;UBK36;UBK37;UBK38;UBK39;UBK40;UBK41;UBK42;UBK44;UBK45;UBK46;UBK47;UBK48;UBK49;UBK50;UBK51;UBK52;UBK53;UBK54;UBK56;UBK57;UBK58;UBK59;UBK60;UBK61;UBK62;UBK63;UBK64;UBK66;UBK67;UBK68;UBK69;UBK70;UBK71;UBK72;UBK73;UBK74;UBK75;UBK76;UBK78;UBK79;UBK80;UBK81;UBK82;UBK83;UBK84;UBK85;UBK86;UBK88;UBK89;UBK90;UBK91;UBK92;UBK93;UBK94;UBK95;UBK96;UBK97;UBK98;UBK100;UBK101;UBK102;UBK103;UBK104;UBK105;UBK106;UBK107;UBM1;UBM2;UBM3;UBM4;UBM5;UBM6;UBM7;UBM8;UBM9;UBM10;UBM11;UBM13;UBM14;UBM15;UBM16;UBM17;UBM18;UBM19;UBM20;UBM22;UBM23;UBM24;UBM25;UBM26;UBM27;UBM28;UBM29;UBM30;UBM31;UBM32;UBM34;UBM35;UBM36;UBM37;UBM38;UBM39;UBM40;UBM41;UBM42;UBM44;UBM45;UBM46;UBM47;UBM48;UBM49;UBM50;UBM51;UBM52;UBM53;UBM54;UBM56;UBM57;UBM58;UBM59;UBM60;UBM61;UBM62;UBM63;UBM64;UBM66;UBM67;UBM68;UBM69;UBM70;UBM71;UBM72;UBM73;UBM74;UBM75;UBM76;UBM78;UBM79;UBM80;UBM81;UBM82;UBM83;UBM84;UBM85;UBM86;UBM88;UBM89;UBM90;UBM91;UBM92;UBM93;UBM94;UBM95;UBM96;UBM97;UBM98;UBM100;UBM101;UBM102;UBM103;UBM104;UBM105;UBM106;UBM107;UBN1;UBN2;UBN3;UBN4;UBN5;UBN6;UBN7;UBN8;UBN9;UBN10;UBN11;UBN13;UBN14;UBN15;UBN16;UBN17;UBN18;UBN19;UBN20;UBN22;UBN23;UBN24;UBN25;UBN26;UBN27;UBN28;UBN29;UBN30;UBN31;UBN32;UBN34;UBN35;UBN36;UBN37;UBN38;UBN39;UBN40;UBN41;UBN42;UBN44;UBN45;UBN46;UBN47;UBN48;UBN49;UBN50;UBN51;UBN52;UBN53;UBN54;UBN56;UBN57;UBN58;UBN59;UBN60;UBN61;UBN62;UBN63;UBN64;UBN66;UBN67;UBN68;UBN69;UBN70;UBN71;UBN72;UBN73;UBN74;UBN75;UBN76;UBN78;UBN79;UBN80;UBN81;UBN82;UBN83;UBN84;UBN85;UBN86;UBN88;UBN89;UBN90;UBN91;UBN92;UBN93;UBN94;UBN95;UBN96;UBN97;UBN98;UBN100;UBN101;UBN102;UBN103;UBN104;UBN105;UBN106;UBN107" H 10350 1450 50  0001 C CNN "MiscRef"
	1    10350 1450
	1    0    0    -1  
$EndComp
$Comp
L A5C:M125C-X6 UBI12
U 1 1 5F759350
P 10350 2600
AR Path="/5F75F22B/5F759350" Ref="UBI12"  Part="1" 
AR Path="/5FBEEC97/5FC01C0B/5F759350" Ref="UBI12"  Part="1" 
F 0 "UBI12" H 10350 3311 50  0000 C CNN
F 1 "M125C-X6" H 10350 3220 50  0000 C CNN
F 2 "" H 10650 2600 50  0001 C CNN
F 3 "" H 10650 2600 50  0001 C CNN
	1    10350 2600
	1    0    0    -1  
$EndComp
$Comp
L A5C:M125C-X6 UBI21
U 1 1 5F7644BF
P 10350 3950
AR Path="/5F75F22B/5F7644BF" Ref="UBI21"  Part="1" 
AR Path="/5FBEEC97/5FC01C0B/5F7644BF" Ref="UBI21"  Part="1" 
F 0 "UBI21" H 10350 4661 50  0000 C CNN
F 1 "M125C-X6" H 10350 4570 50  0000 C CNN
F 2 "" H 10650 3950 50  0001 C CNN
F 3 "" H 10650 3950 50  0001 C CNN
	1    10350 3950
	1    0    0    -1  
$EndComp
$Comp
L A5C:M125C-X6 UBI33
U 1 1 5F7644EF
P 10350 5100
AR Path="/5F75F22B/5F7644EF" Ref="UBI33"  Part="1" 
AR Path="/5FBEEC97/5FC01C0B/5F7644EF" Ref="UBI33"  Part="1" 
F 0 "UBI33" H 10350 5811 50  0000 C CNN
F 1 "M125C-X6" H 10350 5720 50  0000 C CNN
F 2 "" H 10650 5100 50  0001 C CNN
F 3 "" H 10650 5100 50  0001 C CNN
	1    10350 5100
	1    0    0    -1  
$EndComp
$Comp
L A5C:M125C-X6 UBI43
U 1 1 5F69D768
P 10350 6450
AR Path="/5F75F22B/5F69D768" Ref="UBI43"  Part="1" 
AR Path="/5FBEEC97/5FC01C0B/5F69D768" Ref="UBI43"  Part="1" 
F 0 "UBI43" H 10350 7161 50  0000 C CNN
F 1 "M125C-X6" H 10350 7070 50  0000 C CNN
F 2 "" H 10650 6450 50  0001 C CNN
F 3 "" H 10650 6450 50  0001 C CNN
	1    10350 6450
	1    0    0    -1  
$EndComp
$Comp
L A5C:M125C-X6 UBI55
U 1 1 5F69D738
P 10350 7600
AR Path="/5F75F22B/5F69D738" Ref="UBI55"  Part="1" 
AR Path="/5FBEEC97/5FC01C0B/5F69D738" Ref="UBI55"  Part="1" 
F 0 "UBI55" H 10350 8311 50  0000 C CNN
F 1 "M125C-X6" H 10350 8220 50  0000 C CNN
F 2 "" H 10650 7600 50  0001 C CNN
F 3 "" H 10650 7600 50  0001 C CNN
	1    10350 7600
	1    0    0    -1  
$EndComp
$Comp
L A5C:M125C-X6 UBI65
U 1 1 5F69D6FB
P 10350 8950
AR Path="/5F75F22B/5F69D6FB" Ref="UBI65"  Part="1" 
AR Path="/5FBEEC97/5FC01C0B/5F69D6FB" Ref="UBI65"  Part="1" 
F 0 "UBI65" H 10350 9661 50  0000 C CNN
F 1 "M125C-X6" H 10350 9570 50  0000 C CNN
F 2 "" H 10650 8950 50  0001 C CNN
F 3 "" H 10650 8950 50  0001 C CNN
	1    10350 8950
	1    0    0    -1  
$EndComp
$Comp
L A5C:M125C-X6 UBI77
U 1 1 5F69D699
P 10350 10100
AR Path="/5F75F22B/5F69D699" Ref="UBI77"  Part="1" 
AR Path="/5FBEEC97/5FC01C0B/5F69D699" Ref="UBI77"  Part="1" 
F 0 "UBI77" H 10350 10811 50  0000 C CNN
F 1 "M125C-X6" H 10350 10720 50  0000 C CNN
F 2 "" H 10650 10100 50  0001 C CNN
F 3 "" H 10650 10100 50  0001 C CNN
	1    10350 10100
	1    0    0    -1  
$EndComp
Wire Bus Line
	13250 4550 13250 4750
Wire Bus Line
	13250 5300 13250 5500
Wire Bus Line
	13250 6050 13250 6250
Wire Bus Line
	13250 6800 13250 7000
Wire Bus Line
	14450 7750 14450 8150
Wire Bus Line
	850  1100 850  3050
Wire Bus Line
	3600 1100 3600 3050
Wire Bus Line
	6350 1100 6350 3050
Wire Bus Line
	9100 1100 9100 3050
Wire Bus Line
	850  3150 850  5050
Wire Bus Line
	850  6100 850  8050
Wire Bus Line
	850  8150 850  10050
Wire Bus Line
	3600 3150 3600 5050
Wire Bus Line
	3600 6100 3600 8050
Wire Bus Line
	3600 8150 3600 10050
Wire Bus Line
	6350 3150 6350 5050
Wire Bus Line
	6350 6100 6350 8050
Wire Bus Line
	6350 8150 6350 10050
Wire Bus Line
	9100 3150 9100 5050
Wire Bus Line
	9100 6100 9100 8050
Wire Bus Line
	9100 8150 9100 10050
Wire Bus Line
	3350 1100 3350 10700
Wire Bus Line
	6100 1100 6100 10700
Wire Bus Line
	8850 1100 8850 10700
Wire Bus Line
	11600 1100 11600 10700
$EndSCHEMATC
