EESchema Schematic File Version 4
EELAYER 30 0
EELAYER END
$Descr A4 11693 8268
encoding utf-8
Sheet 43 83
Title "CPS Reverse Engineering: DL-0311"
Date "2021-09-12"
Rev ""
Comp ""
Comment1 ""
Comment2 ""
Comment3 "Licence: CC-BY"
Comment4 "Author: Loïc *WydD* Petit"
$EndDescr
Wire Wire Line
	4350 5000 5900 5000
Wire Bus Line
	5800 3600 6000 3600
Wire Bus Line
	5900 3700 5800 3700
Wire Bus Line
	6000 3600 6000 4050
Wire Bus Line
	6000 4050 6100 4050
Wire Bus Line
	6100 4150 5900 4150
Wire Bus Line
	7750 4250 7850 4250
$Comp
L A5C:DBUF UBE124
U 1 1 61118DB5
P 4000 5000
F 0 "UBE124" H 4000 4735 50  0000 C CNN
F 1 "DBUF" H 4000 4826 50  0000 C CNN
F 2 "" H 3725 5075 50  0001 C CNN
F 3 "" H 3725 5075 50  0001 C CNN
	1    4000 5000
	1    0    0    -1  
$EndComp
$Sheet
S 4350 4100 1450 800 
U 612EE466
F0 "wstrom-counter" 50
F1 "wstrom-counter.sch" 50
F2 "~DEBUG6" I L 4350 4400 50 
F3 "~WSTROM-RESET" I L 4350 4600 50 
F4 "MAIN-RESET" I L 4350 4500 50 
F5 "COL[1..2]" I L 4350 4250 50 
F6 "WSTROM-END" O R 5800 4800 50 
F7 "WSTROM" I L 4350 4800 50 
F8 "~WSTROM-CNT[0..15]" O R 5800 4250 50 
$EndSheet
$Sheet
S 6100 3900 1650 600 
U 612EE46C
F0 "wstrom-addr-bus" 50
F1 "wstrom-addr-bus.sch" 50
F2 "~WSTROM" I L 6100 4400 50 
F3 "~WSTROM-CNT[0..15]" I L 6100 4250 50 
F4 "ADDR[1..23]" T R 7750 4050 50 
F5 "GFX-ADDR[0..22]" T R 7750 4250 50 
F6 "~ROMA-BASE[0..6]" I L 6100 4050 50 
F7 "~RAM-BASE[0..6]" I L 6100 4150 50 
$EndSheet
$Sheet
S 4350 2950 1450 900 
U 612EE471
F0 "wstrom-reg" 50
F1 "wstrom-reg.sch" 50
F2 "~ROMA-BASE[0..6]" O R 5800 3600 50 
F3 "~RAM-BASE[0..6]" O R 5800 3700 50 
F4 "BUS-DATA[0..15]" I L 4350 3100 50 
F5 "CLK4M" I L 4350 3600 50 
F6 "CLK8M" I L 4350 3700 50 
F7 "~WSTROM" I L 4350 3500 50 
F8 "COL1" I L 4350 3400 50 
F9 "PL3WED" O R 5800 3400 50 
F10 "PL2WED" O R 5800 3300 50 
F11 "PL1WED" O R 5800 3200 50 
F12 "PL0WED" O R 5800 3100 50 
F13 "~WSTROM-COPY" I L 4350 3250 50 
$EndSheet
Entry Wire Line
	3350 3500 3450 3400
Text Label 4100 3400 0    50   ~ 0
COL1
Text HLabel 3100 3500 0    50   Input ~ 0
COL[1..2]
Wire Wire Line
	3500 5000 3500 3500
Text HLabel 3300 5000 0    50   Input ~ 0
~WSTROM
Text HLabel 4250 3250 0    50   Input ~ 0
~WSTROM-COPY
Wire Wire Line
	4250 3250 4350 3250
Text HLabel 4250 3600 0    50   Input ~ 0
CLK4M
Wire Wire Line
	4250 3600 4350 3600
Text HLabel 4250 3700 0    50   Input ~ 0
CLK8M
Wire Wire Line
	4250 3700 4350 3700
Text HLabel 4250 3100 0    50   Input ~ 0
BUS-DATA[0..15]
Wire Bus Line
	4250 3100 4350 3100
Wire Bus Line
	3350 3500 3350 4250
Wire Bus Line
	3100 4300 3250 4300
Text HLabel 3100 4300 0    50   Input ~ 0
~DEBUG[6..6]
Entry Wire Line
	3250 4300 3350 4400
Text Label 4000 4400 0    50   ~ 0
~DEBUG6
Text HLabel 4250 4500 0    50   Input ~ 0
MAIN-RESET
Wire Wire Line
	4250 4500 4350 4500
Text HLabel 4250 4600 0    50   Input ~ 0
~WSTROM-RESET
Wire Wire Line
	4250 4600 4350 4600
Connection ~ 3500 5000
Wire Wire Line
	3500 5000 3650 5000
Wire Wire Line
	3300 5000 3500 5000
Wire Wire Line
	3450 3400 4350 3400
Wire Wire Line
	3500 3500 4350 3500
Wire Wire Line
	3350 4400 4350 4400
Wire Bus Line
	3350 4250 4350 4250
Wire Bus Line
	3100 3500 3350 3500
Text HLabel 5900 3100 2    50   Output ~ 0
~PL0WED
Text HLabel 5900 3200 2    50   Output ~ 0
~PL1WED
Text HLabel 5900 3300 2    50   Output ~ 0
~PL2WED
Text HLabel 5900 3400 2    50   Output ~ 0
~PL3WED
Wire Wire Line
	5900 3100 5800 3100
Wire Wire Line
	5900 3200 5800 3200
Wire Wire Line
	5900 3300 5800 3300
Wire Wire Line
	5900 3400 5800 3400
Wire Bus Line
	7750 4050 7850 4050
Text HLabel 7850 4050 2    50   3State ~ 0
ADDR[1..23]
Text HLabel 7850 4250 2    50   3State ~ 0
GFX-ADDR[0..22]
Text HLabel 6100 4800 2    50   Output ~ 0
WSTROM-END
Wire Bus Line
	5900 4150 5900 3700
Wire Bus Line
	5800 4250 6100 4250
Wire Wire Line
	5900 4400 5900 5000
Wire Wire Line
	5800 4800 6100 4800
Wire Wire Line
	5900 4400 6100 4400
$EndSCHEMATC
