EESchema Schematic File Version 4
EELAYER 30 0
EELAYER END
$Descr A4 11693 8268
encoding utf-8
Sheet 32 83
Title "CPS Reverse Engineering: DL-0311"
Date "2021-09-12"
Rev ""
Comp ""
Comment1 ""
Comment2 ""
Comment3 "Licence: CC-BY"
Comment4 "Author: Loïc *WydD* Petit"
$EndDescr
Connection ~ 3300 4550
Connection ~ 3300 3550
Connection ~ 3300 4050
Connection ~ 7400 4050
Connection ~ 7400 5050
Connection ~ 7400 4550
Connection ~ 3300 2550
Connection ~ 3300 2050
Connection ~ 3300 3050
Connection ~ 7400 2550
Connection ~ 7400 2050
Connection ~ 7400 3050
Connection ~ 7400 3550
Connection ~ 3300 5050
Connection ~ 3300 5550
Connection ~ 7400 5550
Connection ~ 2900 1100
Entry Wire Line
	2900 1550 3000 1650
Entry Wire Line
	2900 2050 3000 2150
Entry Wire Line
	2900 2550 3000 2650
Entry Wire Line
	2900 3050 3000 3150
Entry Wire Line
	2900 3550 3000 3650
Entry Wire Line
	2900 4050 3000 4150
Entry Wire Line
	2900 4550 3000 4650
Entry Wire Line
	2900 5050 3000 5150
Entry Wire Line
	2900 5550 3000 5650
Entry Wire Line
	4850 1600 4950 1700
Entry Wire Line
	4850 2100 4950 2200
Entry Wire Line
	4850 2600 4950 2700
Entry Wire Line
	4850 3100 4950 3200
Entry Wire Line
	4850 3600 4950 3700
Entry Wire Line
	4850 4100 4950 4200
Entry Wire Line
	4850 4600 4950 4700
Entry Wire Line
	4850 5100 4950 5200
Entry Wire Line
	4850 5600 4950 5700
Entry Wire Line
	7000 1550 7100 1650
Entry Wire Line
	7000 2050 7100 2150
Entry Wire Line
	7000 2550 7100 2650
Entry Wire Line
	7000 3050 7100 3150
Entry Wire Line
	7000 3550 7100 3650
Entry Wire Line
	7000 4050 7100 4150
Entry Wire Line
	7000 4550 7100 4650
Entry Wire Line
	7000 5050 7100 5150
Entry Wire Line
	7000 5550 7100 5650
Entry Wire Line
	8950 1600 9050 1700
Entry Wire Line
	8950 2100 9050 2200
Entry Wire Line
	8950 2600 9050 2700
Entry Wire Line
	8950 3100 9050 3200
Entry Wire Line
	8950 3600 9050 3700
Entry Wire Line
	8950 4100 9050 4200
Entry Wire Line
	8950 4600 9050 4700
Entry Wire Line
	8950 5100 9050 5200
Entry Wire Line
	8950 5600 9050 5700
Wire Wire Line
	2750 5750 3300 5750
Wire Wire Line
	3300 1550 3300 2050
Wire Wire Line
	3300 2050 3300 2550
Wire Wire Line
	3300 2550 3300 3050
Wire Wire Line
	3300 2550 3400 2550
Wire Wire Line
	3300 3050 3300 3550
Wire Wire Line
	3300 3550 3300 4050
Wire Wire Line
	3300 3550 3400 3550
Wire Wire Line
	3300 4050 3300 4550
Wire Wire Line
	3300 4550 3300 5050
Wire Wire Line
	3300 4550 3400 4550
Wire Wire Line
	3300 5050 3300 5550
Wire Wire Line
	3300 5550 3300 5750
Wire Wire Line
	3300 5550 3400 5550
Wire Wire Line
	3400 1550 3300 1550
Wire Wire Line
	3400 1650 3000 1650
Wire Wire Line
	3400 2050 3300 2050
Wire Wire Line
	3400 2150 3000 2150
Wire Wire Line
	3400 2650 3000 2650
Wire Wire Line
	3400 3050 3300 3050
Wire Wire Line
	3400 3150 3000 3150
Wire Wire Line
	3400 3650 3000 3650
Wire Wire Line
	3400 4050 3300 4050
Wire Wire Line
	3400 4150 3000 4150
Wire Wire Line
	3400 4650 3000 4650
Wire Wire Line
	3400 5050 3300 5050
Wire Wire Line
	3400 5150 3000 5150
Wire Wire Line
	3400 5650 3000 5650
Wire Wire Line
	4550 1600 4850 1600
Wire Wire Line
	4550 2100 4850 2100
Wire Wire Line
	4550 2600 4850 2600
Wire Wire Line
	4550 3100 4850 3100
Wire Wire Line
	4550 3600 4850 3600
Wire Wire Line
	4550 4100 4850 4100
Wire Wire Line
	4550 4600 4850 4600
Wire Wire Line
	4550 5100 4850 5100
Wire Wire Line
	4550 5600 4850 5600
Wire Wire Line
	6850 5750 7400 5750
Wire Wire Line
	7400 1550 7400 2050
Wire Wire Line
	7400 2050 7400 2550
Wire Wire Line
	7400 2550 7400 3050
Wire Wire Line
	7400 2550 7500 2550
Wire Wire Line
	7400 3050 7400 3550
Wire Wire Line
	7400 3550 7400 4050
Wire Wire Line
	7400 3550 7500 3550
Wire Wire Line
	7400 4050 7400 4550
Wire Wire Line
	7400 4550 7400 5050
Wire Wire Line
	7400 4550 7500 4550
Wire Wire Line
	7400 5050 7400 5550
Wire Wire Line
	7400 5550 7400 5750
Wire Wire Line
	7400 5550 7500 5550
Wire Wire Line
	7500 1550 7400 1550
Wire Wire Line
	7500 1650 7100 1650
Wire Wire Line
	7500 2050 7400 2050
Wire Wire Line
	7500 2150 7100 2150
Wire Wire Line
	7500 2650 7100 2650
Wire Wire Line
	7500 3050 7400 3050
Wire Wire Line
	7500 3150 7100 3150
Wire Wire Line
	7500 3650 7100 3650
Wire Wire Line
	7500 4050 7400 4050
Wire Wire Line
	7500 4150 7100 4150
Wire Wire Line
	7500 4650 7100 4650
Wire Wire Line
	7500 5050 7400 5050
Wire Wire Line
	7500 5150 7100 5150
Wire Wire Line
	7500 5650 7100 5650
Wire Wire Line
	8650 1600 8950 1600
Wire Wire Line
	8650 2100 8950 2100
Wire Wire Line
	8650 2600 8950 2600
Wire Wire Line
	8650 3100 8950 3100
Wire Wire Line
	8650 3600 8950 3600
Wire Wire Line
	8650 4100 8950 4100
Wire Wire Line
	8650 4600 8950 4600
Wire Wire Line
	8650 5100 8950 5100
Wire Wire Line
	8650 5600 8950 5600
Wire Bus Line
	2900 1100 2750 1100
Wire Bus Line
	4950 5900 5100 5900
Wire Bus Line
	7000 1100 2900 1100
Wire Bus Line
	9050 5850 9200 5850
Text Notes 5100 1650 0    50   ~ 0
CB0
Text Notes 5100 2150 0    50   ~ 0
CB1
Text Notes 5100 2650 0    50   ~ 0
CB2
Text Notes 5100 3150 0    50   ~ 0
CB3
Text Notes 5100 3650 0    50   ~ 0
CB4
Text Notes 5100 4150 0    50   ~ 0
IGNORED
Text Notes 5100 4650 0    50   ~ 0
IGNORED
Text Notes 5100 5150 0    50   ~ 0
IGNORED
Text Notes 5100 5650 0    50   ~ 0
IGNORED
Text Notes 9150 1600 0    50   ~ 0
CB0
Text Notes 9150 2100 0    50   ~ 0
CB1
Text Notes 9150 2600 0    50   ~ 0
CB2
Text Notes 9150 3100 0    50   ~ 0
CB3
Text Notes 9150 3600 0    50   ~ 0
CB4
Text Notes 9150 4150 0    50   ~ 0
IGNORED
Text Notes 9150 4650 0    50   ~ 0
IGNORED
Text Notes 9150 5150 0    50   ~ 0
IGNORED
Text Notes 9150 5650 0    50   ~ 0
IGNORED
Text Label 3050 1650 0    50   ~ 0
~D4
Text Label 3050 2150 0    50   ~ 0
~D5
Text Label 3050 2650 0    50   ~ 0
~D6
Text Label 3050 3150 0    50   ~ 0
~D7
Text Label 3050 3650 0    50   ~ 0
~D8
Text Label 3050 4150 0    50   ~ 0
~D9
Text Label 3050 4650 0    50   ~ 0
~D10
Text Label 3050 5150 0    50   ~ 0
~D11
Text Label 3050 5650 0    50   ~ 0
~D12
Text Label 4550 1600 0    50   ~ 0
AD4
Text Label 4550 2100 0    50   ~ 0
AD5
Text Label 4550 2600 0    50   ~ 0
AD6
Text Label 4550 3100 0    50   ~ 0
AD7
Text Label 4550 3600 0    50   ~ 0
AD8
Text Label 4550 4100 0    50   ~ 0
AD9
Text Label 4550 4600 0    50   ~ 0
AD10
Text Label 4550 5100 0    50   ~ 0
AD11
Text Label 4550 5600 0    50   ~ 0
AD12
Text Label 7150 1650 0    50   ~ 0
~D4
Text Label 7150 2150 0    50   ~ 0
~D5
Text Label 7150 2650 0    50   ~ 0
~D6
Text Label 7150 3150 0    50   ~ 0
~D7
Text Label 7150 3650 0    50   ~ 0
~D8
Text Label 7150 4150 0    50   ~ 0
~D9
Text Label 7150 4650 0    50   ~ 0
~D10
Text Label 7150 5150 0    50   ~ 0
~D11
Text Label 7150 5650 0    50   ~ 0
~D12
Text Label 8650 1600 0    50   ~ 0
BD4
Text Label 8650 2100 0    50   ~ 0
BD5
Text Label 8650 2600 0    50   ~ 0
BD6
Text Label 8650 3100 0    50   ~ 0
BD7
Text Label 8650 3600 0    50   ~ 0
BD8
Text Label 8650 4100 0    50   ~ 0
BD9
Text Label 8650 4600 0    50   ~ 0
BD10
Text Label 8650 5100 0    50   ~ 0
BD11
Text Label 8650 5600 0    50   ~ 0
BD12
Text HLabel 2750 1100 0    50   Input ~ 0
~D[4..12]
Text HLabel 2750 5750 0    50   Input ~ 0
A-WRITE
Text HLabel 5100 5900 2    50   Output ~ 0
AD[4..12]
Text HLabel 6850 5750 0    50   Input ~ 0
B-WRITE
Text HLabel 9200 5850 2    50   Output ~ 0
BD[4..12]
$Comp
L A5C:NAND02 UDC6
U 1 1 615B2815
P 3650 1600
F 0 "UDC6" H 3675 1867 50  0000 C CNN
F 1 "NAND02" H 3675 1776 50  0000 C CNN
F 2 "" H 3650 1600 50  0001 C CNN
F 3 "" H 3650 1600 50  0001 C CNN
	1    3650 1600
	1    0    0    -1  
$EndComp
$Comp
L A5C:NAND02 UDH72
U 1 1 615B32BD
P 3650 2100
F 0 "UDH72" H 3675 1833 50  0000 C CNN
F 1 "NAND02" H 3675 1924 50  0000 C CNN
F 2 "" H 3650 2100 50  0001 C CNN
F 3 "" H 3650 2100 50  0001 C CNN
	1    3650 2100
	1    0    0    1   
$EndComp
$Comp
L A5C:NAND02 UDF82
U 1 1 615CF39B
P 3650 2600
F 0 "UDF82" H 3675 2867 50  0000 C CNN
F 1 "NAND02" H 3675 2776 50  0000 C CNN
F 2 "" H 3650 2600 50  0001 C CNN
F 3 "" H 3650 2600 50  0001 C CNN
	1    3650 2600
	1    0    0    -1  
$EndComp
$Comp
L A5C:NAND02 UDH36
U 1 1 615CF3A1
P 3650 3100
F 0 "UDH36" H 3675 2833 50  0000 C CNN
F 1 "NAND02" H 3675 2924 50  0000 C CNN
F 2 "" H 3650 3100 50  0001 C CNN
F 3 "" H 3650 3100 50  0001 C CNN
	1    3650 3100
	1    0    0    1   
$EndComp
$Comp
L A5C:NAND02 UDC63
U 1 1 615DEE32
P 3650 3600
F 0 "UDC63" H 3675 3867 50  0000 C CNN
F 1 "NAND02" H 3675 3776 50  0000 C CNN
F 2 "" H 3650 3600 50  0001 C CNN
F 3 "" H 3650 3600 50  0001 C CNN
	1    3650 3600
	1    0    0    -1  
$EndComp
$Comp
L A5C:NAND02 UDH12
U 1 1 615DEE38
P 3650 4100
F 0 "UDH12" H 3675 3833 50  0000 C CNN
F 1 "NAND02" H 3675 3924 50  0000 C CNN
F 2 "" H 3650 4100 50  0001 C CNN
F 3 "" H 3650 4100 50  0001 C CNN
	1    3650 4100
	1    0    0    1   
$EndComp
$Comp
L A5C:NAND02 UDC0
U 1 1 615DEE3E
P 3650 4600
F 0 "UDC0" H 3675 4867 50  0000 C CNN
F 1 "NAND02" H 3675 4776 50  0000 C CNN
F 2 "" H 3650 4600 50  0001 C CNN
F 3 "" H 3650 4600 50  0001 C CNN
	1    3650 4600
	1    0    0    -1  
$EndComp
$Comp
L A5C:NAND02 UDH0
U 1 1 615DEE44
P 3650 5100
F 0 "UDH0" H 3675 4833 50  0000 C CNN
F 1 "NAND02" H 3675 4924 50  0000 C CNN
F 2 "" H 3650 5100 50  0001 C CNN
F 3 "" H 3650 5100 50  0001 C CNN
	1    3650 5100
	1    0    0    1   
$EndComp
$Comp
L A5C:NAND02 UDD2
U 1 1 615FA4F4
P 3650 5600
F 0 "UDD2" H 3675 5333 50  0000 C CNN
F 1 "NAND02" H 3675 5424 50  0000 C CNN
F 2 "" H 3650 5600 50  0001 C CNN
F 3 "" H 3650 5600 50  0001 C CNN
	1    3650 5600
	1    0    0    1   
$EndComp
$Comp
L A5C:NAND02 UDD37
U 1 1 61519E6E
P 7750 1600
F 0 "UDD37" H 7775 1867 50  0000 C CNN
F 1 "NAND02" H 7775 1776 50  0000 C CNN
F 2 "" H 7750 1600 50  0001 C CNN
F 3 "" H 7750 1600 50  0001 C CNN
	1    7750 1600
	1    0    0    -1  
$EndComp
$Comp
L A5C:NAND02 UDK73
U 1 1 61519E74
P 7750 2100
F 0 "UDK73" H 7775 1833 50  0000 C CNN
F 1 "NAND02" H 7775 1924 50  0000 C CNN
F 2 "" H 7750 2100 50  0001 C CNN
F 3 "" H 7750 2100 50  0001 C CNN
	1    7750 2100
	1    0    0    1   
$EndComp
$Comp
L A5C:NAND02 UDF78
U 1 1 61519E7A
P 7750 2600
F 0 "UDF78" H 7775 2867 50  0000 C CNN
F 1 "NAND02" H 7775 2776 50  0000 C CNN
F 2 "" H 7750 2600 50  0001 C CNN
F 3 "" H 7750 2600 50  0001 C CNN
	1    7750 2600
	1    0    0    -1  
$EndComp
$Comp
L A5C:NAND02 UDK34
U 1 1 61519E80
P 7750 3100
F 0 "UDK34" H 7775 2833 50  0000 C CNN
F 1 "NAND02" H 7775 2924 50  0000 C CNN
F 2 "" H 7750 3100 50  0001 C CNN
F 3 "" H 7750 3100 50  0001 C CNN
	1    7750 3100
	1    0    0    1   
$EndComp
$Comp
L A5C:NAND02 UDF74
U 1 1 61519E86
P 7750 3600
F 0 "UDF74" H 7775 3867 50  0000 C CNN
F 1 "NAND02" H 7775 3776 50  0000 C CNN
F 2 "" H 7750 3600 50  0001 C CNN
F 3 "" H 7750 3600 50  0001 C CNN
	1    7750 3600
	1    0    0    -1  
$EndComp
$Comp
L A5C:NAND02 UDI43
U 1 1 61519E8C
P 7750 4100
F 0 "UDI43" H 7775 3833 50  0000 C CNN
F 1 "NAND02" H 7775 3924 50  0000 C CNN
F 2 "" H 7750 4100 50  0001 C CNN
F 3 "" H 7750 4100 50  0001 C CNN
	1    7750 4100
	1    0    0    1   
$EndComp
$Comp
L A5C:NAND02 UDG48
U 1 1 61519E92
P 7750 4600
F 0 "UDG48" H 7775 4867 50  0000 C CNN
F 1 "NAND02" H 7775 4776 50  0000 C CNN
F 2 "" H 7750 4600 50  0001 C CNN
F 3 "" H 7750 4600 50  0001 C CNN
	1    7750 4600
	1    0    0    -1  
$EndComp
$Comp
L A5C:NAND02 UDK75
U 1 1 61519E98
P 7750 5100
F 0 "UDK75" H 7775 4833 50  0000 C CNN
F 1 "NAND02" H 7775 4924 50  0000 C CNN
F 2 "" H 7750 5100 50  0001 C CNN
F 3 "" H 7750 5100 50  0001 C CNN
	1    7750 5100
	1    0    0    1   
$EndComp
$Comp
L A5C:NAND02 UDI76
U 1 1 61519E9E
P 7750 5600
F 0 "UDI76" H 7775 5333 50  0000 C CNN
F 1 "NAND02" H 7775 5424 50  0000 C CNN
F 2 "" H 7750 5600 50  0001 C CNN
F 3 "" H 7750 5600 50  0001 C CNN
	1    7750 5600
	1    0    0    1   
$EndComp
$Comp
L A5C:BUF12 UDC4
U 1 1 61411956
P 4250 1600
F 0 "UDC4" H 4250 1917 50  0000 C CNN
F 1 "BUF12" H 4250 1826 50  0000 C CNN
F 2 "" H 4250 1600 50  0001 C CNN
F 3 "" H 4250 1600 50  0001 C CNN
	1    4250 1600
	1    0    0    -1  
$EndComp
$Comp
L A5C:BUF12 UDH38
U 1 1 613967E1
P 4250 2100
F 0 "UDH38" H 4250 2417 50  0000 C CNN
F 1 "BUF12" H 4250 2326 50  0000 C CNN
F 2 "" H 4250 2100 50  0001 C CNN
F 3 "" H 4250 2100 50  0001 C CNN
	1    4250 2100
	1    0    0    -1  
$EndComp
$Comp
L A5C:BUF12 UDF86
U 1 1 614C2BDB
P 4250 2600
F 0 "UDF86" H 4250 2917 50  0000 C CNN
F 1 "BUF12" H 4250 2826 50  0000 C CNN
F 2 "" H 4250 2600 50  0001 C CNN
F 3 "" H 4250 2600 50  0001 C CNN
	1    4250 2600
	1    0    0    -1  
$EndComp
$Comp
L A5C:BUF12 UDH34
U 1 1 614C2F20
P 4250 3100
F 0 "UDH34" H 4250 3417 50  0000 C CNN
F 1 "BUF12" H 4250 3326 50  0000 C CNN
F 2 "" H 4250 3100 50  0001 C CNN
F 3 "" H 4250 3100 50  0001 C CNN
	1    4250 3100
	1    0    0    -1  
$EndComp
$Comp
L A5C:BUF12 UDC28
U 1 1 614C3357
P 4250 3600
F 0 "UDC28" H 4250 3917 50  0000 C CNN
F 1 "BUF12" H 4250 3826 50  0000 C CNN
F 2 "" H 4250 3600 50  0001 C CNN
F 3 "" H 4250 3600 50  0001 C CNN
	1    4250 3600
	1    0    0    -1  
$EndComp
$Comp
L A5C:BUF12 UDH10
U 1 1 6153782B
P 4250 4100
F 0 "UDH10" H 4250 4417 50  0000 C CNN
F 1 "BUF12" H 4250 4326 50  0000 C CNN
F 2 "" H 4250 4100 50  0001 C CNN
F 3 "" H 4250 4100 50  0001 C CNN
	1    4250 4100
	1    0    0    -1  
$EndComp
$Comp
L A5C:BUF12 UDF0
U 1 1 61537831
P 4250 4600
F 0 "UDF0" H 4250 4917 50  0000 C CNN
F 1 "BUF12" H 4250 4826 50  0000 C CNN
F 2 "" H 4250 4600 50  0001 C CNN
F 3 "" H 4250 4600 50  0001 C CNN
	1    4250 4600
	1    0    0    -1  
$EndComp
$Comp
L A5C:BUF12 UDH2
U 1 1 61563AD9
P 4250 5100
F 0 "UDH2" H 4250 5417 50  0000 C CNN
F 1 "BUF12" H 4250 5326 50  0000 C CNN
F 2 "" H 4250 5100 50  0001 C CNN
F 3 "" H 4250 5100 50  0001 C CNN
	1    4250 5100
	1    0    0    -1  
$EndComp
$Comp
L A5C:BUF12 UDD0
U 1 1 61563ADF
P 4250 5600
F 0 "UDD0" H 4250 5917 50  0000 C CNN
F 1 "BUF12" H 4250 5826 50  0000 C CNN
F 2 "" H 4250 5600 50  0001 C CNN
F 3 "" H 4250 5600 50  0001 C CNN
	1    4250 5600
	1    0    0    -1  
$EndComp
$Comp
L A5C:BUF12 UDI38
U 1 1 61519E35
P 8350 1600
F 0 "UDI38" H 8350 1917 50  0000 C CNN
F 1 "BUF12" H 8350 1826 50  0000 C CNN
F 2 "" H 8350 1600 50  0001 C CNN
F 3 "" H 8350 1600 50  0001 C CNN
	1    8350 1600
	1    0    0    -1  
$EndComp
$Comp
L A5C:BUF12 UDL53
U 1 1 61519E2F
P 8350 2100
F 0 "UDL53" H 8350 2417 50  0000 C CNN
F 1 "BUF12" H 8350 2326 50  0000 C CNN
F 2 "" H 8350 2100 50  0001 C CNN
F 3 "" H 8350 2100 50  0001 C CNN
	1    8350 2100
	1    0    0    -1  
$EndComp
$Comp
L A5C:BUF12 UDI40
U 1 1 61519E44
P 8350 2600
F 0 "UDI40" H 8350 2917 50  0000 C CNN
F 1 "BUF12" H 8350 2826 50  0000 C CNN
F 2 "" H 8350 2600 50  0001 C CNN
F 3 "" H 8350 2600 50  0001 C CNN
	1    8350 2600
	1    0    0    -1  
$EndComp
$Comp
L A5C:BUF12 UDK38
U 1 1 61519E4A
P 8350 3100
F 0 "UDK38" H 8350 3417 50  0000 C CNN
F 1 "BUF12" H 8350 3326 50  0000 C CNN
F 2 "" H 8350 3100 50  0001 C CNN
F 3 "" H 8350 3100 50  0001 C CNN
	1    8350 3100
	1    0    0    -1  
$EndComp
$Comp
L A5C:BUF12 UDF76
U 1 1 61519E50
P 8350 3600
F 0 "UDF76" H 8350 3917 50  0000 C CNN
F 1 "BUF12" H 8350 3826 50  0000 C CNN
F 2 "" H 8350 3600 50  0001 C CNN
F 3 "" H 8350 3600 50  0001 C CNN
	1    8350 3600
	1    0    0    -1  
$EndComp
$Comp
L A5C:BUF12 UDL49
U 1 1 61519E56
P 8350 4100
F 0 "UDL49" H 8350 4417 50  0000 C CNN
F 1 "BUF12" H 8350 4326 50  0000 C CNN
F 2 "" H 8350 4100 50  0001 C CNN
F 3 "" H 8350 4100 50  0001 C CNN
	1    8350 4100
	1    0    0    -1  
$EndComp
$Comp
L A5C:BUF12 UDJ61
U 1 1 61519E5C
P 8350 4600
F 0 "UDJ61" H 8350 4917 50  0000 C CNN
F 1 "BUF12" H 8350 4826 50  0000 C CNN
F 2 "" H 8350 4600 50  0001 C CNN
F 3 "" H 8350 4600 50  0001 C CNN
	1    8350 4600
	1    0    0    -1  
$EndComp
$Comp
L A5C:BUF12 UDL59
U 1 1 61519E62
P 8350 5100
F 0 "UDL59" H 8350 5417 50  0000 C CNN
F 1 "BUF12" H 8350 5326 50  0000 C CNN
F 2 "" H 8350 5100 50  0001 C CNN
F 3 "" H 8350 5100 50  0001 C CNN
	1    8350 5100
	1    0    0    -1  
$EndComp
$Comp
L A5C:BUF12 UDI77
U 1 1 61519E68
P 8350 5600
F 0 "UDI77" H 8350 5917 50  0000 C CNN
F 1 "BUF12" H 8350 5826 50  0000 C CNN
F 2 "" H 8350 5600 50  0001 C CNN
F 3 "" H 8350 5600 50  0001 C CNN
	1    8350 5600
	1    0    0    -1  
$EndComp
Wire Bus Line
	2900 1100 2900 5550
Wire Bus Line
	4950 1700 4950 5900
Wire Bus Line
	7000 1100 7000 5550
Wire Bus Line
	9050 1700 9050 5850
$EndSCHEMATC
