EESchema Schematic File Version 4
EELAYER 30 0
EELAYER END
$Descr A4 11693 8268
encoding utf-8
Sheet 3 83
Title "CPS Reverse Engineering: DL-0311"
Date "2021-09-12"
Rev ""
Comp ""
Comment1 ""
Comment2 ""
Comment3 "Licence: CC-BY"
Comment4 "Author: Loïc *WydD* Petit"
$EndDescr
Connection ~ 2850 2100
Connection ~ 2850 2550
Connection ~ 2850 3000
Connection ~ 2850 3450
Connection ~ 2850 3900
Connection ~ 2850 4350
Connection ~ 5150 4350
Connection ~ 5150 4800
Connection ~ 5150 3900
Connection ~ 5150 2100
Connection ~ 5150 2550
Connection ~ 5550 1100
Connection ~ 3950 1000
Connection ~ 1650 1000
Connection ~ 7800 4900
Connection ~ 5150 3450
Connection ~ 5150 3000
Connection ~ 2650 5500
Connection ~ 2850 4800
Connection ~ 2850 5500
Connection ~ 2050 5500
Connection ~ 6350 5400
Connection ~ 6450 1100
Connection ~ 7800 3900
Connection ~ 7800 5800
Entry Wire Line
	1750 1550 1650 1450
Entry Wire Line
	1750 2000 1650 1900
Entry Wire Line
	1750 2450 1650 2350
Entry Wire Line
	1750 2900 1650 2800
Entry Wire Line
	1750 3350 1650 3250
Entry Wire Line
	1750 3800 1650 3700
Entry Wire Line
	1750 4250 1650 4150
Entry Wire Line
	1750 4700 1650 4600
Entry Wire Line
	3150 1550 3250 1450
Entry Wire Line
	3150 2000 3250 1900
Entry Wire Line
	3150 2450 3250 2350
Entry Wire Line
	3150 2900 3250 2800
Entry Wire Line
	3150 3350 3250 3250
Entry Wire Line
	3150 3800 3250 3700
Entry Wire Line
	3150 4250 3250 4150
Entry Wire Line
	3150 4700 3250 4600
Entry Wire Line
	4050 1550 3950 1450
Entry Wire Line
	4050 2000 3950 1900
Entry Wire Line
	4050 2450 3950 2350
Entry Wire Line
	4050 2900 3950 2800
Entry Wire Line
	4050 3350 3950 3250
Entry Wire Line
	4050 3800 3950 3700
Entry Wire Line
	4050 4250 3950 4150
Entry Wire Line
	4050 4700 3950 4600
Entry Wire Line
	5450 1550 5550 1450
Entry Wire Line
	5450 2000 5550 1900
Entry Wire Line
	5450 2450 5550 2350
Entry Wire Line
	5450 2900 5550 2800
Entry Wire Line
	5450 3350 5550 3250
Entry Wire Line
	5450 3800 5550 3700
Entry Wire Line
	5450 4250 5550 4150
Entry Wire Line
	5450 4700 5550 4600
Entry Wire Line
	6450 2450 6550 2550
Entry Wire Line
	6450 2550 6550 2650
Entry Wire Line
	6450 2650 6550 2750
Entry Wire Line
	6450 2750 6550 2850
Entry Wire Line
	6450 2850 6550 2950
Entry Wire Line
	6450 2950 6550 3050
Entry Wire Line
	6450 3050 6550 3150
Entry Wire Line
	6450 3150 6550 3250
Entry Wire Line
	6450 4350 6550 4450
Entry Wire Line
	6450 4450 6550 4550
Entry Wire Line
	6450 4550 6550 4650
Entry Wire Line
	6450 4650 6550 4750
Entry Wire Line
	6450 4750 6550 4850
Entry Wire Line
	6450 4850 6550 4950
Entry Wire Line
	6450 4950 6550 5050
Entry Wire Line
	6450 5050 6550 5150
Entry Wire Line
	9500 2550 9600 2450
Entry Wire Line
	9500 2650 9600 2550
Entry Wire Line
	9500 2750 9600 2650
Entry Wire Line
	9500 2850 9600 2750
Entry Wire Line
	9500 3450 9600 3350
Entry Wire Line
	9500 3550 9600 3450
Entry Wire Line
	9500 3650 9600 3550
Entry Wire Line
	9500 3750 9600 3650
Entry Wire Line
	9500 4450 9600 4350
Entry Wire Line
	9500 4550 9600 4450
Entry Wire Line
	9500 4650 9600 4550
Entry Wire Line
	9500 4750 9600 4650
Entry Wire Line
	9500 5350 9600 5250
Entry Wire Line
	9500 5450 9600 5350
Entry Wire Line
	9500 5550 9600 5450
Entry Wire Line
	9500 5650 9600 5550
Wire Wire Line
	2050 5250 2050 5500
Wire Wire Line
	2050 5500 1750 5500
Wire Wire Line
	2050 5500 2050 5750
Wire Wire Line
	2350 1550 1750 1550
Wire Wire Line
	2350 2000 1750 2000
Wire Wire Line
	2350 2450 1750 2450
Wire Wire Line
	2350 2900 1750 2900
Wire Wire Line
	2350 3350 1750 3350
Wire Wire Line
	2350 3800 1750 3800
Wire Wire Line
	2350 4250 1750 4250
Wire Wire Line
	2350 4700 1750 4700
Wire Wire Line
	2650 1650 2850 1650
Wire Wire Line
	2650 2100 2850 2100
Wire Wire Line
	2650 3000 2850 3000
Wire Wire Line
	2650 3900 2850 3900
Wire Wire Line
	2650 4350 2850 4350
Wire Wire Line
	2650 4800 2850 4800
Wire Wire Line
	2650 5250 2650 5500
Wire Wire Line
	2650 5500 2650 5750
Wire Wire Line
	2750 1550 3150 1550
Wire Wire Line
	2750 2000 3150 2000
Wire Wire Line
	2750 2450 3150 2450
Wire Wire Line
	2750 2900 3150 2900
Wire Wire Line
	2750 3350 3150 3350
Wire Wire Line
	2750 3800 3150 3800
Wire Wire Line
	2750 4250 3150 4250
Wire Wire Line
	2750 4700 3150 4700
Wire Wire Line
	2850 1650 2850 2100
Wire Wire Line
	2850 2100 2850 2550
Wire Wire Line
	2850 2550 2650 2550
Wire Wire Line
	2850 2550 2850 3000
Wire Wire Line
	2850 3000 2850 3450
Wire Wire Line
	2850 3450 2650 3450
Wire Wire Line
	2850 3450 2850 3900
Wire Wire Line
	2850 3900 2850 4350
Wire Wire Line
	2850 4350 2850 4800
Wire Wire Line
	2850 4800 2850 5500
Wire Wire Line
	2850 5500 2650 5500
Wire Wire Line
	2850 5500 5150 5500
Wire Wire Line
	4650 1550 4050 1550
Wire Wire Line
	4650 2000 4050 2000
Wire Wire Line
	4650 2450 4050 2450
Wire Wire Line
	4650 2900 4050 2900
Wire Wire Line
	4650 3350 4050 3350
Wire Wire Line
	4650 3800 4050 3800
Wire Wire Line
	4650 4250 4050 4250
Wire Wire Line
	4650 4700 4050 4700
Wire Wire Line
	4950 1650 5150 1650
Wire Wire Line
	4950 2100 5150 2100
Wire Wire Line
	4950 3000 5150 3000
Wire Wire Line
	4950 3900 5150 3900
Wire Wire Line
	4950 4350 5150 4350
Wire Wire Line
	5050 1550 5450 1550
Wire Wire Line
	5050 2000 5450 2000
Wire Wire Line
	5050 2450 5450 2450
Wire Wire Line
	5050 2900 5450 2900
Wire Wire Line
	5050 3350 5450 3350
Wire Wire Line
	5050 3800 5450 3800
Wire Wire Line
	5050 4250 5450 4250
Wire Wire Line
	5050 4700 5450 4700
Wire Wire Line
	5150 1650 5150 2100
Wire Wire Line
	5150 2100 5150 2550
Wire Wire Line
	5150 2550 4950 2550
Wire Wire Line
	5150 2550 5150 3000
Wire Wire Line
	5150 3450 4950 3450
Wire Wire Line
	5150 3450 5150 3000
Wire Wire Line
	5150 3450 5150 3900
Wire Wire Line
	5150 3900 5150 4350
Wire Wire Line
	5150 4350 5150 4800
Wire Wire Line
	5150 4800 4950 4800
Wire Wire Line
	5150 4800 5150 5500
Wire Wire Line
	6350 3500 6350 5400
Wire Wire Line
	6350 5400 6250 5400
Wire Wire Line
	6350 5400 6800 5400
Wire Wire Line
	6800 2550 6550 2550
Wire Wire Line
	6800 2650 6550 2650
Wire Wire Line
	6800 2750 6550 2750
Wire Wire Line
	6800 2850 6550 2850
Wire Wire Line
	6800 2950 6550 2950
Wire Wire Line
	6800 3050 6550 3050
Wire Wire Line
	6800 3150 6550 3150
Wire Wire Line
	6800 3250 6550 3250
Wire Wire Line
	6800 3500 6350 3500
Wire Wire Line
	6800 4450 6550 4450
Wire Wire Line
	6800 4550 6550 4550
Wire Wire Line
	6800 4650 6550 4650
Wire Wire Line
	6800 4750 6550 4750
Wire Wire Line
	6800 4850 6550 4850
Wire Wire Line
	6800 4950 6550 4950
Wire Wire Line
	6800 5050 6550 5050
Wire Wire Line
	6800 5150 6550 5150
Wire Wire Line
	7400 2550 7900 2550
Wire Wire Line
	7400 2750 7900 2750
Wire Wire Line
	7400 2950 7700 2950
Wire Wire Line
	7400 3150 7500 3150
Wire Wire Line
	7400 3750 7400 3250
Wire Wire Line
	7400 3750 7900 3750
Wire Wire Line
	7400 4450 7900 4450
Wire Wire Line
	7400 4650 7900 4650
Wire Wire Line
	7400 4850 7700 4850
Wire Wire Line
	7400 5050 7500 5050
Wire Wire Line
	7400 5650 7400 5150
Wire Wire Line
	7400 5650 7900 5650
Wire Wire Line
	7400 5800 7800 5800
Wire Wire Line
	7500 3150 7500 3650
Wire Wire Line
	7500 5050 7500 5550
Wire Wire Line
	7600 3050 7400 3050
Wire Wire Line
	7600 3550 7600 3050
Wire Wire Line
	7600 3550 7900 3550
Wire Wire Line
	7600 4950 7400 4950
Wire Wire Line
	7600 5450 7600 4950
Wire Wire Line
	7600 5450 7900 5450
Wire Wire Line
	7700 3450 7700 2950
Wire Wire Line
	7700 3450 7900 3450
Wire Wire Line
	7700 5350 7700 4850
Wire Wire Line
	7700 5350 7900 5350
Wire Wire Line
	7800 3000 7800 3900
Wire Wire Line
	7800 3900 7800 4900
Wire Wire Line
	7800 4900 7800 5800
Wire Wire Line
	7900 2650 7400 2650
Wire Wire Line
	7900 2850 7400 2850
Wire Wire Line
	7900 3000 7800 3000
Wire Wire Line
	7900 3650 7500 3650
Wire Wire Line
	7900 3900 7800 3900
Wire Wire Line
	7900 4550 7400 4550
Wire Wire Line
	7900 4750 7400 4750
Wire Wire Line
	7900 4900 7800 4900
Wire Wire Line
	7900 5550 7500 5550
Wire Wire Line
	7900 5800 7800 5800
Wire Wire Line
	8900 2550 9500 2550
Wire Wire Line
	8900 2650 9500 2650
Wire Wire Line
	8900 2750 9500 2750
Wire Wire Line
	8900 2850 9500 2850
Wire Wire Line
	8900 3450 9500 3450
Wire Wire Line
	8900 3550 9500 3550
Wire Wire Line
	8900 3650 9500 3650
Wire Wire Line
	8900 3750 9500 3750
Wire Wire Line
	8900 4450 9500 4450
Wire Wire Line
	8900 4550 9500 4550
Wire Wire Line
	8900 4650 9500 4650
Wire Wire Line
	8900 4750 9500 4750
Wire Wire Line
	8900 5350 9500 5350
Wire Wire Line
	8900 5450 9500 5450
Wire Wire Line
	8900 5550 9500 5550
Wire Wire Line
	8900 5650 9500 5650
Wire Bus Line
	1650 1000 1450 1000
Wire Bus Line
	3250 1100 5550 1100
Wire Bus Line
	3950 1000 1650 1000
Wire Bus Line
	3950 1000 9600 1000
Wire Bus Line
	5550 1100 6450 1100
Wire Bus Line
	6450 1100 6600 1100
Text Label 2300 1550 2    50   ~ 0
BUS-DATA15
Text Label 2300 2000 2    50   ~ 0
BUS-DATA14
Text Label 2300 2450 2    50   ~ 0
BUS-DATA13
Text Label 2300 2900 2    50   ~ 0
BUS-DATA12
Text Label 2300 3350 2    50   ~ 0
BUS-DATA11
Text Label 2300 3800 2    50   ~ 0
BUS-DATA10
Text Label 2300 4250 2    50   ~ 0
BUS-DATA9
Text Label 2300 4700 2    50   ~ 0
BUS-DATA8
Text Label 3100 1550 2    50   ~ 0
CD15
Text Label 3100 2000 2    50   ~ 0
CD14
Text Label 3100 2450 2    50   ~ 0
CD13
Text Label 3100 2900 2    50   ~ 0
CD12
Text Label 3100 3350 2    50   ~ 0
CD11
Text Label 3100 3800 2    50   ~ 0
CD10
Text Label 3100 4250 2    50   ~ 0
CD9
Text Label 3100 4700 2    50   ~ 0
CD8
Text Label 4600 1550 2    50   ~ 0
BUS-DATA7
Text Label 4600 2000 2    50   ~ 0
BUS-DATA6
Text Label 4600 2450 2    50   ~ 0
BUS-DATA5
Text Label 4600 2900 2    50   ~ 0
BUS-DATA4
Text Label 4600 3350 2    50   ~ 0
BUS-DATA3
Text Label 4600 3800 2    50   ~ 0
BUS-DATA2
Text Label 4600 4250 2    50   ~ 0
BUS-DATA1
Text Label 4600 4700 2    50   ~ 0
BUS-DATA0
Text Label 5400 1550 2    50   ~ 0
CD7
Text Label 5400 2000 2    50   ~ 0
CD6
Text Label 5400 2450 2    50   ~ 0
CD5
Text Label 5400 2900 2    50   ~ 0
CD4
Text Label 5400 3350 2    50   ~ 0
CD3
Text Label 5400 3800 2    50   ~ 0
CD2
Text Label 5400 4250 2    50   ~ 0
CD1
Text Label 5400 4700 2    50   ~ 0
CD0
Text Label 6750 2550 2    50   ~ 0
CD15
Text Label 6750 2650 2    50   ~ 0
CD14
Text Label 6750 2750 2    50   ~ 0
CD13
Text Label 6750 2850 2    50   ~ 0
CD12
Text Label 6750 2950 2    50   ~ 0
CD11
Text Label 6750 3050 2    50   ~ 0
CD10
Text Label 6750 3150 2    50   ~ 0
CD9
Text Label 6750 3250 2    50   ~ 0
CD8
Text Label 6750 4450 2    50   ~ 0
CD7
Text Label 6750 4550 2    50   ~ 0
CD6
Text Label 6750 4650 2    50   ~ 0
CD5
Text Label 6750 4750 2    50   ~ 0
CD4
Text Label 6750 4850 2    50   ~ 0
CD3
Text Label 6750 4950 2    50   ~ 0
CD2
Text Label 6750 5050 2    50   ~ 0
CD1
Text Label 6750 5150 2    50   ~ 0
CD0
Text Label 8950 2550 0    50   ~ 0
BUS-DATA15
Text Label 8950 2650 0    50   ~ 0
BUS-DATA14
Text Label 8950 2750 0    50   ~ 0
BUS-DATA13
Text Label 8950 2850 0    50   ~ 0
BUS-DATA12
Text Label 8950 3450 0    50   ~ 0
BUS-DATA11
Text Label 8950 3550 0    50   ~ 0
BUS-DATA10
Text Label 8950 3650 0    50   ~ 0
BUS-DATA9
Text Label 8950 3750 0    50   ~ 0
BUS-DATA8
Text Label 8950 4450 0    50   ~ 0
BUS-DATA7
Text Label 8950 4550 0    50   ~ 0
BUS-DATA6
Text Label 8950 4650 0    50   ~ 0
BUS-DATA5
Text Label 8950 4750 0    50   ~ 0
BUS-DATA4
Text Label 8950 5350 0    50   ~ 0
BUS-DATA3
Text Label 8950 5450 0    50   ~ 0
BUS-DATA2
Text Label 8950 5550 0    50   ~ 0
BUS-DATA1
Text Label 8950 5650 0    50   ~ 0
BUS-DATA0
Text HLabel 1450 1000 0    50   BiDi ~ 0
BUS-DATA[0..15]
Text HLabel 1750 5500 0    50   Input ~ 0
READ
Text HLabel 6250 5400 0    50   Input ~ 0
WRITE
Text HLabel 6600 1100 2    50   BiDi ~ 0
CD[0..15]
Text HLabel 7400 5800 0    50   Input ~ 0
READ
$Comp
L A5C:OUTTRI UAA?
U 1 1 604D4DFE
P 2550 1550
AR Path="/6029E0E8/604D4DFE" Ref="UAA?"  Part="1" 
AR Path="/604B5523/604D4DFE" Ref="UAA370"  Part="1" 
F 0 "UAA370" H 2550 1815 50  0000 C CNN
F 1 "OUTTRI" H 2550 1724 50  0000 C CNN
F 2 "" H 2050 1500 50  0001 C CNN
F 3 "" H 2050 1500 50  0001 C CNN
	1    2550 1550
	1    0    0    -1  
$EndComp
$Comp
L A5C:OUTTRI UAA?
U 1 1 604D4E04
P 2550 2000
AR Path="/6029E0E8/604D4E04" Ref="UAA?"  Part="1" 
AR Path="/604B5523/604D4E04" Ref="UAA377"  Part="1" 
F 0 "UAA377" H 2550 2265 50  0000 C CNN
F 1 "OUTTRI" H 2550 2174 50  0000 C CNN
F 2 "" H 2050 1950 50  0001 C CNN
F 3 "" H 2050 1950 50  0001 C CNN
	1    2550 2000
	1    0    0    -1  
$EndComp
$Comp
L A5C:OUTTRI UAA?
U 1 1 604D4E0A
P 2550 2450
AR Path="/6029E0E8/604D4E0A" Ref="UAA?"  Part="1" 
AR Path="/604B5523/604D4E0A" Ref="UAA391"  Part="1" 
F 0 "UAA391" H 2550 2715 50  0000 C CNN
F 1 "OUTTRI" H 2550 2624 50  0000 C CNN
F 2 "" H 2050 2400 50  0001 C CNN
F 3 "" H 2050 2400 50  0001 C CNN
	1    2550 2450
	1    0    0    -1  
$EndComp
$Comp
L A5C:OUTTRI UAA?
U 1 1 604D4E10
P 2550 2900
AR Path="/6029E0E8/604D4E10" Ref="UAA?"  Part="1" 
AR Path="/604B5523/604D4E10" Ref="UAA404"  Part="1" 
F 0 "UAA404" H 2550 3165 50  0000 C CNN
F 1 "OUTTRI" H 2550 3074 50  0000 C CNN
F 2 "" H 2050 2850 50  0001 C CNN
F 3 "" H 2050 2850 50  0001 C CNN
	1    2550 2900
	1    0    0    -1  
$EndComp
$Comp
L A5C:OUTTRI UAA?
U 1 1 604D4E16
P 2550 3350
AR Path="/6029E0E8/604D4E16" Ref="UAA?"  Part="1" 
AR Path="/604B5523/604D4E16" Ref="UAB409"  Part="1" 
F 0 "UAB409" H 2550 3615 50  0000 C CNN
F 1 "OUTTRI" H 2550 3524 50  0000 C CNN
F 2 "" H 2050 3300 50  0001 C CNN
F 3 "" H 2050 3300 50  0001 C CNN
	1    2550 3350
	1    0    0    -1  
$EndComp
$Comp
L A5C:OUTTRI UAA?
U 1 1 604D4E1C
P 2550 3800
AR Path="/6029E0E8/604D4E1C" Ref="UAA?"  Part="1" 
AR Path="/604B5523/604D4E1C" Ref="UAA441"  Part="1" 
F 0 "UAA441" H 2550 4065 50  0000 C CNN
F 1 "OUTTRI" H 2550 3974 50  0000 C CNN
F 2 "" H 2050 3750 50  0001 C CNN
F 3 "" H 2050 3750 50  0001 C CNN
	1    2550 3800
	1    0    0    -1  
$EndComp
$Comp
L A5C:OUTTRI UAA?
U 1 1 604D4E22
P 2550 4250
AR Path="/6029E0E8/604D4E22" Ref="UAA?"  Part="1" 
AR Path="/604B5523/604D4E22" Ref="UAA454"  Part="1" 
F 0 "UAA454" H 2550 4515 50  0000 C CNN
F 1 "OUTTRI" H 2550 4424 50  0000 C CNN
F 2 "" H 2050 4200 50  0001 C CNN
F 3 "" H 2050 4200 50  0001 C CNN
	1    2550 4250
	1    0    0    -1  
$EndComp
$Comp
L A5C:OUTTRI UAA?
U 1 1 604D4E28
P 2550 4700
AR Path="/6029E0E8/604D4E28" Ref="UAA?"  Part="1" 
AR Path="/604B5523/604D4E28" Ref="UAA462"  Part="1" 
F 0 "UAA462" H 2550 4965 50  0000 C CNN
F 1 "OUTTRI" H 2550 4874 50  0000 C CNN
F 2 "" H 2050 4650 50  0001 C CNN
F 3 "" H 2050 4650 50  0001 C CNN
	1    2550 4700
	1    0    0    -1  
$EndComp
$Comp
L A5C:OUTTRI UAA?
U 1 1 604D4E95
P 4850 1550
AR Path="/6029E0E8/604D4E95" Ref="UAA?"  Part="1" 
AR Path="/604B5523/604D4E95" Ref="UAA478"  Part="1" 
F 0 "UAA478" H 4850 1815 50  0000 C CNN
F 1 "OUTTRI" H 4850 1724 50  0000 C CNN
F 2 "" H 4350 1500 50  0001 C CNN
F 3 "" H 4350 1500 50  0001 C CNN
	1    4850 1550
	1    0    0    -1  
$EndComp
$Comp
L A5C:OUTTRI UAA?
U 1 1 604D4E8F
P 4850 2000
AR Path="/6029E0E8/604D4E8F" Ref="UAA?"  Part="1" 
AR Path="/604B5523/604D4E8F" Ref="UAA491"  Part="1" 
F 0 "UAA491" H 4850 2265 50  0000 C CNN
F 1 "OUTTRI" H 4850 2174 50  0000 C CNN
F 2 "" H 4350 1950 50  0001 C CNN
F 3 "" H 4350 1950 50  0001 C CNN
	1    4850 2000
	1    0    0    -1  
$EndComp
$Comp
L A5C:OUTTRI UAA?
U 1 1 604D4E89
P 4850 2450
AR Path="/6029E0E8/604D4E89" Ref="UAA?"  Part="1" 
AR Path="/604B5523/604D4E89" Ref="UAD486"  Part="1" 
F 0 "UAD486" H 4850 2715 50  0000 C CNN
F 1 "OUTTRI" H 4850 2624 50  0000 C CNN
F 2 "" H 4350 2400 50  0001 C CNN
F 3 "" H 4350 2400 50  0001 C CNN
	1    4850 2450
	1    0    0    -1  
$EndComp
$Comp
L A5C:OUTTRI UAA?
U 1 1 604D4E83
P 4850 2900
AR Path="/6029E0E8/604D4E83" Ref="UAA?"  Part="1" 
AR Path="/604B5523/604D4E83" Ref="UAA499"  Part="1" 
F 0 "UAA499" H 4850 3165 50  0000 C CNN
F 1 "OUTTRI" H 4850 3074 50  0000 C CNN
F 2 "" H 4350 2850 50  0001 C CNN
F 3 "" H 4350 2850 50  0001 C CNN
	1    4850 2900
	1    0    0    -1  
$EndComp
$Comp
L A5C:OUTTRI UAA?
U 1 1 604D4E7D
P 4850 3350
AR Path="/6029E0E8/604D4E7D" Ref="UAA?"  Part="1" 
AR Path="/604B5523/604D4E7D" Ref="UAB515"  Part="1" 
F 0 "UAB515" H 4850 3615 50  0000 C CNN
F 1 "OUTTRI" H 4850 3524 50  0000 C CNN
F 2 "" H 4350 3300 50  0001 C CNN
F 3 "" H 4350 3300 50  0001 C CNN
	1    4850 3350
	1    0    0    -1  
$EndComp
$Comp
L A5C:OUTTRI UAA?
U 1 1 604D4E77
P 4850 3800
AR Path="/6029E0E8/604D4E77" Ref="UAA?"  Part="1" 
AR Path="/604B5523/604D4E77" Ref="UAC512"  Part="1" 
F 0 "UAC512" H 4850 4065 50  0000 C CNN
F 1 "OUTTRI" H 4850 3974 50  0000 C CNN
F 2 "" H 4350 3750 50  0001 C CNN
F 3 "" H 4350 3750 50  0001 C CNN
	1    4850 3800
	1    0    0    -1  
$EndComp
$Comp
L A5C:OUTTRI UAA?
U 1 1 604D4E71
P 4850 4250
AR Path="/6029E0E8/604D4E71" Ref="UAA?"  Part="1" 
AR Path="/604B5523/604D4E71" Ref="UBA180"  Part="1" 
F 0 "UBA180" H 4850 4515 50  0000 C CNN
F 1 "OUTTRI" H 4850 4424 50  0000 C CNN
F 2 "" H 4350 4200 50  0001 C CNN
F 3 "" H 4350 4200 50  0001 C CNN
	1    4850 4250
	1    0    0    -1  
$EndComp
$Comp
L A5C:OUTTRI UAA?
U 1 1 604D4E6B
P 4850 4700
AR Path="/6029E0E8/604D4E6B" Ref="UAA?"  Part="1" 
AR Path="/604B5523/604D4E6B" Ref="UAB523"  Part="1" 
F 0 "UAB523" H 4850 4965 50  0000 C CNN
F 1 "OUTTRI" H 4850 4874 50  0000 C CNN
F 2 "" H 4350 4650 50  0001 C CNN
F 3 "" H 4350 4650 50  0001 C CNN
	1    4850 4700
	1    0    0    -1  
$EndComp
$Comp
L A5C:NBUF03 UAA?
U 1 1 607C7E94
P 2350 5250
AR Path="/607C7E94" Ref="UAA?"  Part="1" 
AR Path="/604B5523/607C7E94" Ref="UAA251"  Part="1" 
F 0 "UAA251" H 2350 5567 50  0000 C CNN
F 1 "NBUF03" H 2350 5476 50  0000 C CNN
F 2 "" H 2350 5050 50  0001 C CNN
F 3 "" H 2350 5050 50  0001 C CNN
	1    2350 5250
	1    0    0    -1  
$EndComp
$Comp
L A5C:NBUF03 UAD?
U 1 1 607C7E9A
P 2350 5750
AR Path="/607C7E9A" Ref="UAD?"  Part="1" 
AR Path="/604B5523/607C7E9A" Ref="UAD3"  Part="1" 
F 0 "UAD3" H 2350 6067 50  0000 C CNN
F 1 "NBUF03" H 2350 5976 50  0000 C CNN
F 2 "" H 2350 5550 50  0001 C CNN
F 3 "" H 2350 5550 50  0001 C CNN
	1    2350 5750
	1    0    0    -1  
$EndComp
$Comp
L A5C:M368C UAB276
U 1 1 605A6E9B
P 8400 2800
F 0 "UAB276" H 8400 3315 50  0000 C CNN
F 1 "M368C" H 8400 3224 50  0000 C CNN
F 2 "" H 8700 2600 50  0001 C CNN
F 3 "" H 8700 2600 50  0001 C CNN
	1    8400 2800
	1    0    0    -1  
$EndComp
$Comp
L A5C:M368C UCA428
U 1 1 605A6EB1
P 8400 3700
F 0 "UCA428" H 8400 4210 50  0000 C CNN
F 1 "M368C" H 8400 4120 50  0000 C CNN
F 2 "" H 8700 3500 50  0001 C CNN
F 3 "" H 8700 3500 50  0001 C CNN
	1    8400 3700
	1    0    0    -1  
$EndComp
$Comp
L A5C:M368C UAB473
U 1 1 6050E913
P 8400 4700
F 0 "UAB473" H 8400 5215 50  0000 C CNN
F 1 "M368C" H 8400 5124 50  0000 C CNN
F 2 "" H 8700 4500 50  0001 C CNN
F 3 "" H 8700 4500 50  0001 C CNN
	1    8400 4700
	1    0    0    -1  
$EndComp
$Comp
L A5C:M368C UBH157
U 1 1 6050F621
P 8400 5600
F 0 "UBH157" H 8400 6115 50  0000 C CNN
F 1 "M368C" H 8400 6024 50  0000 C CNN
F 2 "" H 8700 5400 50  0001 C CNN
F 3 "" H 8700 5400 50  0001 C CNN
	1    8400 5600
	1    0    0    -1  
$EndComp
$Comp
L A5C:L8L UAA411
U 1 1 605A6E95
P 7100 2950
F 0 "UAA411" H 7100 3615 50  0000 C CNN
F 1 "L8L" H 7100 3524 50  0000 C CNN
F 2 "" H 7050 3250 50  0001 C CNN
F 3 "" H 7050 3250 50  0001 C CNN
	1    7100 2950
	1    0    0    -1  
$EndComp
$Comp
L A5C:L8L UAA503
U 1 1 6050DA48
P 7100 4850
F 0 "UAA503" H 7100 5515 50  0000 C CNN
F 1 "L8L" H 7100 5424 50  0000 C CNN
F 2 "" H 7050 5150 50  0001 C CNN
F 3 "" H 7050 5150 50  0001 C CNN
	1    7100 4850
	1    0    0    -1  
$EndComp
Wire Bus Line
	1650 1000 1650 4600
Wire Bus Line
	3250 1100 3250 4600
Wire Bus Line
	3950 1000 3950 4600
Wire Bus Line
	5550 1100 5550 4600
Wire Bus Line
	6450 1100 6450 5050
Wire Bus Line
	9600 1000 9600 5550
$EndSCHEMATC
