EESchema Schematic File Version 4
EELAYER 30 0
EELAYER END
$Descr A3 11693 16535 portrait
encoding utf-8
Sheet 40 69
Title ""
Date "2020-11-26"
Rev ""
Comp ""
Comment1 "Licence: CC-BY"
Comment2 "Author: Loïc *WydD* Petit"
Comment3 ""
Comment4 ""
$EndDescr
Connection ~ 7150 9100
Connection ~ 7200 9200
Connection ~ 7250 9300
Connection ~ 7300 9400
Connection ~ 7350 9500
Connection ~ 7400 9600
Connection ~ 7450 9700
Connection ~ 2900 9100
Connection ~ 2950 9200
Connection ~ 3000 9300
Connection ~ 3050 9400
Connection ~ 3100 9500
Connection ~ 3150 9600
Connection ~ 3200 9700
Connection ~ 9250 9500
Connection ~ 9250 2000
Connection ~ 7450 2200
Connection ~ 7400 2100
Connection ~ 7350 2000
Connection ~ 7300 1900
Connection ~ 7250 1800
Connection ~ 7200 1700
Connection ~ 7150 1600
Connection ~ 1200 5100
Connection ~ 1300 5000
Connection ~ 9250 4500
Connection ~ 7450 4700
Connection ~ 7400 4600
Connection ~ 7350 4500
Connection ~ 7300 4400
Connection ~ 7250 4300
Connection ~ 7200 4200
Connection ~ 7150 4100
Connection ~ 9250 7000
Connection ~ 7450 7200
Connection ~ 7400 7100
Connection ~ 7350 7000
Connection ~ 7300 6900
Connection ~ 7250 6800
Connection ~ 7200 6700
Connection ~ 7150 6600
Connection ~ 1200 7600
Connection ~ 1300 7500
Connection ~ 7650 5000
Connection ~ 7750 5100
Connection ~ 7850 5200
Connection ~ 7650 7500
Connection ~ 7750 7600
Connection ~ 7850 7700
Connection ~ 1200 10100
Connection ~ 1300 10000
Connection ~ 7650 10000
Connection ~ 7750 10100
Connection ~ 8050 5400
Connection ~ 8050 7900
Connection ~ 2850 12900
Connection ~ 1200 8300
Connection ~ 1300 8200
Connection ~ 3300 9800
Connection ~ 3500 11400
Connection ~ 3600 11900
Connection ~ 2900 6600
Connection ~ 2950 6700
Connection ~ 3000 6800
Connection ~ 3050 6900
Connection ~ 3100 7000
Connection ~ 3150 7100
Connection ~ 3200 7200
Connection ~ 3300 7300
Connection ~ 3500 10000
Connection ~ 3600 10100
Connection ~ 3700 10200
Connection ~ 3800 10400
Connection ~ 1200 5800
Connection ~ 1300 5700
Connection ~ 2900 4100
Connection ~ 2950 4200
Connection ~ 3000 4300
Connection ~ 3100 4500
Connection ~ 3150 4600
Connection ~ 3200 4700
Connection ~ 3500 7500
Connection ~ 3600 7600
Connection ~ 3700 7700
Connection ~ 3800 7900
Connection ~ 3300 4800
Connection ~ 1200 3300
Connection ~ 1300 3200
Connection ~ 2900 1600
Connection ~ 2950 1700
Connection ~ 3000 1800
Connection ~ 3050 1900
Connection ~ 3100 2000
Connection ~ 3150 2100
Connection ~ 3200 2200
Connection ~ 3500 5000
Connection ~ 3600 5100
Connection ~ 3700 5200
Connection ~ 3800 5400
Connection ~ 3300 2300
Connection ~ 3050 4400
Connection ~ 3700 12400
Connection ~ 7850 10200
Connection ~ 8050 10400
Connection ~ 1300 10700
Connection ~ 1200 10800
Entry Wire Line
	1700 11300 1800 11400
Entry Wire Line
	1700 11800 1800 11900
Entry Wire Line
	1700 12300 1800 12400
Entry Wire Line
	1700 12800 1800 12900
Wire Wire Line
	950  1600 1800 1600
Wire Wire Line
	950  4100 1800 4100
Wire Wire Line
	950  6600 1800 6600
Wire Wire Line
	950  9100 1800 9100
Wire Wire Line
	1200 2600 1200 3300
Wire Wire Line
	1200 3300 5550 3300
Wire Wire Line
	1200 5100 1200 3300
Wire Wire Line
	1200 5100 1200 5800
Wire Wire Line
	1200 5800 5550 5800
Wire Wire Line
	1200 7600 1200 5800
Wire Wire Line
	1200 7600 1200 8300
Wire Wire Line
	1200 8300 1200 10100
Wire Wire Line
	1200 8300 5550 8300
Wire Wire Line
	1200 10100 1200 10800
Wire Wire Line
	1200 10800 950  10800
Wire Wire Line
	1200 10800 5550 10800
Wire Wire Line
	1300 2500 1300 3200
Wire Wire Line
	1300 3200 1300 5000
Wire Wire Line
	1300 5000 1300 5700
Wire Wire Line
	1300 5700 1300 7500
Wire Wire Line
	1300 5700 5450 5700
Wire Wire Line
	1300 7500 1300 8200
Wire Wire Line
	1300 10000 1300 8200
Wire Wire Line
	1300 10000 1300 10700
Wire Wire Line
	1300 10700 950  10700
Wire Wire Line
	1400 950  1400 2300
Wire Wire Line
	1400 2300 1800 2300
Wire Wire Line
	1400 3450 1400 4800
Wire Wire Line
	1400 4800 1800 4800
Wire Wire Line
	1400 5950 1400 7300
Wire Wire Line
	1400 7300 1800 7300
Wire Wire Line
	1400 8450 1400 9800
Wire Wire Line
	1400 9800 1800 9800
Wire Wire Line
	1450 1000 1450 2200
Wire Wire Line
	1450 2200 1800 2200
Wire Wire Line
	1450 3500 1450 4700
Wire Wire Line
	1450 4700 1800 4700
Wire Wire Line
	1450 6000 1450 7200
Wire Wire Line
	1450 7200 1800 7200
Wire Wire Line
	1450 8500 1450 9700
Wire Wire Line
	1450 9700 1800 9700
Wire Wire Line
	1500 1050 1500 2100
Wire Wire Line
	1500 2100 1800 2100
Wire Wire Line
	1500 3550 1500 4600
Wire Wire Line
	1500 3550 3100 3550
Wire Wire Line
	1500 4600 1800 4600
Wire Wire Line
	1500 6050 1500 7100
Wire Wire Line
	1500 7100 1800 7100
Wire Wire Line
	1500 8550 1500 9600
Wire Wire Line
	1500 9600 1800 9600
Wire Wire Line
	1550 1100 1550 2000
Wire Wire Line
	1550 2000 1800 2000
Wire Wire Line
	1550 3600 1550 4500
Wire Wire Line
	1550 4500 1800 4500
Wire Wire Line
	1550 6100 1550 7000
Wire Wire Line
	1550 7000 1800 7000
Wire Wire Line
	1550 8600 1550 9500
Wire Wire Line
	1550 9500 1800 9500
Wire Wire Line
	1600 1150 1600 1900
Wire Wire Line
	1600 1900 1800 1900
Wire Wire Line
	1600 3650 1600 4400
Wire Wire Line
	1600 4400 1800 4400
Wire Wire Line
	1600 6150 1600 6900
Wire Wire Line
	1600 6900 1800 6900
Wire Wire Line
	1600 8650 1600 9400
Wire Wire Line
	1600 9400 1800 9400
Wire Wire Line
	1650 1200 1650 1800
Wire Wire Line
	1650 1800 1800 1800
Wire Wire Line
	1650 3700 1650 4300
Wire Wire Line
	1650 4300 1800 4300
Wire Wire Line
	1650 6200 1650 6800
Wire Wire Line
	1650 6800 1800 6800
Wire Wire Line
	1650 8700 1650 9300
Wire Wire Line
	1650 9300 1800 9300
Wire Wire Line
	1700 1250 1700 1700
Wire Wire Line
	1700 1700 1800 1700
Wire Wire Line
	1700 3750 1700 4200
Wire Wire Line
	1700 4200 1800 4200
Wire Wire Line
	1700 6250 1700 6700
Wire Wire Line
	1700 6700 1800 6700
Wire Wire Line
	1700 8750 1700 9200
Wire Wire Line
	1700 9200 1800 9200
Wire Wire Line
	1800 2500 1300 2500
Wire Wire Line
	1800 2600 1200 2600
Wire Wire Line
	1800 5000 1300 5000
Wire Wire Line
	1800 5100 1200 5100
Wire Wire Line
	1800 7500 1300 7500
Wire Wire Line
	1800 7600 1200 7600
Wire Wire Line
	1800 10000 1300 10000
Wire Wire Line
	1800 10100 1200 10100
Wire Wire Line
	1800 11400 2850 11400
Wire Wire Line
	1800 11900 2850 11900
Wire Wire Line
	1800 12400 2850 12400
Wire Wire Line
	1800 12900 2850 12900
Wire Wire Line
	2800 1600 2900 1600
Wire Wire Line
	2800 1700 2950 1700
Wire Wire Line
	2800 1800 3000 1800
Wire Wire Line
	2800 1900 3050 1900
Wire Wire Line
	2800 2000 3100 2000
Wire Wire Line
	2800 2100 3150 2100
Wire Wire Line
	2800 2200 3200 2200
Wire Wire Line
	2800 2300 3300 2300
Wire Wire Line
	2800 4100 2900 4100
Wire Wire Line
	2800 4200 2950 4200
Wire Wire Line
	2800 4300 3000 4300
Wire Wire Line
	2800 4400 3050 4400
Wire Wire Line
	2800 4500 3100 4500
Wire Wire Line
	2800 4600 3150 4600
Wire Wire Line
	2800 4700 3200 4700
Wire Wire Line
	2800 4800 3300 4800
Wire Wire Line
	2800 6600 2900 6600
Wire Wire Line
	2800 6700 2950 6700
Wire Wire Line
	2800 6800 3000 6800
Wire Wire Line
	2800 6900 3050 6900
Wire Wire Line
	2800 7000 3100 7000
Wire Wire Line
	2800 7100 3150 7100
Wire Wire Line
	2800 7200 3200 7200
Wire Wire Line
	2800 7300 3300 7300
Wire Wire Line
	2800 9100 2900 9100
Wire Wire Line
	2800 9200 2950 9200
Wire Wire Line
	2800 9300 3000 9300
Wire Wire Line
	2800 9400 3050 9400
Wire Wire Line
	2800 9500 3100 9500
Wire Wire Line
	2800 9600 3150 9600
Wire Wire Line
	2800 9700 3200 9700
Wire Wire Line
	2800 9800 3300 9800
Wire Wire Line
	2850 13400 2850 12900
Wire Wire Line
	2900 1250 1700 1250
Wire Wire Line
	2900 1600 2900 1250
Wire Wire Line
	2900 1600 3900 1600
Wire Wire Line
	2900 3750 1700 3750
Wire Wire Line
	2900 4100 2900 3750
Wire Wire Line
	2900 4100 3900 4100
Wire Wire Line
	2900 6250 1700 6250
Wire Wire Line
	2900 6600 2900 6250
Wire Wire Line
	2900 6600 3900 6600
Wire Wire Line
	2900 8750 1700 8750
Wire Wire Line
	2900 9100 2900 8750
Wire Wire Line
	2900 9100 3900 9100
Wire Wire Line
	2950 1200 1650 1200
Wire Wire Line
	2950 1700 2950 1200
Wire Wire Line
	2950 1700 3900 1700
Wire Wire Line
	2950 3700 1650 3700
Wire Wire Line
	2950 4200 2950 3700
Wire Wire Line
	2950 4200 3900 4200
Wire Wire Line
	2950 6200 1650 6200
Wire Wire Line
	2950 6700 2950 6200
Wire Wire Line
	2950 6700 3900 6700
Wire Wire Line
	2950 8700 1650 8700
Wire Wire Line
	2950 9200 2950 8700
Wire Wire Line
	2950 9200 3900 9200
Wire Wire Line
	3000 1150 1600 1150
Wire Wire Line
	3000 1800 3000 1150
Wire Wire Line
	3000 1800 3900 1800
Wire Wire Line
	3000 3650 1600 3650
Wire Wire Line
	3000 3650 3000 4300
Wire Wire Line
	3000 4300 3900 4300
Wire Wire Line
	3000 6150 1600 6150
Wire Wire Line
	3000 6150 3000 6800
Wire Wire Line
	3000 6800 3900 6800
Wire Wire Line
	3000 8650 1600 8650
Wire Wire Line
	3000 9300 3000 8650
Wire Wire Line
	3000 9300 3900 9300
Wire Wire Line
	3050 1100 1550 1100
Wire Wire Line
	3050 1900 3050 1100
Wire Wire Line
	3050 1900 3900 1900
Wire Wire Line
	3050 3600 1550 3600
Wire Wire Line
	3050 4400 3050 3600
Wire Wire Line
	3050 4400 3900 4400
Wire Wire Line
	3050 6100 1550 6100
Wire Wire Line
	3050 6900 3050 6100
Wire Wire Line
	3050 6900 3900 6900
Wire Wire Line
	3050 8600 1550 8600
Wire Wire Line
	3050 9400 3050 8600
Wire Wire Line
	3050 9400 3900 9400
Wire Wire Line
	3100 1050 1500 1050
Wire Wire Line
	3100 2000 3100 1050
Wire Wire Line
	3100 2000 3900 2000
Wire Wire Line
	3100 4500 3100 3550
Wire Wire Line
	3100 4500 3900 4500
Wire Wire Line
	3100 6050 1500 6050
Wire Wire Line
	3100 7000 3100 6050
Wire Wire Line
	3100 7000 3900 7000
Wire Wire Line
	3100 8550 1500 8550
Wire Wire Line
	3100 9500 3100 8550
Wire Wire Line
	3100 9500 3900 9500
Wire Wire Line
	3150 1000 1450 1000
Wire Wire Line
	3150 2100 3150 1000
Wire Wire Line
	3150 2100 3900 2100
Wire Wire Line
	3150 3500 1450 3500
Wire Wire Line
	3150 4600 3150 3500
Wire Wire Line
	3150 4600 3900 4600
Wire Wire Line
	3150 6000 1450 6000
Wire Wire Line
	3150 7100 3150 6000
Wire Wire Line
	3150 7100 3900 7100
Wire Wire Line
	3150 8500 1450 8500
Wire Wire Line
	3150 9600 3150 8500
Wire Wire Line
	3150 9600 3900 9600
Wire Wire Line
	3200 950  1400 950 
Wire Wire Line
	3200 2200 3200 950 
Wire Wire Line
	3200 2200 3900 2200
Wire Wire Line
	3200 3450 1400 3450
Wire Wire Line
	3200 3450 3200 4700
Wire Wire Line
	3200 4700 3900 4700
Wire Wire Line
	3200 5950 1400 5950
Wire Wire Line
	3200 5950 3200 7200
Wire Wire Line
	3200 7200 3900 7200
Wire Wire Line
	3200 8450 1400 8450
Wire Wire Line
	3200 9700 3200 8450
Wire Wire Line
	3200 9700 3900 9700
Wire Wire Line
	3300 2300 3300 3100
Wire Wire Line
	3300 2300 3900 2300
Wire Wire Line
	3300 3100 5200 3100
Wire Wire Line
	3300 4800 3300 5600
Wire Wire Line
	3300 4800 3900 4800
Wire Wire Line
	3300 5600 5200 5600
Wire Wire Line
	3300 7300 3300 8100
Wire Wire Line
	3300 7300 3900 7300
Wire Wire Line
	3300 8100 5200 8100
Wire Wire Line
	3300 9800 3300 10600
Wire Wire Line
	3300 9800 3900 9800
Wire Wire Line
	3300 10600 5200 10600
Wire Wire Line
	3450 11400 3500 11400
Wire Wire Line
	3450 11900 3600 11900
Wire Wire Line
	3450 12400 3700 12400
Wire Wire Line
	3450 13400 8050 13400
Wire Wire Line
	3500 2500 3900 2500
Wire Wire Line
	3500 5000 3500 2500
Wire Wire Line
	3500 5000 3900 5000
Wire Wire Line
	3500 7500 3500 5000
Wire Wire Line
	3500 7500 3900 7500
Wire Wire Line
	3500 10000 3500 7500
Wire Wire Line
	3500 10000 3500 11400
Wire Wire Line
	3500 10000 3900 10000
Wire Wire Line
	3500 11400 7650 11400
Wire Wire Line
	3600 2600 3600 5100
Wire Wire Line
	3600 2600 3900 2600
Wire Wire Line
	3600 5100 3600 7600
Wire Wire Line
	3600 5100 3900 5100
Wire Wire Line
	3600 7600 3600 10100
Wire Wire Line
	3600 7600 3900 7600
Wire Wire Line
	3600 10100 3600 11900
Wire Wire Line
	3600 10100 3900 10100
Wire Wire Line
	3600 11900 7750 11900
Wire Wire Line
	3700 2700 3900 2700
Wire Wire Line
	3700 5200 3700 2700
Wire Wire Line
	3700 5200 3900 5200
Wire Wire Line
	3700 7700 3700 5200
Wire Wire Line
	3700 7700 3900 7700
Wire Wire Line
	3700 10200 3700 7700
Wire Wire Line
	3700 10200 3900 10200
Wire Wire Line
	3700 12400 3700 10200
Wire Wire Line
	3700 12400 7850 12400
Wire Wire Line
	3800 2900 3800 5400
Wire Wire Line
	3800 2900 3900 2900
Wire Wire Line
	3800 5400 3800 7900
Wire Wire Line
	3800 5400 3900 5400
Wire Wire Line
	3800 7900 3800 10400
Wire Wire Line
	3800 7900 3900 7900
Wire Wire Line
	3800 10400 3800 12900
Wire Wire Line
	3800 10400 3900 10400
Wire Wire Line
	3800 12900 3450 12900
Wire Wire Line
	4900 2000 5100 2000
Wire Wire Line
	4900 4500 5100 4500
Wire Wire Line
	4900 7000 5100 7000
Wire Wire Line
	4900 9500 5100 9500
Wire Wire Line
	5100 900  5100 2000
Wire Wire Line
	5100 900  9250 900 
Wire Wire Line
	5100 3400 5100 4500
Wire Wire Line
	5100 3400 9250 3400
Wire Wire Line
	5100 5900 5100 7000
Wire Wire Line
	5100 5900 9250 5900
Wire Wire Line
	5100 8400 5100 9500
Wire Wire Line
	5100 8400 9250 8400
Wire Wire Line
	5200 1600 5200 3100
Wire Wire Line
	5200 1600 6050 1600
Wire Wire Line
	5200 4100 5200 5600
Wire Wire Line
	5200 4100 6050 4100
Wire Wire Line
	5200 6600 5200 8100
Wire Wire Line
	5200 6600 6050 6600
Wire Wire Line
	5200 9100 5200 10600
Wire Wire Line
	5200 9100 6050 9100
Wire Wire Line
	5450 2500 5450 3200
Wire Wire Line
	5450 2500 6050 2500
Wire Wire Line
	5450 3200 1300 3200
Wire Wire Line
	5450 5000 5450 5700
Wire Wire Line
	5450 5000 6050 5000
Wire Wire Line
	5450 7500 5450 8200
Wire Wire Line
	5450 7500 6050 7500
Wire Wire Line
	5450 8200 1300 8200
Wire Wire Line
	5450 10000 5450 10700
Wire Wire Line
	5450 10000 6050 10000
Wire Wire Line
	5450 10700 1300 10700
Wire Wire Line
	5550 2600 5550 3300
Wire Wire Line
	5550 2600 6050 2600
Wire Wire Line
	5550 5100 5550 5800
Wire Wire Line
	5550 5100 6050 5100
Wire Wire Line
	5550 7600 5550 8300
Wire Wire Line
	5550 7600 6050 7600
Wire Wire Line
	5550 10100 5550 10800
Wire Wire Line
	5550 10100 6050 10100
Wire Wire Line
	5650 950  5650 2300
Wire Wire Line
	5650 2300 6050 2300
Wire Wire Line
	5650 3450 5650 4800
Wire Wire Line
	5650 4800 6050 4800
Wire Wire Line
	5650 5950 5650 7300
Wire Wire Line
	5650 7300 6050 7300
Wire Wire Line
	5650 8450 5650 9800
Wire Wire Line
	5650 9800 6050 9800
Wire Wire Line
	5700 1000 5700 2200
Wire Wire Line
	5700 2200 6050 2200
Wire Wire Line
	5700 3500 5700 4700
Wire Wire Line
	5700 4700 6050 4700
Wire Wire Line
	5700 6000 5700 7200
Wire Wire Line
	5700 7200 6050 7200
Wire Wire Line
	5700 8500 5700 9700
Wire Wire Line
	5700 9700 6050 9700
Wire Wire Line
	5750 1050 5750 2100
Wire Wire Line
	5750 2100 6050 2100
Wire Wire Line
	5750 3550 5750 4600
Wire Wire Line
	5750 4600 6050 4600
Wire Wire Line
	5750 6050 5750 7100
Wire Wire Line
	5750 7100 6050 7100
Wire Wire Line
	5750 8550 5750 9600
Wire Wire Line
	5750 9600 6050 9600
Wire Wire Line
	5800 1100 5800 2000
Wire Wire Line
	5800 2000 6050 2000
Wire Wire Line
	5800 3600 5800 4500
Wire Wire Line
	5800 4500 6050 4500
Wire Wire Line
	5800 6100 5800 7000
Wire Wire Line
	5800 7000 6050 7000
Wire Wire Line
	5800 8600 5800 9500
Wire Wire Line
	5800 9500 6050 9500
Wire Wire Line
	5850 1150 5850 1900
Wire Wire Line
	5850 1900 6050 1900
Wire Wire Line
	5850 3650 5850 4400
Wire Wire Line
	5850 4400 6050 4400
Wire Wire Line
	5850 6150 5850 6900
Wire Wire Line
	5850 6900 6050 6900
Wire Wire Line
	5850 8650 5850 9400
Wire Wire Line
	5850 9400 6050 9400
Wire Wire Line
	5900 1200 5900 1800
Wire Wire Line
	5900 1800 6050 1800
Wire Wire Line
	5900 3700 5900 4300
Wire Wire Line
	5900 4300 6050 4300
Wire Wire Line
	5900 6200 5900 6800
Wire Wire Line
	5900 6800 6050 6800
Wire Wire Line
	5900 8700 5900 9300
Wire Wire Line
	5900 9300 6050 9300
Wire Wire Line
	5950 1250 5950 1700
Wire Wire Line
	5950 1700 6050 1700
Wire Wire Line
	5950 3750 5950 4200
Wire Wire Line
	5950 4200 6050 4200
Wire Wire Line
	5950 6250 5950 6700
Wire Wire Line
	5950 6700 6050 6700
Wire Wire Line
	5950 8750 5950 9200
Wire Wire Line
	5950 9200 6050 9200
Wire Wire Line
	7050 1600 7150 1600
Wire Wire Line
	7050 1700 7200 1700
Wire Wire Line
	7050 1800 7250 1800
Wire Wire Line
	7050 1900 7300 1900
Wire Wire Line
	7050 2000 7350 2000
Wire Wire Line
	7050 2100 7400 2100
Wire Wire Line
	7050 2200 7450 2200
Wire Wire Line
	7050 2300 8150 2300
Wire Wire Line
	7050 4100 7150 4100
Wire Wire Line
	7050 4200 7200 4200
Wire Wire Line
	7050 4300 7250 4300
Wire Wire Line
	7050 4400 7300 4400
Wire Wire Line
	7050 4500 7350 4500
Wire Wire Line
	7050 4600 7400 4600
Wire Wire Line
	7050 4700 7450 4700
Wire Wire Line
	7050 4800 8150 4800
Wire Wire Line
	7050 6600 7150 6600
Wire Wire Line
	7050 6700 7200 6700
Wire Wire Line
	7050 6800 7250 6800
Wire Wire Line
	7050 6900 7300 6900
Wire Wire Line
	7050 7000 7350 7000
Wire Wire Line
	7050 7100 7400 7100
Wire Wire Line
	7050 7200 7450 7200
Wire Wire Line
	7050 7300 8150 7300
Wire Wire Line
	7050 9100 7150 9100
Wire Wire Line
	7050 9200 7200 9200
Wire Wire Line
	7050 9300 7250 9300
Wire Wire Line
	7050 9400 7300 9400
Wire Wire Line
	7050 9500 7350 9500
Wire Wire Line
	7050 9600 7400 9600
Wire Wire Line
	7050 9700 7450 9700
Wire Wire Line
	7050 9800 8150 9800
Wire Wire Line
	7150 1250 5950 1250
Wire Wire Line
	7150 1600 7150 1250
Wire Wire Line
	7150 1600 8150 1600
Wire Wire Line
	7150 3750 5950 3750
Wire Wire Line
	7150 4100 7150 3750
Wire Wire Line
	7150 4100 8150 4100
Wire Wire Line
	7150 6250 5950 6250
Wire Wire Line
	7150 6600 7150 6250
Wire Wire Line
	7150 6600 8150 6600
Wire Wire Line
	7150 8750 5950 8750
Wire Wire Line
	7150 9100 7150 8750
Wire Wire Line
	7150 9100 8150 9100
Wire Wire Line
	7200 1200 5900 1200
Wire Wire Line
	7200 1700 7200 1200
Wire Wire Line
	7200 1700 8150 1700
Wire Wire Line
	7200 3700 5900 3700
Wire Wire Line
	7200 4200 7200 3700
Wire Wire Line
	7200 4200 8150 4200
Wire Wire Line
	7200 6200 5900 6200
Wire Wire Line
	7200 6700 7200 6200
Wire Wire Line
	7200 6700 8150 6700
Wire Wire Line
	7200 8700 5900 8700
Wire Wire Line
	7200 9200 7200 8700
Wire Wire Line
	7200 9200 8150 9200
Wire Wire Line
	7250 1150 5850 1150
Wire Wire Line
	7250 1800 7250 1150
Wire Wire Line
	7250 1800 8150 1800
Wire Wire Line
	7250 3650 5850 3650
Wire Wire Line
	7250 4300 7250 3650
Wire Wire Line
	7250 4300 8150 4300
Wire Wire Line
	7250 6150 5850 6150
Wire Wire Line
	7250 6800 7250 6150
Wire Wire Line
	7250 6800 8150 6800
Wire Wire Line
	7250 8650 5850 8650
Wire Wire Line
	7250 9300 7250 8650
Wire Wire Line
	7250 9300 8150 9300
Wire Wire Line
	7300 1100 5800 1100
Wire Wire Line
	7300 1900 7300 1100
Wire Wire Line
	7300 1900 8150 1900
Wire Wire Line
	7300 3600 5800 3600
Wire Wire Line
	7300 4400 7300 3600
Wire Wire Line
	7300 4400 8150 4400
Wire Wire Line
	7300 6100 5800 6100
Wire Wire Line
	7300 6900 7300 6100
Wire Wire Line
	7300 6900 8150 6900
Wire Wire Line
	7300 8600 5800 8600
Wire Wire Line
	7300 9400 7300 8600
Wire Wire Line
	7300 9400 8150 9400
Wire Wire Line
	7350 1050 5750 1050
Wire Wire Line
	7350 2000 7350 1050
Wire Wire Line
	7350 2000 8150 2000
Wire Wire Line
	7350 3550 5750 3550
Wire Wire Line
	7350 4500 7350 3550
Wire Wire Line
	7350 4500 8150 4500
Wire Wire Line
	7350 6050 5750 6050
Wire Wire Line
	7350 7000 7350 6050
Wire Wire Line
	7350 7000 8150 7000
Wire Wire Line
	7350 8550 5750 8550
Wire Wire Line
	7350 9500 7350 8550
Wire Wire Line
	7350 9500 8150 9500
Wire Wire Line
	7400 1000 5700 1000
Wire Wire Line
	7400 2100 7400 1000
Wire Wire Line
	7400 2100 8150 2100
Wire Wire Line
	7400 3500 5700 3500
Wire Wire Line
	7400 4600 7400 3500
Wire Wire Line
	7400 4600 8150 4600
Wire Wire Line
	7400 6000 5700 6000
Wire Wire Line
	7400 7100 7400 6000
Wire Wire Line
	7400 7100 8150 7100
Wire Wire Line
	7400 8500 5700 8500
Wire Wire Line
	7400 9600 7400 8500
Wire Wire Line
	7400 9600 8150 9600
Wire Wire Line
	7450 950  5650 950 
Wire Wire Line
	7450 2200 7450 950 
Wire Wire Line
	7450 2200 8150 2200
Wire Wire Line
	7450 3450 5650 3450
Wire Wire Line
	7450 4700 7450 3450
Wire Wire Line
	7450 4700 8150 4700
Wire Wire Line
	7450 5950 5650 5950
Wire Wire Line
	7450 7200 7450 5950
Wire Wire Line
	7450 7200 8150 7200
Wire Wire Line
	7450 8450 5650 8450
Wire Wire Line
	7450 9700 7450 8450
Wire Wire Line
	7450 9700 8150 9700
Wire Wire Line
	7650 2500 7650 5000
Wire Wire Line
	7650 5000 7650 7500
Wire Wire Line
	7650 7500 7650 10000
Wire Wire Line
	7650 10000 7650 11400
Wire Wire Line
	7750 2600 7750 5100
Wire Wire Line
	7750 5100 7750 7600
Wire Wire Line
	7750 7600 7750 10100
Wire Wire Line
	7750 10100 7750 11900
Wire Wire Line
	7850 2700 7850 5200
Wire Wire Line
	7850 5200 7850 7700
Wire Wire Line
	7850 7700 7850 10200
Wire Wire Line
	7850 10200 7850 12400
Wire Wire Line
	8050 2900 8050 5400
Wire Wire Line
	8050 2900 8150 2900
Wire Wire Line
	8050 5400 8050 7900
Wire Wire Line
	8050 5400 8150 5400
Wire Wire Line
	8050 7900 8050 10400
Wire Wire Line
	8050 7900 8150 7900
Wire Wire Line
	8050 10400 8050 13400
Wire Wire Line
	8050 10400 8150 10400
Wire Wire Line
	8150 2500 7650 2500
Wire Wire Line
	8150 2600 7750 2600
Wire Wire Line
	8150 2700 7850 2700
Wire Wire Line
	8150 5000 7650 5000
Wire Wire Line
	8150 5100 7750 5100
Wire Wire Line
	8150 5200 7850 5200
Wire Wire Line
	8150 7500 7650 7500
Wire Wire Line
	8150 7600 7750 7600
Wire Wire Line
	8150 7700 7850 7700
Wire Wire Line
	8150 10000 7650 10000
Wire Wire Line
	8150 10100 7750 10100
Wire Wire Line
	8150 10200 7850 10200
Wire Wire Line
	9250 900  9250 2000
Wire Wire Line
	9250 2000 9150 2000
Wire Wire Line
	9250 2000 10800 2000
Wire Wire Line
	9250 3400 9250 4500
Wire Wire Line
	9250 4500 9150 4500
Wire Wire Line
	9250 4500 9800 4500
Wire Wire Line
	9250 5900 9250 7000
Wire Wire Line
	9250 7000 9150 7000
Wire Wire Line
	9250 7000 9900 7000
Wire Wire Line
	9250 8400 9250 9500
Wire Wire Line
	9250 9500 9150 9500
Wire Wire Line
	9250 9500 10000 9500
Wire Wire Line
	9800 2100 10800 2100
Wire Wire Line
	9800 4500 9800 2100
Wire Wire Line
	9900 2200 10800 2200
Wire Wire Line
	9900 7000 9900 2200
Wire Wire Line
	10000 2300 10800 2300
Wire Wire Line
	10000 9500 10000 2300
Wire Bus Line
	1700 11150 1600 11150
Text Label 1900 11400 0    50   ~ 0
XS0
Text Label 1900 11900 0    50   ~ 0
XS1
Text Label 1900 12400 0    50   ~ 0
XS2
Text Label 1900 12900 0    50   ~ 0
XS3
Text HLabel 950  1600 0    50   Input ~ 0
A
Text HLabel 950  4100 0    50   Input ~ 0
B
Text HLabel 950  6600 0    50   Input ~ 0
C
Text HLabel 950  9100 0    50   Input ~ 0
D
Text HLabel 950  10700 0    50   Input ~ 0
~CLK8M
Text HLabel 950  10800 0    50   Input ~ 0
~RESET
Text HLabel 1600 11150 0    50   Input ~ 0
XS[0..3]
Text HLabel 10800 2000 2    50   Output ~ 0
GFX-A
Text HLabel 10800 2100 2    50   Output ~ 0
GFX-B
Text HLabel 10800 2200 2    50   Output ~ 0
GFX-C
Text HLabel 10800 2300 2    50   Output ~ 0
GFX-D
$Comp
L A5C:BUF12 UAV?
U 1 1 5FD84790
P 3150 11400
AR Path="/60BA673A/5FD84790" Ref="UAV?"  Part="1" 
AR Path="/5FB6D140/5FD84790" Ref="UAV?"  Part="1" 
AR Path="/5FD021E1/5FD84790" Ref="UAV294"  Part="1" 
AR Path="/5FBBD4DB/5FBBDC0B/5FD84790" Ref="UAV294"  Part="1" 
F 0 "UAV294" H 3150 11717 50  0000 C CNN
F 1 "BUF12" H 3150 11626 50  0000 C CNN
F 2 "" H 3150 11400 50  0001 C CNN
F 3 "" H 3150 11400 50  0001 C CNN
	1    3150 11400
	1    0    0    -1  
$EndComp
$Comp
L A5C:BUF12 UAV?
U 1 1 5FD84796
P 3150 11900
AR Path="/60BA673A/5FD84796" Ref="UAV?"  Part="1" 
AR Path="/5FB6D140/5FD84796" Ref="UAV?"  Part="1" 
AR Path="/5FD021E1/5FD84796" Ref="UAV298"  Part="1" 
AR Path="/5FBBD4DB/5FBBDC0B/5FD84796" Ref="UAV298"  Part="1" 
F 0 "UAV298" H 3150 12217 50  0000 C CNN
F 1 "BUF12" H 3150 12126 50  0000 C CNN
F 2 "" H 3150 11900 50  0001 C CNN
F 3 "" H 3150 11900 50  0001 C CNN
	1    3150 11900
	1    0    0    -1  
$EndComp
$Comp
L A5C:BUF12 UAV?
U 1 1 5FD8479C
P 3150 12400
AR Path="/60BA673A/5FD8479C" Ref="UAV?"  Part="1" 
AR Path="/5FB6D140/5FD8479C" Ref="UAV?"  Part="1" 
AR Path="/5FD021E1/5FD8479C" Ref="UAV303"  Part="1" 
AR Path="/5FBBD4DB/5FBBDC0B/5FD8479C" Ref="UAV303"  Part="1" 
F 0 "UAV303" H 3150 12717 50  0000 C CNN
F 1 "BUF12" H 3150 12626 50  0000 C CNN
F 2 "" H 3150 12400 50  0001 C CNN
F 3 "" H 3150 12400 50  0001 C CNN
	1    3150 12400
	1    0    0    -1  
$EndComp
$Comp
L A5C:BUF12 UAV?
U 1 1 5FD84848
P 3150 12900
AR Path="/60BA673A/5FD84848" Ref="UAV?"  Part="1" 
AR Path="/5FB6D140/5FD84848" Ref="UAV?"  Part="1" 
AR Path="/5FD021E1/5FD84848" Ref="UAV306"  Part="1" 
AR Path="/5FBBD4DB/5FBBDC0B/5FD84848" Ref="UAV306"  Part="1" 
F 0 "UAV306" H 3150 13217 50  0000 C CNN
F 1 "BUF12" H 3150 13126 50  0000 C CNN
F 2 "" H 3150 12900 50  0001 C CNN
F 3 "" H 3150 12900 50  0001 C CNN
	1    3150 12900
	1    0    0    -1  
$EndComp
$Comp
L A5C:NBUF02 UAK?
U 1 1 5FD84857
P 3150 13400
AR Path="/5FB6D140/5FD84857" Ref="UAK?"  Part="1" 
AR Path="/5FD021E1/5FD84857" Ref="UAV308"  Part="1" 
AR Path="/5FBBD4DB/5FBBDC0B/5FD84857" Ref="UAV308"  Part="1" 
F 0 "UAV308" H 3150 13717 50  0000 C CNN
F 1 "NBUF02" H 3150 13626 50  0000 C CNN
F 2 "" H 3150 13200 50  0001 C CNN
F 3 "" H 3150 13200 50  0001 C CNN
	1    3150 13400
	1    0    0    -1  
$EndComp
$Comp
L A5C:M273C UAR?
U 1 1 5FD847EA
P 2300 2100
AR Path="/60BA673A/5FD847EA" Ref="UAR?"  Part="1" 
AR Path="/5FB6D140/5FD847EA" Ref="UAR?"  Part="1" 
AR Path="/5FD021E1/5FD847EA" Ref="UAR246"  Part="1" 
AR Path="/5FBBD4DB/5FBBDC0B/5FD847EA" Ref="UAR246"  Part="1" 
F 0 "UAR246" H 2300 2867 50  0000 C CNN
F 1 "M273C" H 2300 2776 50  0000 C CNN
F 2 "" H 2300 2100 50  0001 C CNN
F 3 "" H 2300 2100 50  0001 C CNN
	1    2300 2100
	1    0    0    -1  
$EndComp
$Comp
L A5C:M273C UAS?
U 1 1 5FD847F0
P 2300 4600
AR Path="/60BA673A/5FD847F0" Ref="UAS?"  Part="1" 
AR Path="/5FB6D140/5FD847F0" Ref="UAS?"  Part="1" 
AR Path="/5FD021E1/5FD847F0" Ref="UAS207"  Part="1" 
AR Path="/5FBBD4DB/5FBBDC0B/5FD847F0" Ref="UAS207"  Part="1" 
F 0 "UAS207" H 2300 5367 50  0000 C CNN
F 1 "M273C" H 2300 5276 50  0000 C CNN
F 2 "" H 2300 4600 50  0001 C CNN
F 3 "" H 2300 4600 50  0001 C CNN
	1    2300 4600
	1    0    0    -1  
$EndComp
$Comp
L A5C:M273C UAV?
U 1 1 5FD847F6
P 2300 7100
AR Path="/60BA673A/5FD847F6" Ref="UAV?"  Part="1" 
AR Path="/5FB6D140/5FD847F6" Ref="UAV?"  Part="1" 
AR Path="/5FD021E1/5FD847F6" Ref="UAV246"  Part="1" 
AR Path="/5FBBD4DB/5FBBDC0B/5FD847F6" Ref="UAV246"  Part="1" 
F 0 "UAV246" H 2300 7867 50  0000 C CNN
F 1 "M273C" H 2300 7776 50  0000 C CNN
F 2 "" H 2300 7100 50  0001 C CNN
F 3 "" H 2300 7100 50  0001 C CNN
	1    2300 7100
	1    0    0    -1  
$EndComp
$Comp
L A5C:M273C UAX?
U 1 1 5FD847FC
P 2300 9600
AR Path="/60BA673A/5FD847FC" Ref="UAX?"  Part="1" 
AR Path="/5FB6D140/5FD847FC" Ref="UAX?"  Part="1" 
AR Path="/5FD021E1/5FD847FC" Ref="UAX207"  Part="1" 
AR Path="/5FBBD4DB/5FBBDC0B/5FD847FC" Ref="UAX207"  Part="1" 
F 0 "UAX207" H 2300 10367 50  0000 C CNN
F 1 "M273C" H 2300 10276 50  0000 C CNN
F 2 "" H 2300 9600 50  0001 C CNN
F 3 "" H 2300 9600 50  0001 C CNN
	1    2300 9600
	1    0    0    -1  
$EndComp
$Comp
L A5C:M273C UAT?
U 1 1 5FD84802
P 6550 2100
AR Path="/60BA673A/5FD84802" Ref="UAT?"  Part="1" 
AR Path="/5FB6D140/5FD84802" Ref="UAT?"  Part="1" 
AR Path="/5FD021E1/5FD84802" Ref="UAT246"  Part="1" 
AR Path="/5FBBD4DB/5FBBDC0B/5FD84802" Ref="UAT246"  Part="1" 
F 0 "UAT246" H 6550 2867 50  0000 C CNN
F 1 "M273C" H 6550 2776 50  0000 C CNN
F 2 "" H 6550 2100 50  0001 C CNN
F 3 "" H 6550 2100 50  0001 C CNN
	1    6550 2100
	1    0    0    -1  
$EndComp
$Comp
L A5C:M273C UAU?
U 1 1 5FD84808
P 6550 4600
AR Path="/60BA673A/5FD84808" Ref="UAU?"  Part="1" 
AR Path="/5FB6D140/5FD84808" Ref="UAU?"  Part="1" 
AR Path="/5FD021E1/5FD84808" Ref="UAU207"  Part="1" 
AR Path="/5FBBD4DB/5FBBDC0B/5FD84808" Ref="UAU207"  Part="1" 
F 0 "UAU207" H 6550 5367 50  0000 C CNN
F 1 "M273C" H 6550 5276 50  0000 C CNN
F 2 "" H 6550 4600 50  0001 C CNN
F 3 "" H 6550 4600 50  0001 C CNN
	1    6550 4600
	1    0    0    -1  
$EndComp
$Comp
L A5C:M273C UAY?
U 1 1 5FD8480E
P 6550 7100
AR Path="/60BA673A/5FD8480E" Ref="UAY?"  Part="1" 
AR Path="/5FB6D140/5FD8480E" Ref="UAY?"  Part="1" 
AR Path="/5FD021E1/5FD8480E" Ref="UAY246"  Part="1" 
AR Path="/5FBBD4DB/5FBBDC0B/5FD8480E" Ref="UAY246"  Part="1" 
F 0 "UAY246" H 6550 7867 50  0000 C CNN
F 1 "M273C" H 6550 7776 50  0000 C CNN
F 2 "" H 6550 7100 50  0001 C CNN
F 3 "" H 6550 7100 50  0001 C CNN
	1    6550 7100
	1    0    0    -1  
$EndComp
$Comp
L A5C:M273C UAZ?
U 1 1 5FD84814
P 6550 9600
AR Path="/60BA673A/5FD84814" Ref="UAZ?"  Part="1" 
AR Path="/5FB6D140/5FD84814" Ref="UAZ?"  Part="1" 
AR Path="/5FD021E1/5FD84814" Ref="UAZ207"  Part="1" 
AR Path="/5FBBD4DB/5FBBDC0B/5FD84814" Ref="UAZ207"  Part="1" 
F 0 "UAZ207" H 6550 10367 50  0000 C CNN
F 1 "M273C" H 6550 10276 50  0000 C CNN
F 2 "" H 6550 9600 50  0001 C CNN
F 3 "" H 6550 9600 50  0001 C CNN
	1    6550 9600
	1    0    0    -1  
$EndComp
$Comp
L A5C:MUX8GLH UAV?
U 1 1 5FD84900
P 4400 2200
AR Path="/60BA673A/5FD84900" Ref="UAV?"  Part="1" 
AR Path="/5FB6D140/5FD84900" Ref="UAV?"  Part="1" 
AR Path="/5FD021E1/5FD84900" Ref="UAS247"  Part="1" 
AR Path="/5FBBD4DB/5FBBDC0B/5FD84900" Ref="UAS247"  Part="1" 
F 0 "UAS247" H 4400 3067 50  0000 C CNN
F 1 "MUX8GLH" H 4400 2976 50  0000 C CNN
F 2 "" H 4400 2200 50  0001 C CNN
F 3 "" H 4400 2200 50  0001 C CNN
	1    4400 2200
	1    0    0    -1  
$EndComp
$Comp
L A5C:MUX8GLH UAV?
U 1 1 5FD848D1
P 4400 4700
AR Path="/60BA673A/5FD848D1" Ref="UAV?"  Part="1" 
AR Path="/5FB6D140/5FD848D1" Ref="UAV?"  Part="1" 
AR Path="/5FD021E1/5FD848D1" Ref="UAR208"  Part="1" 
AR Path="/5FBBD4DB/5FBBDC0B/5FD848D1" Ref="UAR208"  Part="1" 
F 0 "UAR208" H 4400 5567 50  0000 C CNN
F 1 "MUX8GLH" H 4400 5476 50  0000 C CNN
F 2 "" H 4400 4700 50  0001 C CNN
F 3 "" H 4400 4700 50  0001 C CNN
	1    4400 4700
	1    0    0    -1  
$EndComp
$Comp
L A5C:MUX8GLH UAV?
U 1 1 5FD848A7
P 4400 7200
AR Path="/60BA673A/5FD848A7" Ref="UAV?"  Part="1" 
AR Path="/5FB6D140/5FD848A7" Ref="UAV?"  Part="1" 
AR Path="/5FD021E1/5FD848A7" Ref="UAX247"  Part="1" 
AR Path="/5FBBD4DB/5FBBDC0B/5FD848A7" Ref="UAX247"  Part="1" 
F 0 "UAX247" H 4400 8067 50  0000 C CNN
F 1 "MUX8GLH" H 4400 7976 50  0000 C CNN
F 2 "" H 4400 7200 50  0001 C CNN
F 3 "" H 4400 7200 50  0001 C CNN
	1    4400 7200
	1    0    0    -1  
$EndComp
$Comp
L A5C:MUX8GLH UAZ?
U 1 1 5FD84878
P 4400 9700
AR Path="/60BA673A/5FD84878" Ref="UAZ?"  Part="1" 
AR Path="/5FB6D140/5FD84878" Ref="UAZ?"  Part="1" 
AR Path="/5FD021E1/5FD84878" Ref="UAV208"  Part="1" 
AR Path="/5FBBD4DB/5FBBDC0B/5FD84878" Ref="UAV208"  Part="1" 
F 0 "UAV208" H 4400 10567 50  0000 C CNN
F 1 "MUX8GLH" H 4400 10476 50  0000 C CNN
F 2 "" H 4400 9700 50  0001 C CNN
F 3 "" H 4400 9700 50  0001 C CNN
	1    4400 9700
	1    0    0    -1  
$EndComp
$Comp
L A5C:MUX8GLH UAU?
U 1 1 5FD8481A
P 8650 2200
AR Path="/60BA673A/5FD8481A" Ref="UAU?"  Part="1" 
AR Path="/5FB6D140/5FD8481A" Ref="UAU?"  Part="1" 
AR Path="/5FD021E1/5FD8481A" Ref="UAU247"  Part="1" 
AR Path="/5FBBD4DB/5FBBDC0B/5FD8481A" Ref="UAU247"  Part="1" 
F 0 "UAU247" H 8650 3067 50  0000 C CNN
F 1 "MUX8GLH" H 8650 2976 50  0000 C CNN
F 2 "" H 8650 2200 50  0001 C CNN
F 3 "" H 8650 2200 50  0001 C CNN
	1    8650 2200
	1    0    0    -1  
$EndComp
$Comp
L A5C:MUX8GLH UAT?
U 1 1 5FD84820
P 8650 4700
AR Path="/60BA673A/5FD84820" Ref="UAT?"  Part="1" 
AR Path="/5FB6D140/5FD84820" Ref="UAT?"  Part="1" 
AR Path="/5FD021E1/5FD84820" Ref="UAT208"  Part="1" 
AR Path="/5FBBD4DB/5FBBDC0B/5FD84820" Ref="UAT208"  Part="1" 
F 0 "UAT208" H 8650 5567 50  0000 C CNN
F 1 "MUX8GLH" H 8650 5476 50  0000 C CNN
F 2 "" H 8650 4700 50  0001 C CNN
F 3 "" H 8650 4700 50  0001 C CNN
	1    8650 4700
	1    0    0    -1  
$EndComp
$Comp
L A5C:MUX8GLH UAZ?
U 1 1 5FD84826
P 8650 7200
AR Path="/60BA673A/5FD84826" Ref="UAZ?"  Part="1" 
AR Path="/5FB6D140/5FD84826" Ref="UAZ?"  Part="1" 
AR Path="/5FD021E1/5FD84826" Ref="UAZ247"  Part="1" 
AR Path="/5FBBD4DB/5FBBDC0B/5FD84826" Ref="UAZ247"  Part="1" 
F 0 "UAZ247" H 8650 8067 50  0000 C CNN
F 1 "MUX8GLH" H 8650 7976 50  0000 C CNN
F 2 "" H 8650 7200 50  0001 C CNN
F 3 "" H 8650 7200 50  0001 C CNN
	1    8650 7200
	1    0    0    -1  
$EndComp
$Comp
L A5C:MUX8GLH UAY?
U 1 1 5FD8482C
P 8650 9700
AR Path="/60BA673A/5FD8482C" Ref="UAY?"  Part="1" 
AR Path="/5FB6D140/5FD8482C" Ref="UAY?"  Part="1" 
AR Path="/5FD021E1/5FD8482C" Ref="UAY208"  Part="1" 
AR Path="/5FBBD4DB/5FBBDC0B/5FD8482C" Ref="UAY208"  Part="1" 
F 0 "UAY208" H 8650 10567 50  0000 C CNN
F 1 "MUX8GLH" H 8650 10476 50  0000 C CNN
F 2 "" H 8650 9700 50  0001 C CNN
F 3 "" H 8650 9700 50  0001 C CNN
	1    8650 9700
	1    0    0    -1  
$EndComp
NoConn ~ 4900 9400
NoConn ~ 9150 9400
NoConn ~ 9150 6900
NoConn ~ 4900 6900
NoConn ~ 4900 4400
NoConn ~ 9150 4400
NoConn ~ 9150 1900
NoConn ~ 4900 1900
Wire Bus Line
	1700 11150 1700 12800
$EndSCHEMATC
