EESchema Schematic File Version 4
EELAYER 30 0
EELAYER END
$Descr A4 11693 8268
encoding utf-8
Sheet 20 83
Title "CPS Reverse Engineering: DL-0311"
Date "2021-09-12"
Rev ""
Comp ""
Comment1 ""
Comment2 ""
Comment3 "Licence: CC-BY"
Comment4 "Author: Loïc *WydD* Petit"
$EndDescr
Connection ~ 9350 1250
Connection ~ 9350 5800
Connection ~ 9350 3950
Connection ~ 9350 2400
Connection ~ 3650 4900
Connection ~ 5350 5150
Connection ~ 8650 2500
Connection ~ 8650 4150
Connection ~ 8650 5900
Connection ~ 5350 6350
Connection ~ 1100 4850
Connection ~ 3400 5450
Connection ~ 3300 4900
Connection ~ 3850 4550
Connection ~ 2500 5400
Connection ~ 2450 4300
NoConn ~ 9250 1150
NoConn ~ 5950 4950
NoConn ~ 9250 5700
NoConn ~ 9250 2300
NoConn ~ 5950 1550
NoConn ~ 9250 4050
Entry Wire Line
	1500 2250 1600 2350
Entry Wire Line
	1500 2350 1600 2450
Entry Wire Line
	1500 2450 1600 2550
Entry Wire Line
	1500 2550 1600 2650
Entry Wire Line
	9950 2400 10050 2300
Entry Wire Line
	9950 5800 10050 5700
Entry Wire Line
	10200 1250 10300 1150
Entry Wire Line
	10200 3950 10300 3850
Wire Wire Line
	1000 4850 1100 4850
Wire Wire Line
	1100 4850 2500 4850
Wire Wire Line
	1100 5900 1100 4850
Wire Wire Line
	1600 2350 2200 2350
Wire Wire Line
	1600 2450 2200 2450
Wire Wire Line
	1600 2550 2200 2550
Wire Wire Line
	1600 2650 2200 2650
Wire Wire Line
	1900 5900 1100 5900
Wire Wire Line
	2450 4300 2350 4300
Wire Wire Line
	2450 4550 2450 4300
Wire Wire Line
	2450 4550 3850 4550
Wire Wire Line
	2500 4950 2500 5400
Wire Wire Line
	2500 5500 2500 5900
Wire Wire Line
	3050 4300 3750 4300
Wire Wire Line
	3050 4900 3300 4900
Wire Wire Line
	3050 5450 3400 5450
Wire Wire Line
	3300 1650 3300 4900
Wire Wire Line
	3300 4900 3650 4900
Wire Wire Line
	3400 2050 3400 5450
Wire Wire Line
	3400 2050 7600 2050
Wire Wire Line
	3400 5450 7600 5450
Wire Wire Line
	3650 4900 4350 4900
Wire Wire Line
	3650 5200 3650 4900
Wire Wire Line
	3650 5200 4350 5200
Wire Wire Line
	3750 4300 3750 4800
Wire Wire Line
	3750 4800 4350 4800
Wire Wire Line
	3850 1550 3850 4550
Wire Wire Line
	3850 4550 3850 5100
Wire Wire Line
	3850 5100 4350 5100
Wire Wire Line
	4700 1550 3850 1550
Wire Wire Line
	4700 1650 3300 1650
Wire Wire Line
	5250 6350 5350 6350
Wire Wire Line
	5350 5150 5350 1750
Wire Wire Line
	5350 6350 5350 5150
Wire Wire Line
	5450 1550 5250 1550
Wire Wire Line
	5450 1750 5350 1750
Wire Wire Line
	5450 4950 5250 4950
Wire Wire Line
	5450 5150 5350 5150
Wire Wire Line
	5950 1650 6600 1650
Wire Wire Line
	5950 5050 6600 5050
Wire Wire Line
	6600 1950 6600 1650
Wire Wire Line
	6600 5350 6600 5050
Wire Wire Line
	6800 4900 6900 4900
Wire Wire Line
	6800 5050 6800 4900
Wire Wire Line
	7450 3050 7650 3050
Wire Wire Line
	7450 3950 7850 3950
Wire Wire Line
	7450 4850 7650 4850
Wire Wire Line
	7500 1400 7600 1400
Wire Wire Line
	7500 1650 7500 1400
Wire Wire Line
	7500 2550 7500 2800
Wire Wire Line
	7500 2800 9350 2800
Wire Wire Line
	7500 5950 7500 6200
Wire Wire Line
	7500 6200 9350 6200
Wire Wire Line
	7550 3500 7450 3500
Wire Wire Line
	7550 3850 7550 3500
Wire Wire Line
	7550 4050 7550 4400
Wire Wire Line
	7550 4400 7450 4400
Wire Wire Line
	7600 1500 6850 1500
Wire Wire Line
	7600 1950 6600 1950
Wire Wire Line
	7600 2550 7500 2550
Wire Wire Line
	7600 2650 7000 2650
Wire Wire Line
	7600 5350 6600 5350
Wire Wire Line
	7600 5950 7500 5950
Wire Wire Line
	7600 6050 7000 6050
Wire Wire Line
	7650 3050 7650 3750
Wire Wire Line
	7650 3750 7850 3750
Wire Wire Line
	7650 4150 7850 4150
Wire Wire Line
	7650 4850 7650 4150
Wire Wire Line
	7850 3850 7550 3850
Wire Wire Line
	7850 4050 7550 4050
Wire Wire Line
	8500 1150 8750 1150
Wire Wire Line
	8500 2300 8750 2300
Wire Wire Line
	8500 3950 8750 3950
Wire Wire Line
	8500 5700 8750 5700
Wire Wire Line
	8650 1350 8650 2500
Wire Wire Line
	8650 2500 8650 4150
Wire Wire Line
	8650 4150 8650 5900
Wire Wire Line
	8650 5900 8650 6350
Wire Wire Line
	8650 6350 5350 6350
Wire Wire Line
	8750 1350 8650 1350
Wire Wire Line
	8750 2500 8650 2500
Wire Wire Line
	8750 4150 8650 4150
Wire Wire Line
	8750 5900 8650 5900
Wire Wire Line
	9250 2400 9350 2400
Wire Wire Line
	9250 3950 9350 3950
Wire Wire Line
	9250 5800 9350 5800
Wire Wire Line
	9350 1250 9250 1250
Wire Wire Line
	9350 1250 9350 1650
Wire Wire Line
	9350 1250 10200 1250
Wire Wire Line
	9350 1650 7500 1650
Wire Wire Line
	9350 2400 9350 2800
Wire Wire Line
	9350 2400 9950 2400
Wire Wire Line
	9350 3950 9350 5050
Wire Wire Line
	9350 3950 10200 3950
Wire Wire Line
	9350 5050 6800 5050
Wire Wire Line
	9350 5800 9350 6200
Wire Wire Line
	9350 5800 9950 5800
Wire Bus Line
	1500 2100 1400 2100
Wire Bus Line
	1500 2100 1500 2550
Wire Bus Line
	10050 800  10050 5700
Wire Bus Line
	10050 800  10500 800 
Wire Bus Line
	10300 950  10300 3850
Wire Bus Line
	10300 950  10500 950 
Text Notes 9450 2300 0    50   ~ 0
~GFX-CHNL
Text Notes 9450 3850 0    50   ~ 0
GFX-CHNL
Text Notes 9450 5700 0    50   ~ 0
~GFX-CHNL
Text Notes 9500 1050 0    50   ~ 0
GFX-CHNL
Text Label 1650 2350 0    50   ~ 0
GFX-ADDR16
Text Label 1650 2450 0    50   ~ 0
GFX-ADDR17
Text Label 1650 2550 0    50   ~ 0
GFX-ADDR18
Text Label 1650 2650 0    50   ~ 0
GFX-ADDR19
Text Label 4350 4700 2    50   ~ 0
GFX-ADDR19
Text Label 4350 5000 2    50   ~ 0
GFX-ADDR17
Text Label 4700 1450 2    50   ~ 0
GFX-ADDR18
Text Label 6850 1500 0    50   ~ 0
~GFX-CHNL
Text Label 6900 3000 2    50   ~ 0
GFX-ADDR19
Text Label 6900 3450 2    50   ~ 0
GFX-ADDR18
Text Label 6900 3900 2    50   ~ 0
GFX-ADDR17
Text Label 6900 4350 2    50   ~ 0
GFX-ADDR16
Text Label 6900 4800 2    50   ~ 0
~GFX-CHNL
Text Label 7000 2650 0    50   ~ 0
~GFX-CHNL
Text Label 7000 6050 0    50   ~ 0
~GFX-CHNL
Text Label 7600 800  2    50   ~ 0
GFX-ADDR19
Text Label 7600 900  2    50   ~ 0
ELSE.GFX-CHNL
Text Label 7600 1000 2    50   ~ 0
GFX-ADDR18
Text Label 7600 1100 2    50   ~ 0
STARS.GFX-CHNL
Text Label 7600 1200 2    50   ~ 0
GFX-ADDR17
Text Label 7600 1300 2    50   ~ 0
SCROLL3.GFX-CHNL
Text Label 7600 2150 2    50   ~ 0
GFX-ADDR19
Text Label 7600 2250 2    50   ~ 0
ELSE.GFX-CHNL
Text Label 7600 2350 2    50   ~ 0
GFX-ADDR17
Text Label 7600 2450 2    50   ~ 0
SCROLL3.GFX-CHNL
Text Label 7600 5550 2    50   ~ 0
GFX-ADDR18
Text Label 7600 5650 2    50   ~ 0
ELSE.GFX-CHNL
Text Label 7600 5750 2    50   ~ 0
GFX-ADDR16
Text Label 7600 5850 2    50   ~ 0
SCROLL3.GFX-CHNL
Text Label 9450 1250 0    50   ~ 0
B-ROMA19
Text Label 9450 2400 0    50   ~ 0
A-ROMA19
Text Label 9450 3950 0    50   ~ 0
B-ROMA18
Text Label 9450 5800 0    50   ~ 0
A-ROMA18
Text HLabel 1000 4850 0    50   Input ~ 0
~GFX-CHNL
Text HLabel 1400 2100 0    50   Input ~ 0
GFX-ADDR[16..19]
Text HLabel 1900 5400 0    50   Input ~ 0
~SCROLL1-STARS
Text HLabel 2350 4300 0    50   Input ~ 0
SCROLL3-STARS
Text HLabel 5250 6350 0    50   Input ~ 0
~CLK4M
Text HLabel 6900 3100 0    50   Input ~ 0
SCROLL1.GFX-CHNL
Text HLabel 6900 3550 0    50   Input ~ 0
ELSE.GFX-CHNL
Text HLabel 6900 4000 0    50   Input ~ 0
STARS.GFX-CHNL
Text HLabel 6900 4450 0    50   Input ~ 0
SCROLL3.GFX-CHNL
Text HLabel 10500 800  2    50   Output ~ 0
A-ROMA[18..19]
Text HLabel 10500 950  2    50   Output ~ 0
B-ROMA[18..19]
$Comp
L A5C:AND02 UEF178
U 1 1 6604FD48
P 2750 4900
F 0 "UEF178" H 2775 5167 50  0000 C CNN
F 1 "AND02" H 2775 5076 50  0000 C CNN
F 2 "" H 2750 4900 50  0001 C CNN
F 3 "" H 2750 4900 50  0001 C CNN
	1    2750 4900
	1    0    0    -1  
$EndComp
$Comp
L A5C:AND02 UEF183
U 1 1 6604FD4E
P 2750 5450
F 0 "UEF183" H 2775 5717 50  0000 C CNN
F 1 "AND02" H 2775 5626 50  0000 C CNN
F 2 "" H 2750 5450 50  0001 C CNN
F 3 "" H 2750 5450 50  0001 C CNN
	1    2750 5450
	1    0    0    -1  
$EndComp
$Comp
L A5C:NAND02 UEC154
U 1 1 6604FC11
P 7150 3050
F 0 "UEC154" H 7175 3317 50  0000 C CNN
F 1 "NAND02" H 7175 3226 50  0000 C CNN
F 2 "" H 7150 3050 50  0001 C CNN
F 3 "" H 7150 3050 50  0001 C CNN
	1    7150 3050
	1    0    0    -1  
$EndComp
$Comp
L A5C:NAND02 UEC159
U 1 1 6604FC17
P 7150 3500
F 0 "UEC159" H 7175 3767 50  0000 C CNN
F 1 "NAND02" H 7175 3676 50  0000 C CNN
F 2 "" H 7150 3500 50  0001 C CNN
F 3 "" H 7150 3500 50  0001 C CNN
	1    7150 3500
	1    0    0    -1  
$EndComp
$Comp
L A5C:NAND02 UEC160
U 1 1 6604FC1D
P 7150 3950
F 0 "UEC160" H 7175 4217 50  0000 C CNN
F 1 "NAND02" H 7175 4126 50  0000 C CNN
F 2 "" H 7150 3950 50  0001 C CNN
F 3 "" H 7150 3950 50  0001 C CNN
	1    7150 3950
	1    0    0    -1  
$EndComp
$Comp
L A5C:NAND02 UEC152
U 1 1 6604FC23
P 7150 4400
F 0 "UEC152" H 7175 4667 50  0000 C CNN
F 1 "NAND02" H 7175 4576 50  0000 C CNN
F 2 "" H 7150 4400 50  0001 C CNN
F 3 "" H 7150 4400 50  0001 C CNN
	1    7150 4400
	1    0    0    -1  
$EndComp
$Comp
L A5C:NAND02 UEC140
U 1 1 6604FC29
P 7150 4850
F 0 "UEC140" H 7175 5117 50  0000 C CNN
F 1 "NAND02" H 7175 5026 50  0000 C CNN
F 2 "" H 7150 4850 50  0001 C CNN
F 3 "" H 7150 4850 50  0001 C CNN
	1    7150 4850
	1    0    0    -1  
$EndComp
$Comp
L A5C:NAND03 UEG184
U 1 1 677B6B31
P 4950 1550
F 0 "UEG184" H 4975 1842 50  0000 C CNN
F 1 "NAND03" H 4975 1751 50  0000 C CNN
F 2 "" H 4950 1550 50  0001 C CNN
F 3 "" H 4950 1550 50  0001 C CNN
	1    4950 1550
	1    0    0    -1  
$EndComp
$Comp
L A5C:INV01 UEF167
U 1 1 6604FD41
P 2200 5400
F 0 "UEF167" H 2200 5717 50  0000 C CNN
F 1 "INV01" H 2200 5626 50  0000 C CNN
F 2 "" H 2200 5200 50  0001 C CNN
F 3 "" H 2200 5200 50  0001 C CNN
	1    2200 5400
	1    0    0    -1  
$EndComp
$Comp
L A5C:INV01 UEF185
U 1 1 6604FD3A
P 2200 5900
F 0 "UEF185" H 2200 6217 50  0000 C CNN
F 1 "INV01" H 2200 6126 50  0000 C CNN
F 2 "" H 2200 5700 50  0001 C CNN
F 3 "" H 2200 5700 50  0001 C CNN
	1    2200 5900
	1    0    0    -1  
$EndComp
$Comp
L A5C:INV01 UEF192
U 1 1 6604FC7B
P 2750 4300
F 0 "UEF192" H 2750 4617 50  0000 C CNN
F 1 "INV01" H 2750 4526 50  0000 C CNN
F 2 "" H 2750 4100 50  0001 C CNN
F 3 "" H 2750 4100 50  0001 C CNN
	1    2750 4300
	1    0    0    -1  
$EndComp
$Comp
L A5C:DFFCOO UEG187
U 1 1 6604FC85
P 5700 1650
F 0 "UEG187" H 5700 2015 50  0000 C CNN
F 1 "DFFCOO" H 5700 1924 50  0000 C CNN
F 2 "" H 5700 1650 50  0001 C CNN
F 3 "" H 5700 1650 50  0001 C CNN
	1    5700 1650
	1    0    0    -1  
$EndComp
$Comp
L A5C:DFFCOO UEG203
U 1 1 6604FC4B
P 5700 5050
F 0 "UEG203" H 5700 5415 50  0000 C CNN
F 1 "DFFCOO" H 5700 5324 50  0000 C CNN
F 2 "" H 5700 5050 50  0001 C CNN
F 3 "" H 5700 5050 50  0001 C CNN
	1    5700 5050
	1    0    0    -1  
$EndComp
$Comp
L A5C:DFFCOO UEG126
U 1 1 6604FBB2
P 9000 1250
F 0 "UEG126" H 9000 1615 50  0000 C CNN
F 1 "DFFCOO" H 9000 1524 50  0000 C CNN
F 2 "" H 9000 1250 50  0001 C CNN
F 3 "" H 9000 1250 50  0001 C CNN
	1    9000 1250
	1    0    0    -1  
$EndComp
$Comp
L A5C:DFFCOO UEE212
U 1 1 6604FB98
P 9000 2400
F 0 "UEE212" H 9000 2765 50  0000 C CNN
F 1 "DFFCOO" H 9000 2674 50  0000 C CNN
F 2 "" H 9000 2400 50  0001 C CNN
F 3 "" H 9000 2400 50  0001 C CNN
	1    9000 2400
	1    0    0    -1  
$EndComp
$Comp
L A5C:DFFCOO UEC148
U 1 1 6604FC5B
P 9000 4050
F 0 "UEC148" H 9000 4415 50  0000 C CNN
F 1 "DFFCOO" H 9000 4324 50  0000 C CNN
F 2 "" H 9000 4050 50  0001 C CNN
F 3 "" H 9000 4050 50  0001 C CNN
	1    9000 4050
	1    0    0    -1  
$EndComp
$Comp
L A5C:DFFCOO UEG173
U 1 1 6604FC75
P 9000 5800
F 0 "UEG173" H 9000 6165 50  0000 C CNN
F 1 "DFFCOO" H 9000 6074 50  0000 C CNN
F 2 "" H 9000 5800 50  0001 C CNN
F 3 "" H 9000 5800 50  0001 C CNN
	1    9000 5800
	1    0    0    -1  
$EndComp
$Comp
L A5C:NAND05 UEC155
U 1 1 6604FC2F
P 8150 3950
F 0 "UEC155" H 8175 4340 50  0000 C CNN
F 1 "NAND05" H 8175 4249 50  0000 C CNN
F 2 "" H 8150 3650 50  0001 C CNN
F 3 "" H 8150 3650 50  0001 C CNN
	1    8150 3950
	1    0    0    -1  
$EndComp
$Comp
L A5C:AOI32 UEG192
U 1 1 6604FC42
P 4800 4950
F 0 "UEG192" H 4800 5392 50  0000 C CNN
F 1 "AOI32" H 4800 5301 50  0000 C CNN
F 2 "" H 4950 4950 50  0001 C CNN
F 3 "" H 4950 4950 50  0001 C CNN
	1    4800 4950
	1    0    0    -1  
$EndComp
$Comp
L A5C:AOI24 UEG122
U 1 1 68330FF3
P 8050 1150
F 0 "UEG122" H 8050 1717 50  0000 C CNN
F 1 "AOI24" H 8050 1626 50  0000 C CNN
F 2 "" H 8250 1450 50  0001 C CNN
F 3 "" H 8250 1450 50  0001 C CNN
	1    8050 1150
	1    0    0    -1  
$EndComp
$Comp
L A5C:AOI24 UEF187
U 1 1 6604FBA1
P 8050 2300
F 0 "UEF187" H 8050 2867 50  0000 C CNN
F 1 "AOI24" H 8050 2776 50  0000 C CNN
F 2 "" H 8250 2600 50  0001 C CNN
F 3 "" H 8250 2600 50  0001 C CNN
	1    8050 2300
	1    0    0    -1  
$EndComp
$Comp
L A5C:AOI24 UEG180
U 1 1 6604FC6C
P 8050 5700
F 0 "UEG180" H 8050 6267 50  0000 C CNN
F 1 "AOI24" H 8050 6176 50  0000 C CNN
F 2 "" H 8250 6000 50  0001 C CNN
F 3 "" H 8250 6000 50  0001 C CNN
	1    8050 5700
	1    0    0    -1  
$EndComp
$EndSCHEMATC
