EESchema Schematic File Version 4
EELAYER 30 0
EELAYER END
$Descr A3 16535 11693
encoding utf-8
Sheet 80 83
Title "CPS Reverse Engineering: DL-0311"
Date "2021-09-12"
Rev ""
Comp ""
Comment1 ""
Comment2 ""
Comment3 "Licence: CC-BY"
Comment4 "Author: Loïc *WydD* Petit"
$EndDescr
Connection ~ 10400 10300
Connection ~ 10400 8450
Connection ~ 10400 3500
Connection ~ 10400 6900
Connection ~ 10400 5050
Connection ~ 10400 1650
Connection ~ 4800 5900
Connection ~ 4900 6200
Connection ~ 4700 6000
Connection ~ 4700 9400
Connection ~ 4700 2600
Connection ~ 6400 6250
Connection ~ 6400 9650
Connection ~ 9700 3600
Connection ~ 9700 5250
Connection ~ 9700 7000
Connection ~ 9700 8650
Connection ~ 9700 10400
Connection ~ 6400 10850
Connection ~ 2150 9350
Connection ~ 4350 6000
Connection ~ 4450 6550
Connection ~ 4450 9950
Connection ~ 4350 9400
Connection ~ 4800 8800
Connection ~ 4900 9050
Connection ~ 3550 9900
Connection ~ 3500 8800
NoConn ~ 7000 9450
NoConn ~ 10300 10200
NoConn ~ 10300 6800
NoConn ~ 10300 3400
NoConn ~ 7000 2650
NoConn ~ 7000 6050
NoConn ~ 10300 1750
NoConn ~ 10300 5150
NoConn ~ 10300 8550
Entry Wire Line
	2000 2250 2100 2350
Entry Wire Line
	2000 2350 2100 2450
Entry Wire Line
	2000 2450 2100 2550
Entry Wire Line
	2000 2550 2100 2650
Entry Wire Line
	2000 2650 2100 2750
Entry Wire Line
	2000 2750 2100 2850
Entry Wire Line
	11000 3500 11100 3400
Entry Wire Line
	11000 6900 11100 6800
Entry Wire Line
	11000 10300 11100 10200
Entry Wire Line
	11250 1650 11350 1550
Entry Wire Line
	11250 5050 11350 4950
Entry Wire Line
	11250 8450 11350 8350
Wire Wire Line
	2050 9350 2150 9350
Wire Wire Line
	2100 2350 2700 2350
Wire Wire Line
	2100 2450 2700 2450
Wire Wire Line
	2100 2550 2700 2550
Wire Wire Line
	2100 2650 2700 2650
Wire Wire Line
	2100 2750 2700 2750
Wire Wire Line
	2100 2850 2700 2850
Wire Wire Line
	2150 9350 3550 9350
Wire Wire Line
	2150 10400 2150 9350
Wire Wire Line
	2950 10400 2150 10400
Wire Wire Line
	3500 8800 3400 8800
Wire Wire Line
	3500 9050 3500 8800
Wire Wire Line
	3500 9050 4900 9050
Wire Wire Line
	3550 9450 3550 9900
Wire Wire Line
	3550 10000 3550 10400
Wire Wire Line
	4100 8800 4800 8800
Wire Wire Line
	4100 9400 4350 9400
Wire Wire Line
	4100 9950 4450 9950
Wire Wire Line
	4350 2600 4350 6000
Wire Wire Line
	4350 6000 4350 9400
Wire Wire Line
	4350 9400 4700 9400
Wire Wire Line
	4450 3150 8650 3150
Wire Wire Line
	4450 6550 4450 3150
Wire Wire Line
	4450 6550 4450 9950
Wire Wire Line
	4450 6550 8650 6550
Wire Wire Line
	4450 9950 8650 9950
Wire Wire Line
	4700 2600 4350 2600
Wire Wire Line
	4700 2600 5400 2600
Wire Wire Line
	4700 2900 4700 2600
Wire Wire Line
	4700 2900 5400 2900
Wire Wire Line
	4700 6000 4350 6000
Wire Wire Line
	4700 6000 5400 6000
Wire Wire Line
	4700 6300 4700 6000
Wire Wire Line
	4700 6300 5400 6300
Wire Wire Line
	4700 9400 5400 9400
Wire Wire Line
	4700 9700 4700 9400
Wire Wire Line
	4700 9700 5400 9700
Wire Wire Line
	4800 2500 4800 5900
Wire Wire Line
	4800 2500 5400 2500
Wire Wire Line
	4800 5900 4800 8800
Wire Wire Line
	4800 5900 5400 5900
Wire Wire Line
	4800 8800 4800 9300
Wire Wire Line
	4800 9300 5400 9300
Wire Wire Line
	4900 2800 4900 6200
Wire Wire Line
	4900 2800 5400 2800
Wire Wire Line
	4900 6200 4900 9050
Wire Wire Line
	4900 6200 5400 6200
Wire Wire Line
	4900 9050 4900 9600
Wire Wire Line
	4900 9600 5400 9600
Wire Wire Line
	6300 10850 6400 10850
Wire Wire Line
	6400 2850 6500 2850
Wire Wire Line
	6400 6250 6400 2850
Wire Wire Line
	6400 9650 6400 6250
Wire Wire Line
	6400 10850 6400 9650
Wire Wire Line
	6500 2650 6300 2650
Wire Wire Line
	6500 6050 6300 6050
Wire Wire Line
	6500 6250 6400 6250
Wire Wire Line
	6500 9450 6300 9450
Wire Wire Line
	6500 9650 6400 9650
Wire Wire Line
	7000 2750 7650 2750
Wire Wire Line
	7000 6150 7650 6150
Wire Wire Line
	7000 9550 7650 9550
Wire Wire Line
	7650 3050 7650 2750
Wire Wire Line
	7650 6450 7650 6150
Wire Wire Line
	7650 9850 7650 9550
Wire Wire Line
	7850 2600 7950 2600
Wire Wire Line
	7850 2750 7850 2600
Wire Wire Line
	7850 6000 7950 6000
Wire Wire Line
	7850 6150 7850 6000
Wire Wire Line
	7850 9400 7950 9400
Wire Wire Line
	7850 9550 7850 9400
Wire Wire Line
	8500 750  8700 750 
Wire Wire Line
	8500 1650 8900 1650
Wire Wire Line
	8500 2550 8700 2550
Wire Wire Line
	8500 4150 8700 4150
Wire Wire Line
	8500 5050 8900 5050
Wire Wire Line
	8500 5950 8700 5950
Wire Wire Line
	8500 7550 8700 7550
Wire Wire Line
	8500 8450 8900 8450
Wire Wire Line
	8500 9350 8700 9350
Wire Wire Line
	8550 3650 8550 3900
Wire Wire Line
	8550 3900 10400 3900
Wire Wire Line
	8550 7050 8550 7300
Wire Wire Line
	8550 7300 10400 7300
Wire Wire Line
	8550 10450 8550 10700
Wire Wire Line
	8550 10700 10400 10700
Wire Wire Line
	8600 1200 8500 1200
Wire Wire Line
	8600 1550 8600 1200
Wire Wire Line
	8600 1750 8600 2100
Wire Wire Line
	8600 2100 8500 2100
Wire Wire Line
	8600 4600 8500 4600
Wire Wire Line
	8600 4950 8600 4600
Wire Wire Line
	8600 5150 8600 5500
Wire Wire Line
	8600 5500 8500 5500
Wire Wire Line
	8600 8000 8500 8000
Wire Wire Line
	8600 8350 8600 8000
Wire Wire Line
	8600 8550 8600 8900
Wire Wire Line
	8600 8900 8500 8900
Wire Wire Line
	8650 3050 7650 3050
Wire Wire Line
	8650 3650 8550 3650
Wire Wire Line
	8650 3750 8050 3750
Wire Wire Line
	8650 6450 7650 6450
Wire Wire Line
	8650 7050 8550 7050
Wire Wire Line
	8650 7150 8050 7150
Wire Wire Line
	8650 9850 7650 9850
Wire Wire Line
	8650 10450 8550 10450
Wire Wire Line
	8650 10550 8050 10550
Wire Wire Line
	8700 750  8700 1450
Wire Wire Line
	8700 1450 8900 1450
Wire Wire Line
	8700 1850 8900 1850
Wire Wire Line
	8700 2550 8700 1850
Wire Wire Line
	8700 4150 8700 4850
Wire Wire Line
	8700 4850 8900 4850
Wire Wire Line
	8700 5250 8900 5250
Wire Wire Line
	8700 5950 8700 5250
Wire Wire Line
	8700 7550 8700 8250
Wire Wire Line
	8700 8250 8900 8250
Wire Wire Line
	8700 8650 8900 8650
Wire Wire Line
	8700 9350 8700 8650
Wire Wire Line
	8900 1550 8600 1550
Wire Wire Line
	8900 1750 8600 1750
Wire Wire Line
	8900 4950 8600 4950
Wire Wire Line
	8900 5150 8600 5150
Wire Wire Line
	8900 8350 8600 8350
Wire Wire Line
	8900 8550 8600 8550
Wire Wire Line
	9550 1650 9800 1650
Wire Wire Line
	9550 3400 9800 3400
Wire Wire Line
	9550 5050 9800 5050
Wire Wire Line
	9550 6800 9800 6800
Wire Wire Line
	9550 8450 9800 8450
Wire Wire Line
	9550 10200 9800 10200
Wire Wire Line
	9700 1850 9700 3600
Wire Wire Line
	9700 3600 9700 5250
Wire Wire Line
	9700 3600 9800 3600
Wire Wire Line
	9700 5250 9700 7000
Wire Wire Line
	9700 7000 9700 8650
Wire Wire Line
	9700 8650 9700 10400
Wire Wire Line
	9700 10400 9700 10850
Wire Wire Line
	9700 10850 6400 10850
Wire Wire Line
	9800 1850 9700 1850
Wire Wire Line
	9800 5250 9700 5250
Wire Wire Line
	9800 7000 9700 7000
Wire Wire Line
	9800 8650 9700 8650
Wire Wire Line
	9800 10400 9700 10400
Wire Wire Line
	10300 3500 10400 3500
Wire Wire Line
	10300 6900 10400 6900
Wire Wire Line
	10300 8450 10400 8450
Wire Wire Line
	10300 10300 10400 10300
Wire Wire Line
	10400 1650 10300 1650
Wire Wire Line
	10400 1650 10400 2750
Wire Wire Line
	10400 1650 11250 1650
Wire Wire Line
	10400 2750 7850 2750
Wire Wire Line
	10400 3500 10400 3900
Wire Wire Line
	10400 3500 11000 3500
Wire Wire Line
	10400 5050 10300 5050
Wire Wire Line
	10400 5050 10400 6150
Wire Wire Line
	10400 5050 11250 5050
Wire Wire Line
	10400 6150 7850 6150
Wire Wire Line
	10400 6900 10400 7300
Wire Wire Line
	10400 6900 11000 6900
Wire Wire Line
	10400 8450 10400 9550
Wire Wire Line
	10400 8450 11250 8450
Wire Wire Line
	10400 9550 7850 9550
Wire Wire Line
	10400 10300 10400 10700
Wire Wire Line
	10400 10300 11000 10300
Wire Bus Line
	2000 2150 1900 2150
Wire Bus Line
	11100 1050 11550 1050
Wire Bus Line
	11350 1200 11550 1200
Text Notes 10500 1550 0    50   ~ 0
GFX-CHNL
Text Notes 10500 3400 0    50   ~ 0
~GFX-CHNL
Text Notes 10500 4950 0    50   ~ 0
GFX-CHNL
Text Notes 10500 6800 0    50   ~ 0
~GFX-CHNL
Text Notes 10500 8350 0    50   ~ 0
GFX-CHNL
Text Notes 10500 10200 0    50   ~ 0
~GFX-CHNL
Text Label 2150 2350 0    50   ~ 0
GFX-ADDR7
Text Label 2150 2450 0    50   ~ 0
GFX-ADDR8
Text Label 2150 2550 0    50   ~ 0
GFX-ADDR9
Text Label 2150 2650 0    50   ~ 0
GFX-ADDR10
Text Label 2150 2750 0    50   ~ 0
GFX-ADDR11
Text Label 2150 2850 0    50   ~ 0
GFX-ADDR12
Text Label 5400 2400 2    50   ~ 0
GFX-ADDR12
Text Label 5400 2700 2    50   ~ 0
GFX-ADDR10
Text Label 5400 5800 2    50   ~ 0
GFX-ADDR11
Text Label 5400 6100 2    50   ~ 0
GFX-ADDR9
Text Label 5400 9200 2    50   ~ 0
GFX-ADDR10
Text Label 5400 9500 2    50   ~ 0
GFX-ADDR8
Text Label 7950 700  2    50   ~ 0
GFX-ADDR12
Text Label 7950 1150 2    50   ~ 0
GFX-ADDR11
Text Label 7950 1600 2    50   ~ 0
GFX-ADDR10
Text Label 7950 2050 2    50   ~ 0
GFX-ADDR9
Text Label 7950 2500 2    50   ~ 0
~GFX-CHNL
Text Label 7950 4100 2    50   ~ 0
GFX-ADDR11
Text Label 7950 4200 2    50   ~ 0
SCROLL1.GFX-CHNL
Text Label 7950 4550 2    50   ~ 0
GFX-ADDR10
Text Label 7950 4650 2    50   ~ 0
ELSE.GFX-CHNL
Text Label 7950 5000 2    50   ~ 0
GFX-ADDR9
Text Label 7950 5100 2    50   ~ 0
STARS.GFX-CHNL
Text Label 7950 5450 2    50   ~ 0
GFX-ADDR8
Text Label 7950 5550 2    50   ~ 0
SCROLL3.GFX-CHNL
Text Label 7950 5900 2    50   ~ 0
~GFX-CHNL
Text Label 7950 7500 2    50   ~ 0
GFX-ADDR10
Text Label 7950 7600 2    50   ~ 0
SCROLL1.GFX-CHNL
Text Label 7950 7950 2    50   ~ 0
GFX-ADDR9
Text Label 7950 8050 2    50   ~ 0
ELSE.GFX-CHNL
Text Label 7950 8400 2    50   ~ 0
GFX-ADDR8
Text Label 7950 8500 2    50   ~ 0
STARS.GFX-CHNL
Text Label 7950 8850 2    50   ~ 0
GFX-ADDR7
Text Label 7950 8950 2    50   ~ 0
SCROLL3.GFX-CHNL
Text Label 7950 9300 2    50   ~ 0
~GFX-CHNL
Text Label 8050 3750 0    50   ~ 0
~GFX-CHNL
Text Label 8050 7150 0    50   ~ 0
~GFX-CHNL
Text Label 8050 10550 0    50   ~ 0
~GFX-CHNL
Text Label 8650 3250 2    50   ~ 0
GFX-ADDR11
Text Label 8650 3350 2    50   ~ 0
ELSE.GFX-CHNL
Text Label 8650 3450 2    50   ~ 0
GFX-ADDR9
Text Label 8650 3550 2    50   ~ 0
SCROLL3.GFX-CHNL
Text Label 8650 6650 2    50   ~ 0
GFX-ADDR10
Text Label 8650 6750 2    50   ~ 0
ELSE.GFX-CHNL
Text Label 8650 6850 2    50   ~ 0
GFX-ADDR8
Text Label 8650 6950 2    50   ~ 0
SCROLL3.GFX-CHNL
Text Label 8650 10050 2    50   ~ 0
GFX-ADDR9
Text Label 8650 10150 2    50   ~ 0
ELSE.GFX-CHNL
Text Label 8650 10250 2    50   ~ 0
GFX-ADDR7
Text Label 8650 10350 2    50   ~ 0
SCROLL3.GFX-CHNL
Text Label 10500 1650 0    50   ~ 0
B-ROMA11
Text Label 10500 3500 0    50   ~ 0
A-ROMA11
Text Label 10500 5050 0    50   ~ 0
B-ROMA10
Text Label 10500 6900 0    50   ~ 0
A-ROMA10
Text Label 10500 8450 0    50   ~ 0
B-ROMA9
Text Label 10500 10300 0    50   ~ 0
A-ROMA9
Text HLabel 1900 2150 0    50   Input ~ 0
GFX-ADDR[7..12]
Text HLabel 2050 9350 0    50   Input ~ 0
~GFX-CHNL
Text HLabel 2950 9900 0    50   Input ~ 0
~SCROLL1-STARS
Text HLabel 3400 8800 0    50   Input ~ 0
SCROLL3-STARS
Text HLabel 6300 10850 0    50   Input ~ 0
~CLK4M
Text HLabel 7950 800  0    50   Input ~ 0
SCROLL1.GFX-CHNL
Text HLabel 7950 1250 0    50   Input ~ 0
ELSE.GFX-CHNL
Text HLabel 7950 1700 0    50   Input ~ 0
STARS.GFX-CHNL
Text HLabel 7950 2150 0    50   Input ~ 0
SCROLL3.GFX-CHNL
Text HLabel 11550 1050 2    50   Output ~ 0
A-ROMA[9..11]
Text HLabel 11550 1200 2    50   Output ~ 0
B-ROMA[9..11]
$Comp
L A5C:AND02 UEB102
U 1 1 6208339C
P 3800 9400
F 0 "UEB102" H 3825 9667 50  0000 C CNN
F 1 "AND02" H 3825 9576 50  0000 C CNN
F 2 "" H 3800 9400 50  0001 C CNN
F 3 "" H 3800 9400 50  0001 C CNN
	1    3800 9400
	1    0    0    -1  
$EndComp
$Comp
L A5C:AND02 UEA151
U 1 1 620833A2
P 3800 9950
F 0 "UEA151" H 3825 10217 50  0000 C CNN
F 1 "AND02" H 3825 10126 50  0000 C CNN
F 2 "" H 3800 9950 50  0001 C CNN
F 3 "" H 3800 9950 50  0001 C CNN
	1    3800 9950
	1    0    0    -1  
$EndComp
$Comp
L A5C:NAND02 UEA132
U 1 1 62083341
P 8200 750
F 0 "UEA132" H 8225 1017 50  0000 C CNN
F 1 "NAND02" H 8225 926 50  0000 C CNN
F 2 "" H 8200 750 50  0001 C CNN
F 3 "" H 8200 750 50  0001 C CNN
	1    8200 750 
	1    0    0    -1  
$EndComp
$Comp
L A5C:NAND02 UEA133
U 1 1 6208333B
P 8200 1200
F 0 "UEA133" H 8225 1467 50  0000 C CNN
F 1 "NAND02" H 8225 1376 50  0000 C CNN
F 2 "" H 8200 1200 50  0001 C CNN
F 3 "" H 8200 1200 50  0001 C CNN
	1    8200 1200
	1    0    0    -1  
$EndComp
$Comp
L A5C:NAND02 UEB129
U 1 1 62083335
P 8200 1650
F 0 "UEB129" H 8225 1917 50  0000 C CNN
F 1 "NAND02" H 8225 1826 50  0000 C CNN
F 2 "" H 8200 1650 50  0001 C CNN
F 3 "" H 8200 1650 50  0001 C CNN
	1    8200 1650
	1    0    0    -1  
$EndComp
$Comp
L A5C:NAND02 UEB140
U 1 1 6208332F
P 8200 2100
F 0 "UEB140" H 8225 2367 50  0000 C CNN
F 1 "NAND02" H 8225 2276 50  0000 C CNN
F 2 "" H 8200 2100 50  0001 C CNN
F 3 "" H 8200 2100 50  0001 C CNN
	1    8200 2100
	1    0    0    -1  
$EndComp
$Comp
L A5C:NAND02 UEB151
U 1 1 62083329
P 8200 2550
F 0 "UEB151" H 8225 2817 50  0000 C CNN
F 1 "NAND02" H 8225 2726 50  0000 C CNN
F 2 "" H 8200 2550 50  0001 C CNN
F 3 "" H 8200 2550 50  0001 C CNN
	1    8200 2550
	1    0    0    -1  
$EndComp
$Comp
L A5C:NAND02 UEF129
U 1 1 6208321F
P 8200 4150
F 0 "UEF129" H 8225 4417 50  0000 C CNN
F 1 "NAND02" H 8225 4326 50  0000 C CNN
F 2 "" H 8200 4150 50  0001 C CNN
F 3 "" H 8200 4150 50  0001 C CNN
	1    8200 4150
	1    0    0    -1  
$EndComp
$Comp
L A5C:NAND02 UEE129
U 1 1 62083219
P 8200 4600
F 0 "UEE129" H 8225 4867 50  0000 C CNN
F 1 "NAND02" H 8225 4776 50  0000 C CNN
F 2 "" H 8200 4600 50  0001 C CNN
F 3 "" H 8200 4600 50  0001 C CNN
	1    8200 4600
	1    0    0    -1  
$EndComp
$Comp
L A5C:NAND02 UEE116
U 1 1 62083213
P 8200 5050
F 0 "UEE116" H 8225 5317 50  0000 C CNN
F 1 "NAND02" H 8225 5226 50  0000 C CNN
F 2 "" H 8200 5050 50  0001 C CNN
F 3 "" H 8200 5050 50  0001 C CNN
	1    8200 5050
	1    0    0    -1  
$EndComp
$Comp
L A5C:NAND02 UEF112
U 1 1 6208320D
P 8200 5500
F 0 "UEF112" H 8225 5767 50  0000 C CNN
F 1 "NAND02" H 8225 5676 50  0000 C CNN
F 2 "" H 8200 5500 50  0001 C CNN
F 3 "" H 8200 5500 50  0001 C CNN
	1    8200 5500
	1    0    0    -1  
$EndComp
$Comp
L A5C:NAND02 UEF159
U 1 1 62083207
P 8200 5950
F 0 "UEF159" H 8225 6217 50  0000 C CNN
F 1 "NAND02" H 8225 6126 50  0000 C CNN
F 2 "" H 8200 5950 50  0001 C CNN
F 3 "" H 8200 5950 50  0001 C CNN
	1    8200 5950
	1    0    0    -1  
$EndComp
$Comp
L A5C:NAND02 UEE191
U 1 1 62083257
P 8200 7550
F 0 "UEE191" H 8225 7817 50  0000 C CNN
F 1 "NAND02" H 8225 7726 50  0000 C CNN
F 2 "" H 8200 7550 50  0001 C CNN
F 3 "" H 8200 7550 50  0001 C CNN
	1    8200 7550
	1    0    0    -1  
$EndComp
$Comp
L A5C:NAND02 UEE185
U 1 1 6208325D
P 8200 8000
F 0 "UEE185" H 8225 8267 50  0000 C CNN
F 1 "NAND02" H 8225 8176 50  0000 C CNN
F 2 "" H 8200 8000 50  0001 C CNN
F 3 "" H 8200 8000 50  0001 C CNN
	1    8200 8000
	1    0    0    -1  
$EndComp
$Comp
L A5C:NAND02 UEC188
U 1 1 62083263
P 8200 8450
F 0 "UEC188" H 8225 8717 50  0000 C CNN
F 1 "NAND02" H 8225 8626 50  0000 C CNN
F 2 "" H 8200 8450 50  0001 C CNN
F 3 "" H 8200 8450 50  0001 C CNN
	1    8200 8450
	1    0    0    -1  
$EndComp
$Comp
L A5C:NAND02 UED194
U 1 1 62083269
P 8200 8900
F 0 "UED194" H 8225 9167 50  0000 C CNN
F 1 "NAND02" H 8225 9076 50  0000 C CNN
F 2 "" H 8200 8900 50  0001 C CNN
F 3 "" H 8200 8900 50  0001 C CNN
	1    8200 8900
	1    0    0    -1  
$EndComp
$Comp
L A5C:NAND02 UED201
U 1 1 6208326F
P 8200 9350
F 0 "UED201" H 8225 9617 50  0000 C CNN
F 1 "NAND02" H 8225 9526 50  0000 C CNN
F 2 "" H 8200 9350 50  0001 C CNN
F 3 "" H 8200 9350 50  0001 C CNN
	1    8200 9350
	1    0    0    -1  
$EndComp
$Comp
L A5C:INV01 UEB150
U 1 1 62083395
P 3250 9900
F 0 "UEB150" H 3250 10217 50  0000 C CNN
F 1 "INV01" H 3250 10126 50  0000 C CNN
F 2 "" H 3250 9700 50  0001 C CNN
F 3 "" H 3250 9700 50  0001 C CNN
	1    3250 9900
	1    0    0    -1  
$EndComp
$Comp
L A5C:INV01 UEA153
U 1 1 6208338E
P 3250 10400
F 0 "UEA153" H 3250 10717 50  0000 C CNN
F 1 "INV01" H 3250 10626 50  0000 C CNN
F 2 "" H 3250 10200 50  0001 C CNN
F 3 "" H 3250 10200 50  0001 C CNN
	1    3250 10400
	1    0    0    -1  
$EndComp
$Comp
L A5C:INV01 UEC100
U 1 1 620832C3
P 3800 8800
F 0 "UEC100" H 3800 9117 50  0000 C CNN
F 1 "INV01" H 3800 9026 50  0000 C CNN
F 2 "" H 3800 8600 50  0001 C CNN
F 3 "" H 3800 8600 50  0001 C CNN
	1    3800 8800
	1    0    0    -1  
$EndComp
$Comp
L A5C:DFFCOO UED132
U 1 1 6208335D
P 6750 2750
F 0 "UED132" H 6750 3115 50  0000 C CNN
F 1 "DFFCOO" H 6750 3024 50  0000 C CNN
F 2 "" H 6750 2750 50  0001 C CNN
F 3 "" H 6750 2750 50  0001 C CNN
	1    6750 2750
	1    0    0    -1  
$EndComp
$Comp
L A5C:DFFCOO UED4
U 1 1 620832CD
P 6750 6150
F 0 "UED4" H 6750 6515 50  0000 C CNN
F 1 "DFFCOO" H 6750 6424 50  0000 C CNN
F 2 "" H 6750 6150 50  0001 C CNN
F 3 "" H 6750 6150 50  0001 C CNN
	1    6750 6150
	1    0    0    -1  
$EndComp
$Comp
L A5C:DFFCOO UEA119
U 1 1 62083292
P 6750 9550
F 0 "UEA119" H 6750 9915 50  0000 C CNN
F 1 "DFFCOO" H 6750 9824 50  0000 C CNN
F 2 "" H 6750 9550 50  0001 C CNN
F 3 "" H 6750 9550 50  0001 C CNN
	1    6750 9550
	1    0    0    -1  
$EndComp
$Comp
L A5C:DFFCOO UEB142
U 1 1 62083313
P 10050 1750
F 0 "UEB142" H 10050 2115 50  0000 C CNN
F 1 "DFFCOO" H 10050 2024 50  0000 C CNN
F 2 "" H 10050 1750 50  0001 C CNN
F 3 "" H 10050 1750 50  0001 C CNN
	1    10050 1750
	1    0    0    -1  
$EndComp
$Comp
L A5C:DFFCOO UED143
U 1 1 620832F9
P 10050 3500
F 0 "UED143" H 10050 3865 50  0000 C CNN
F 1 "DFFCOO" H 10050 3774 50  0000 C CNN
F 2 "" H 10050 3500 50  0001 C CNN
F 3 "" H 10050 3500 50  0001 C CNN
	1    10050 3500
	1    0    0    -1  
$EndComp
$Comp
L A5C:DFFCOO UEF154
U 1 1 620831F1
P 10050 5150
F 0 "UEF154" H 10050 5515 50  0000 C CNN
F 1 "DFFCOO" H 10050 5424 50  0000 C CNN
F 2 "" H 10050 5150 50  0001 C CNN
F 3 "" H 10050 5150 50  0001 C CNN
	1    10050 5150
	1    0    0    -1  
$EndComp
$Comp
L A5C:DFFCOO UEC20
U 1 1 620831D7
P 10050 6900
F 0 "UEC20" H 10050 7265 50  0000 C CNN
F 1 "DFFCOO" H 10050 7174 50  0000 C CNN
F 2 "" H 10050 6900 50  0001 C CNN
F 3 "" H 10050 6900 50  0001 C CNN
	1    10050 6900
	1    0    0    -1  
$EndComp
$Comp
L A5C:DFFCOO UED202
U 1 1 620832A2
P 10050 8550
F 0 "UED202" H 10050 8915 50  0000 C CNN
F 1 "DFFCOO" H 10050 8824 50  0000 C CNN
F 2 "" H 10050 8550 50  0001 C CNN
F 3 "" H 10050 8550 50  0001 C CNN
	1    10050 8550
	1    0    0    -1  
$EndComp
$Comp
L A5C:DFFCOO UEA135
U 1 1 620832BC
P 10050 10300
F 0 "UEA135" H 10050 10665 50  0000 C CNN
F 1 "DFFCOO" H 10050 10574 50  0000 C CNN
F 2 "" H 10050 10300 50  0001 C CNN
F 3 "" H 10050 10300 50  0001 C CNN
	1    10050 10300
	1    0    0    -1  
$EndComp
$Comp
L A5C:NAND05 UEB133
U 1 1 62083321
P 9200 1650
F 0 "UEB133" H 9225 2040 50  0000 C CNN
F 1 "NAND05" H 9225 1949 50  0000 C CNN
F 2 "" H 9200 1350 50  0001 C CNN
F 3 "" H 9200 1350 50  0001 C CNN
	1    9200 1650
	1    0    0    -1  
$EndComp
$Comp
L A5C:NAND05 UEF130
U 1 1 620831FF
P 9200 5050
F 0 "UEF130" H 9225 5440 50  0000 C CNN
F 1 "NAND05" H 9225 5349 50  0000 C CNN
F 2 "" H 9200 4750 50  0001 C CNN
F 3 "" H 9200 4750 50  0001 C CNN
	1    9200 5050
	1    0    0    -1  
$EndComp
$Comp
L A5C:NAND05 UEE193
U 1 1 62083275
P 9200 8450
F 0 "UEE193" H 9225 8840 50  0000 C CNN
F 1 "NAND05" H 9225 8749 50  0000 C CNN
F 2 "" H 9200 8150 50  0001 C CNN
F 3 "" H 9200 8150 50  0001 C CNN
	1    9200 8450
	1    0    0    -1  
$EndComp
$Comp
L A5C:AOI32 UED99
U 1 1 62083366
P 5850 2650
F 0 "UED99" H 5850 3092 50  0000 C CNN
F 1 "AOI32" H 5850 3001 50  0000 C CNN
F 2 "" H 6000 2650 50  0001 C CNN
F 3 "" H 6000 2650 50  0001 C CNN
	1    5850 2650
	1    0    0    -1  
$EndComp
$Comp
L A5C:AOI32 UED92
U 1 1 620832D6
P 5850 6050
F 0 "UED92" H 5850 6492 50  0000 C CNN
F 1 "AOI32" H 5850 6401 50  0000 C CNN
F 2 "" H 6000 6050 50  0001 C CNN
F 3 "" H 6000 6050 50  0001 C CNN
	1    5850 6050
	1    0    0    -1  
$EndComp
$Comp
L A5C:AOI32 UEC96
U 1 1 62083289
P 5850 9450
F 0 "UEC96" H 5850 9892 50  0000 C CNN
F 1 "AOI32" H 5850 9801 50  0000 C CNN
F 2 "" H 6000 9450 50  0001 C CNN
F 3 "" H 6000 9450 50  0001 C CNN
	1    5850 9450
	1    0    0    -1  
$EndComp
$Comp
L A5C:AOI24 UED150
U 1 1 62083302
P 9100 3400
F 0 "UED150" H 9100 3967 50  0000 C CNN
F 1 "AOI24" H 9100 3876 50  0000 C CNN
F 2 "" H 9300 3700 50  0001 C CNN
F 3 "" H 9300 3700 50  0001 C CNN
	1    9100 3400
	1    0    0    -1  
$EndComp
$Comp
L A5C:AOI24 UED15
U 1 1 620831E0
P 9100 6800
F 0 "UED15" H 9100 7367 50  0000 C CNN
F 1 "AOI24" H 9100 7276 50  0000 C CNN
F 2 "" H 9300 7100 50  0001 C CNN
F 3 "" H 9300 7100 50  0001 C CNN
	1    9100 6800
	1    0    0    -1  
$EndComp
$Comp
L A5C:AOI24 UEA127
U 1 1 620832B3
P 9100 10200
F 0 "UEA127" H 9100 10767 50  0000 C CNN
F 1 "AOI24" H 9100 10676 50  0000 C CNN
F 2 "" H 9300 10500 50  0001 C CNN
F 3 "" H 9300 10500 50  0001 C CNN
	1    9100 10200
	1    0    0    -1  
$EndComp
Wire Bus Line
	11100 1050 11100 10200
Wire Bus Line
	11350 1200 11350 8350
Wire Bus Line
	2000 2150 2000 2750
$EndSCHEMATC
