EESchema Schematic File Version 4
EELAYER 30 0
EELAYER END
$Descr A4 11693 8268
encoding utf-8
Sheet 16 17
Title ""
Date "2019-10-17"
Rev ""
Comp ""
Comment1 ""
Comment2 "Licence: CC-BY"
Comment3 "Author: Loic *WydD* Petit"
Comment4 "Project: CPS2 Reverse Engineering: 93646B"
$EndDescr
Connection ~ 1600 3550
Connection ~ 1600 3650
Connection ~ 1600 3750
Connection ~ 1600 3850
Connection ~ 1600 3950
Connection ~ 1600 4250
Connection ~ 1600 4350
Connection ~ 1600 4450
Connection ~ 1600 4550
Connection ~ 1600 4650
Connection ~ 1600 4750
Connection ~ 1600 4850
Connection ~ 1600 4950
Connection ~ 1600 5050
Connection ~ 600  6200
Connection ~ 950  2050
Connection ~ 1600 4050
Connection ~ 1600 4150
Connection ~ 1600 2700
Connection ~ 1600 2800
Connection ~ 1600 2900
Connection ~ 1600 3000
Connection ~ 1600 3100
Connection ~ 1600 3200
Connection ~ 1400 3200
Connection ~ 1400 3550
Connection ~ 9200 3650
NoConn ~ 10550 3050
NoConn ~ 8700 4450
NoConn ~ 8700 4050
NoConn ~ 8700 3950
NoConn ~ 8700 3850
Entry Wire Line
	1900 900  2000 1000
Entry Wire Line
	2050 7350 1950 7450
Entry Wire Line
	2000 900  2100 1000
Entry Wire Line
	2150 7350 2050 7450
Entry Wire Line
	2100 900  2200 1000
Entry Wire Line
	2250 7350 2150 7450
Entry Wire Line
	2200 900  2300 1000
Entry Wire Line
	2350 7350 2250 7450
Entry Wire Line
	2300 900  2400 1000
Entry Wire Line
	2450 7350 2350 7450
Entry Wire Line
	2400 900  2500 1000
Entry Wire Line
	2550 7350 2450 7450
Entry Wire Line
	2500 900  2600 1000
Entry Wire Line
	2650 7350 2550 7450
Entry Wire Line
	2600 900  2700 1000
Entry Wire Line
	2750 7350 2650 7450
Entry Wire Line
	2700 900  2800 1000
Entry Wire Line
	2850 7350 2750 7450
Entry Wire Line
	2800 900  2900 1000
Entry Wire Line
	2950 7350 2850 7450
Entry Wire Line
	2900 900  3000 1000
Entry Wire Line
	3050 7350 2950 7450
Entry Wire Line
	3000 900  3100 1000
Entry Wire Line
	3150 7350 3050 7450
Entry Wire Line
	3100 900  3200 1000
Entry Wire Line
	3250 7350 3150 7450
Entry Wire Line
	3200 900  3300 1000
Entry Wire Line
	3350 7350 3250 7450
Entry Wire Line
	3300 900  3400 1000
Entry Wire Line
	3450 7350 3350 7450
Entry Wire Line
	3400 900  3500 1000
Entry Wire Line
	3550 7350 3450 7450
Entry Wire Line
	3500 900  3600 1000
Entry Wire Line
	3650 7350 3550 7450
Entry Wire Line
	3600 900  3700 1000
Entry Wire Line
	3750 7350 3650 7450
Entry Wire Line
	3700 900  3800 1000
Entry Wire Line
	3850 7350 3750 7450
Entry Wire Line
	3800 900  3900 1000
Entry Wire Line
	3950 7350 3850 7450
Entry Wire Line
	3900 900  4000 1000
Entry Wire Line
	4050 7350 3950 7450
Entry Wire Line
	4000 900  4100 1000
Entry Wire Line
	4150 7350 4050 7450
Entry Wire Line
	4100 900  4200 1000
Entry Wire Line
	4250 7350 4150 7450
Entry Wire Line
	4400 7350 4500 7450
Entry Wire Line
	4500 7350 4600 7450
Entry Wire Line
	4500 900  4400 1000
Entry Wire Line
	4600 7350 4700 7450
Entry Wire Line
	4600 900  4500 1000
Entry Wire Line
	4700 7350 4800 7450
Entry Wire Line
	4700 900  4600 1000
Entry Wire Line
	4800 7350 4900 7450
Entry Wire Line
	4800 900  4700 1000
Entry Wire Line
	4900 7350 5000 7450
Entry Wire Line
	4900 900  4800 1000
Entry Wire Line
	5000 7350 5100 7450
Entry Wire Line
	5000 900  4900 1000
Entry Wire Line
	5100 7350 5200 7450
Entry Wire Line
	5100 900  5000 1000
Entry Wire Line
	5200 7350 5300 7450
Entry Wire Line
	5200 900  5100 1000
Entry Wire Line
	5300 7350 5400 7450
Entry Wire Line
	5300 900  5200 1000
Entry Wire Line
	5400 7350 5500 7450
Entry Wire Line
	5400 900  5300 1000
Entry Wire Line
	5500 7350 5600 7450
Entry Wire Line
	5500 900  5400 1000
Entry Wire Line
	5600 7350 5700 7450
Entry Wire Line
	5600 900  5500 1000
Entry Wire Line
	5700 7350 5800 7450
Entry Wire Line
	5700 900  5600 1000
Entry Wire Line
	5800 7350 5900 7450
Entry Wire Line
	5800 900  5700 1000
Entry Wire Line
	5900 7350 6000 7450
Entry Wire Line
	5900 900  5800 1000
Entry Wire Line
	6000 900  5900 1000
Entry Wire Line
	7500 2800 7400 2700
Entry Wire Line
	7300 2400 7400 2300
Entry Wire Line
	7300 2500 7400 2400
Entry Wire Line
	7300 2600 7400 2500
Entry Wire Line
	7300 2700 7400 2600
Entry Wire Line
	7300 2800 7400 2700
Wire Wire Line
	550  2050 550  2400
Wire Wire Line
	950  2050 550  2050
Wire Wire Line
	1150 3550 1150 3500
Wire Wire Line
	1350 2400 1600 2400
Wire Wire Line
	1400 3000 1600 3000
Wire Wire Line
	1400 3200 1150 3200
Wire Wire Line
	1400 3200 1600 3200
Wire Wire Line
	1400 3250 1400 3200
Wire Wire Line
	1400 3450 1400 3550
Wire Wire Line
	1400 3550 1150 3550
Wire Wire Line
	1400 3550 1600 3550
Wire Wire Line
	1400 4150 1600 4150
Wire Wire Line
	1600 2600 1600 2700
Wire Wire Line
	1600 2700 1600 2800
Wire Wire Line
	1600 2800 1600 2900
Wire Wire Line
	1600 2900 1600 3000
Wire Wire Line
	1600 3000 1600 3100
Wire Wire Line
	1600 3100 1600 3200
Wire Wire Line
	1600 3200 1600 3300
Wire Wire Line
	1600 3450 1600 3550
Wire Wire Line
	1600 3550 1600 3650
Wire Wire Line
	1600 3650 1600 3750
Wire Wire Line
	1600 3750 1600 3850
Wire Wire Line
	1600 3850 1600 3950
Wire Wire Line
	1600 3950 1600 4050
Wire Wire Line
	1600 4050 1600 4150
Wire Wire Line
	1600 4150 1600 4250
Wire Wire Line
	1600 4250 1600 4350
Wire Wire Line
	1600 4350 1600 4450
Wire Wire Line
	1600 4450 1600 4550
Wire Wire Line
	1600 4550 1600 4650
Wire Wire Line
	1600 4650 1600 4750
Wire Wire Line
	1600 4750 1600 4850
Wire Wire Line
	1600 4850 1600 4950
Wire Wire Line
	1600 4950 1600 5050
Wire Wire Line
	1600 5050 1600 5150
Wire Wire Line
	2050 7350 2050 6750
Wire Wire Line
	2000 1600 2000 1000
Wire Wire Line
	2150 7350 2150 6750
Wire Wire Line
	2100 1600 2100 1000
Wire Wire Line
	2250 7350 2250 6750
Wire Wire Line
	2200 1600 2200 1000
Wire Wire Line
	2350 7350 2350 6750
Wire Wire Line
	2300 1600 2300 1000
Wire Wire Line
	2450 7350 2450 6750
Wire Wire Line
	2400 1600 2400 1000
Wire Wire Line
	2550 7350 2550 6750
Wire Wire Line
	2500 1600 2500 1000
Wire Wire Line
	2650 7350 2650 6750
Wire Wire Line
	2600 1600 2600 1000
Wire Wire Line
	2750 7350 2750 6750
Wire Wire Line
	2700 1600 2700 1000
Wire Wire Line
	2850 7350 2850 6750
Wire Wire Line
	2800 1600 2800 1000
Wire Wire Line
	2950 7350 2950 6750
Wire Wire Line
	2900 1600 2900 1000
Wire Wire Line
	3050 7350 3050 6750
Wire Wire Line
	3000 1600 3000 1000
Wire Wire Line
	3150 7350 3150 6750
Wire Wire Line
	3100 1600 3100 1000
Wire Wire Line
	3250 7350 3250 6750
Wire Wire Line
	3200 1600 3200 1000
Wire Wire Line
	3350 7350 3350 6750
Wire Wire Line
	3300 1600 3300 1000
Wire Wire Line
	3450 7350 3450 6750
Wire Wire Line
	3400 1600 3400 1000
Wire Wire Line
	3550 7350 3550 6750
Wire Wire Line
	3500 1600 3500 1000
Wire Wire Line
	3650 7350 3650 6750
Wire Wire Line
	3600 1600 3600 1000
Wire Wire Line
	3750 7350 3750 6750
Wire Wire Line
	3700 1600 3700 1000
Wire Wire Line
	3850 7350 3850 6750
Wire Wire Line
	3800 1600 3800 1000
Wire Wire Line
	3950 7350 3950 6750
Wire Wire Line
	3900 1600 3900 1000
Wire Wire Line
	4050 7350 4050 6750
Wire Wire Line
	4000 1600 4000 1000
Wire Wire Line
	4150 7350 4150 6750
Wire Wire Line
	4100 1600 4100 1000
Wire Wire Line
	4250 7350 4250 6750
Wire Wire Line
	4200 1600 4200 1000
Wire Wire Line
	4400 7350 4400 6750
Wire Wire Line
	4400 1600 4400 1000
Wire Wire Line
	4500 7350 4500 6750
Wire Wire Line
	4500 1600 4500 1000
Wire Wire Line
	4600 7350 4600 6750
Wire Wire Line
	4600 1600 4600 1000
Wire Wire Line
	4700 7350 4700 6750
Wire Wire Line
	4700 1600 4700 1000
Wire Wire Line
	4800 7350 4800 6750
Wire Wire Line
	4800 1600 4800 1000
Wire Wire Line
	4900 7350 4900 6750
Wire Wire Line
	4900 1600 4900 1000
Wire Wire Line
	5000 7350 5000 6750
Wire Wire Line
	5000 1600 5000 1000
Wire Wire Line
	5100 7350 5100 6750
Wire Wire Line
	5100 1600 5100 1000
Wire Wire Line
	5200 7350 5200 6750
Wire Wire Line
	5200 1600 5200 1000
Wire Wire Line
	5300 7350 5300 6750
Wire Wire Line
	5300 1600 5300 1000
Wire Wire Line
	5400 7350 5400 6750
Wire Wire Line
	5400 1600 5400 1000
Wire Wire Line
	5500 7350 5500 6750
Wire Wire Line
	5500 1600 5500 1000
Wire Wire Line
	5600 7350 5600 6750
Wire Wire Line
	5600 1600 5600 1000
Wire Wire Line
	5700 7350 5700 6750
Wire Wire Line
	5700 1600 5700 1000
Wire Wire Line
	5800 7350 5800 6750
Wire Wire Line
	5800 1600 5800 1000
Wire Wire Line
	5900 7350 5900 6750
Wire Wire Line
	5900 1600 5900 1000
Wire Wire Line
	8000 2800 7500 2800
Wire Wire Line
	6800 2400 7300 2400
Wire Wire Line
	6800 2500 7300 2500
Wire Wire Line
	6800 2600 7300 2600
Wire Wire Line
	6800 2700 7300 2700
Wire Wire Line
	6800 2800 7300 2800
Wire Wire Line
	6800 3050 7050 3050
Wire Wire Line
	6800 3250 7050 3250
Wire Wire Line
	6800 3400 7250 3400
Wire Wire Line
	6800 3600 7250 3600
Wire Wire Line
	6800 4000 7250 4000
Wire Wire Line
	6800 3700 7250 3700
Wire Wire Line
	6800 4650 7250 4650
Wire Wire Line
	6800 4750 7250 4750
Wire Wire Line
	6800 4950 7250 4950
Wire Wire Line
	6900 3900 6800 3900
Wire Wire Line
	7050 3150 6800 3150
Wire Wire Line
	7100 3900 7250 3900
Wire Wire Line
	700  7000 600  7000
Wire Wire Line
	600  7000 600  6200
Wire Wire Line
	7250 3500 6800 3500
Wire Wire Line
	8500 850  9100 850 
Wire Wire Line
	8500 950  9100 950 
Wire Wire Line
	8450 4050 8600 4050
Wire Wire Line
	8600 4050 8600 4150
Wire Wire Line
	8600 4150 8700 4150
Wire Wire Line
	8700 4250 8500 4250
Wire Wire Line
	9100 1050 8500 1050
Wire Wire Line
	9100 1150 8500 1150
Wire Wire Line
	9100 1250 8500 1250
Wire Wire Line
	9100 1350 8500 1350
Wire Wire Line
	9100 1450 8500 1450
Wire Wire Line
	9100 1550 8500 1550
Wire Wire Line
	9100 1650 8500 1650
Wire Wire Line
	9100 1750 8500 1750
Wire Wire Line
	9100 1850 8500 1850
Wire Wire Line
	9100 1950 8500 1950
Wire Wire Line
	9100 2050 8500 2050
Wire Wire Line
	9100 2150 8500 2150
Wire Wire Line
	9100 2250 8500 2250
Wire Wire Line
	9100 2350 8500 2350
Wire Wire Line
	9500 3650 9200 3650
Wire Wire Line
	9700 3950 10200 3950
Wire Wire Line
	9700 4050 10300 4050
Wire Wire Line
	9700 4150 10300 4150
Wire Wire Line
	9700 4250 10300 4250
Wire Wire Line
	9700 4350 10300 4350
Wire Wire Line
	9700 4450 10300 4450
Wire Wire Line
	9700 4550 10300 4550
Wire Wire Line
	9700 4650 10300 4650
Wire Wire Line
	9700 4750 10300 4750
Wire Wire Line
	10200 3850 9700 3850
Wire Wire Line
	10550 850  9950 850 
Wire Wire Line
	10550 950  9950 950 
Wire Wire Line
	10550 1050 9950 1050
Wire Wire Line
	10550 1150 9950 1150
Wire Wire Line
	10550 1250 9950 1250
Wire Wire Line
	10550 1350 9950 1350
Wire Wire Line
	10550 1450 9950 1450
Wire Wire Line
	10550 1550 9950 1550
Wire Wire Line
	10550 1650 9950 1650
Wire Wire Line
	10550 1750 9950 1750
Wire Wire Line
	10550 1850 9950 1850
Wire Wire Line
	10550 1950 9950 1950
Wire Wire Line
	10550 2050 9950 2050
Wire Wire Line
	10550 2150 9950 2150
Wire Wire Line
	10550 2250 9950 2250
Wire Wire Line
	10550 2350 9950 2350
Wire Wire Line
	10550 2450 9950 2450
Wire Wire Line
	10550 2550 9950 2550
Wire Wire Line
	10550 2650 9950 2650
Wire Wire Line
	10550 2750 9950 2750
Wire Wire Line
	10550 2850 9950 2850
Wire Wire Line
	10550 2950 9950 2950
Wire Wire Line
	10550 3150 9950 3150
Wire Bus Line
	7400 2100 7550 2100
Text Notes 6950 6150 0    50   ~ 0
o12 = /i1 & /i3 & i4 & /i5 & /i6 +\n      /i1 & /i3 & i4 & i5 & i6\n/o15 = /i1 & i3 & i4 & i5 & i6 & i7 & i8 & i9 & i11 +\n       /i1 & /i3 & i4 & i5 & /i6 & /i7 & /i8 +\n       /i1 & i3 & /i4 & /i5 & /i6 & /i7 & i8 +\n       /i1 & i3 & /i4 & /i5 & /i7 & /i8 +\n       /i1 & /i3 & i4 & i5 & /i6 & /i7 & i8 & i9
Text Notes 9350 6350 0    50   ~ 0
o12 = /BUS-AS AND ADDR=(\n    40 0000 - 4f ffff    object positions\n    70 0000 - 7f ffff    object ram\n)\n/o15 = /BUS-AS AND ADDR=(\n    60 0000 - 63 ffff    qsound shared ram\n    66 0000 - 67 ffff    peripherals\n    80 0000 - 83 ffff    cps2 register\n    90 0000 - 93 ffff    gfx ram\n    84 0000 - 87 ffff    ???\n    ff 0000 - ff ffff    ram\n)
Text Label 2050 7300 1    50   ~ 0
CPU-ADDR1
Text Label 2000 1550 1    50   ~ 0
BUS-ADDR1
Text Label 2150 7300 1    50   ~ 0
CPU-ADDR2
Text Label 2100 1550 1    50   ~ 0
BUS-ADDR2
Text Label 2250 7300 1    50   ~ 0
CPU-ADDR3
Text Label 2200 1550 1    50   ~ 0
BUS-ADDR3
Text Label 2350 7300 1    50   ~ 0
CPU-ADDR4
Text Label 2300 1550 1    50   ~ 0
BUS-ADDR4
Text Label 2450 7300 1    50   ~ 0
CPU-ADDR5
Text Label 2400 1550 1    50   ~ 0
BUS-ADDR5
Text Label 2550 7300 1    50   ~ 0
CPU-ADDR6
Text Label 2500 1550 1    50   ~ 0
BUS-ADDR6
Text Label 2650 7300 1    50   ~ 0
CPU-ADDR7
Text Label 2600 1550 1    50   ~ 0
BUS-ADDR7
Text Label 2750 7300 1    50   ~ 0
CPU-ADDR8
Text Label 2700 1550 1    50   ~ 0
BUS-ADDR8
Text Label 2850 7300 1    50   ~ 0
CPU-ADDR9
Text Label 2800 1550 1    50   ~ 0
BUS-ADDR9
Text Label 2950 7300 1    50   ~ 0
CPU-ADDR10
Text Label 2900 1550 1    50   ~ 0
BUS-ADDR10
Text Label 3050 7300 1    50   ~ 0
CPU-ADDR11
Text Label 3000 1550 1    50   ~ 0
BUS-ADDR11
Text Label 3150 7300 1    50   ~ 0
CPU-ADDR12
Text Label 3100 1550 1    50   ~ 0
BUS-ADDR12
Text Label 3250 7300 1    50   ~ 0
CPU-ADDR13
Text Label 3200 1550 1    50   ~ 0
BUS-ADDR13
Text Label 3350 7300 1    50   ~ 0
CPU-ADDR14
Text Label 3300 1550 1    50   ~ 0
BUS-ADDR14
Text Label 3450 7300 1    50   ~ 0
CPU-ADDR15
Text Label 3400 1550 1    50   ~ 0
BUS-ADDR15
Text Label 3550 7300 1    50   ~ 0
CPU-ADDR16
Text Label 3500 1550 1    50   ~ 0
BUS-ADDR16
Text Label 3650 7300 1    50   ~ 0
CPU-ADDR17
Text Label 3600 1550 1    50   ~ 0
BUS-ADDR17
Text Label 3750 7300 1    50   ~ 0
CPU-ADDR18
Text Label 3700 1550 1    50   ~ 0
BUS-ADDR18
Text Label 3850 7300 1    50   ~ 0
CPU-ADDR19
Text Label 3800 1550 1    50   ~ 0
BUS-ADDR19
Text Label 3950 7300 1    50   ~ 0
CPU-ADDR20
Text Label 3900 1550 1    50   ~ 0
BUS-ADDR20
Text Label 4050 7300 1    50   ~ 0
CPU-ADDR21
Text Label 4000 1550 1    50   ~ 0
BUS-ADDR21
Text Label 4150 7300 1    50   ~ 0
CPU-ADDR22
Text Label 4100 1550 1    50   ~ 0
BUS-ADDR22
Text Label 4250 7300 1    50   ~ 0
CPU-ADDR23
Text Label 4200 1550 1    50   ~ 0
BUS-ADDR23
Text Label 4400 7300 1    50   ~ 0
CPU-DATA0
Text Label 4400 1550 1    50   ~ 0
BUS-DATA0
Text Label 4500 7300 1    50   ~ 0
CPU-DATA1
Text Label 4500 1550 1    50   ~ 0
BUS-DATA1
Text Label 4600 7300 1    50   ~ 0
CPU-DATA2
Text Label 4600 1550 1    50   ~ 0
BUS-DATA2
Text Label 4700 7300 1    50   ~ 0
CPU-DATA3
Text Label 4700 1550 1    50   ~ 0
BUS-DATA3
Text Label 4800 7300 1    50   ~ 0
CPU-DATA4
Text Label 4800 1550 1    50   ~ 0
BUS-DATA4
Text Label 4900 7300 1    50   ~ 0
CPU-DATA5
Text Label 4900 1550 1    50   ~ 0
BUS-DATA5
Text Label 5000 7300 1    50   ~ 0
CPU-DATA6
Text Label 5000 1550 1    50   ~ 0
BUS-DATA6
Text Label 5100 7300 1    50   ~ 0
CPU-DATA7
Text Label 5100 1550 1    50   ~ 0
BUS-DATA7
Text Label 5200 7300 1    50   ~ 0
CPU-DATA8
Text Label 5200 1550 1    50   ~ 0
BUS-DATA8
Text Label 5300 7300 1    50   ~ 0
CPU-DATA9
Text Label 5300 1550 1    50   ~ 0
BUS-DATA9
Text Label 5400 7300 1    50   ~ 0
CPU-DATA10
Text Label 5400 1550 1    50   ~ 0
BUS-DATA10
Text Label 5500 7300 1    50   ~ 0
CPU-DATA11
Text Label 5500 1550 1    50   ~ 0
BUS-DATA11
Text Label 5600 7300 1    50   ~ 0
CPU-DATA12
Text Label 5600 1550 1    50   ~ 0
BUS-DATA12
Text Label 5700 7300 1    50   ~ 0
CPU-DATA13
Text Label 5700 1550 1    50   ~ 0
BUS-DATA13
Text Label 5800 7300 1    50   ~ 0
CPU-DATA14
Text Label 5800 1550 1    50   ~ 0
BUS-DATA14
Text Label 5900 7300 1    50   ~ 0
CPU-DATA15
Text Label 5900 1550 1    50   ~ 0
BUS-DATA15
Text Label 7950 2800 2    50   ~ 0
CONTROL6
Text Label 6850 2400 0    50   ~ 0
CONTROL5
Text Label 6850 2500 0    50   ~ 0
CONTROL4
Text Label 6850 2600 0    50   ~ 0
CONTROL3
Text Label 6850 2700 0    50   ~ 0
CONTROL2
Text Label 6850 2800 0    50   ~ 0
CONTROL1
Text Label 9050 850  2    50   ~ 0
CPU-DATA0
Text Label 9050 950  2    50   ~ 0
CPU-DATA1
Text Label 9050 1050 2    50   ~ 0
CPU-DATA2
Text Label 9050 1150 2    50   ~ 0
CPU-DATA3
Text Label 9050 1250 2    50   ~ 0
CPU-DATA4
Text Label 9050 1350 2    50   ~ 0
CPU-DATA5
Text Label 9050 1450 2    50   ~ 0
CPU-DATA6
Text Label 9050 1550 2    50   ~ 0
CPU-DATA7
Text Label 9050 1650 2    50   ~ 0
CPU-DATA8
Text Label 9050 1750 2    50   ~ 0
CPU-DATA9
Text Label 9050 1850 2    50   ~ 0
CPU-DATA10
Text Label 9050 1950 2    50   ~ 0
CPU-DATA11
Text Label 9050 2050 2    50   ~ 0
CPU-DATA12
Text Label 9050 2150 2    50   ~ 0
CPU-DATA13
Text Label 9050 2250 2    50   ~ 0
CPU-DATA14
Text Label 9050 2350 2    50   ~ 0
CPU-DATA15
Text Label 9750 3850 0    50   ~ 0
CONTROL4
Text Label 9750 3950 0    50   ~ 0
CONTROL6
Text Label 9750 4050 0    50   ~ 0
BUS-ADDR23
Text Label 9750 4150 0    50   ~ 0
BUS-ADDR22
Text Label 9750 4250 0    50   ~ 0
BUS-ADDR21
Text Label 9750 4350 0    50   ~ 0
BUS-ADDR20
Text Label 9750 4450 0    50   ~ 0
BUS-ADDR19
Text Label 9750 4550 0    50   ~ 0
BUS-ADDR18
Text Label 9750 4650 0    50   ~ 0
BUS-ADDR17
Text Label 9750 4750 0    50   ~ 0
BUS-ADDR16
Text Label 10500 850  2    50   ~ 0
CPU-ADDR1
Text Label 10500 950  2    50   ~ 0
CPU-ADDR2
Text Label 10500 1050 2    50   ~ 0
CPU-ADDR3
Text Label 10500 1150 2    50   ~ 0
CPU-ADDR4
Text Label 10500 1250 2    50   ~ 0
CPU-ADDR5
Text Label 10500 1350 2    50   ~ 0
CPU-ADDR6
Text Label 10500 1450 2    50   ~ 0
CPU-ADDR7
Text Label 10500 1550 2    50   ~ 0
CPU-ADDR8
Text Label 10500 1650 2    50   ~ 0
CPU-ADDR9
Text Label 10500 1750 2    50   ~ 0
CPU-ADDR10
Text Label 10500 1850 2    50   ~ 0
CPU-ADDR11
Text Label 10500 1950 2    50   ~ 0
CPU-ADDR12
Text Label 10500 2050 2    50   ~ 0
CPU-ADDR13
Text Label 10500 2150 2    50   ~ 0
CPU-ADDR14
Text Label 10500 2250 2    50   ~ 0
CPU-ADDR15
Text Label 10500 2350 2    50   ~ 0
CPU-ADDR16
Text Label 10500 2450 2    50   ~ 0
CPU-ADDR17
Text Label 10500 2550 2    50   ~ 0
CPU-ADDR18
Text Label 10500 2650 2    50   ~ 0
CPU-ADDR19
Text Label 10500 2750 2    50   ~ 0
CPU-ADDR20
Text Label 10500 2850 2    50   ~ 0
CPU-ADDR21
Text Label 10500 2950 2    50   ~ 0
CPU-ADDR22
Text Label 10500 3150 2    50   ~ 0
CPU-ADDR23
Text HLabel 1600 7450 0    50   Input ~ 0
CPU-ADDR[1..23]
Text HLabel 1650 900  0    50   Output ~ 0
BUS-ADDR[1..23]
Text HLabel 6200 7450 2    50   Input ~ 0
CPU-DATA[0..15]
Text HLabel 6300 900  2    50   BiDi ~ 0
BUS-DATA[0..15]
Text HLabel 7050 3050 2    50   Output ~ 0
CBUS-DATA-DIR
Text HLabel 7050 3150 2    50   Output ~ 0
CBUS-ADDR-DIR
Text HLabel 7050 3250 2    50   Output ~ 0
~CBUS-ADDR-ENABLE
Text HLabel 7250 3400 2    50   Output ~ 0
ENABLE
Text HLabel 7250 3500 2    50   Input ~ 0
~ENABLE-REGISTERS
Text HLabel 7250 3600 2    50   Input ~ 0
ENABLE-ADDR-BUS
Text HLabel 7250 3900 2    50   Input ~ 0
CLK16M
Text HLabel 7250 4000 2    50   Input ~ 0
CLK2M
Text HLabel 6950 4200 2    50   Output ~ 0
CLK2M-OUT
Text HLabel 6950 4300 2    50   Output ~ 0
CLK16M-OUT
Text HLabel 7250 3700 2    50   Input ~ 0
~A-BOARD-CONNECTED
Text HLabel 7250 4650 2    50   Input ~ 0
~RESETI
Text HLabel 7250 4750 2    50   Output ~ 0
~RESETI-OUT
Text HLabel 7250 4950 2    50   Output ~ 0
~OBJRAM-BANK-W
Text HLabel 7550 2100 2    50   Input ~ 0
BUS-CONTROL[1..7]
Text HLabel 8500 4250 0    50   Output ~ 0
~CBUS-DATA-ENABLE
$Comp
L power:VCC #PWR0171
U 1 1 5D9743F0
P 950 2050
F 0 "#PWR0171" H 950 1900 50  0001 C CNN
F 1 "VCC" H 967 2223 50  0000 C CNN
F 2 "" H 950 2050 50  0001 C CNN
F 3 "" H 950 2050 50  0001 C CNN
	1    950  2050
	1    0    0    -1  
$EndComp
$Comp
L power:VCC #PWR0168
U 1 1 5D958F8E
P 1200 5350
F 0 "#PWR0168" H 1200 5200 50  0001 C CNN
F 1 "VCC" H 1217 5523 50  0000 C CNN
F 2 "" H 1200 5350 50  0001 C CNN
F 3 "" H 1200 5350 50  0001 C CNN
	1    1200 5350
	-1   0    0    -1  
$EndComp
$Comp
L power:VDD #PWR0173
U 1 1 5D9779DA
P 1400 3000
F 0 "#PWR0173" H 1400 2850 50  0001 C CNN
F 1 "VDD" H 1417 3173 50  0000 C CNN
F 2 "" H 1400 3000 50  0001 C CNN
F 3 "" H 1400 3000 50  0001 C CNN
	1    1400 3000
	-1   0    0    -1  
$EndComp
$Comp
L power:VCC #PWR0169
U 1 1 5D95A037
P 600 6200
F 0 "#PWR0169" H 600 6050 50  0001 C CNN
F 1 "VCC" H 617 6373 50  0000 C CNN
F 2 "" H 600 6200 50  0001 C CNN
F 3 "" H 600 6200 50  0001 C CNN
	1    600  6200
	-1   0    0    -1  
$EndComp
$Comp
L power:VCC #PWR?
U 1 1 5DF5EEA9
P 9200 3650
AR Path="/635BEEB0/5DF5EEA9" Ref="#PWR?"  Part="1" 
AR Path="/5DF5EEA9" Ref="#PWR?"  Part="1" 
AR Path="/5DC1E7F0/5DF5EEA9" Ref="#PWR0180"  Part="1" 
F 0 "#PWR0180" H 9200 3500 50  0001 C CNN
F 1 "VCC" H 9000 3700 50  0000 L CNN
F 2 "" H 9200 3650 50  0001 C CNN
F 3 "" H 9200 3650 50  0001 C CNN
	1    9200 3650
	1    0    0    -1  
$EndComp
$Comp
L power:VCC #PWR0177
U 1 1 5EDB9AC1
P 9500 850
F 0 "#PWR0177" H 9500 700 50  0001 C CNN
F 1 "VCC" H 9517 1023 50  0000 C CNN
F 2 "" H 9500 850 50  0001 C CNN
F 3 "" H 9500 850 50  0001 C CNN
	1    9500 850 
	0    1    1    0   
$EndComp
$Comp
L power:VCC #PWR0178
U 1 1 5EDB9ACE
P 9500 1650
F 0 "#PWR0178" H 9500 1500 50  0001 C CNN
F 1 "VCC" H 9517 1823 50  0000 C CNN
F 2 "" H 9500 1650 50  0001 C CNN
F 3 "" H 9500 1650 50  0001 C CNN
	1    9500 1650
	0    1    1    0   
$EndComp
$Comp
L power:VCC #PWR0174
U 1 1 5ED26C4C
P 10950 850
F 0 "#PWR0174" H 10950 700 50  0001 C CNN
F 1 "VCC" H 10967 1023 50  0000 C CNN
F 2 "" H 10950 850 50  0001 C CNN
F 3 "" H 10950 850 50  0001 C CNN
	1    10950 850 
	0    1    1    0   
$EndComp
$Comp
L power:VCC #PWR0175
U 1 1 5ED5D927
P 10950 1650
F 0 "#PWR0175" H 10950 1500 50  0001 C CNN
F 1 "VCC" H 10967 1823 50  0000 C CNN
F 2 "" H 10950 1650 50  0001 C CNN
F 3 "" H 10950 1650 50  0001 C CNN
	1    10950 1650
	0    1    1    0   
$EndComp
$Comp
L power:VCC #PWR0176
U 1 1 5ED646AB
P 10950 2450
F 0 "#PWR0176" H 10950 2300 50  0001 C CNN
F 1 "VCC" H 10967 2623 50  0000 C CNN
F 2 "" H 10950 2450 50  0001 C CNN
F 3 "" H 10950 2450 50  0001 C CNN
	1    10950 2450
	0    1    1    0   
$EndComp
$Comp
L power:GND #PWR0172
U 1 1 5D9743F8
P 950 2750
F 0 "#PWR0172" H 950 2500 50  0001 C CNN
F 1 "GND" H 955 2577 50  0000 C CNN
F 2 "" H 950 2750 50  0001 C CNN
F 3 "" H 950 2750 50  0001 C CNN
	1    950  2750
	1    0    0    -1  
$EndComp
$Comp
L power:GND #PWR0170
U 1 1 5D9680AF
P 1400 4150
F 0 "#PWR0170" H 1400 3900 50  0001 C CNN
F 1 "GND" H 1405 3977 50  0000 C CNN
F 2 "" H 1400 4150 50  0001 C CNN
F 3 "" H 1400 4150 50  0001 C CNN
	1    1400 4150
	-1   0    0    -1  
$EndComp
$Comp
L power:GND #PWR?
U 1 1 5E2F06DF
P 8450 4050
AR Path="/6492EFBF/5E2F06DF" Ref="#PWR?"  Part="1" 
AR Path="/5E2F06DF" Ref="#PWR?"  Part="1" 
AR Path="/5DC1E7F0/5E2F06DF" Ref="#PWR0182"  Part="1" 
F 0 "#PWR0182" H 8450 3800 50  0001 C CNN
F 1 "GND" H 8455 3877 50  0001 C CNN
F 2 "" H 8450 4050 50  0001 C CNN
F 3 "" H 8450 4050 50  0001 C CNN
	1    8450 4050
	1    0    0    -1  
$EndComp
$Comp
L power:GND #PWR?
U 1 1 5DB9D477
P 9200 4950
AR Path="/6492EFBF/5DB9D477" Ref="#PWR?"  Part="1" 
AR Path="/5DB9D477" Ref="#PWR?"  Part="1" 
AR Path="/5DC1E7F0/5DB9D477" Ref="#PWR0179"  Part="1" 
F 0 "#PWR0179" H 9200 4700 50  0001 C CNN
F 1 "GND" H 9205 4777 50  0001 C CNN
F 2 "" H 9200 4950 50  0001 C CNN
F 3 "" H 9200 4950 50  0001 C CNN
	1    9200 4950
	1    0    0    -1  
$EndComp
$Comp
L power:GND #PWR?
U 1 1 5E05CDB4
P 9700 3650
AR Path="/635BEEB0/5E05CDB4" Ref="#PWR?"  Part="1" 
AR Path="/5E05CDB4" Ref="#PWR?"  Part="1" 
AR Path="/5DC1E7F0/5E05CDB4" Ref="#PWR0181"  Part="1" 
F 0 "#PWR0181" H 9700 3400 50  0001 C CNN
F 1 "GND" H 9705 3477 50  0001 C CNN
F 2 "" H 9700 3650 50  0001 C CNN
F 3 "" H 9700 3650 50  0001 C CNN
	1    9700 3650
	-1   0    0    -1  
$EndComp
$Comp
L Device:R_Small R12
U 1 1 5D966AAB
P 800 7000
F 0 "R12" V 750 6850 50  0000 C CNN
F 1 "4.7k" V 750 7150 50  0000 C CNN
F 2 "" H 800 7000 50  0001 C CNN
F 3 "~" H 800 7000 50  0001 C CNN
	1    800  7000
	0    1    -1   0   
$EndComp
$Comp
L Device:C_Small CX?
U 1 1 5DDFA3CE
P 1400 3350
AR Path="/5E35B989/5DDFA3CE" Ref="CX?"  Part="1" 
AR Path="/5DC1E7F0/5DDFA3CE" Ref="CX13"  Part="1" 
F 0 "CX13" H 1492 3396 50  0001 L CNN
F 1 "0.1u" H 1200 3250 50  0000 L CNN
F 2 "" H 1400 3350 50  0001 C CNN
F 3 "~" H 1400 3350 50  0001 C CNN
	1    1400 3350
	-1   0    0    -1  
$EndComp
$Comp
L Device:C_Small C?
U 1 1 5E05CDAE
P 9600 3650
AR Path="/635BEEB0/5E05CDAE" Ref="C?"  Part="1" 
AR Path="/5E05CDAE" Ref="C?"  Part="1" 
AR Path="/5DC1E7F0/5E05CDAE" Ref="CX14"  Part="1" 
F 0 "CX14" V 9371 3650 50  0001 C CNN
F 1 "0.1u" V 9463 3650 50  0000 C TNN
F 2 "" H 9600 3650 50  0001 C CNN
F 3 "~" H 9600 3650 50  0001 C CNN
	1    9600 3650
	0    -1   1    0   
$EndComp
$Comp
L Device:Ferrite_Bead_Small FB2
U 1 1 5DA9B1A5
P 7000 3900
F 0 "FB2" V 6855 3900 50  0000 C CNN
F 1 "Ferrite_Bead_Small" V 6854 3900 50  0001 C CNN
F 2 "" V 6930 3900 50  0001 C CNN
F 3 "~" H 7000 3900 50  0001 C CNN
	1    7000 3900
	0    1    1    0   
$EndComp
$Comp
L Device:C EXC?
U 1 1 5DDFA3D4
P 1150 3350
AR Path="/5E35B989/5DDFA3D4" Ref="EXC?"  Part="1" 
AR Path="/5DC1E7F0/5DDFA3D4" Ref="EXC3"  Part="1" 
F 0 "EXC3" H 1150 3450 50  0000 L CNN
F 1 "1u" H 1150 3250 50  0000 L CNN
F 2 "" H 1188 3200 50  0001 C CNN
F 3 "~" H 1150 3350 50  0001 C CNN
	1    1150 3350
	1    0    0    -1  
$EndComp
$Comp
L Device:R_Network08 RA23
U 1 1 5D955DF7
P 1400 5750
F 0 "RA23" V 783 5750 50  0000 C CNN
F 1 "4.7k" V 874 5750 50  0000 C CNN
F 2 "Resistor_THT:R_Array_SIP9" V 1875 5750 50  0001 C CNN
F 3 "http://www.vishay.com/docs/31509/csc.pdf" H 1400 5750 50  0001 C CNN
	1    1400 5750
	0    -1   1    0   
$EndComp
$Comp
L Device:R_Network08 RA24
U 1 1 5D95A030
P 800 6600
F 0 "RA24" V 183 6600 50  0000 C CNN
F 1 "4.7k" V 274 6600 50  0000 C CNN
F 2 "Resistor_THT:R_Array_SIP9" V 1275 6600 50  0001 C CNN
F 3 "http://www.vishay.com/docs/31509/csc.pdf" H 800 6600 50  0001 C CNN
	1    800  6600
	0    -1   1    0   
$EndComp
$Comp
L Device:R_Network08 RA21
U 1 1 5EDB9ABA
P 9300 1250
F 0 "RA21" V 9600 1500 50  0000 C CNN
F 1 "4.7k" V 9500 1500 50  0000 C CNN
F 2 "Resistor_THT:R_Array_SIP9" V 9775 1250 50  0001 C CNN
F 3 "http://www.vishay.com/docs/31509/csc.pdf" H 9300 1250 50  0001 C CNN
	1    9300 1250
	0    1    1    0   
$EndComp
$Comp
L Device:R_Network08 RA22
U 1 1 5EDB9AC7
P 9300 2050
F 0 "RA22" V 9600 2300 50  0000 C CNN
F 1 "4.7k" V 9500 2300 50  0000 C CNN
F 2 "Resistor_THT:R_Array_SIP9" V 9775 2050 50  0001 C CNN
F 3 "http://www.vishay.com/docs/31509/csc.pdf" H 9300 2050 50  0001 C CNN
	1    9300 2050
	0    1    1    0   
$EndComp
$Comp
L Device:R_Network08 RA18
U 1 1 5ED26C45
P 10750 1250
F 0 "RA18" V 11050 1500 50  0000 C CNN
F 1 "4.7k" V 10950 1500 50  0000 C CNN
F 2 "Resistor_THT:R_Array_SIP9" V 11225 1250 50  0001 C CNN
F 3 "http://www.vishay.com/docs/31509/csc.pdf" H 10750 1250 50  0001 C CNN
	1    10750 1250
	0    1    1    0   
$EndComp
$Comp
L Device:R_Network08 RA19
U 1 1 5ED5D920
P 10750 2050
F 0 "RA19" V 11050 2300 50  0000 C CNN
F 1 "4.7k" V 10950 2300 50  0000 C CNN
F 2 "Resistor_THT:R_Array_SIP9" V 11225 2050 50  0001 C CNN
F 3 "http://www.vishay.com/docs/31509/csc.pdf" H 10750 2050 50  0001 C CNN
	1    10750 2050
	0    1    1    0   
$EndComp
$Comp
L Device:R_Network08 RA20
U 1 1 5ED646A4
P 10750 2850
F 0 "RA20" V 11050 3100 50  0000 C CNN
F 1 "4.7k" V 10950 3100 50  0000 C CNN
F 2 "Resistor_THT:R_Array_SIP9" V 11225 2850 50  0001 C CNN
F 3 "http://www.vishay.com/docs/31509/csc.pdf" H 10750 2850 50  0001 C CNN
	1    10750 2850
	0    1    1    0   
$EndComp
$Comp
L CPS2-Custom:RX5VA VD1
U 1 1 5D9743FF
P 950 2400
F 0 "VD1" H 1150 2700 50  0000 L CNN
F 1 "RX5VA" H 650 2100 50  0000 L CNN
F 2 "" V 550 2500 50  0001 C CNN
F 3 "" V 550 2500 50  0001 C CNN
	1    950  2400
	1    0    0    -1  
$EndComp
$Comp
L CPS2-Custom:PAL16L8-PIN16IN UH10
U 1 1 5DBFCD70
P 9200 4350
F 0 "UH10" H 9450 4950 50  0000 C CNN
F 1 "PAL16L8" H 9000 3850 50  0000 C CNN
F 2 "" H 9200 4350 50  0001 C CNN
F 3 "" H 9200 4350 50  0001 C CNN
	1    9200 4350
	-1   0    0    -1  
$EndComp
$Comp
L CPS2-Custom:DL-1727 U-MIF-H7
U 1 1 5DC25FE7
P 3950 3950
AR Path="/5DC25FE7" Ref="U-MIF-H7"  Part="1" 
AR Path="/5DC1E7F0/5DC25FE7" Ref="U-MIF-H7"  Part="1" 
F 0 "U-MIF-H7" V 3650 3950 200 0000 C CNN
F 1 "DL-1727" V 3950 3950 200 0000 C CNN
F 2 "" H 7550 5400 50  0001 C CNN
F 3 "" H 7550 5400 50  0001 C CNN
	1    3950 3950
	0    -1   1    0   
$EndComp
NoConn ~ 6800 5100
NoConn ~ 6800 5200
NoConn ~ 6800 5300
NoConn ~ 6800 5400
NoConn ~ 6800 5500
NoConn ~ 6800 5600
NoConn ~ 6800 5700
NoConn ~ 6800 5800
NoConn ~ 6150 1600
NoConn ~ 6250 1600
NoConn ~ 6350 1600
Entry Wire Line
	7300 2300 7400 2200
Wire Wire Line
	6800 2300 7300 2300
Text Label 6850 2300 0    50   ~ 0
CONTROL7
Text Label 7400 2100 2    50   ~ 0
CONTROL[1..7]
Wire Wire Line
	1600 6200 1000 6200
Wire Wire Line
	1600 6300 1000 6300
Wire Wire Line
	1600 6400 1000 6400
Wire Wire Line
	1600 6500 1000 6500
Wire Wire Line
	1600 6600 1000 6600
Wire Wire Line
	1600 6700 1000 6700
Wire Wire Line
	1600 6800 1000 6800
Wire Wire Line
	1600 6900 1000 6900
Wire Wire Line
	900  7000 1600 7000
Text Label 1100 6500 0    50   ~ 0
REG9-D0
Text Label 1100 6600 0    50   ~ 0
REG9-D1
Text Label 1100 6700 0    50   ~ 0
REG9-D2
Text Label 1100 6800 0    50   ~ 0
REG9-D3
Text Label 1100 6900 0    50   ~ 0
REG9-D4
Text Label 1100 7000 0    50   ~ 0
REG9-D15
Text Label 6050 7200 1    50   ~ 0
REG9-D0
Text Label 6150 7200 1    50   ~ 0
REG9-D1
Text Label 6250 7200 1    50   ~ 0
REG9-D2
Text Label 6350 7200 1    50   ~ 0
REG9-D3
Text Label 6450 7200 1    50   ~ 0
REG9-D4
Text Label 6550 7200 1    50   ~ 0
REG9-D15
Wire Wire Line
	6550 6750 6550 7200
Wire Wire Line
	6450 7200 6450 6750
Wire Wire Line
	6350 6750 6350 7200
Wire Wire Line
	6250 7200 6250 6750
Wire Wire Line
	6150 6750 6150 7200
Wire Wire Line
	6050 7200 6050 6750
Wire Wire Line
	6800 4200 6950 4200
Wire Wire Line
	6800 4300 6950 4300
Wire Wire Line
	6800 4550 8700 4550
Wire Wire Line
	8700 4350 8550 4350
Wire Wire Line
	8550 4350 8550 4450
Wire Wire Line
	8550 4450 6800 4450
Wire Bus Line
	7400 2100 7400 2700
Wire Bus Line
	4500 900  6300 900 
Wire Bus Line
	4500 7450 6200 7450
Wire Bus Line
	1600 7450 4150 7450
Wire Bus Line
	1650 900  4100 900 
$EndSCHEMATC
