EESchema Schematic File Version 4
EELAYER 30 0
EELAYER END
$Descr A3 16535 11693
encoding utf-8
Sheet 71 83
Title "CPS Reverse Engineering: DL-0311"
Date "2021-09-12"
Rev ""
Comp ""
Comment1 ""
Comment2 ""
Comment3 "Licence: CC-BY"
Comment4 "Author: Loïc *WydD* Petit"
$EndDescr
Connection ~ 5200 4400
Connection ~ 5350 4550
Connection ~ 5450 4650
Connection ~ 5550 4800
Connection ~ 5650 4900
Connection ~ 5750 5000
Connection ~ 5850 5100
Connection ~ 5950 5250
Connection ~ 6050 5350
Connection ~ 8050 4400
Connection ~ 8200 4550
Connection ~ 8300 4650
Connection ~ 8400 4800
Connection ~ 8500 4900
Connection ~ 8600 5000
Connection ~ 8700 5100
Connection ~ 8800 5250
Connection ~ 8900 5350
Connection ~ 7800 4400
Connection ~ 7800 2750
Connection ~ 10650 2950
Connection ~ 10650 4400
Connection ~ 10750 4500
Connection ~ 10750 3050
Connection ~ 7900 4500
Connection ~ 7900 2850
Connection ~ 8050 5850
Connection ~ 5200 5850
Connection ~ 8200 6000
Connection ~ 5350 6000
Connection ~ 5450 6100
Connection ~ 8300 6100
Connection ~ 8400 6250
Connection ~ 5550 6250
Connection ~ 5650 6350
Connection ~ 8500 6350
Connection ~ 8600 6450
Connection ~ 5750 6450
Connection ~ 5850 6550
Connection ~ 8700 6550
Connection ~ 8800 6700
Connection ~ 5950 6700
Connection ~ 6050 6800
Connection ~ 8900 6800
Connection ~ 5350 7200
Connection ~ 5450 7300
Connection ~ 5550 7450
Connection ~ 5650 7550
Connection ~ 5750 7650
Connection ~ 5850 7750
Connection ~ 6050 8000
Connection ~ 5950 7900
Connection ~ 8050 7100
Connection ~ 10650 5850
Connection ~ 10750 5950
Connection ~ 5000 2750
Connection ~ 5100 8300
Connection ~ 9100 8700
Connection ~ 9200 8800
Connection ~ 9000 8200
Connection ~ 5200 2950
Connection ~ 5000 6750
Connection ~ 11400 9050
Connection ~ 10650 8100
Connection ~ 10750 8200
Entry Wire Line
	2750 7100 2850 7200
Entry Wire Line
	3300 6050 3200 6150
Entry Wire Line
	3300 6150 3200 6250
Entry Wire Line
	3300 6250 3200 6350
Entry Wire Line
	3300 6350 3200 6450
Entry Wire Line
	3300 6450 3200 6550
Entry Wire Line
	3300 6550 3200 6650
Entry Wire Line
	4600 5950 4500 6050
Entry Wire Line
	4600 6050 4500 6150
Entry Wire Line
	4600 6150 4500 6250
Entry Wire Line
	4600 6250 4500 6350
Wire Wire Line
	2850 7200 3200 7200
Wire Wire Line
	3100 7350 3200 7350
Wire Wire Line
	3100 7650 3200 7650
Wire Wire Line
	3100 7800 3200 7800
Wire Wire Line
	3200 7450 3100 7450
Wire Wire Line
	3200 7550 3100 7550
Wire Wire Line
	3200 7950 3100 7950
Wire Wire Line
	3300 6050 4500 6050
Wire Wire Line
	3300 6150 4500 6150
Wire Wire Line
	3300 6250 4500 6250
Wire Wire Line
	3300 6350 4500 6350
Wire Wire Line
	3850 6450 3300 6450
Wire Wire Line
	3850 6550 3300 6550
Wire Wire Line
	4600 7900 5950 7900
Wire Wire Line
	4600 8000 6050 8000
Wire Wire Line
	4600 8200 9000 8200
Wire Wire Line
	4600 8300 5100 8300
Wire Wire Line
	4600 8700 9100 8700
Wire Wire Line
	4600 8800 9200 8800
Wire Wire Line
	4600 9200 11400 9200
Wire Wire Line
	5100 2850 6150 2850
Wire Wire Line
	5100 8300 5100 2850
Wire Wire Line
	5100 8300 9300 8300
Wire Wire Line
	5350 3100 5350 4550
Wire Wire Line
	5350 4550 5350 6000
Wire Wire Line
	5350 6000 6150 6000
Wire Wire Line
	5350 7200 4600 7200
Wire Wire Line
	5350 7200 5350 6000
Wire Wire Line
	5450 3200 6150 3200
Wire Wire Line
	5450 4650 5450 3200
Wire Wire Line
	5450 4650 6150 4650
Wire Wire Line
	5450 6100 5450 4650
Wire Wire Line
	5450 6100 5450 7300
Wire Wire Line
	5450 6100 6150 6100
Wire Wire Line
	5450 7300 4600 7300
Wire Wire Line
	5450 7300 8300 7300
Wire Wire Line
	5550 3350 5550 4800
Wire Wire Line
	5550 4800 5550 6250
Wire Wire Line
	5550 6250 5550 7450
Wire Wire Line
	5550 6250 6150 6250
Wire Wire Line
	5550 7450 4600 7450
Wire Wire Line
	5650 3450 6150 3450
Wire Wire Line
	5650 4900 5650 3450
Wire Wire Line
	5650 6350 5650 4900
Wire Wire Line
	5650 6350 5650 7550
Wire Wire Line
	5650 6350 6150 6350
Wire Wire Line
	5650 7550 4600 7550
Wire Wire Line
	5650 7550 8500 7550
Wire Wire Line
	5750 3550 5750 5000
Wire Wire Line
	5750 5000 5750 6450
Wire Wire Line
	5750 6450 5750 7650
Wire Wire Line
	5750 6450 6150 6450
Wire Wire Line
	5750 7650 4600 7650
Wire Wire Line
	5850 3650 6150 3650
Wire Wire Line
	5850 5100 5850 3650
Wire Wire Line
	5850 6550 5850 5100
Wire Wire Line
	5850 6550 5850 7750
Wire Wire Line
	5850 7750 4600 7750
Wire Wire Line
	5850 7750 8700 7750
Wire Wire Line
	5950 3800 5950 5250
Wire Wire Line
	5950 5250 5950 6700
Wire Wire Line
	5950 6700 5950 7900
Wire Wire Line
	5950 6700 6150 6700
Wire Wire Line
	5950 7900 8800 7900
Wire Wire Line
	6050 3900 6150 3900
Wire Wire Line
	6050 5350 6050 3900
Wire Wire Line
	6050 6800 6050 5350
Wire Wire Line
	6050 6800 6050 8000
Wire Wire Line
	6050 8000 8900 8000
Wire Wire Line
	6150 3100 5350 3100
Wire Wire Line
	6150 3350 5550 3350
Wire Wire Line
	6150 3550 5750 3550
Wire Wire Line
	6150 3800 5950 3800
Wire Wire Line
	6150 4550 5350 4550
Wire Wire Line
	6150 4800 5550 4800
Wire Wire Line
	6150 4900 5650 4900
Wire Wire Line
	6150 5000 5750 5000
Wire Wire Line
	6150 5100 5850 5100
Wire Wire Line
	6150 5250 5950 5250
Wire Wire Line
	6150 5350 6050 5350
Wire Wire Line
	6150 6550 5850 6550
Wire Wire Line
	6150 6800 6050 6800
Wire Wire Line
	8200 3100 8200 4550
Wire Wire Line
	8200 4550 8200 6000
Wire Wire Line
	8200 6000 8200 7200
Wire Wire Line
	8200 6000 9000 6000
Wire Wire Line
	8200 7200 5350 7200
Wire Wire Line
	8300 3200 9000 3200
Wire Wire Line
	8300 4650 8300 3200
Wire Wire Line
	8300 4650 9000 4650
Wire Wire Line
	8300 6100 8300 4650
Wire Wire Line
	8300 6100 9000 6100
Wire Wire Line
	8300 7300 8300 6100
Wire Wire Line
	8400 3350 8400 4800
Wire Wire Line
	8400 4800 8400 6250
Wire Wire Line
	8400 6250 8400 7450
Wire Wire Line
	8400 6250 9000 6250
Wire Wire Line
	8400 7450 5550 7450
Wire Wire Line
	8500 3450 9000 3450
Wire Wire Line
	8500 4900 8500 3450
Wire Wire Line
	8500 6350 8500 4900
Wire Wire Line
	8500 6350 8500 7550
Wire Wire Line
	8500 6350 9000 6350
Wire Wire Line
	8600 3550 8600 5000
Wire Wire Line
	8600 5000 8600 6450
Wire Wire Line
	8600 6450 8600 7650
Wire Wire Line
	8600 6450 9000 6450
Wire Wire Line
	8600 7650 5750 7650
Wire Wire Line
	8700 3650 9000 3650
Wire Wire Line
	8700 5100 8700 3650
Wire Wire Line
	8700 6550 8700 5100
Wire Wire Line
	8700 6550 8700 7750
Wire Wire Line
	8800 3800 8800 5250
Wire Wire Line
	8800 5250 8800 6700
Wire Wire Line
	8800 6700 8800 7900
Wire Wire Line
	8800 6700 9000 6700
Wire Wire Line
	8900 3900 9000 3900
Wire Wire Line
	8900 5350 8900 3900
Wire Wire Line
	8900 6800 8900 5350
Wire Wire Line
	8900 6800 8900 8000
Wire Wire Line
	8950 8400 9300 8400
Wire Wire Line
	8950 8950 9300 8950
Wire Wire Line
	9000 3100 8200 3100
Wire Wire Line
	9000 3350 8400 3350
Wire Wire Line
	9000 3550 8600 3550
Wire Wire Line
	9000 3800 8800 3800
Wire Wire Line
	9000 4550 8200 4550
Wire Wire Line
	9000 4800 8400 4800
Wire Wire Line
	9000 4900 8500 4900
Wire Wire Line
	9000 5000 8600 5000
Wire Wire Line
	9000 5100 8700 5100
Wire Wire Line
	9000 5250 8800 5250
Wire Wire Line
	9000 5350 8900 5350
Wire Wire Line
	9000 6550 8700 6550
Wire Wire Line
	9000 6800 8900 6800
Wire Wire Line
	9000 7100 9000 8200
Wire Wire Line
	9000 8200 9300 8200
Wire Wire Line
	9100 7500 9100 8700
Wire Wire Line
	9100 7500 11500 7500
Wire Wire Line
	9100 8700 9300 8700
Wire Wire Line
	9200 7600 9200 8800
Wire Wire Line
	9200 8800 9300 8800
Wire Wire Line
	10550 8350 11500 8350
Wire Wire Line
	10550 8450 11500 8450
Wire Wire Line
	10550 8550 11500 8550
Wire Wire Line
	10550 8700 11500 8700
Wire Wire Line
	10550 8800 11500 8800
Wire Wire Line
	11400 6900 11500 6900
Wire Wire Line
	11400 7000 11500 7000
Wire Wire Line
	11400 7400 11500 7400
Wire Wire Line
	11400 9050 11400 7400
Wire Wire Line
	11400 9050 11500 9050
Wire Wire Line
	11400 9200 11400 9050
Wire Wire Line
	11500 7100 9000 7100
Wire Wire Line
	11500 7600 9200 7600
Wire Wire Line
	12800 6750 12900 6750
Wire Wire Line
	12800 8100 12900 8100
Wire Wire Line
	12800 8450 12900 8450
Wire Wire Line
	12900 7600 12800 7600
Wire Wire Line
	12900 8100 12900 7600
Wire Bus Line
	2600 7100 2750 7100
Wire Bus Line
	3200 6750 5000 6750
Wire Bus Line
	4600 5850 5200 5850
Wire Bus Line
	4900 2750 5000 2750
Wire Bus Line
	4900 2950 5200 2950
Wire Bus Line
	5000 2750 5000 6750
Wire Bus Line
	5000 2750 6150 2750
Wire Bus Line
	5000 6750 5000 8100
Wire Bus Line
	5000 8100 9300 8100
Wire Bus Line
	5200 2950 6150 2950
Wire Bus Line
	5200 4400 5200 2950
Wire Bus Line
	5200 5850 5200 4400
Wire Bus Line
	5200 7100 5200 5850
Wire Bus Line
	6150 4400 5200 4400
Wire Bus Line
	6150 5850 5200 5850
Wire Bus Line
	7700 2850 7900 2850
Wire Bus Line
	7700 4500 7900 4500
Wire Bus Line
	7700 5850 7800 5850
Wire Bus Line
	7800 2600 10650 2600
Wire Bus Line
	7800 2750 7700 2750
Wire Bus Line
	7800 2750 7800 2600
Wire Bus Line
	7800 4400 7700 4400
Wire Bus Line
	7800 4400 7800 2750
Wire Bus Line
	7800 5850 7800 4400
Wire Bus Line
	7900 2700 7900 2850
Wire Bus Line
	7900 2850 7900 4500
Wire Bus Line
	7900 4500 7900 5950
Wire Bus Line
	7900 5950 7700 5950
Wire Bus Line
	8050 2950 9000 2950
Wire Bus Line
	8050 4400 8050 2950
Wire Bus Line
	8050 5850 8050 4400
Wire Bus Line
	8050 5850 8050 7100
Wire Bus Line
	8050 7100 5200 7100
Wire Bus Line
	8050 7100 8050 8550
Wire Bus Line
	8050 8550 9300 8550
Wire Bus Line
	9000 4400 8050 4400
Wire Bus Line
	9000 5850 8050 5850
Wire Bus Line
	10550 5950 10750 5950
Wire Bus Line
	10550 8100 10650 8100
Wire Bus Line
	10550 8200 10750 8200
Wire Bus Line
	10650 2600 10650 2950
Wire Bus Line
	10650 2950 10550 2950
Wire Bus Line
	10650 2950 10650 4400
Wire Bus Line
	10650 4400 10550 4400
Wire Bus Line
	10650 4400 10650 5850
Wire Bus Line
	10650 5850 10550 5850
Wire Bus Line
	10650 5850 10650 8100
Wire Bus Line
	10650 8100 11500 8100
Wire Bus Line
	10750 2700 7900 2700
Wire Bus Line
	10750 3050 10550 3050
Wire Bus Line
	10750 3050 10750 2700
Wire Bus Line
	10750 4500 10550 4500
Wire Bus Line
	10750 4500 10750 3050
Wire Bus Line
	10750 5950 10750 4500
Wire Bus Line
	10750 5950 10750 8200
Wire Bus Line
	11400 6750 11500 6750
Wire Bus Line
	11400 7250 11500 7250
Wire Bus Line
	11500 8200 10750 8200
Wire Bus Line
	11500 8950 11300 8950
Wire Bus Line
	12900 6850 12800 6850
Wire Bus Line
	12900 6950 12800 6950
Wire Bus Line
	12900 8550 12800 8550
Text Notes 11500 1100 0    50   ~ 0
This part is a big and complex bus multiplexer.\nSometimes it has clear distinct lines, sometimes processing are mutualized between layers.\nFor the sake of clarity, I've layed down what is the result of the ROMA bus\nafter everything is applied (assuming no DEBUG flag)
Text Notes 11500 3300 0    50   ~ 0
ROMA\n0\n1\n2\n3\n4\n5\n6\n7\n8\n9\n10\n11\n12\n13\n14\n15\n16\n17\n18\n19\n20\n21\n22
Text Notes 11500 3650 0    50   ~ 0
Notes:\n- Flips are noted as F(A) = A xnor ~F\n- ADDR is the GFX-ADDR bus and Y is the ROMA-Y bus
Text Notes 11500 3950 0    50   ~ 0
If we go beyond and resolve each ADDR value, we get the following lookup table\nThere are timing considerations to have regarding the channel but the overall idea is there.
Text Notes 11500 6100 0    50   ~ 0
Bit\n0\n1\n2\n3\n4\n5\n6\n7\n8\n9\n10\n11\n12\n13\n14\n15\n16\n17\n18\n19\n20\n21\n22
Text Notes 11850 3300 0    50   ~ 0
Sprites\nYFLIP(Y0)\nYFLIP(Y1)\nYFLIP(Y2)\nYFLIP(Y3)\nADDR4\nADDR5\nADDR6\nADDR7\nADDR8\nADDR9\nADDR10\nADDR11\nADDR12\nADDR13\nADDR14\nADDR15\nADDR16\nADDR17\nADDR18\nADDR19\nADDR20\nADDR21\nADDR22
Text Notes 11850 6100 0    50   ~ 0
Sprites\nYFLIP(COL5)\nYFLIP(COL6)\nYFLIP(COL7)\nYFLIP(COL8)\nXTILE0\nXTILE1\nXTILE2\nXTILE3\nYTILE0\nYTILE1\nYTILE2\nYTILE3\nBASE0\nBASE1\nBASE2\nBASE3\nBASE4\nBASE5\nBASE6\nBASE7\n0\n0\n0
Text Notes 12400 3300 0    50   ~ 0
Scroll 1\nYFLIP(Y0)\nYFLIP(Y1)\nYFLIP(Y2)\nADDR4\nADDR5\nADDR6\nADDR7\nADDR8\nADDR9\nADDR10\nADDR11\nADDR12\nADDR13\nADDR14\nADDR15\nADDR16\nADDR17\nADDR18\nADDR19\n0\nADDR20\nADDR21\nADDR22
Text Notes 12400 6100 0    50   ~ 0
Scroll 1\nYFLIP(Y0)\nYFLIP(Y1)\nYFLIP(Y2)\nTILE0\nTILE1\nTILE2\nTILE3\nTILE4\nTILE5\nTILE6\nTILE7\nTILE8\nTILE9\nTILE10\nTILE11\nTILE12\nTILE13\nTILE14\nTILE15\n0\n1\n0\n0
Text Notes 12900 3300 0    50   ~ 0
Scroll 2\nYFLIP(Y0)\nYFLIP(Y1)\nYFLIP(Y2)\nYFLIP(Y3)\nADDR4\nADDR5\nADDR6\nADDR7\nADDR8\nADDR9\nADDR10\nADDR11\nADDR12\nADDR13\nADDR14\nADDR15\nADDR16\nADDR17\nADDR18\nADDR19\nADDR20\nADDR21\nADDR22
Text Notes 12900 6100 0    50   ~ 0
Scroll 2\nYFLIP(Y0)\nYFLIP(Y1)\nYFLIP(Y2)\nYFLIP(Y3)\nTILE0\nTILE1\nTILE2\nTILE3\nTILE4\nTILE5\nTILE6\nTILE7\nTILE8\nTILE9\nTILE10\nTILE11\nTILE12\nTILE13\nTILE14\nTILE15\n0\n1\n0
Text Notes 13200 1350 0    50   ~ 0
OPERATIONS
Text Notes 13200 4150 0    50   ~ 0
OPERATIONS
Text Notes 13400 3300 0    50   ~ 0
Scroll 3\nXFLIP(Y0)\nYFLIP(Y1)\nYFLIP(Y2)\nYFLIP(Y3)\nYFLIP(Y4)\nYFLIP(Y5)\nADDR4\nADDR5\nADDR6\nADDR7\nADDR8\nADDR9\nADDR10\nADDR11\nADDR12\nADDR13\nADDR14\nADDR15\nADDR16\nADDR17\nADDR20\nADDR21\nADDR22
Text Notes 13400 6100 0    50   ~ 0
Scroll 3\nXFLIP(X1)\nYFLIP(Y0)\nYFLIP(Y1)\nYFLIP(Y2)\nYFLIP(Y3)\nYFLIP(Y4)\nTILE0\nTILE1\nTILE2\nTILE3\nTILE4\nTILE5\nTILE6\nTILE7\nTILE8\nTILE9\nTILE10\nTILE11\nTILE12\nTILE13\n1\n1\n0
Text Notes 13900 3300 0    50   ~ 0
Star 1\nY0\nY1\nY2\nY3\nY4\nADDR4\nADDR5\nADDR6\nADDR7\nADDR8\nADDR9\nADDR10\nADDR11\nADDR12\nADDR13\nADDR14\nADDR15\nADDR16\nADDR17\nADDR18\nADDR20\nADDR21\nADDR22
Text Notes 13900 6100 0    50   ~ 0
Star 1\nY0\nY1\nY2\nY3\nY4\nY5\nY6\nY7\nSTARX0\nSTARX1\nSTARX2\nSTARX3\nY8\n0\n0\n0\n0\n0\n0\n0\n0\n0\n1
Text Notes 14350 3300 0    50   ~ 0
Star 2\nY0\nY1\nY2\nY3\nY4\nADDR4\nADDR5\nADDR6\nADDR7\nADDR8\nADDR9\nADDR10\nADDR11\nADDR12\nADDR13\nADDR14\nADDR15\nADDR16\nADDR17\nADDR18\nADDR20\nADDR21\nADDR22
Text Notes 14350 6100 0    50   ~ 0
Star 2\nY0\nY1\nY2\nY3\nY4\nY5\nY6\nY7\nSTARX0\nSTARX1\nSTARX2\nSTARX3\nY8\n0\n0\n0\n0\n0\n0\n0\n0\n0\n1
Text Notes 14800 3300 0    50   ~ 0
WSTROM\nADDR0\nADDR1\nADDR2\nADDR3\nADDR4\nADDR5\nADDR6\nADDR7\nADDR8\nADDR9\nADDR10\nADDR11\nADDR12\nADDR13\nADDR14\nADDR15\nADDR16\nADDR17\nADDR18\nADDR19\nADDR20\nADDR21\nADDR22
Text Notes 14800 6100 0    50   ~ 0
WSTROM\nCNT0\nCNT1\nCNT2\nCNT3\nCNT4\nCNT5\nCNT6\nCNT7\nCNT8\nCNT9\nCNT10\nCNT11\nCNT12\nCNT13\nCNT14\nCNT15\nCNT16\nCNT17\nCNT18\nCNT19\nCNT20\nCNT21\nCNT22
Text Label 2950 7200 0    50   ~ 0
COL1
Text Label 3350 6050 0    50   ~ 0
ROMA-Y0
Text Label 3350 6150 0    50   ~ 0
ROMA-Y1
Text Label 3350 6250 0    50   ~ 0
ROMA-Y2
Text Label 3350 6350 0    50   ~ 0
ROMA-Y3
Text Label 3350 6450 0    50   ~ 0
ROMA-Y4
Text Label 3350 6550 0    50   ~ 0
ROMA-Y5
Text Label 4500 6050 2    50   ~ 0
GFX-ADDR0
Text Label 4500 6150 2    50   ~ 0
GFX-ADDR1
Text Label 4500 6250 2    50   ~ 0
GFX-ADDR2
Text Label 4500 6350 2    50   ~ 0
GFX-ADDR3
Text HLabel 2600 7100 0    50   Input ~ 0
COL[1..1]
Text HLabel 3100 7350 0    50   Input ~ 0
~SCROLL1-T
Text HLabel 3100 7450 0    50   Input ~ 0
~SCROLL3-T
Text HLabel 3100 7550 0    50   Input ~ 0
STARS-T
Text HLabel 3100 7650 0    50   Input ~ 0
~WSTROM
Text HLabel 3100 7800 0    50   Input ~ 0
_YFLIP
Text HLabel 3100 7950 0    50   Input ~ 0
CLK4M
Text HLabel 4900 2750 0    50   3State ~ 0
ROMA-Y[0..5]
Text HLabel 4900 2950 0    50   3State ~ 0
GFX-ADDR[0..22]
Text HLabel 8950 8400 0    50   Input ~ 0
_XFLIP
Text HLabel 8950 8950 0    50   Input ~ 0
_CDEN
Text HLabel 11300 8950 0    50   Input ~ 0
~DEBUG[2..3]
Text HLabel 11400 6750 0    50   Input ~ 0
_CPC[0..1]
Text HLabel 11400 6900 0    50   Input ~ 0
_XFLIP
Text HLabel 11400 7000 0    50   Input ~ 0
FLIP
Text HLabel 11400 7250 0    50   Input ~ 0
_CB[0..4]
Text HLabel 12900 6750 2    50   Output ~ 0
XSEL
Text HLabel 12900 6850 2    50   Output ~ 0
CPC[0..1]
Text HLabel 12900 6950 2    50   3State ~ 0
CB[0..4]
Text HLabel 12900 8450 2    50   Output ~ 0
CDEN
Text HLabel 12900 8550 2    50   3State ~ 0
ROMA[0..22]
$Sheet
S 11500 6600 1300 1150
U 611DA3AE
F0 "gfx-attr-out" 50
F1 "gfx-attr-out.sch" 50
F2 "GFX-CHNL" I L 11500 7400 50 
F3 "CB[0..4]" T R 12800 6950 50 
F4 "~ENABLE-ATTR" I R 12800 7600 50 
F5 "_CB[0..4]" I L 11500 7250 50 
F6 "_CPC[0..1]" I L 11500 6750 50 
F7 "_XFLIP" I L 11500 6900 50 
F8 "FLIP" I L 11500 7000 50 
F9 "SCROLL3-T" I L 11500 7100 50 
F10 "CLK-~CHNL" I L 11500 7500 50 
F11 "CLK-CHNL" I L 11500 7600 50 
F12 "XSEL" O R 12800 6750 50 
F13 "CPC[0..1]" O R 12800 6850 50 
$EndSheet
$Sheet
S 3200 7050 1400 2300
U 611BF701
F0 "roma-control-signals" 50
F1 "roma-control-signals.sch" 50
F2 "COL1" I L 3200 7200 50 
F3 "GFX-CHNL" O R 4600 9200 50 
F4 "~GFX-CHNL" O R 4600 7900 50 
F5 "CLK4M" I L 3200 7950 50 
F6 "~CLK4M" O R 4600 8000 50 
F7 "~SCROLL1-T" I L 3200 7350 50 
F8 "~WSTROM" I L 3200 7650 50 
F9 "~SCROLL3-T" I L 3200 7450 50 
F10 "STARS-T" I L 3200 7550 50 
F11 "SCROLL3-STARS" O R 4600 7300 50 
F12 "~SCROLL1-STARS" O R 4600 7200 50 
F13 "SCROLL3-T" O R 4600 8200 50 
F14 "_YFLIP" I L 3200 7800 50 
F15 "~YFLIP" O R 4600 8300 50 
F16 "CLK-~CHNL" O R 4600 8700 50 
F17 "CLK-CHNL" O R 4600 8800 50 
F18 "SCROLL1.GFX-CHNL" O R 4600 7450 50 
F19 "ELSE.GFX-CHNL" O R 4600 7750 50 
F20 "STARS.GFX-CHNL" O R 4600 7650 50 
F21 "SCROLL3.GFX-CHNL" O R 4600 7550 50 
$EndSheet
$Sheet
S 9300 7950 1250 1150
U 611CDAEC
F0 "roma-mux-0-2" 50
F1 "roma-mux-0-2.sch" 50
F2 "CLK-~CHNL" I L 9300 8700 50 
F3 "CLK-CHNL" I L 9300 8800 50 
F4 "~A-CDEN" O R 10550 8700 50 
F5 "~B-CDEN" O R 10550 8800 50 
F6 "ROMA22" O R 10550 8350 50 
F7 "~ROMA21" O R 10550 8450 50 
F8 "~ROMA20" O R 10550 8550 50 
F9 "B-ROMA[0..2]" O R 10550 8200 50 
F10 "A-ROMA[0..2]" O R 10550 8100 50 
F11 "_CDEN" I L 9300 8950 50 
F12 "GFX-ADDR[20..22]" I L 9300 8550 50 
F13 "ROMA-Y[0..2]" I L 9300 8100 50 
F14 "~YFLIP" I L 9300 8300 50 
F15 "SCROLL3-T" I L 9300 8200 50 
F16 "_XFLIP" I L 9300 8400 50 
$EndSheet
$Sheet
S 9000 2800 1550 1250
U 61AB8FDA
F0 "roma-mux-12-14" 50
F1 "roma-mux-12-14.sch" 50
F2 "~GFX-CHNL" I L 9000 3800 50 
F3 "~SCROLL1-STARS" I L 9000 3100 50 
F4 "SCROLL3-STARS" I L 9000 3200 50 
F5 "~CLK4M" I L 9000 3900 50 
F6 "SCROLL1.GFX-CHNL" I L 9000 3350 50 
F7 "ELSE.GFX-CHNL" I L 9000 3650 50 
F8 "STARS.GFX-CHNL" I L 9000 3550 50 
F9 "SCROLL3.GFX-CHNL" I L 9000 3450 50 
F10 "A-ROMA[12..14]" O R 10550 2950 50 
F11 "B-ROMA[12..14]" O R 10550 3050 50 
F12 "GFX-ADDR[10..15]" I L 9000 2950 50 
$EndSheet
$Sheet
S 9000 4250 1550 1250
U 61AC4252
F0 "roma-mux-15-17" 50
F1 "roma-mux-15-17.sch" 50
F2 "~GFX-CHNL" I L 9000 5250 50 
F3 "GFX-ADDR[13..18]" I L 9000 4400 50 
F4 "~SCROLL1-STARS" I L 9000 4550 50 
F5 "SCROLL3-STARS" I L 9000 4650 50 
F6 "~CLK4M" I L 9000 5350 50 
F7 "SCROLL1.GFX-CHNL" I L 9000 4800 50 
F8 "ELSE.GFX-CHNL" I L 9000 5100 50 
F9 "STARS.GFX-CHNL" I L 9000 5000 50 
F10 "SCROLL3.GFX-CHNL" I L 9000 4900 50 
F11 "A-ROMA[15..17]" O R 10550 4400 50 
F12 "B-ROMA[15..17]" O R 10550 4500 50 
$EndSheet
$Sheet
S 9000 5700 1550 1250
U 61AC42FC
F0 "roma-mux-18-19" 50
F1 "roma-mux-18-19.sch" 50
F2 "GFX-ADDR[16..19]" I L 9000 5850 50 
F3 "~GFX-CHNL" I L 9000 6700 50 
F4 "~SCROLL1-STARS" I L 9000 6000 50 
F5 "SCROLL3-STARS" I L 9000 6100 50 
F6 "~CLK4M" I L 9000 6800 50 
F7 "SCROLL1.GFX-CHNL" I L 9000 6250 50 
F8 "ELSE.GFX-CHNL" I L 9000 6550 50 
F9 "STARS.GFX-CHNL" I L 9000 6450 50 
F10 "SCROLL3.GFX-CHNL" I L 9000 6350 50 
F11 "B-ROMA[18..19]" O R 10550 5950 50 
F12 "A-ROMA[18..19]" O R 10550 5850 50 
$EndSheet
$Sheet
S 6150 2600 1550 1450
U 61AC5BDD
F0 "roma-mux-3-5" 50
F1 "roma-mux-3-5.sch" 50
F2 "GFX-ADDR[4..9]" I L 6150 2950 50 
F3 "~GFX-CHNL" I L 6150 3800 50 
F4 "~SCROLL1-STARS" I L 6150 3100 50 
F5 "SCROLL3-STARS" I L 6150 3200 50 
F6 "~CLK4M" I L 6150 3900 50 
F7 "SCROLL1.GFX-CHNL" I L 6150 3350 50 
F8 "ELSE.GFX-CHNL" I L 6150 3650 50 
F9 "STARS.GFX-CHNL" I L 6150 3550 50 
F10 "SCROLL3.GFX-CHNL" I L 6150 3450 50 
F11 "ROMA-Y[3..5]" I L 6150 2750 50 
F12 "~YFLIP" I L 6150 2850 50 
F13 "A-ROMA[3..5]" O R 7700 2750 50 
F14 "B-ROMA[3..5]" O R 7700 2850 50 
$EndSheet
$Sheet
S 6150 4250 1550 1250
U 611C24AB
F0 "roma-mux-6-8" 50
F1 "roma-mux-6-8.sch" 50
F2 "SCROLL3-STARS" I L 6150 4650 50 
F3 "~CLK4M" I L 6150 5350 50 
F4 "~GFX-CHNL" I L 6150 5250 50 
F5 "~SCROLL1-STARS" I L 6150 4550 50 
F6 "B-ROMA[6..8]" O R 7700 4500 50 
F7 "A-ROMA[6..8]" O R 7700 4400 50 
F8 "SCROLL1.GFX-CHNL" I L 6150 4800 50 
F9 "SCROLL3.GFX-CHNL" I L 6150 4900 50 
F10 "STARS.GFX-CHNL" I L 6150 5000 50 
F11 "ELSE.GFX-CHNL" I L 6150 5100 50 
F12 "GFX-ADDR[4..9]" I L 6150 4400 50 
$EndSheet
$Sheet
S 6150 5700 1550 1250
U 61817BCD
F0 "roma-mux-9-11" 50
F1 "roma-mux-9-11.sch" 50
F2 "GFX-ADDR[7..12]" I L 6150 5850 50 
F3 "~GFX-CHNL" I L 6150 6700 50 
F4 "~SCROLL1-STARS" I L 6150 6000 50 
F5 "SCROLL3-STARS" I L 6150 6100 50 
F6 "~CLK4M" I L 6150 6800 50 
F7 "SCROLL1.GFX-CHNL" I L 6150 6250 50 
F8 "ELSE.GFX-CHNL" I L 6150 6550 50 
F9 "STARS.GFX-CHNL" I L 6150 6450 50 
F10 "SCROLL3.GFX-CHNL" I L 6150 6350 50 
F11 "A-ROMA[9..11]" O R 7700 5850 50 
F12 "B-ROMA[9..11]" O R 7700 5950 50 
$EndSheet
$Sheet
S 11500 7950 1300 1250
U 61262549
F0 "roma-mux-out" 50
F1 "roma-mux-out.sch" 50
F2 "GFX-CHNL" I L 11500 9050 50 
F3 "CDEN" O R 12800 8450 50 
F4 "~ROMA20" I L 11500 8550 50 
F5 "~ROMA21" I L 11500 8450 50 
F6 "ROMA22" I L 11500 8350 50 
F7 "~DEBUG[2..3]" I L 11500 8950 50 
F8 "ROMA[0..22]" T R 12800 8550 50 
F9 "~A-CDEN" I L 11500 8700 50 
F10 "~B-CDEN" I L 11500 8800 50 
F11 "~ENABLE-ATTR" O R 12800 8100 50 
F12 "A-ROMA[0..19]" I L 11500 8100 50 
F13 "B-ROMA[0..19]" I L 11500 8200 50 
$EndSheet
Wire Bus Line
	4600 5850 4600 6250
Wire Bus Line
	3200 6150 3200 6750
$EndSCHEMATC
