EESchema Schematic File Version 4
EELAYER 30 0
EELAYER END
$Descr A4 11693 8268
encoding utf-8
Sheet 11 83
Title "CPS Reverse Engineering: DL-0311"
Date "2021-09-12"
Rev ""
Comp ""
Comment1 ""
Comment2 ""
Comment3 "Licence: CC-BY"
Comment4 "Author: Loïc *WydD* Petit"
$EndDescr
Connection ~ 9100 6300
Connection ~ 9000 5850
Connection ~ 7650 6350
Connection ~ 9400 2300
Entry Wire Line
	9250 5750 9150 5850
Entry Wire Line
	9250 6200 9150 6300
Entry Wire Line
	5050 1250 5150 1350
Wire Wire Line
	1650 2450 2700 2450
Wire Wire Line
	1650 4100 1650 2450
Wire Wire Line
	1650 4100 2700 4100
Wire Wire Line
	2600 1650 2700 1650
Wire Wire Line
	2600 1750 2700 1750
Wire Wire Line
	2600 1850 2700 1850
Wire Wire Line
	2600 3150 2700 3150
Wire Wire Line
	2600 3250 2700 3250
Wire Wire Line
	2600 3350 2700 3350
Wire Wire Line
	2600 3450 2700 3450
Wire Wire Line
	2600 3650 2700 3650
Wire Wire Line
	2600 3750 2700 3750
Wire Wire Line
	2600 3850 2700 3850
Wire Wire Line
	2600 3950 2700 3950
Wire Wire Line
	2600 4850 2700 4850
Wire Wire Line
	2700 2050 2600 2050
Wire Wire Line
	2700 2150 2600 2150
Wire Wire Line
	2700 2250 2600 2250
Wire Wire Line
	7550 5800 7750 5800
Wire Wire Line
	7550 6350 7650 6350
Wire Wire Line
	7650 6350 7650 5900
Wire Wire Line
	7650 6350 7750 6350
Wire Wire Line
	7750 5900 7650 5900
Wire Wire Line
	7750 6250 7550 6250
Wire Wire Line
	8300 5850 9000 5850
Wire Wire Line
	8300 6300 9100 6300
Wire Wire Line
	9000 5250 9000 5850
Wire Wire Line
	9000 5250 9200 5250
Wire Wire Line
	9000 5850 9150 5850
Wire Wire Line
	9100 6300 9100 5350
Wire Wire Line
	9100 6300 9150 6300
Wire Wire Line
	9200 5350 9100 5350
Wire Wire Line
	5150 1350 6600 1350
Wire Wire Line
	5200 2550 5300 2550
Wire Wire Line
	5200 2650 5300 2650
Wire Wire Line
	5200 2750 5300 2750
Wire Wire Line
	6600 2500 6600 1350
Wire Wire Line
	6600 2500 7550 2500
Wire Wire Line
	7450 3700 7550 3700
Wire Wire Line
	7450 3800 7550 3800
Wire Wire Line
	7450 3900 7550 3900
Wire Wire Line
	7450 4000 7550 4000
Wire Wire Line
	7450 4150 7550 4150
Wire Wire Line
	7450 4250 7550 4250
Wire Wire Line
	7450 4350 7550 4350
Wire Wire Line
	7450 4450 7550 4450
Wire Wire Line
	7450 4550 7550 4550
Wire Wire Line
	7450 4750 7550 4750
Wire Wire Line
	7550 2950 7450 2950
Wire Wire Line
	9200 3500 9300 3500
Wire Wire Line
	9300 2950 9200 2950
Wire Wire Line
	9300 2950 9300 3500
Wire Bus Line
	1850 4600 2700 4600
Wire Bus Line
	2600 2950 2700 2950
Wire Bus Line
	2600 4750 2700 4750
Wire Bus Line
	2700 1450 2600 1450
Wire Bus Line
	4250 1150 5050 1150
Wire Bus Line
	5050 2400 5300 2400
Wire Bus Line
	5150 1450 4250 1450
Wire Bus Line
	5150 2300 5150 1450
Wire Bus Line
	5150 3050 5150 4600
Wire Bus Line
	5150 4600 4250 4600
Wire Bus Line
	5300 2300 5150 2300
Wire Bus Line
	5300 2950 4250 2950
Wire Bus Line
	5300 3050 5150 3050
Wire Bus Line
	6300 2750 7550 2750
Wire Bus Line
	6700 2300 7550 2300
Wire Bus Line
	7550 2600 6300 2600
Wire Bus Line
	7550 3500 7450 3500
Wire Bus Line
	9400 2300 9200 2300
Wire Bus Line
	9400 2300 9400 3700
Wire Bus Line
	9400 3700 9200 3700
Wire Bus Line
	9500 2300 9400 2300
Text Notes 9450 6050 0    50   ~ 0
0 = ROWSCROLL\n1 = SCROLL1\n2 = SCROLL2\n3 = SCROLL3
Text Notes 5900 2400 0    100  ~ 0
+
Text Notes 5900 3050 0    100  ~ 0
+
Text Label 1850 4600 0    50   ~ 0
SCROLL-TYPE[0..1]
Text Label 2600 2050 2    50   ~ 0
~BUS-SCROLL2
Text Label 2600 2150 2    50   ~ 0
~BUS-SCROLL3
Text Label 2600 2250 2    50   ~ 0
SCROLL-TYPE1
Text Label 2600 3950 2    50   ~ 0
ROWSCROLL
Text Label 8300 5850 0    50   ~ 0
SCROLL-TYPE0
Text Label 8300 6300 0    50   ~ 0
SCROLL-TYPE1
Text Label 5200 2550 2    50   ~ 0
~BUS-SCROLL1
Text Label 5200 2650 2    50   ~ 0
~BUS-SCROLL2
Text Label 5200 2750 2    50   ~ 0
~BUS-SCROLL3
Text Label 10200 5300 2    50   ~ 0
ROWSCROLL
Text Label 10200 5600 2    50   ~ 0
SCROLL-TYPE[0..1]
Text Label 5750 1350 2    50   ~ 0
SCROLL-CNT0
Text Label 6700 2300 0    50   ~ 0
SCROLL-TYPE[0..1]
Text Label 7450 2950 2    50   ~ 0
ROWSCROLL
Text HLabel 1050 4100 0    50   Input ~ 0
CLK4M
Text HLabel 2600 1450 0    50   Input ~ 0
BUS-DATA[0..15]
Text HLabel 2600 1650 0    50   Input ~ 0
~SCROLL1-X
Text HLabel 2600 1750 0    50   Input ~ 0
~SCROLL2-X
Text HLabel 2600 1850 0    50   Input ~ 0
~SCROLL3-X
Text HLabel 2600 2950 0    50   Input ~ 0
BUS-DATA[0..15]
Text HLabel 2600 3150 0    50   Input ~ 0
~ROWSCROLL-OFFSET
Text HLabel 2600 3250 0    50   Input ~ 0
~SCROLL1-Y
Text HLabel 2600 3350 0    50   Input ~ 0
~SCROLL2-Y
Text HLabel 2600 3450 0    50   Input ~ 0
~SCROLL3-Y
Text HLabel 2600 3650 0    50   Input ~ 0
~BUS-SCROLL1
Text HLabel 2600 3750 0    50   Input ~ 0
~BUS-SCROLL2
Text HLabel 2600 3850 0    50   Input ~ 0
~BUS-SCROLL3
Text HLabel 2600 4750 0    50   Input ~ 0
LINE[0..8]
Text HLabel 2600 4850 0    50   Input ~ 0
FLIP
Text HLabel 7550 5800 0    50   Input ~ 0
~BUS-SCROLL1
Text HLabel 7550 6250 0    50   Input ~ 0
~BUS-SCROLL2
Text HLabel 7550 6350 0    50   Input ~ 0
~BUS-SCROLL3
Text HLabel 4250 1150 0    50   Input ~ 0
SCROLL-CNT[0..6]
Text HLabel 7450 3500 0    50   Input ~ 0
BUS-DATA[0..15]
Text HLabel 7450 3700 0    50   Input ~ 0
~ROWSCROLL-BASE
Text HLabel 7450 3800 0    50   Input ~ 0
~SCROLL1-BASE
Text HLabel 7450 3900 0    50   Input ~ 0
~SCROLL2-BASE
Text HLabel 7450 4000 0    50   Input ~ 0
~SCROLL3-BASE
Text HLabel 7450 4150 0    50   Input ~ 0
~BUS-ROWSCROLL
Text HLabel 7450 4250 0    50   Input ~ 0
~BUS-SCROLL1
Text HLabel 7450 4350 0    50   Input ~ 0
~BUS-SCROLL2
Text HLabel 7450 4450 0    50   Input ~ 0
~BUS-SCROLL3
Text HLabel 7450 4550 0    50   Input ~ 0
BUS-READY
Text HLabel 7450 4750 0    50   Input ~ 0
~CLK4M
Text HLabel 9500 2300 2    50   3State ~ 0
ADDR[1..23]
$Comp
L A5C:NAND02 UBF124
U 1 1 65A8843A
P 8000 5850
F 0 "UBF124" H 8025 6117 50  0000 C CNN
F 1 "NAND02P" H 8025 6026 50  0000 C CNN
F 2 "" H 8000 5850 50  0001 C CNN
F 3 "" H 8000 5850 50  0001 C CNN
	1    8000 5850
	1    0    0    -1  
$EndComp
$Comp
L A5C:NAND02 UBF75
U 1 1 64CE2920
P 8000 6300
F 0 "UBF75" H 8025 6567 50  0000 C CNN
F 1 "NAND02P" H 8025 6476 50  0000 C CNN
F 2 "" H 8000 6300 50  0001 C CNN
F 3 "" H 8000 6300 50  0001 C CNN
	1    8000 6300
	1    0    0    -1  
$EndComp
$Comp
L A5C:NOR02 UCA?
U 1 1 61D3CBB2
P 9450 5300
AR Path="/61111462/6124883D/61D3CBB2" Ref="UCA?"  Part="1" 
AR Path="/61111462/61D3CBB2" Ref="UCA421"  Part="1" 
F 0 "UCA421" H 9475 5567 50  0000 C CNN
F 1 "NOR02" H 9475 5476 50  0000 C CNN
F 2 "" H 9450 5300 50  0001 C CNN
F 3 "" H 9450 5300 50  0001 C CNN
	1    9450 5300
	1    0    0    -1  
$EndComp
$Comp
L A5C:INV01 UBJ56
U 1 1 60CABFD9
P 1350 4100
F 0 "UBJ56" H 1350 4417 50  0000 C CNN
F 1 "INV02" H 1350 4326 50  0000 C CNN
F 2 "" H 1350 3900 50  0001 C CNN
F 3 "" H 1350 3900 50  0001 C CNN
	1    1350 4100
	1    0    0    -1  
$EndComp
$Sheet
S 7550 3350 1650 1550
U 612E0C41
F0 "scroll-base" 50
F1 "scroll-base.sch" 50
F2 "~ROWSCROLL-BASE" I L 7550 3700 50 
F3 "~BUS-ROWSCROLL" I L 7550 4150 50 
F4 "BUS-READY" I L 7550 4550 50 
F5 "~CLK4M" I L 7550 4750 50 
F6 "~ROWSCROLL-READY" O R 9200 3500 50 
F7 "~SCROLL1-BASE" I L 7550 3800 50 
F8 "~SCROLL3-BASE" I L 7550 4000 50 
F9 "~SCROLL2-BASE" I L 7550 3900 50 
F10 "~BUS-SCROLL2" I L 7550 4350 50 
F11 "~BUS-SCROLL1" I L 7550 4250 50 
F12 "~BUS-SCROLL3" I L 7550 4450 50 
F13 "BUS-DATA[3..15]" I L 7550 3500 50 
F14 "ADDR[11..23]" T R 9200 3700 50 
$EndSheet
$Sheet
S 5300 2150 1000 1100
U 61150945
F0 "scroll-bus-addr-adders" 50
F1 "scroll-bus-addr-adders.sch" 50
F2 "~X+2" I L 5300 2750 50 
F3 "~X+4" I L 5300 2650 50 
F4 "~X+8" I L 5300 2550 50 
F5 "BASE-X[0..5]" I L 5300 2300 50 
F6 "CNT[1..6]" I L 5300 2400 50 
F7 "ROW[0..7]" I L 5300 3050 50 
F8 "BASE-Y[0..9]" I L 5300 2950 50 
F9 "X[0..5]" O R 6300 2600 50 
F10 "Y[0..9]" O R 6300 2750 50 
$EndSheet
$Sheet
S 2700 4450 1550 550 
U 6112159B
F0 "scroll-bus-addr-line" 50
F1 "scroll-bus-addr-line.sch" 50
F2 "LINE[0..8]" I L 2700 4750 50 
F3 "FLIP" I L 2700 4850 50 
F4 "SCROLL-TYPE[0..1]" I L 2700 4600 50 
F5 "ROW[0..7]" O R 4250 4600 50 
$EndSheet
$Sheet
S 7550 2150 1650 950 
U 6124883D
F0 "scroll-bus-addr-out-lo" 50
F1 "scroll-bus-addr-out-lo.sch" 50
F2 "SCROLL-TYPE[0..1]" I L 7550 2300 50 
F3 "ADDR[1..13]" T R 9200 2300 50 
F4 "~ADDR-HI" I L 7550 2950 50 
F5 "~ROWSCROLL-READY" I R 9200 2950 50 
F6 "CNT0" I L 7550 2500 50 
F7 "X[0..5]" I L 7550 2600 50 
F8 "Y[0..9]" I L 7550 2750 50 
$EndSheet
$Sheet
S 2700 1300 1550 1300
U 61111C69
F0 "scroll-bus-addr-x" 50
F1 "scroll-bus-addr-x.sch" 50
F2 "~CLK4M" I L 2700 2450 50 
F3 "~SCROLL1-X" I L 2700 1650 50 
F4 "BUS-DATA[0..10]" I L 2700 1450 50 
F5 "~BUS-ELSE" I L 2700 2250 50 
F6 "~SCROLL2-X" I L 2700 1750 50 
F7 "~SCROLL3-X" I L 2700 1850 50 
F8 "~BUS-SCROLL2" I L 2700 2050 50 
F9 "~BUS-SCROLL3" I L 2700 2150 50 
F10 "BASE-X[0..9]" O R 4250 1450 50 
$EndSheet
$Sheet
S 2700 2800 1550 1450
U 611CEDF2
F0 "scroll-bus-addr-y" 50
F1 "scroll-bus-addr-y.sch" 50
F2 "~CLK4M" I L 2700 4100 50 
F3 "~ROWSCROLL-OFFSET" I L 2700 3150 50 
F4 "~SCROLL1-Y" I L 2700 3250 50 
F5 "~SCROLL2-Y" I L 2700 3350 50 
F6 "~SCROLL3-Y" I L 2700 3450 50 
F7 "~BUS-SCROLL1" I L 2700 3650 50 
F8 "~BUS-SCROLL2" I L 2700 3750 50 
F9 "~BUS-SCROLL3" I L 2700 3850 50 
F10 "BUS-ELSE" I L 2700 3950 50 
F11 "BUS-DATA[0..10]" I L 2700 2950 50 
F12 "BASE-Y[0..9]" O R 4250 2950 50 
$EndSheet
Wire Bus Line
	9250 5600 10200 5600
Wire Wire Line
	10200 5300 9750 5300
Connection ~ 1650 4100
Text Notes 1400 7500 0    50   ~ 0
ADDR\n23\n22\n21\n20\n19\n18\n17\n16\n15\n14\n13\n12\n11\n10\n9\n8\n7\n6\n5\n4\n3\n2\n1
Text Notes 1800 7500 0    50   ~ 0
SCROLL1\nBASE15\nBASE14\nBASE13\nBASE12\nBASE11\nBASE10\nBASE09\nBASE08\nBASE07\nBASE06\nY5\nX5\nX4\nX3\nX2\nX1\nX0\nY4\nY3\nY2\nY1\nY0\nATTR
Text Notes 2350 7500 0    50   ~ 0
SCROLL2\nBASE15\nBASE14\nBASE13\nBASE12\nBASE11\nBASE10\nBASE09\nBASE08\nBASE07\nBASE06\nY5\nY4\nX5\nX4\nX3\nX2\nX1\nX0\nY3\nY2\nY1\nY0\nATTR
Text Notes 2900 7500 0    50   ~ 0
SCROLL3\nBASE15\nBASE14\nBASE13\nBASE12\nBASE11\nBASE10\nBASE09\nBASE08\nBASE07\nBASE06\nY5\nY4\nY3\nX5\nX4\nX3\nX2\nX1\nX0\nY2\nY1\nY0\nATTR
Text Notes 3450 7500 0    50   ~ 0
ROWSCROLL\nBASE15\nBASE14\nBASE13\nBASE12\nBASE11\nBASE10\nBASE09\nBASE08\nBASE07\nBASE06\nBASE05\nBASE04\nBASE03\nY9\nY8\nY7\nY6\nY5\nY4\nY3\nY2\nY1\nY0
Wire Bus Line
	9250 5600 9250 6200
Wire Bus Line
	5050 1150 5050 2400
$EndSCHEMATC
