EESchema Schematic File Version 4
EELAYER 30 0
EELAYER END
$Descr A3 16535 11693
encoding utf-8
Sheet 68 69
Title ""
Date "2020-11-26"
Rev ""
Comp ""
Comment1 "Licence: CC-BY"
Comment2 "Author: Loïc *WydD* Petit"
Comment3 ""
Comment4 ""
$EndDescr
Connection ~ 2300 7750
Connection ~ 2200 7950
Connection ~ 2400 8050
Connection ~ 2500 8150
Connection ~ 2400 8550
Connection ~ 2200 8750
Connection ~ 2300 8850
Connection ~ 2500 8950
Connection ~ 5400 5350
Connection ~ 5900 7900
Connection ~ 6150 900 
Connection ~ 6150 1300
Connection ~ 6150 1200
Connection ~ 6150 1100
Connection ~ 6150 1000
Connection ~ 5900 7100
Connection ~ 5900 8700
Connection ~ 2200 7050
Connection ~ 2300 7150
Connection ~ 2400 7250
Connection ~ 2500 7350
NoConn ~ 7150 2550
NoConn ~ 6150 2550
NoConn ~ 7150 4850
NoConn ~ 6150 4850
NoConn ~ 10200 2550
NoConn ~ 9200 2550
NoConn ~ 10200 4850
NoConn ~ 9200 4850
NoConn ~ 9900 7800
NoConn ~ 15150 7950
Entry Wire Line
	1550 7050 1450 6950
Entry Wire Line
	1550 7150 1450 7050
Entry Wire Line
	1550 7250 1450 7150
Entry Wire Line
	1550 7350 1450 7250
Entry Wire Line
	5400 2250 5500 2150
Entry Wire Line
	5400 2350 5500 2250
Entry Wire Line
	5400 2450 5500 2350
Entry Wire Line
	5400 2550 5500 2450
Entry Wire Line
	5400 3300 5500 3200
Entry Wire Line
	5400 3400 5500 3300
Entry Wire Line
	5400 3500 5500 3400
Entry Wire Line
	5400 3600 5500 3500
Entry Wire Line
	5400 3700 5500 3600
Entry Wire Line
	5400 3800 5500 3700
Entry Wire Line
	5400 4250 5500 4350
Entry Wire Line
	5400 4550 5500 4450
Entry Wire Line
	5400 4650 5500 4550
Entry Wire Line
	5400 4750 5500 4650
Entry Wire Line
	5400 4850 5500 4750
Entry Wire Line
	7900 1000 7800 900 
Entry Wire Line
	7900 1100 7800 1000
Entry Wire Line
	7900 1200 7800 1100
Entry Wire Line
	7900 1300 7800 1200
Entry Wire Line
	7900 1400 7800 1300
Entry Wire Line
	7900 1500 7800 1400
Entry Wire Line
	7900 2150 7800 2050
Entry Wire Line
	7900 2250 7800 2150
Entry Wire Line
	7900 2350 7800 2250
Entry Wire Line
	7900 2450 7800 2350
Entry Wire Line
	7900 2550 7800 2450
Entry Wire Line
	7900 3300 7800 3200
Entry Wire Line
	7900 3400 7800 3300
Entry Wire Line
	7900 3500 7800 3400
Entry Wire Line
	7900 3600 7800 3500
Entry Wire Line
	7900 3700 7800 3600
Entry Wire Line
	7900 3800 7800 3700
Entry Wire Line
	7900 4450 7800 4350
Entry Wire Line
	7900 4550 7800 4450
Entry Wire Line
	7900 4650 7800 4550
Entry Wire Line
	7900 4750 7800 4650
Entry Wire Line
	7900 4850 7800 4750
Entry Wire Line
	8450 1000 8550 900 
Entry Wire Line
	8450 1100 8550 1000
Entry Wire Line
	8450 1200 8550 1100
Entry Wire Line
	8450 1300 8550 1200
Entry Wire Line
	8450 1400 8550 1300
Entry Wire Line
	8450 1500 8550 1400
Entry Wire Line
	8450 1950 8550 2050
Entry Wire Line
	8450 2250 8550 2150
Entry Wire Line
	8450 2350 8550 2250
Entry Wire Line
	8450 2450 8550 2350
Entry Wire Line
	8450 2550 8550 2450
Entry Wire Line
	8450 3300 8550 3200
Entry Wire Line
	8450 3400 8550 3300
Entry Wire Line
	8450 3500 8550 3400
Entry Wire Line
	8450 3600 8550 3500
Entry Wire Line
	8450 3700 8550 3600
Entry Wire Line
	8450 3800 8550 3700
Entry Wire Line
	8450 4250 8550 4350
Entry Wire Line
	8450 4550 8550 4450
Entry Wire Line
	8450 4650 8550 4550
Entry Wire Line
	8450 4750 8550 4650
Entry Wire Line
	8450 4850 8550 4750
Entry Wire Line
	10400 7900 10500 8000
Entry Wire Line
	10400 8000 10500 8100
Entry Wire Line
	10400 8100 10500 8200
Entry Wire Line
	10400 8200 10500 8300
Entry Wire Line
	10400 8300 10500 8400
Entry Wire Line
	10400 8400 10500 8500
Entry Wire Line
	10400 8500 10500 8600
Entry Wire Line
	10950 1000 10850 900 
Entry Wire Line
	10950 1100 10850 1000
Entry Wire Line
	10950 1200 10850 1100
Entry Wire Line
	10950 1300 10850 1200
Entry Wire Line
	10950 1400 10850 1300
Entry Wire Line
	10950 1500 10850 1400
Entry Wire Line
	10950 2150 10850 2050
Entry Wire Line
	10950 2250 10850 2150
Entry Wire Line
	10950 2350 10850 2250
Entry Wire Line
	10950 2450 10850 2350
Entry Wire Line
	10950 2550 10850 2450
Entry Wire Line
	10950 3300 10850 3200
Entry Wire Line
	10950 3400 10850 3300
Entry Wire Line
	10950 3500 10850 3400
Entry Wire Line
	10950 3600 10850 3500
Entry Wire Line
	10950 3700 10850 3600
Entry Wire Line
	10950 3800 10850 3700
Entry Wire Line
	10950 4450 10850 4350
Entry Wire Line
	10950 4550 10850 4450
Entry Wire Line
	10950 4650 10850 4550
Entry Wire Line
	10950 4750 10850 4650
Entry Wire Line
	10950 4850 10850 4750
Entry Wire Line
	13150 1950 13050 1850
Entry Wire Line
	13150 2050 13050 1950
Entry Wire Line
	13150 2150 13050 2050
Entry Wire Line
	13150 2250 13050 2150
Entry Wire Line
	13150 2350 13050 2250
Entry Wire Line
	13150 2450 13050 2350
Wire Wire Line
	1550 7050 2200 7050
Wire Wire Line
	1550 7150 2300 7150
Wire Wire Line
	1550 7250 2400 7250
Wire Wire Line
	2200 7050 2200 7950
Wire Wire Line
	2200 7050 2750 7050
Wire Wire Line
	2200 7950 2200 8750
Wire Wire Line
	2200 8750 2200 9550
Wire Wire Line
	2300 7150 2300 7750
Wire Wire Line
	2300 7150 3350 7150
Wire Wire Line
	2300 7750 2300 8850
Wire Wire Line
	2300 8850 2300 9650
Wire Wire Line
	2300 9650 3350 9650
Wire Wire Line
	2400 7250 2400 8050
Wire Wire Line
	2400 7250 3350 7250
Wire Wire Line
	2400 8050 2400 8550
Wire Wire Line
	2400 8550 2400 9750
Wire Wire Line
	2500 7350 1550 7350
Wire Wire Line
	2500 7350 2500 8150
Wire Wire Line
	2500 8150 2500 8950
Wire Wire Line
	2500 8950 2500 9350
Wire Wire Line
	2750 6950 2750 7050
Wire Wire Line
	2750 7750 2300 7750
Wire Wire Line
	2750 8550 2400 8550
Wire Wire Line
	2750 9350 2500 9350
Wire Wire Line
	3350 6950 3350 7050
Wire Wire Line
	3350 7350 2500 7350
Wire Wire Line
	3350 7850 3350 7750
Wire Wire Line
	3350 7950 2200 7950
Wire Wire Line
	3350 8050 2400 8050
Wire Wire Line
	3350 8150 2500 8150
Wire Wire Line
	3350 8650 3350 8550
Wire Wire Line
	3350 8750 2200 8750
Wire Wire Line
	3350 8850 2300 8850
Wire Wire Line
	3350 8950 2500 8950
Wire Wire Line
	3350 9450 3350 9350
Wire Wire Line
	3350 9550 2200 9550
Wire Wire Line
	3350 9750 2400 9750
Wire Wire Line
	3950 7200 6000 7200
Wire Wire Line
	3950 8000 6000 8000
Wire Wire Line
	3950 8800 6000 8800
Wire Wire Line
	3950 9600 6000 9600
Wire Wire Line
	4600 7300 5250 7300
Wire Wire Line
	4600 7400 5250 7400
Wire Wire Line
	4600 7500 5250 7500
Wire Wire Line
	4600 7600 5250 7600
Wire Wire Line
	4600 8100 5250 8100
Wire Wire Line
	4600 8200 5250 8200
Wire Wire Line
	4600 8300 5250 8300
Wire Wire Line
	4600 8400 5250 8400
Wire Wire Line
	4600 8900 5250 8900
Wire Wire Line
	4600 9000 5250 9000
Wire Wire Line
	4600 9100 5250 9100
Wire Wire Line
	4600 9200 5250 9200
Wire Wire Line
	4600 9700 5250 9700
Wire Wire Line
	4600 9800 5250 9800
Wire Wire Line
	4600 9900 5250 9900
Wire Wire Line
	4600 10000 5250 10000
Wire Wire Line
	5100 6850 4600 6850
Wire Wire Line
	5500 2150 6150 2150
Wire Wire Line
	5500 2250 6150 2250
Wire Wire Line
	5500 2350 6150 2350
Wire Wire Line
	5500 2450 6150 2450
Wire Wire Line
	5500 3200 6150 3200
Wire Wire Line
	5500 3300 6150 3300
Wire Wire Line
	5500 3400 6150 3400
Wire Wire Line
	5500 3500 6150 3500
Wire Wire Line
	5500 3600 6150 3600
Wire Wire Line
	5500 3700 6150 3700
Wire Wire Line
	5500 4350 6150 4350
Wire Wire Line
	5500 4450 6150 4450
Wire Wire Line
	5500 4550 6150 4550
Wire Wire Line
	5500 4650 6150 4650
Wire Wire Line
	5500 4750 6150 4750
Wire Wire Line
	5850 7450 6000 7450
Wire Wire Line
	5850 8250 6000 8250
Wire Wire Line
	5850 9050 6000 9050
Wire Wire Line
	5850 9850 6000 9850
Wire Wire Line
	5900 6850 5700 6850
Wire Wire Line
	5900 7100 5900 6850
Wire Wire Line
	5900 7100 5900 7900
Wire Wire Line
	5900 7900 5900 8700
Wire Wire Line
	5900 8700 5900 9500
Wire Wire Line
	6000 7100 5900 7100
Wire Wire Line
	6000 7300 6000 7450
Wire Wire Line
	6000 7900 5900 7900
Wire Wire Line
	6000 8100 6000 8250
Wire Wire Line
	6000 8700 5900 8700
Wire Wire Line
	6000 8900 6000 9050
Wire Wire Line
	6000 9500 5900 9500
Wire Wire Line
	6000 9700 6000 9850
Wire Wire Line
	6050 1600 6150 1600
Wire Wire Line
	6050 2750 6050 1600
Wire Wire Line
	6050 3900 6150 3900
Wire Wire Line
	6050 5050 6050 3900
Wire Wire Line
	6150 1000 6150 900 
Wire Wire Line
	6150 1100 6150 1000
Wire Wire Line
	6150 1200 6150 1100
Wire Wire Line
	6150 1300 6150 1200
Wire Wire Line
	6150 1400 6150 1300
Wire Wire Line
	6150 2750 6050 2750
Wire Wire Line
	6150 5050 6050 5050
Wire Wire Line
	6800 8000 7600 8000
Wire Wire Line
	6800 8800 6900 8800
Wire Wire Line
	6800 10350 7100 10350
Wire Wire Line
	6900 8100 6900 8800
Wire Wire Line
	6900 8100 7600 8100
Wire Wire Line
	7000 8200 7000 9600
Wire Wire Line
	7000 8200 7600 8200
Wire Wire Line
	7000 9600 6800 9600
Wire Wire Line
	7100 8300 7100 10350
Wire Wire Line
	7100 8300 7600 8300
Wire Wire Line
	7150 900  7800 900 
Wire Wire Line
	7150 1000 7800 1000
Wire Wire Line
	7150 1100 7800 1100
Wire Wire Line
	7150 1200 7800 1200
Wire Wire Line
	7150 1300 7800 1300
Wire Wire Line
	7150 1400 7800 1400
Wire Wire Line
	7150 2050 7800 2050
Wire Wire Line
	7150 2150 7800 2150
Wire Wire Line
	7150 2250 7800 2250
Wire Wire Line
	7150 2350 7800 2350
Wire Wire Line
	7150 2450 7800 2450
Wire Wire Line
	7150 3200 7800 3200
Wire Wire Line
	7150 3300 7800 3300
Wire Wire Line
	7150 3400 7800 3400
Wire Wire Line
	7150 3500 7800 3500
Wire Wire Line
	7150 3600 7800 3600
Wire Wire Line
	7150 3700 7800 3700
Wire Wire Line
	7150 4350 7800 4350
Wire Wire Line
	7150 4450 7800 4450
Wire Wire Line
	7150 4550 7800 4550
Wire Wire Line
	7150 4650 7800 4650
Wire Wire Line
	7150 4750 7800 4750
Wire Wire Line
	7200 7200 6800 7200
Wire Wire Line
	7200 7200 7200 7900
Wire Wire Line
	7200 7900 7600 7900
Wire Wire Line
	7200 8400 7200 10800
Wire Wire Line
	7200 8400 7600 8400
Wire Wire Line
	7200 10800 6800 10800
Wire Wire Line
	8400 7900 8900 7900
Wire Wire Line
	8400 8000 8900 8000
Wire Wire Line
	8400 8100 8900 8100
Wire Wire Line
	8400 8200 8900 8200
Wire Wire Line
	8400 8300 8900 8300
Wire Wire Line
	8400 8400 8900 8400
Wire Wire Line
	8400 8600 8750 8600
Wire Wire Line
	8550 900  9200 900 
Wire Wire Line
	8550 1000 9200 1000
Wire Wire Line
	8550 1100 9200 1100
Wire Wire Line
	8550 1200 9200 1200
Wire Wire Line
	8550 1300 9200 1300
Wire Wire Line
	8550 1400 9200 1400
Wire Wire Line
	8550 2050 9200 2050
Wire Wire Line
	8550 2150 9200 2150
Wire Wire Line
	8550 2250 9200 2250
Wire Wire Line
	8550 2350 9200 2350
Wire Wire Line
	8550 2450 9200 2450
Wire Wire Line
	8550 3200 9200 3200
Wire Wire Line
	8550 3300 9200 3300
Wire Wire Line
	8550 3400 9200 3400
Wire Wire Line
	8550 3500 9200 3500
Wire Wire Line
	8550 3600 9200 3600
Wire Wire Line
	8550 3700 9200 3700
Wire Wire Line
	8550 4350 9200 4350
Wire Wire Line
	8550 4450 9200 4450
Wire Wire Line
	8550 4550 9200 4550
Wire Wire Line
	8550 4650 9200 4650
Wire Wire Line
	8550 4750 9200 4750
Wire Wire Line
	8650 9000 8900 9000
Wire Wire Line
	8750 8500 8900 8500
Wire Wire Line
	8750 8600 8750 8500
Wire Wire Line
	8900 9000 8900 8800
Wire Wire Line
	9100 1600 9200 1600
Wire Wire Line
	9100 2750 9100 1600
Wire Wire Line
	9100 3900 9200 3900
Wire Wire Line
	9100 5050 9100 3900
Wire Wire Line
	9200 2750 9100 2750
Wire Wire Line
	9200 5050 9100 5050
Wire Wire Line
	9900 7900 10400 7900
Wire Wire Line
	9900 8000 10400 8000
Wire Wire Line
	9900 8100 10400 8100
Wire Wire Line
	9900 8200 10400 8200
Wire Wire Line
	9900 8300 10400 8300
Wire Wire Line
	9900 8400 10400 8400
Wire Wire Line
	9900 8500 10400 8500
Wire Wire Line
	10200 900  10850 900 
Wire Wire Line
	10200 1000 10850 1000
Wire Wire Line
	10200 1100 10850 1100
Wire Wire Line
	10200 1200 10850 1200
Wire Wire Line
	10200 1300 10850 1300
Wire Wire Line
	10200 1400 10850 1400
Wire Wire Line
	10200 2050 10850 2050
Wire Wire Line
	10200 2150 10850 2150
Wire Wire Line
	10200 2250 10850 2250
Wire Wire Line
	10200 2350 10850 2350
Wire Wire Line
	10200 2450 10850 2450
Wire Wire Line
	10200 3200 10850 3200
Wire Wire Line
	10200 3300 10850 3300
Wire Wire Line
	10200 3400 10850 3400
Wire Wire Line
	10200 3500 10850 3500
Wire Wire Line
	10200 3600 10850 3600
Wire Wire Line
	10200 3700 10850 3700
Wire Wire Line
	10200 4350 10850 4350
Wire Wire Line
	10200 4450 10850 4450
Wire Wire Line
	10200 4550 10850 4550
Wire Wire Line
	10200 4650 10850 4650
Wire Wire Line
	10200 4750 10850 4750
Wire Wire Line
	11500 7200 12150 7200
Wire Wire Line
	11500 7300 12150 7300
Wire Wire Line
	11500 7400 12150 7400
Wire Wire Line
	11500 7500 12150 7500
Wire Wire Line
	12000 1850 13050 1850
Wire Wire Line
	12000 1950 13050 1950
Wire Wire Line
	12000 2050 13050 2050
Wire Wire Line
	12000 2150 13050 2150
Wire Wire Line
	12000 2250 13050 2250
Wire Wire Line
	12000 2350 13050 2350
Wire Wire Line
	12750 7350 13450 7350
Wire Wire Line
	12800 7800 13450 7800
Wire Wire Line
	12800 7900 13450 7900
Wire Wire Line
	12800 8000 13450 8000
Wire Wire Line
	12800 8100 13450 8100
Wire Wire Line
	13450 7450 13000 7450
Wire Wire Line
	14050 7400 14000 7400
Wire Wire Line
	14050 7850 14050 7400
Wire Wire Line
	14600 8400 14600 8000
Wire Bus Line
	1450 6850 1350 6850
Wire Bus Line
	5200 5250 5300 5250
Wire Bus Line
	5200 5450 8350 5450
Wire Bus Line
	5300 5250 5300 4250
Wire Bus Line
	5400 4250 5300 4250
Wire Bus Line
	5400 5350 5200 5350
Wire Bus Line
	5400 5350 8250 5350
Wire Bus Line
	7900 5250 10950 5250
Wire Bus Line
	8250 1950 8250 5350
Wire Bus Line
	8250 1950 8450 1950
Wire Bus Line
	8350 4250 8450 4250
Wire Bus Line
	8350 5450 8350 4250
Wire Bus Line
	8450 5550 5200 5550
Wire Bus Line
	10500 8700 10650 8700
Wire Bus Line
	13150 2650 14400 2650
Text Notes 2450 10100 0    50   ~ 0
Clean the row selection to make sure\nthat the sprite layer is NOT on two rows
Text Notes 4650 10450 0    50   ~ 0
Apply the priority mask on the\ntransparency selection on the palette
Text Notes 6000 6800 0    50   ~ 0
/[\n    PALETTE != Transparent &\n    (\n      /SPRITE +\n      /PRIO\n    )\n]
Text Notes 7950 7400 0    50   ~ 0
Takes the FIRST row that has a colour\n(and sync it on CLK8M)
Text Notes 11700 2250 0    50   ~ 0
CDC0
Text Notes 11700 2350 0    50   ~ 0
CDC1
Text Notes 11900 1850 2    50   ~ 0
COLOUR0
Text Notes 11900 1950 2    50   ~ 0
COLOUR1
Text Notes 11900 2050 2    50   ~ 0
COLOUR2
Text Notes 11900 2150 2    50   ~ 0
COLOUR3
Text Notes 13300 6950 0    50   ~ 0
USELESS BIT OF LOGIC
Text Label 2000 7050 2    50   ~ 0
~SPRITE-R1
Text Label 2000 7150 2    50   ~ 0
~SPRITE-R2
Text Label 2000 7250 2    50   ~ 0
~SPRITE-R3
Text Label 2000 7350 2    50   ~ 0
~SPRITE-R4
Text Label 3950 7200 0    50   ~ 0
~SPRITE_R1
Text Label 3950 8000 0    50   ~ 0
~SPRITE_R2
Text Label 3950 8800 0    50   ~ 0
~SPRITE_R3
Text Label 3950 9600 0    50   ~ 0
~SPRITE_R4
Text Label 4700 7300 0    50   ~ 0
ROW1-D0
Text Label 4700 7400 0    50   ~ 0
ROW1-D1
Text Label 4700 7500 0    50   ~ 0
ROW1-D2
Text Label 4700 7600 0    50   ~ 0
ROW1-D3
Text Label 4700 8100 0    50   ~ 0
ROW2-D0
Text Label 4700 8200 0    50   ~ 0
ROW2-D1
Text Label 4700 8300 0    50   ~ 0
ROW2-D2
Text Label 4700 8400 0    50   ~ 0
ROW2-D3
Text Label 4700 8900 0    50   ~ 0
ROW3-D0
Text Label 4700 9000 0    50   ~ 0
ROW3-D1
Text Label 4700 9100 0    50   ~ 0
ROW3-D2
Text Label 4700 9200 0    50   ~ 0
ROW3-D3
Text Label 4700 9700 0    50   ~ 0
ROW4-D0
Text Label 4700 9800 0    50   ~ 0
ROW4-D1
Text Label 4700 9900 0    50   ~ 0
ROW4-D2
Text Label 4700 10000 0    50   ~ 0
ROW4-D3
Text Label 5600 2150 0    50   ~ 0
ROW4-D0
Text Label 5600 2250 0    50   ~ 0
ROW4-D1
Text Label 5600 2350 0    50   ~ 0
ROW4-D2
Text Label 5600 2450 0    50   ~ 0
ROW4-D3
Text Label 5600 3200 0    50   ~ 0
ROW4-D0
Text Label 5600 3300 0    50   ~ 0
ROW4-D1
Text Label 5600 3400 0    50   ~ 0
ROW4-D2
Text Label 5600 3500 0    50   ~ 0
ROW4-D3
Text Label 5600 3600 0    50   ~ 0
ROW4-D9
Text Label 5600 3700 0    50   ~ 0
ROW4-D10
Text Label 5600 4350 0    50   ~ 0
ROW4-D11
Text Label 5600 4450 0    50   ~ 0
ROW3-D0
Text Label 5600 4550 0    50   ~ 0
ROW3-D1
Text Label 5600 4650 0    50   ~ 0
ROW3-D2
Text Label 5600 4750 0    50   ~ 0
ROW3-D3
Text Label 6050 1600 2    50   ~ 0
~SPRITE_R4
Text Label 6050 3900 2    50   ~ 0
~SPRITE_R3
Text Label 7300 900  0    50   ~ 0
OUT0
Text Label 7300 1000 0    50   ~ 0
OUT1
Text Label 7300 1100 0    50   ~ 0
OUT2
Text Label 7300 1200 0    50   ~ 0
OUT3
Text Label 7300 1300 0    50   ~ 0
OUT4
Text Label 7300 1400 0    50   ~ 0
OUT5
Text Label 7300 2050 0    50   ~ 0
OUT6
Text Label 7300 2150 0    50   ~ 0
OUT7
Text Label 7300 2250 0    50   ~ 0
OUT8
Text Label 7300 2350 0    50   ~ 0
OUT9
Text Label 7300 2450 0    50   ~ 0
OUT10
Text Label 7300 3200 0    50   ~ 0
OUT0
Text Label 7300 3300 0    50   ~ 0
OUT1
Text Label 7300 3400 0    50   ~ 0
OUT2
Text Label 7300 3500 0    50   ~ 0
OUT3
Text Label 7300 3600 0    50   ~ 0
OUT4
Text Label 7300 3700 0    50   ~ 0
OUT5
Text Label 7300 4350 0    50   ~ 0
OUT6
Text Label 7300 4450 0    50   ~ 0
OUT7
Text Label 7300 4550 0    50   ~ 0
OUT8
Text Label 7300 4650 0    50   ~ 0
OUT9
Text Label 7300 4750 0    50   ~ 0
OUT10
Text Label 8650 900  0    50   ~ 0
ROW3-D0
Text Label 8650 1000 0    50   ~ 0
ROW3-D1
Text Label 8650 1100 0    50   ~ 0
ROW3-D2
Text Label 8650 1200 0    50   ~ 0
ROW3-D3
Text Label 8650 1300 0    50   ~ 0
ROW3-D9
Text Label 8650 1400 0    50   ~ 0
ROW3-D10
Text Label 8650 2050 0    50   ~ 0
ROW3-D11
Text Label 8650 2150 0    50   ~ 0
ROW2-D0
Text Label 8650 2250 0    50   ~ 0
ROW2-D1
Text Label 8650 2350 0    50   ~ 0
ROW2-D2
Text Label 8650 2450 0    50   ~ 0
ROW2-D3
Text Label 8650 3200 0    50   ~ 0
ROW2-D0
Text Label 8650 3300 0    50   ~ 0
ROW2-D1
Text Label 8650 3400 0    50   ~ 0
ROW2-D2
Text Label 8650 3500 0    50   ~ 0
ROW2-D3
Text Label 8650 3600 0    50   ~ 0
ROW2-D9
Text Label 8650 3700 0    50   ~ 0
ROW2-D10
Text Label 8650 4350 0    50   ~ 0
ROW2-D11
Text Label 8650 4450 0    50   ~ 0
ROW1-D0
Text Label 8650 4550 0    50   ~ 0
ROW1-D1
Text Label 8650 4650 0    50   ~ 0
ROW1-D2
Text Label 8650 4750 0    50   ~ 0
ROW1-D3
Text Label 9100 1600 2    50   ~ 0
~SPRITE_R2
Text Label 9100 3900 2    50   ~ 0
~SPRITE_R1
Text Label 10000 7900 0    50   ~ 0
~ROW-E1
Text Label 10000 8000 0    50   ~ 0
~ROW-E2
Text Label 10000 8100 0    50   ~ 0
~ROW-E3
Text Label 10000 8200 0    50   ~ 0
~ROW-E4
Text Label 10000 8300 0    50   ~ 0
~ROW-E5
Text Label 10000 8400 0    50   ~ 0
~ROW-E6
Text Label 10000 8500 0    50   ~ 0
~ROW-E7
Text Label 10350 900  0    50   ~ 0
OUT0
Text Label 10350 1000 0    50   ~ 0
OUT1
Text Label 10350 1100 0    50   ~ 0
OUT2
Text Label 10350 1200 0    50   ~ 0
OUT3
Text Label 10350 1300 0    50   ~ 0
OUT4
Text Label 10350 1400 0    50   ~ 0
OUT5
Text Label 10350 2050 0    50   ~ 0
OUT6
Text Label 10350 2150 0    50   ~ 0
OUT7
Text Label 10350 2250 0    50   ~ 0
OUT8
Text Label 10350 2350 0    50   ~ 0
OUT9
Text Label 10350 2450 0    50   ~ 0
OUT10
Text Label 10350 3200 0    50   ~ 0
OUT0
Text Label 10350 3300 0    50   ~ 0
OUT1
Text Label 10350 3400 0    50   ~ 0
OUT2
Text Label 10350 3500 0    50   ~ 0
OUT3
Text Label 10350 3600 0    50   ~ 0
OUT4
Text Label 10350 3700 0    50   ~ 0
OUT5
Text Label 10350 4350 0    50   ~ 0
OUT6
Text Label 10350 4450 0    50   ~ 0
OUT7
Text Label 10350 4550 0    50   ~ 0
OUT8
Text Label 10350 4650 0    50   ~ 0
OUT9
Text Label 10350 4750 0    50   ~ 0
OUT10
Text Label 11650 7200 0    50   ~ 0
OUT0
Text Label 11650 7300 0    50   ~ 0
OUT1
Text Label 11650 7400 0    50   ~ 0
OUT2
Text Label 11650 7500 0    50   ~ 0
OUT3
Text Label 12100 1850 0    50   ~ 0
PRIO-S0
Text Label 12100 1950 0    50   ~ 0
PRIO-S1
Text Label 12100 2050 0    50   ~ 0
PRIO-S2
Text Label 12100 2150 0    50   ~ 0
PRIO-S3
Text Label 12100 2250 0    50   ~ 0
PRIO-S4
Text Label 12100 2350 0    50   ~ 0
PRIO-S5
Text Label 12550 1850 0    50   ~ 0
OUT0
Text Label 12550 1950 0    50   ~ 0
OUT1
Text Label 12550 2050 0    50   ~ 0
OUT2
Text Label 12550 2150 0    50   ~ 0
OUT3
Text Label 12550 2250 0    50   ~ 0
OUT4
Text Label 12550 2350 0    50   ~ 0
OUT5
Text Label 12950 7800 0    50   ~ 0
OUT7
Text Label 12950 7900 0    50   ~ 0
OUT8
Text Label 12950 8000 0    50   ~ 0
OUT9
Text Label 12950 8100 0    50   ~ 0
OUT10
Text Label 13100 7450 0    50   ~ 0
OUT6
Text Label 13250 2650 0    50   ~ 0

Text Label 13800 2650 0    50   ~ 0

Text HLabel 1350 6850 0    50   Input ~ 0
~SPRITE-R[1..4]
Text HLabel 4600 6850 0    50   Input ~ 0
PRIORITY
Text HLabel 5200 5250 0    50   Input ~ 0
ROW4-D[0..11]
Text HLabel 5200 5350 0    50   Input ~ 0
ROW3-D[0..11]
Text HLabel 5200 5450 0    50   Input ~ 0
ROW2-D[0..11]
Text HLabel 5200 5550 0    50   Input ~ 0
ROW1-D[0..11]
Text HLabel 6800 10350 0    50   Input ~ 0
~ROW5-E
Text HLabel 6800 10800 0    50   Input ~ 0
~ROW6-E
Text HLabel 7600 8600 0    50   Input ~ 0
BLANK
Text HLabel 8900 8700 0    50   Input ~ 0
CLK8M
Text HLabel 10650 8700 2    50   Output ~ 0
~ROW-E[1..7]
Text HLabel 14000 8400 0    50   Input ~ 0
BLANK
Text HLabel 14400 2650 2    50   Output ~ 0
PRIO-S[0..5]
$Comp
L power:VCC #PWR?
U 1 1 601D2FD5
P 6150 900
AR Path="/614CE0F4/601D2FD5" Ref="#PWR?"  Part="1" 
AR Path="/5FBEEC97/5FC01C06/601D2FD5" Ref="#PWR0245"  Part="1" 
F 0 "#PWR0245" H 6150 750 50  0001 C CNN
F 1 "VCC" H 6165 1073 50  0000 C CNN
F 2 "" H 6150 900 50  0001 C CNN
F 3 "" H 6150 900 50  0001 C CNN
	1    6150 900 
	1    0    0    -1  
$EndComp
$Comp
L power:VCC #PWR?
U 1 1 601D303B
P 6150 2050
AR Path="/614CE0F4/601D303B" Ref="#PWR?"  Part="1" 
AR Path="/5FBEEC97/5FC01C06/601D303B" Ref="#PWR0246"  Part="1" 
F 0 "#PWR0246" H 6150 1900 50  0001 C CNN
F 1 "VCC" H 6165 2223 50  0000 C CNN
F 2 "" H 6150 2050 50  0001 C CNN
F 3 "" H 6150 2050 50  0001 C CNN
	1    6150 2050
	1    0    0    -1  
$EndComp
$Comp
L power:VCC #PWR?
U 1 1 605DD76C
P 8650 9000
AR Path="/614CE0F4/605DD76C" Ref="#PWR?"  Part="1" 
AR Path="/5FBEEC97/5FC01C06/605DD76C" Ref="#PWR0247"  Part="1" 
F 0 "#PWR0247" H 8650 8850 50  0001 C CNN
F 1 "VCC" H 8665 9173 50  0000 C CNN
F 2 "" H 8650 9000 50  0001 C CNN
F 3 "" H 8650 9000 50  0001 C CNN
	1    8650 9000
	1    0    0    -1  
$EndComp
$Comp
L power:VCC #PWR?
U 1 1 605CFEA7
P 8900 7800
AR Path="/614CE0F4/605CFEA7" Ref="#PWR?"  Part="1" 
AR Path="/5FBEEC97/5FC01C06/605CFEA7" Ref="#PWR0248"  Part="1" 
F 0 "#PWR0248" H 8900 7650 50  0001 C CNN
F 1 "VCC" H 8915 7973 50  0000 C CNN
F 2 "" H 8900 7800 50  0001 C CNN
F 3 "" H 8900 7800 50  0001 C CNN
	1    8900 7800
	1    0    0    -1  
$EndComp
$Comp
L A5C:AND02 UBIX164
U 1 1 60CD41E3
P 13700 7400
AR Path="/614CE0F4/60CD41E3" Ref="UBIX164"  Part="1" 
AR Path="/5FBEEC97/5FC01C06/60CD41E3" Ref="UBIX164"  Part="1" 
F 0 "UBIX164" H 13725 7667 50  0000 C CNN
F 1 "AND02" H 13725 7576 50  0000 C CNN
F 2 "" H 13700 7400 50  0001 C CNN
F 3 "" H 13700 7400 50  0001 C CNN
	1    13700 7400
	1    0    0    -1  
$EndComp
$Comp
L A5C:AND02 UBIX164
U 1 1 60DAC926
P 14300 7900
AR Path="/614CE0F4/60DAC926" Ref="UBIX164"  Part="1" 
AR Path="/5FBEEC97/5FC01C06/60DAC926" Ref="UBMX164"  Part="1" 
F 0 "UBMX164" H 14325 8167 50  0000 C CNN
F 1 "AND02" H 14325 8076 50  0000 C CNN
F 2 "" H 14300 7900 50  0001 C CNN
F 3 "" H 14300 7900 50  0001 C CNN
	1    14300 7900
	1    0    0    -1  
$EndComp
$Comp
L A5C:AND02 UBMX164
U 1 1 60DF2EE2
P 14850 7950
AR Path="/614CE0F4/60DF2EE2" Ref="UBMX164"  Part="1" 
AR Path="/5FBEEC97/5FC01C06/60DF2EE2" Ref="UBNX164"  Part="1" 
F 0 "UBNX164" H 14875 8217 50  0000 C CNN
F 1 "AND02" H 14875 8126 50  0000 C CNN
F 2 "" H 14850 7950 50  0001 C CNN
F 3 "" H 14850 7950 50  0001 C CNN
	1    14850 7950
	1    0    0    -1  
$EndComp
$Comp
L A5C:INV01 U?
U 1 1 614D4E72
P 3050 6950
AR Path="/5F726526/614D4E72" Ref="U?"  Part="1" 
AR Path="/614CE0F4/614D4E72" Ref="UBF88"  Part="1" 
AR Path="/5FBEEC97/5FC01C06/614D4E72" Ref="UBF88"  Part="1" 
F 0 "UBF88" H 3050 7266 50  0000 C CNN
F 1 "INV01" H 3050 7175 50  0000 C CNN
F 2 "" H 3050 6750 50  0001 C CNN
F 3 "" H 3050 6750 50  0001 C CNN
	1    3050 6950
	1    0    0    -1  
$EndComp
$Comp
L A5C:INV01 U?
U 1 1 614D4E78
P 3050 7750
AR Path="/5F726526/614D4E78" Ref="U?"  Part="1" 
AR Path="/614CE0F4/614D4E78" Ref="UBF91"  Part="1" 
AR Path="/5FBEEC97/5FC01C06/614D4E78" Ref="UBF91"  Part="1" 
F 0 "UBF91" H 3050 8066 50  0000 C CNN
F 1 "INV01" H 3050 7975 50  0000 C CNN
F 2 "" H 3050 7550 50  0001 C CNN
F 3 "" H 3050 7550 50  0001 C CNN
	1    3050 7750
	1    0    0    -1  
$EndComp
$Comp
L A5C:INV01 U?
U 1 1 614DB8D1
P 3050 8550
AR Path="/5F726526/614DB8D1" Ref="U?"  Part="1" 
AR Path="/614CE0F4/614DB8D1" Ref="UBF94"  Part="1" 
AR Path="/5FBEEC97/5FC01C06/614DB8D1" Ref="UBF94"  Part="1" 
F 0 "UBF94" H 3050 8866 50  0000 C CNN
F 1 "INV01" H 3050 8775 50  0000 C CNN
F 2 "" H 3050 8350 50  0001 C CNN
F 3 "" H 3050 8350 50  0001 C CNN
	1    3050 8550
	1    0    0    -1  
$EndComp
$Comp
L A5C:INV01 U?
U 1 1 614DD165
P 3050 9350
AR Path="/5F726526/614DD165" Ref="U?"  Part="1" 
AR Path="/614CE0F4/614DD165" Ref="UBF98"  Part="1" 
AR Path="/5FBEEC97/5FC01C06/614DD165" Ref="UBF98"  Part="1" 
F 0 "UBF98" H 3050 9666 50  0000 C CNN
F 1 "INV01" H 3050 9575 50  0000 C CNN
F 2 "" H 3050 9150 50  0001 C CNN
F 3 "" H 3050 9150 50  0001 C CNN
	1    3050 9350
	1    0    0    -1  
$EndComp
$Comp
L A5C:INV01 UBMX159
U 1 1 603A5742
P 5400 6850
AR Path="/614CE0F4/603A5742" Ref="UBMX159"  Part="1" 
AR Path="/5FBEEC97/5FC01C06/603A5742" Ref="UBMX159"  Part="1" 
F 0 "UBMX159" H 5400 7167 50  0000 C CNN
F 1 "INV01" H 5400 7076 50  0000 C CNN
F 2 "" H 5400 6650 50  0001 C CNN
F 3 "" H 5400 6650 50  0001 C CNN
	1    5400 6850
	1    0    0    -1  
$EndComp
$Comp
L A5C:INV01 UBMX160
U 1 1 60DF2C2D
P 14300 8400
AR Path="/614CE0F4/60DF2C2D" Ref="UBMX160"  Part="1" 
AR Path="/5FBEEC97/5FC01C06/60DF2C2D" Ref="UBMX160"  Part="1" 
F 0 "UBMX160" H 14300 8717 50  0000 C CNN
F 1 "INV01" H 14300 8626 50  0000 C CNN
F 2 "" H 14300 8200 50  0001 C CNN
F 3 "" H 14300 8200 50  0001 C CNN
	1    14300 8400
	1    0    0    -1  
$EndComp
$Comp
L A5C:NAND04 U?
U 1 1 614D4E6C
P 3650 7200
AR Path="/5F726526/614D4E6C" Ref="U?"  Part="1" 
AR Path="/614CE0F4/614D4E6C" Ref="UBF89"  Part="1" 
AR Path="/5FBEEC97/5FC01C06/614D4E6C" Ref="UBF89"  Part="1" 
F 0 "UBF89" H 3650 7542 50  0000 C CNN
F 1 "NAND04" H 3650 7451 50  0000 C CNN
F 2 "" H 3650 6950 50  0001 C CNN
F 3 "" H 3650 6950 50  0001 C CNN
	1    3650 7200
	1    0    0    -1  
$EndComp
$Comp
L A5C:NAND04 U?
U 1 1 614D4E66
P 3650 8000
AR Path="/5F726526/614D4E66" Ref="U?"  Part="1" 
AR Path="/614CE0F4/614D4E66" Ref="UBF92"  Part="1" 
AR Path="/5FBEEC97/5FC01C06/614D4E66" Ref="UBF92"  Part="1" 
F 0 "UBF92" H 3650 8342 50  0000 C CNN
F 1 "NAND04" H 3650 8251 50  0000 C CNN
F 2 "" H 3650 7750 50  0001 C CNN
F 3 "" H 3650 7750 50  0001 C CNN
	1    3650 8000
	1    0    0    -1  
$EndComp
$Comp
L A5C:NAND04 U?
U 1 1 614DB8CB
P 3650 8800
AR Path="/5F726526/614DB8CB" Ref="U?"  Part="1" 
AR Path="/614CE0F4/614DB8CB" Ref="UBF95"  Part="1" 
AR Path="/5FBEEC97/5FC01C06/614DB8CB" Ref="UBF95"  Part="1" 
F 0 "UBF95" H 3650 9142 50  0000 C CNN
F 1 "NAND04" H 3650 9051 50  0000 C CNN
F 2 "" H 3650 8550 50  0001 C CNN
F 3 "" H 3650 8550 50  0001 C CNN
	1    3650 8800
	1    0    0    -1  
$EndComp
$Comp
L A5C:NAND04 U?
U 1 1 614DD15F
P 3650 9600
AR Path="/5F726526/614DD15F" Ref="U?"  Part="1" 
AR Path="/614CE0F4/614DD15F" Ref="UBF99"  Part="1" 
AR Path="/5FBEEC97/5FC01C06/614DD15F" Ref="UBF99"  Part="1" 
F 0 "UBF99" H 3650 9942 50  0000 C CNN
F 1 "NAND04" H 3650 9851 50  0000 C CNN
F 2 "" H 3650 9350 50  0001 C CNN
F 3 "" H 3650 9350 50  0001 C CNN
	1    3650 9600
	1    0    0    -1  
$EndComp
$Comp
L A5C:NAND04 UBN108
U 1 1 61839364
P 5550 7450
AR Path="/614CE0F4/61839364" Ref="UBN108"  Part="1" 
AR Path="/5FBEEC97/5FC01C06/61839364" Ref="UBN108"  Part="1" 
F 0 "UBN108" H 5550 7108 50  0000 C CNN
F 1 "NAND04" H 5550 7199 50  0000 C CNN
F 2 "" H 5550 7200 50  0001 C CNN
F 3 "" H 5550 7200 50  0001 C CNN
	1    5550 7450
	1    0    0    -1  
$EndComp
$Comp
L A5C:NAND04 UBM108
U 1 1 61823101
P 5550 8250
AR Path="/614CE0F4/61823101" Ref="UBM108"  Part="1" 
AR Path="/5FBEEC97/5FC01C06/61823101" Ref="UBM108"  Part="1" 
F 0 "UBM108" H 5550 7908 50  0000 C CNN
F 1 "NAND04" H 5550 7999 50  0000 C CNN
F 2 "" H 5550 8000 50  0001 C CNN
F 3 "" H 5550 8000 50  0001 C CNN
	1    5550 8250
	1    0    0    -1  
$EndComp
$Comp
L A5C:NAND04 UBK108
U 1 1 6180F4D7
P 5550 9050
AR Path="/614CE0F4/6180F4D7" Ref="UBK108"  Part="1" 
AR Path="/5FBEEC97/5FC01C06/6180F4D7" Ref="UBK108"  Part="1" 
F 0 "UBK108" H 5550 8708 50  0000 C CNN
F 1 "NAND04" H 5550 8799 50  0000 C CNN
F 2 "" H 5550 8800 50  0001 C CNN
F 3 "" H 5550 8800 50  0001 C CNN
	1    5550 9050
	1    0    0    -1  
$EndComp
$Comp
L A5C:NAND04 UBI108
U 1 1 6179525F
P 5550 9850
AR Path="/614CE0F4/6179525F" Ref="UBI108"  Part="1" 
AR Path="/5FBEEC97/5FC01C06/6179525F" Ref="UBI108"  Part="1" 
F 0 "UBI108" H 5550 10192 50  0000 C CNN
F 1 "NAND04" H 5550 10101 50  0000 C CNN
F 2 "" H 5550 9600 50  0001 C CNN
F 3 "" H 5550 9600 50  0001 C CNN
	1    5550 9850
	1    0    0    1   
$EndComp
$Comp
L A5C:NAND04 UBKX158
U 1 1 60D37775
P 12450 7350
AR Path="/614CE0F4/60D37775" Ref="UBKX158"  Part="1" 
AR Path="/5FBEEC97/5FC01C06/60D37775" Ref="UBKX158"  Part="1" 
F 0 "UBKX158" H 12450 7692 50  0000 C CNN
F 1 "NAND04" H 12450 7601 50  0000 C CNN
F 2 "" H 12450 7100 50  0001 C CNN
F 3 "" H 12450 7100 50  0001 C CNN
	1    12450 7350
	1    0    0    -1  
$EndComp
$Comp
L A5C:NAND04 UBIX158
U 1 1 60CF1DEA
P 13750 7950
AR Path="/614CE0F4/60CF1DEA" Ref="UBIX158"  Part="1" 
AR Path="/5FBEEC97/5FC01C06/60CF1DEA" Ref="UBIX158"  Part="1" 
F 0 "UBIX158" H 13750 8292 50  0000 C CNN
F 1 "NAND04" H 13750 8201 50  0000 C CNN
F 2 "" H 13750 7700 50  0001 C CNN
F 3 "" H 13750 7700 50  0001 C CNN
	1    13750 7950
	1    0    0    -1  
$EndComp
$Comp
L A5C:OAI21 UBN110
U 1 1 6183936A
P 6400 7200
AR Path="/614CE0F4/6183936A" Ref="UBN110"  Part="1" 
AR Path="/5FBEEC97/5FC01C06/6183936A" Ref="UBN110"  Part="1" 
F 0 "UBN110" H 6400 7517 50  0000 C CNN
F 1 "OAI21" H 6400 7426 50  0000 C CNN
F 2 "" H 6450 7050 50  0001 C CNN
F 3 "" H 6450 7050 50  0001 C CNN
	1    6400 7200
	1    0    0    -1  
$EndComp
$Comp
L A5C:OAI21 UBM110
U 1 1 61823107
P 6400 8000
AR Path="/614CE0F4/61823107" Ref="UBM110"  Part="1" 
AR Path="/5FBEEC97/5FC01C06/61823107" Ref="UBM110"  Part="1" 
F 0 "UBM110" H 6400 8317 50  0000 C CNN
F 1 "OAI21" H 6400 8226 50  0000 C CNN
F 2 "" H 6450 7850 50  0001 C CNN
F 3 "" H 6450 7850 50  0001 C CNN
	1    6400 8000
	1    0    0    -1  
$EndComp
$Comp
L A5C:OAI21 UBK110
U 1 1 6180F4DD
P 6400 8800
AR Path="/614CE0F4/6180F4DD" Ref="UBK110"  Part="1" 
AR Path="/5FBEEC97/5FC01C06/6180F4DD" Ref="UBK110"  Part="1" 
F 0 "UBK110" H 6400 9117 50  0000 C CNN
F 1 "OAI21" H 6400 9026 50  0000 C CNN
F 2 "" H 6450 8650 50  0001 C CNN
F 3 "" H 6450 8650 50  0001 C CNN
	1    6400 8800
	1    0    0    -1  
$EndComp
$Comp
L A5C:OAI21 UBI110
U 1 1 6179E6F0
P 6400 9600
AR Path="/614CE0F4/6179E6F0" Ref="UBI110"  Part="1" 
AR Path="/5FBEEC97/5FC01C06/6179E6F0" Ref="UBI110"  Part="1" 
F 0 "UBI110" H 6400 9917 50  0000 C CNN
F 1 "OAI21" H 6400 9826 50  0000 C CNN
F 2 "" H 6450 9450 50  0001 C CNN
F 3 "" H 6450 9450 50  0001 C CNN
	1    6400 9600
	1    0    0    -1  
$EndComp
$Comp
L A5C:PRIO UBH70
U 1 1 604BEAB5
P 8000 8250
AR Path="/614CE0F4/604BEAB5" Ref="UBH70"  Part="1" 
AR Path="/5FBEEC97/5FC01C06/604BEAB5" Ref="UBH70"  Part="1" 
F 0 "UBH70" H 8000 8865 50  0000 C CNN
F 1 "PRIO" H 8000 8774 50  0000 C CNN
F 2 "" H 7750 8100 50  0001 C CNN
F 3 "" H 7750 8100 50  0001 C CNN
	1    8000 8250
	1    0    0    -1  
$EndComp
$Comp
L A5C:M125C-X6 UBI?
U 1 1 614F7732
P 6650 1350
AR Path="/5F75F22B/614F7732" Ref="UBI?"  Part="1" 
AR Path="/614CE0F4/614F7732" Ref="UBI87"  Part="1" 
AR Path="/5FBEEC97/5FC01C06/614F7732" Ref="UBI87"  Part="1" 
F 0 "UBI87" H 6650 2061 50  0000 C CNN
F 1 "M125C-X6" H 6650 1970 50  0000 C CNN
F 2 "" H 6950 1350 50  0001 C CNN
F 3 "" H 6950 1350 50  0001 C CNN
	1    6650 1350
	1    0    0    -1  
$EndComp
$Comp
L A5C:M125C-X6 UBI?
U 1 1 614F7738
P 6650 2500
AR Path="/5F75F22B/614F7738" Ref="UBI?"  Part="1" 
AR Path="/614CE0F4/614F7738" Ref="UBI99"  Part="1" 
AR Path="/5FBEEC97/5FC01C06/614F7738" Ref="UBI99"  Part="1" 
F 0 "UBI99" H 6650 3211 50  0000 C CNN
F 1 "M125C-X6" H 6650 3120 50  0000 C CNN
F 2 "" H 6950 2500 50  0001 C CNN
F 3 "" H 6950 2500 50  0001 C CNN
	1    6650 2500
	1    0    0    -1  
$EndComp
$Comp
L A5C:M125C-X6 UBI?
U 1 1 615F84BD
P 6650 3650
AR Path="/5F75F22B/615F84BD" Ref="UBI?"  Part="1" 
AR Path="/614CE0F4/615F84BD" Ref="UBK87"  Part="1" 
AR Path="/5FBEEC97/5FC01C06/615F84BD" Ref="UBK87"  Part="1" 
F 0 "UBK87" H 6650 4361 50  0000 C CNN
F 1 "M125C-X6" H 6650 4270 50  0000 C CNN
F 2 "" H 6950 3650 50  0001 C CNN
F 3 "" H 6950 3650 50  0001 C CNN
	1    6650 3650
	1    0    0    -1  
$EndComp
$Comp
L A5C:M125C-X6 UBI?
U 1 1 61601330
P 6650 4800
AR Path="/5F75F22B/61601330" Ref="UBI?"  Part="1" 
AR Path="/614CE0F4/61601330" Ref="UBK99"  Part="1" 
AR Path="/5FBEEC97/5FC01C06/61601330" Ref="UBK99"  Part="1" 
F 0 "UBK99" H 6650 5511 50  0000 C CNN
F 1 "M125C-X6" H 6650 5420 50  0000 C CNN
F 2 "" H 6950 4800 50  0001 C CNN
F 3 "" H 6950 4800 50  0001 C CNN
	1    6650 4800
	1    0    0    -1  
$EndComp
$Comp
L A5C:M125C-X6 UBI?
U 1 1 6167387C
P 9700 1350
AR Path="/5F75F22B/6167387C" Ref="UBI?"  Part="1" 
AR Path="/614CE0F4/6167387C" Ref="UBM87"  Part="1" 
AR Path="/5FBEEC97/5FC01C06/6167387C" Ref="UBM87"  Part="1" 
F 0 "UBM87" H 9700 2061 50  0000 C CNN
F 1 "M125C-X6" H 9700 1970 50  0000 C CNN
F 2 "" H 10000 1350 50  0001 C CNN
F 3 "" H 10000 1350 50  0001 C CNN
	1    9700 1350
	1    0    0    -1  
$EndComp
$Comp
L A5C:M125C-X6 UBI?
U 1 1 61662525
P 9700 2500
AR Path="/5F75F22B/61662525" Ref="UBI?"  Part="1" 
AR Path="/614CE0F4/61662525" Ref="UBM99"  Part="1" 
AR Path="/5FBEEC97/5FC01C06/61662525" Ref="UBM99"  Part="1" 
F 0 "UBM99" H 9700 3211 50  0000 C CNN
F 1 "M125C-X6" H 9700 3120 50  0000 C CNN
F 2 "" H 10000 2500 50  0001 C CNN
F 3 "" H 10000 2500 50  0001 C CNN
	1    9700 2500
	1    0    0    -1  
$EndComp
$Comp
L A5C:M125C-X6 UBI?
U 1 1 61662553
P 9700 3650
AR Path="/5F75F22B/61662553" Ref="UBI?"  Part="1" 
AR Path="/614CE0F4/61662553" Ref="UBN87"  Part="1" 
AR Path="/5FBEEC97/5FC01C06/61662553" Ref="UBN87"  Part="1" 
F 0 "UBN87" H 9700 4361 50  0000 C CNN
F 1 "M125C-X6" H 9700 4270 50  0000 C CNN
F 2 "" H 10000 3650 50  0001 C CNN
F 3 "" H 10000 3650 50  0001 C CNN
	1    9700 3650
	1    0    0    -1  
$EndComp
$Comp
L A5C:M125C-X6 UBI?
U 1 1 6166256F
P 9700 4800
AR Path="/5F75F22B/6166256F" Ref="UBI?"  Part="1" 
AR Path="/614CE0F4/6166256F" Ref="UBN99"  Part="1" 
AR Path="/5FBEEC97/5FC01C06/6166256F" Ref="UBN99"  Part="1" 
F 0 "UBN99" H 9700 5511 50  0000 C CNN
F 1 "M125C-X6" H 9700 5420 50  0000 C CNN
F 2 "" H 10000 4800 50  0001 C CNN
F 3 "" H 10000 4800 50  0001 C CNN
	1    9700 4800
	1    0    0    -1  
$EndComp
$Comp
L A5C:M273C UBF48
U 1 1 605774BD
P 9400 8300
AR Path="/614CE0F4/605774BD" Ref="UBF48"  Part="1" 
AR Path="/5FBEEC97/5FC01C06/605774BD" Ref="UBF48"  Part="1" 
F 0 "UBF48" H 9400 9067 50  0000 C CNN
F 1 "M273C" H 9400 8976 50  0000 C CNN
F 2 "" H 9400 8300 50  0001 C CNN
F 3 "" H 9400 8300 50  0001 C CNN
	1    9400 8300
	1    0    0    -1  
$EndComp
Wire Bus Line
	1450 6850 1450 7250
Wire Bus Line
	5400 4550 5400 5350
Wire Bus Line
	8450 4550 8450 5550
Wire Bus Line
	8450 1000 8450 1950
Wire Bus Line
	10500 8000 10500 8700
Wire Bus Line
	13150 1950 13150 2650
Wire Bus Line
	5400 2250 5400 4250
Wire Bus Line
	8450 2250 8450 4250
Wire Bus Line
	7900 1000 7900 5250
Wire Bus Line
	10950 1000 10950 5250
$EndSCHEMATC
