EESchema Schematic File Version 4
EELAYER 30 0
EELAYER END
$Descr A4 11693 8268
encoding utf-8
Sheet 10 22
Title ""
Date "2020-12-13"
Rev ""
Comp ""
Comment1 ""
Comment2 "Licence: CC-BY"
Comment3 "Author: Loïc *WydD* Petit"
Comment4 "Project: CPS2 Reverse Engineering: 93646A"
$EndDescr
Connection ~ 9750 2900
Connection ~ 9750 850 
Connection ~ 9750 4300
Connection ~ 9750 6350
Connection ~ 2550 7550
Connection ~ 2650 7550
Connection ~ 2750 7550
Connection ~ 2850 7550
Connection ~ 2950 7550
Connection ~ 3050 7550
Connection ~ 3150 7550
Connection ~ 3250 7550
Connection ~ 3350 7550
Connection ~ 3450 7550
Connection ~ 3550 7550
Connection ~ 3650 7550
Connection ~ 3750 7550
Connection ~ 3850 7550
Connection ~ 3950 7550
Connection ~ 4050 7550
Connection ~ 4150 7550
Connection ~ 2950 1350
Connection ~ 3050 1350
Connection ~ 3150 1350
Connection ~ 3250 1350
Connection ~ 3350 1350
Connection ~ 3450 1350
Connection ~ 3550 1350
Connection ~ 3650 1350
Connection ~ 3750 1350
Connection ~ 6750 750 
Connection ~ 6500 3550
Connection ~ 6600 3550
Connection ~ 6700 3550
Connection ~ 6800 3550
Connection ~ 6900 3550
Connection ~ 7000 3550
Connection ~ 7100 3550
Connection ~ 5250 3800
Connection ~ 8250 3900
Connection ~ 9350 2250
Connection ~ 6600 4000
Connection ~ 6750 3800
Connection ~ 9350 5700
Entry Wire Line
	1250 1600 1350 1700
Entry Wire Line
	1250 1700 1350 1800
Entry Wire Line
	1250 1800 1350 1900
Entry Wire Line
	1250 1900 1350 2000
Entry Wire Line
	1250 2000 1350 2100
Entry Wire Line
	1250 2100 1350 2200
Entry Wire Line
	1250 2200 1350 2300
Entry Wire Line
	1250 2300 1350 2400
Entry Wire Line
	1250 2400 1350 2500
Entry Wire Line
	1250 2500 1350 2600
Entry Wire Line
	1250 2600 1350 2700
Entry Wire Line
	1250 2700 1350 2800
Entry Wire Line
	1250 3100 1350 3000
Entry Wire Line
	1250 3200 1350 3100
Entry Wire Line
	1250 3300 1350 3200
Entry Wire Line
	1250 3400 1350 3300
Entry Wire Line
	1250 3500 1350 3400
Entry Wire Line
	1250 3600 1350 3500
Entry Wire Line
	1250 3700 1350 3600
Entry Wire Line
	1250 3800 1350 3700
Entry Wire Line
	1250 3900 1350 3800
Entry Wire Line
	1250 4000 1350 3900
Entry Wire Line
	1250 4100 1350 4000
Entry Wire Line
	1250 4200 1350 4100
Entry Wire Line
	1250 5200 1350 5300
Entry Wire Line
	1250 5300 1350 5400
Entry Wire Line
	1250 5400 1350 5500
Entry Wire Line
	1250 5500 1350 5600
Entry Wire Line
	1250 5600 1350 5700
Entry Wire Line
	1250 5700 1350 5800
Entry Wire Line
	1250 5800 1350 5900
Entry Wire Line
	1250 5900 1350 6000
Entry Wire Line
	1250 6000 1350 6100
Entry Wire Line
	1250 6100 1350 6200
Entry Wire Line
	1250 6200 1350 6300
Entry Wire Line
	1250 6300 1350 6400
Entry Wire Line
	1250 6400 1350 6500
Entry Wire Line
	1250 6500 1350 6600
Entry Wire Line
	1250 6600 1350 6700
Entry Wire Line
	1250 6700 1350 6800
Entry Wire Line
	5150 3250 5250 3350
Entry Wire Line
	5150 3350 5250 3450
Entry Wire Line
	5150 3450 5250 3550
Entry Wire Line
	5150 3550 5250 3650
Entry Wire Line
	5150 3650 5250 3750
Entry Wire Line
	5150 3750 5250 3850
Entry Wire Line
	5150 3850 5250 3950
Entry Wire Line
	5150 3950 5250 4050
Entry Wire Line
	5150 4050 5250 4150
Entry Wire Line
	5150 4150 5250 4250
Entry Wire Line
	5150 4250 5250 4350
Entry Wire Line
	5150 4350 5250 4450
Entry Wire Line
	5250 2400 5350 2500
Entry Wire Line
	5250 2500 5350 2600
Entry Wire Line
	5250 2600 5350 2700
Entry Wire Line
	5250 2700 5350 2800
Entry Wire Line
	5250 2800 5350 2900
Entry Wire Line
	5250 2900 5350 3000
Entry Wire Line
	5250 3000 5350 3100
Entry Wire Line
	5250 3100 5350 3200
Entry Wire Line
	5350 5150 5250 5250
Entry Wire Line
	5350 5250 5250 5350
Entry Wire Line
	5350 5350 5250 5450
Entry Wire Line
	5350 5450 5250 5550
Entry Wire Line
	5350 5550 5250 5650
Entry Wire Line
	5350 5650 5250 5750
Entry Wire Line
	5350 5750 5250 5850
Entry Wire Line
	5350 5850 5250 5950
Entry Wire Line
	5450 2400 5350 2500
Entry Wire Line
	5450 2500 5350 2600
Entry Wire Line
	5450 2600 5350 2700
Entry Wire Line
	5450 2700 5350 2800
Entry Wire Line
	5450 2800 5350 2900
Entry Wire Line
	5450 2900 5350 3000
Entry Wire Line
	5450 3000 5350 3100
Entry Wire Line
	5450 3100 5350 3200
Entry Wire Line
	5450 3200 5350 3300
Entry Wire Line
	5450 6000 5350 6100
Entry Wire Line
	5450 6100 5350 6200
Entry Wire Line
	5450 6200 5350 6300
Entry Wire Line
	5450 6300 5350 6400
Entry Wire Line
	5450 6400 5350 6500
Entry Wire Line
	5450 6500 5350 6600
Entry Wire Line
	5450 6600 5350 6700
Entry Wire Line
	5450 6700 5350 6800
Entry Wire Line
	5450 6800 5350 6900
Entry Wire Line
	5450 6900 5350 7000
Entry Wire Line
	5450 7000 5350 7100
Entry Wire Line
	5450 7100 5350 7200
Entry Wire Line
	6600 5200 6700 5300
Entry Wire Line
	6600 5300 6700 5400
Entry Wire Line
	6600 5400 6700 5500
Entry Wire Line
	6600 5500 6700 5600
Entry Wire Line
	6850 4900 6750 4800
Entry Wire Line
	6850 5000 6750 4900
Entry Wire Line
	6850 5100 6750 5000
Entry Wire Line
	6850 5200 6750 5100
Entry Wire Line
	8150 2400 8250 2500
Entry Wire Line
	8150 2500 8250 2600
Entry Wire Line
	8150 2600 8250 2700
Entry Wire Line
	8150 2700 8250 2800
Entry Wire Line
	8150 2800 8250 2900
Entry Wire Line
	8150 2900 8250 3000
Entry Wire Line
	8150 3000 8250 3100
Entry Wire Line
	8150 3100 8250 3200
Entry Wire Line
	8150 3200 8250 3300
Entry Wire Line
	9050 1050 8950 1150
Entry Wire Line
	9050 1150 8950 1250
Entry Wire Line
	9050 1250 8950 1350
Entry Wire Line
	9050 1350 8950 1450
Entry Wire Line
	9050 1450 8950 1550
Entry Wire Line
	9050 1550 8950 1650
Entry Wire Line
	9050 1650 8950 1750
Entry Wire Line
	9050 1750 8950 1850
Entry Wire Line
	9050 1850 8950 1950
Entry Wire Line
	9050 4500 8950 4400
Entry Wire Line
	9050 4600 8950 4500
Entry Wire Line
	9050 4700 8950 4600
Entry Wire Line
	9050 4800 8950 4700
Entry Wire Line
	9050 4900 8950 4800
Entry Wire Line
	9050 5000 8950 4900
Entry Wire Line
	9050 5100 8950 5000
Entry Wire Line
	9050 5200 8950 5100
Entry Wire Line
	9050 5300 8950 5200
Entry Wire Line
	10500 1050 10600 1150
Entry Wire Line
	10500 1150 10600 1250
Entry Wire Line
	10500 1250 10600 1350
Entry Wire Line
	10500 1350 10600 1450
Entry Wire Line
	10500 1450 10600 1550
Entry Wire Line
	10500 1550 10600 1650
Entry Wire Line
	10500 1650 10600 1750
Entry Wire Line
	10500 1750 10600 1850
Entry Wire Line
	10500 1850 10600 1950
Entry Wire Line
	10500 1950 10600 2050
Entry Wire Line
	10500 2050 10600 2150
Entry Wire Line
	10500 2150 10600 2250
Entry Wire Line
	10500 2250 10600 2350
Entry Wire Line
	10500 2350 10600 2450
Entry Wire Line
	10500 2450 10600 2550
Entry Wire Line
	10500 2550 10600 2650
Entry Wire Line
	10600 4400 10500 4500
Entry Wire Line
	10600 4500 10500 4600
Entry Wire Line
	10600 4600 10500 4700
Entry Wire Line
	10600 4700 10500 4800
Entry Wire Line
	10600 4800 10500 4900
Entry Wire Line
	10600 4900 10500 5000
Entry Wire Line
	10600 5000 10500 5100
Entry Wire Line
	10600 5100 10500 5200
Entry Wire Line
	10600 5200 10500 5300
Entry Wire Line
	10600 5300 10500 5400
Entry Wire Line
	10600 5400 10500 5500
Entry Wire Line
	10600 5500 10500 5600
Entry Wire Line
	10600 5600 10500 5700
Entry Wire Line
	10600 5700 10500 5800
Entry Wire Line
	10600 5800 10500 5900
Entry Wire Line
	10600 5900 10500 6000
Wire Wire Line
	1350 1700 1850 1700
Wire Wire Line
	1350 1800 1850 1800
Wire Wire Line
	1350 1900 1850 1900
Wire Wire Line
	1350 2000 1850 2000
Wire Wire Line
	1350 2100 1850 2100
Wire Wire Line
	1350 2200 1850 2200
Wire Wire Line
	1350 2300 1850 2300
Wire Wire Line
	1350 2400 1850 2400
Wire Wire Line
	1350 2500 1850 2500
Wire Wire Line
	1350 2600 1850 2600
Wire Wire Line
	1350 2700 1850 2700
Wire Wire Line
	1350 2800 1850 2800
Wire Wire Line
	1350 3000 1850 3000
Wire Wire Line
	1350 3100 1850 3100
Wire Wire Line
	1350 3200 1850 3200
Wire Wire Line
	1350 3300 1850 3300
Wire Wire Line
	1350 3400 1850 3400
Wire Wire Line
	1350 3500 1850 3500
Wire Wire Line
	1350 3600 1850 3600
Wire Wire Line
	1350 3700 1850 3700
Wire Wire Line
	1350 3800 1850 3800
Wire Wire Line
	1350 3900 1850 3900
Wire Wire Line
	1350 4000 1850 4000
Wire Wire Line
	1350 4100 1850 4100
Wire Wire Line
	1350 5300 1850 5300
Wire Wire Line
	1350 5400 1850 5400
Wire Wire Line
	1350 5500 1850 5500
Wire Wire Line
	1350 5600 1850 5600
Wire Wire Line
	1350 5700 1850 5700
Wire Wire Line
	1350 5800 1850 5800
Wire Wire Line
	1350 5900 1850 5900
Wire Wire Line
	1350 6000 1850 6000
Wire Wire Line
	1350 6100 1850 6100
Wire Wire Line
	1350 6200 1850 6200
Wire Wire Line
	1350 6300 1850 6300
Wire Wire Line
	1350 6400 1850 6400
Wire Wire Line
	1350 6500 1850 6500
Wire Wire Line
	1350 6600 1850 6600
Wire Wire Line
	1350 6700 1850 6700
Wire Wire Line
	1350 6800 1850 6800
Wire Wire Line
	1500 4800 1850 4800
Wire Wire Line
	1500 4900 1850 4900
Wire Wire Line
	1500 5000 1850 5000
Wire Wire Line
	1500 5100 1850 5100
Wire Wire Line
	1500 7000 1850 7000
Wire Wire Line
	1850 7150 1500 7150
Wire Wire Line
	2450 7550 2550 7550
Wire Wire Line
	2550 7550 2650 7550
Wire Wire Line
	2650 7550 2750 7550
Wire Wire Line
	2750 7550 2850 7550
Wire Wire Line
	2850 1350 2950 1350
Wire Wire Line
	2850 7550 2950 7550
Wire Wire Line
	2950 1350 3050 1350
Wire Wire Line
	2950 7550 3050 7550
Wire Wire Line
	3050 1350 3150 1350
Wire Wire Line
	3050 7550 3150 7550
Wire Wire Line
	3150 1350 3250 1350
Wire Wire Line
	3150 7550 3250 7550
Wire Wire Line
	3250 1350 3350 1350
Wire Wire Line
	3250 7550 3350 7550
Wire Wire Line
	3350 1350 3450 1350
Wire Wire Line
	3350 7550 3450 7550
Wire Wire Line
	3450 1350 3550 1350
Wire Wire Line
	3450 7550 3550 7550
Wire Wire Line
	3550 1350 3650 1350
Wire Wire Line
	3550 7550 3650 7550
Wire Wire Line
	3650 1350 3750 1350
Wire Wire Line
	3650 7550 3750 7550
Wire Wire Line
	3750 1350 3850 1350
Wire Wire Line
	3750 7550 3850 7550
Wire Wire Line
	3850 7550 3950 7550
Wire Wire Line
	3950 7550 4050 7550
Wire Wire Line
	4050 7550 4150 7550
Wire Wire Line
	4150 7550 4250 7550
Wire Wire Line
	4850 1700 5750 1700
Wire Wire Line
	4850 1800 5750 1800
Wire Wire Line
	4850 1900 5750 1900
Wire Wire Line
	4850 2000 5750 2000
Wire Wire Line
	4850 2150 5750 2150
Wire Wire Line
	4850 2250 5750 2250
Wire Wire Line
	4850 2400 5250 2400
Wire Wire Line
	4850 2500 5250 2500
Wire Wire Line
	4850 2600 5250 2600
Wire Wire Line
	4850 2700 5250 2700
Wire Wire Line
	4850 2800 5250 2800
Wire Wire Line
	4850 2900 5250 2900
Wire Wire Line
	4850 3000 5250 3000
Wire Wire Line
	4850 3100 5250 3100
Wire Wire Line
	4850 3250 5150 3250
Wire Wire Line
	4850 3350 5150 3350
Wire Wire Line
	4850 3450 5150 3450
Wire Wire Line
	4850 3550 5150 3550
Wire Wire Line
	4850 3650 5150 3650
Wire Wire Line
	4850 3750 5150 3750
Wire Wire Line
	4850 3850 5150 3850
Wire Wire Line
	4850 3950 5150 3950
Wire Wire Line
	4850 4050 5150 4050
Wire Wire Line
	4850 4150 5150 4150
Wire Wire Line
	4850 4250 5150 4250
Wire Wire Line
	4850 4350 5150 4350
Wire Wire Line
	4850 4550 5150 4550
Wire Wire Line
	4850 4650 5150 4650
Wire Wire Line
	4850 4750 5150 4750
Wire Wire Line
	4850 4850 5150 4850
Wire Wire Line
	4850 5250 5250 5250
Wire Wire Line
	4850 5350 5250 5350
Wire Wire Line
	4850 5450 5250 5450
Wire Wire Line
	4850 5550 5250 5550
Wire Wire Line
	4850 5650 5250 5650
Wire Wire Line
	4850 5750 5250 5750
Wire Wire Line
	4850 5850 5250 5850
Wire Wire Line
	4850 5950 5250 5950
Wire Wire Line
	4850 6100 5350 6100
Wire Wire Line
	4850 6200 5350 6200
Wire Wire Line
	4850 6300 5350 6300
Wire Wire Line
	4850 6400 5350 6400
Wire Wire Line
	4850 6500 5350 6500
Wire Wire Line
	4850 6600 5350 6600
Wire Wire Line
	4850 6700 5350 6700
Wire Wire Line
	4850 6800 5350 6800
Wire Wire Line
	4850 6900 5350 6900
Wire Wire Line
	4850 7000 5350 7000
Wire Wire Line
	4850 7100 5350 7100
Wire Wire Line
	4850 7200 5350 7200
Wire Wire Line
	5150 5000 4850 5000
Wire Wire Line
	5150 5100 4850 5100
Wire Wire Line
	5400 1100 5750 1100
Wire Wire Line
	5400 1200 5750 1200
Wire Wire Line
	5400 1300 5750 1300
Wire Wire Line
	5450 1450 5750 1450
Wire Wire Line
	5450 1550 5750 1550
Wire Wire Line
	5450 2400 5750 2400
Wire Wire Line
	5450 2500 5750 2500
Wire Wire Line
	5450 2600 5750 2600
Wire Wire Line
	5450 2700 5750 2700
Wire Wire Line
	5450 2800 5750 2800
Wire Wire Line
	5450 2900 5750 2900
Wire Wire Line
	5450 3000 5750 3000
Wire Wire Line
	5450 3100 5750 3100
Wire Wire Line
	5450 3200 5750 3200
Wire Wire Line
	6400 3550 6500 3550
Wire Wire Line
	6500 3550 6600 3550
Wire Wire Line
	6600 3550 6700 3550
Wire Wire Line
	6700 3550 6800 3550
Wire Wire Line
	6700 5300 7200 5300
Wire Wire Line
	6700 5400 7200 5400
Wire Wire Line
	6700 5500 7200 5500
Wire Wire Line
	6700 5600 7200 5600
Wire Wire Line
	6750 750  6850 750 
Wire Wire Line
	6800 3550 6900 3550
Wire Wire Line
	6900 3550 7000 3550
Wire Wire Line
	7000 3550 7100 3550
Wire Wire Line
	7100 3550 7200 3550
Wire Wire Line
	7200 4900 6850 4900
Wire Wire Line
	7200 5000 6850 5000
Wire Wire Line
	7200 5100 6850 5100
Wire Wire Line
	7200 5200 6850 5200
Wire Wire Line
	7850 1100 8200 1100
Wire Wire Line
	7850 1250 8200 1250
Wire Wire Line
	7850 1700 8150 1700
Wire Wire Line
	7850 1800 8150 1800
Wire Wire Line
	7850 1900 8150 1900
Wire Wire Line
	7850 2000 8150 2000
Wire Wire Line
	7850 2400 8150 2400
Wire Wire Line
	7850 2500 8150 2500
Wire Wire Line
	7850 2600 8150 2600
Wire Wire Line
	7850 2700 8150 2700
Wire Wire Line
	7850 2800 8150 2800
Wire Wire Line
	7850 2900 8150 2900
Wire Wire Line
	7850 3000 8150 3000
Wire Wire Line
	7850 3100 8150 3100
Wire Wire Line
	7850 3200 8150 3200
Wire Wire Line
	8150 1550 7850 1550
Wire Wire Line
	8150 2150 7850 2150
Wire Wire Line
	8150 2250 7850 2250
Wire Wire Line
	9050 1050 9350 1050
Wire Wire Line
	9050 1150 9350 1150
Wire Wire Line
	9050 1250 9350 1250
Wire Wire Line
	9050 1350 9350 1350
Wire Wire Line
	9050 1450 9350 1450
Wire Wire Line
	9050 1550 9350 1550
Wire Wire Line
	9050 1650 9350 1650
Wire Wire Line
	9050 1750 9350 1750
Wire Wire Line
	9050 1850 9350 1850
Wire Wire Line
	9050 2150 9350 2150
Wire Wire Line
	9050 2250 9350 2250
Wire Wire Line
	9050 4500 9350 4500
Wire Wire Line
	9050 4600 9350 4600
Wire Wire Line
	9050 4700 9350 4700
Wire Wire Line
	9050 4800 9350 4800
Wire Wire Line
	9050 4900 9350 4900
Wire Wire Line
	9050 5000 9350 5000
Wire Wire Line
	9050 5100 9350 5100
Wire Wire Line
	9050 5200 9350 5200
Wire Wire Line
	9050 5300 9350 5300
Wire Wire Line
	9050 5600 9350 5600
Wire Wire Line
	9050 5700 9350 5700
Wire Wire Line
	9350 2350 9350 2250
Wire Wire Line
	9350 5700 9350 5800
Wire Wire Line
	9650 850  9750 850 
Wire Wire Line
	9650 2900 9750 2900
Wire Wire Line
	9650 4300 9750 4300
Wire Wire Line
	9650 6350 9750 6350
Wire Wire Line
	9750 850  9850 850 
Wire Wire Line
	9750 2900 9850 2900
Wire Wire Line
	9750 4300 9850 4300
Wire Wire Line
	9750 6350 9850 6350
Wire Wire Line
	10150 1050 10500 1050
Wire Wire Line
	10150 1150 10500 1150
Wire Wire Line
	10150 1250 10500 1250
Wire Wire Line
	10150 1350 10500 1350
Wire Wire Line
	10150 1450 10500 1450
Wire Wire Line
	10150 1550 10500 1550
Wire Wire Line
	10150 1650 10500 1650
Wire Wire Line
	10150 1750 10500 1750
Wire Wire Line
	10150 1850 10500 1850
Wire Wire Line
	10150 1950 10500 1950
Wire Wire Line
	10150 2050 10500 2050
Wire Wire Line
	10150 2150 10500 2150
Wire Wire Line
	10150 2250 10500 2250
Wire Wire Line
	10150 2350 10500 2350
Wire Wire Line
	10150 2450 10500 2450
Wire Wire Line
	10150 2550 10500 2550
Wire Wire Line
	10150 4500 10500 4500
Wire Wire Line
	10150 4600 10500 4600
Wire Wire Line
	10150 4700 10500 4700
Wire Wire Line
	10150 4800 10500 4800
Wire Wire Line
	10150 4900 10500 4900
Wire Wire Line
	10150 5000 10500 5000
Wire Wire Line
	10150 5100 10500 5100
Wire Wire Line
	10150 5200 10500 5200
Wire Wire Line
	10150 5300 10500 5300
Wire Wire Line
	10150 5400 10500 5400
Wire Wire Line
	10150 5500 10500 5500
Wire Wire Line
	10150 5600 10500 5600
Wire Wire Line
	10150 5700 10500 5700
Wire Wire Line
	10150 5800 10500 5800
Wire Wire Line
	10150 5900 10500 5900
Wire Wire Line
	10150 6000 10500 6000
Wire Bus Line
	1100 4300 1250 4300
Wire Bus Line
	1100 5100 1250 5100
Wire Bus Line
	1250 1450 1150 1450
Wire Bus Line
	5250 3800 6750 3800
Wire Bus Line
	5350 3700 8950 3700
Wire Bus Line
	5350 3900 8250 3900
Wire Bus Line
	5450 4000 6600 4000
Wire Bus Line
	6600 4000 10600 4000
Wire Bus Line
	6750 3800 10600 3800
Wire Bus Line
	8250 3900 8950 3900
Text Label 1400 5300 0    50   ~ 0
GFX-IN0
Text Label 1400 5400 0    50   ~ 0
GFX-IN1
Text Label 1400 5500 0    50   ~ 0
GFX-IN2
Text Label 1400 5600 0    50   ~ 0
GFX-IN3
Text Label 1400 5700 0    50   ~ 0
GFX-IN4
Text Label 1400 5800 0    50   ~ 0
GFX-IN5
Text Label 1400 5900 0    50   ~ 0
GFX-IN6
Text Label 1400 6000 0    50   ~ 0
GFX-IN7
Text Label 1400 6100 0    50   ~ 0
GFX-IN8
Text Label 1400 6200 0    50   ~ 0
GFX-IN9
Text Label 1400 6300 0    50   ~ 0
GFX-IN10
Text Label 1400 6400 0    50   ~ 0
GFX-IN11
Text Label 1400 6500 0    50   ~ 0
GFX-IN12
Text Label 1400 6600 0    50   ~ 0
GFX-IN13
Text Label 1400 6700 0    50   ~ 0
GFX-IN14
Text Label 1400 6800 0    50   ~ 0
GFX-IN15
Text Label 1450 3000 0    50   ~ 0
LUTA0
Text Label 1450 3100 0    50   ~ 0
LUTA1
Text Label 1450 3200 0    50   ~ 0
LUTA2
Text Label 1450 3300 0    50   ~ 0
LUTA3
Text Label 1450 3400 0    50   ~ 0
LUTA4
Text Label 1450 3500 0    50   ~ 0
LUTA5
Text Label 1450 3600 0    50   ~ 0
LUTA6
Text Label 1450 3700 0    50   ~ 0
LUTA7
Text Label 1450 3800 0    50   ~ 0
LUTA8
Text Label 1450 3900 0    50   ~ 0
LUTA9
Text Label 1450 4000 0    50   ~ 0
LUTA10
Text Label 1450 4100 0    50   ~ 0
LUTA11
Text Label 1550 4800 0    50   ~ 0
FLIP
Text Label 1550 4900 0    50   ~ 0
~VBLANK
Text Label 1550 5100 0    50   ~ 0
LI
Text Label 1800 7150 2    50   ~ 0
CLK16M
Text Label 4900 2400 0    50   ~ 0
A-A0
Text Label 4900 2500 0    50   ~ 0
A-A1
Text Label 4900 2600 0    50   ~ 0
A-A2
Text Label 4900 2700 0    50   ~ 0
A-A3
Text Label 4900 2800 0    50   ~ 0
A-A4
Text Label 4900 2900 0    50   ~ 0
A-A5
Text Label 4900 3000 0    50   ~ 0
A-A6
Text Label 4900 3100 0    50   ~ 0
A-A7
Text Label 4900 3250 0    50   ~ 0
A-D0
Text Label 4900 3350 0    50   ~ 0
A-D1
Text Label 4900 3450 0    50   ~ 0
A-D2
Text Label 4900 3550 0    50   ~ 0
A-D3
Text Label 4900 3650 0    50   ~ 0
A-D4
Text Label 4900 3750 0    50   ~ 0
A-D5
Text Label 4900 3850 0    50   ~ 0
A-D6
Text Label 4900 3950 0    50   ~ 0
A-D7
Text Label 4900 4050 0    50   ~ 0
A-D8
Text Label 4900 4150 0    50   ~ 0
A-D9
Text Label 4900 4250 0    50   ~ 0
A-D10
Text Label 4900 4350 0    50   ~ 0
A-D11
Text Label 4900 4550 0    50   ~ 0
UK16
Text Label 4900 4650 0    50   ~ 0
UK17
Text Label 4900 4750 0    50   ~ 0
UK22
Text Label 4900 4850 0    50   ~ 0
UK23
Text Label 4900 5250 0    50   ~ 0
B-A0
Text Label 4900 5350 0    50   ~ 0
B-A1
Text Label 4900 5450 0    50   ~ 0
B-A2
Text Label 4900 5550 0    50   ~ 0
B-A3
Text Label 4900 5650 0    50   ~ 0
B-A4
Text Label 4900 5750 0    50   ~ 0
B-A5
Text Label 4900 5850 0    50   ~ 0
B-A6
Text Label 4900 5950 0    50   ~ 0
B-A7
Text Label 4900 6100 0    50   ~ 0
B-D0
Text Label 4900 6200 0    50   ~ 0
B-D1
Text Label 4900 6300 0    50   ~ 0
B-D2
Text Label 4900 6400 0    50   ~ 0
B-D3
Text Label 4900 6500 0    50   ~ 0
B-D4
Text Label 4900 6600 0    50   ~ 0
B-D5
Text Label 4900 6700 0    50   ~ 0
B-D6
Text Label 4900 6800 0    50   ~ 0
B-D7
Text Label 4900 6900 0    50   ~ 0
B-D8
Text Label 4900 7000 0    50   ~ 0
B-D9
Text Label 4900 7100 0    50   ~ 0
B-D10
Text Label 4900 7200 0    50   ~ 0
B-D11
Text Label 5150 5000 2    50   ~ 0
~B-RAS
Text Label 5150 5100 2    50   ~ 0
~B-CAS
Text Label 5200 2150 0    50   ~ 0
~A-RAS
Text Label 5200 2250 0    50   ~ 0
~A-CAS
Text Label 5450 1100 0    50   ~ 0
~VBLANK
Text Label 5450 1200 0    50   ~ 0
FLIP
Text Label 5450 1300 0    50   ~ 0
LI
Text Label 5450 1450 0    50   ~ 0
~A-OE
Text Label 5450 1550 0    50   ~ 0
~A-WE
Text Label 5500 2400 0    50   ~ 0
A-A0
Text Label 5500 2500 0    50   ~ 0
A-A1
Text Label 5500 2600 0    50   ~ 0
A-A2
Text Label 5500 2700 0    50   ~ 0
A-A3
Text Label 5500 2800 0    50   ~ 0
A-A4
Text Label 5500 2900 0    50   ~ 0
A-A5
Text Label 5500 3000 0    50   ~ 0
A-A6
Text Label 5500 3100 0    50   ~ 0
A-A7
Text Label 5500 3200 0    50   ~ 0
A-A8
Text Label 7150 4900 2    50   ~ 0
A-D12
Text Label 7150 5000 2    50   ~ 0
A-D13
Text Label 7150 5100 2    50   ~ 0
A-D14
Text Label 7150 5200 2    50   ~ 0
A-D15
Text Label 7150 5300 2    50   ~ 0
B-D12
Text Label 7150 5400 2    50   ~ 0
B-D13
Text Label 7150 5500 2    50   ~ 0
B-D14
Text Label 7150 5600 2    50   ~ 0
B-D15
Text Label 7900 1100 0    50   ~ 0
CLK16M
Text Label 7900 1700 0    50   ~ 0
UK16
Text Label 7900 1800 0    50   ~ 0
UK17
Text Label 7900 1900 0    50   ~ 0
UK22
Text Label 7900 2000 0    50   ~ 0
UK23
Text Label 7900 2400 0    50   ~ 0
B-A0
Text Label 7900 2500 0    50   ~ 0
B-A1
Text Label 7900 2600 0    50   ~ 0
B-A2
Text Label 7900 2700 0    50   ~ 0
B-A3
Text Label 7900 2800 0    50   ~ 0
B-A4
Text Label 7900 2900 0    50   ~ 0
B-A5
Text Label 7900 3000 0    50   ~ 0
B-A6
Text Label 7900 3100 0    50   ~ 0
B-A7
Text Label 7900 3200 0    50   ~ 0
B-A8
Text Label 8150 2150 2    50   ~ 0
~B-RAS
Text Label 8150 2250 2    50   ~ 0
~B-CAS
Text Label 9050 2150 0    50   ~ 0
~A-RAS
Text Label 9050 2250 0    50   ~ 0
~A-CAS
Text Label 9050 5600 0    50   ~ 0
~B-RAS
Text Label 9050 5700 0    50   ~ 0
~B-CAS
Text Label 9100 1050 0    50   ~ 0
A-A0
Text Label 9100 1150 0    50   ~ 0
A-A1
Text Label 9100 1250 0    50   ~ 0
A-A2
Text Label 9100 1350 0    50   ~ 0
A-A3
Text Label 9100 1450 0    50   ~ 0
A-A4
Text Label 9100 1550 0    50   ~ 0
A-A5
Text Label 9100 1650 0    50   ~ 0
A-A6
Text Label 9100 1750 0    50   ~ 0
A-A7
Text Label 9100 1850 0    50   ~ 0
A-A8
Text Label 9100 4500 0    50   ~ 0
B-A0
Text Label 9100 4600 0    50   ~ 0
B-A1
Text Label 9100 4700 0    50   ~ 0
B-A2
Text Label 9100 4800 0    50   ~ 0
B-A3
Text Label 9100 4900 0    50   ~ 0
B-A4
Text Label 9100 5000 0    50   ~ 0
B-A5
Text Label 9100 5100 0    50   ~ 0
B-A6
Text Label 9100 5200 0    50   ~ 0
B-A7
Text Label 9100 5300 0    50   ~ 0
B-A8
Text Label 10200 1050 0    50   ~ 0
A-D0
Text Label 10200 1150 0    50   ~ 0
A-D1
Text Label 10200 1250 0    50   ~ 0
A-D2
Text Label 10200 1350 0    50   ~ 0
A-D3
Text Label 10200 1450 0    50   ~ 0
A-D4
Text Label 10200 1550 0    50   ~ 0
A-D5
Text Label 10200 1650 0    50   ~ 0
A-D6
Text Label 10200 1750 0    50   ~ 0
A-D7
Text Label 10200 1850 0    50   ~ 0
A-D8
Text Label 10200 1950 0    50   ~ 0
A-D9
Text Label 10200 2050 0    50   ~ 0
A-D10
Text Label 10200 2150 0    50   ~ 0
A-D11
Text Label 10200 2250 0    50   ~ 0
A-D12
Text Label 10200 2350 0    50   ~ 0
A-D13
Text Label 10200 2450 0    50   ~ 0
A-D14
Text Label 10200 2550 0    50   ~ 0
A-D15
Text Label 10200 4500 0    50   ~ 0
B-D0
Text Label 10200 4600 0    50   ~ 0
B-D1
Text Label 10200 4700 0    50   ~ 0
B-D2
Text Label 10200 4800 0    50   ~ 0
B-D3
Text Label 10200 4900 0    50   ~ 0
B-D4
Text Label 10200 5000 0    50   ~ 0
B-D5
Text Label 10200 5100 0    50   ~ 0
B-D6
Text Label 10200 5200 0    50   ~ 0
B-D7
Text Label 10200 5300 0    50   ~ 0
B-D8
Text Label 10200 5400 0    50   ~ 0
B-D9
Text Label 10200 5500 0    50   ~ 0
B-D10
Text Label 10200 5600 0    50   ~ 0
B-D11
Text Label 10200 5700 0    50   ~ 0
B-D12
Text Label 10200 5800 0    50   ~ 0
B-D13
Text Label 10200 5900 0    50   ~ 0
B-D14
Text Label 10200 6000 0    50   ~ 0
B-D15
Text HLabel 1100 4300 0    50   BiDi ~ 0
LUTA[0..11]
Text HLabel 1100 5100 0    50   Input ~ 0
GFX-IN[0..15]
Text HLabel 1150 1450 0    50   Output ~ 0
LUTB[0..11]
Text HLabel 1500 4800 0    50   Input ~ 0
FLIP
Text HLabel 1500 4900 0    50   Input ~ 0
~VBLANK
Text HLabel 1500 5000 0    50   Input ~ 0
FI
Text HLabel 1500 5100 0    50   Input ~ 0
LI
Text HLabel 1500 7000 0    50   Input ~ 0
~RESETI
Text HLabel 1500 7150 0    50   Input ~ 0
CLK16M
Text HLabel 8200 1250 2    50   Input ~ 0
~RESET
$Comp
L power:VCC #PWR0297
U 1 1 5DE590AC
P 3350 1350
F 0 "#PWR0297" H 3350 1200 50  0001 C CNN
F 1 "VCC" H 3367 1523 50  0000 C CNN
F 2 "" H 3350 1350 50  0001 C CNN
F 3 "" H 3350 1350 50  0001 C CNN
	1    3350 1350
	1    0    0    -1  
$EndComp
$Comp
L power:VCC #PWR0298
U 1 1 5DE5984C
P 6750 750
F 0 "#PWR0298" H 6750 600 50  0001 C CNN
F 1 "VCC" H 6767 923 50  0000 C CNN
F 2 "" H 6750 750 50  0001 C CNN
F 3 "" H 6750 750 50  0001 C CNN
	1    6750 750 
	1    0    0    -1  
$EndComp
$Comp
L power:VCC #PWR0300
U 1 1 5FF73D4D
P 7600 4900
F 0 "#PWR0300" H 7600 4750 50  0001 C CNN
F 1 "VCC" H 7617 5073 50  0000 C CNN
F 2 "" H 7600 4900 50  0001 C CNN
F 3 "" H 7600 4900 50  0001 C CNN
	1    7600 4900
	1    0    0    -1  
$EndComp
$Comp
L power:VCC #PWR0294
U 1 1 5E847C5D
P 9750 850
F 0 "#PWR0294" H 9750 700 50  0001 C CNN
F 1 "VCC" H 9767 1023 50  0000 C CNN
F 2 "" H 9750 850 50  0001 C CNN
F 3 "" H 9750 850 50  0001 C CNN
	1    9750 850 
	1    0    0    -1  
$EndComp
$Comp
L power:VCC #PWR0295
U 1 1 5E8481BC
P 9750 4300
F 0 "#PWR0295" H 9750 4150 50  0001 C CNN
F 1 "VCC" H 9767 4473 50  0000 C CNN
F 2 "" H 9750 4300 50  0001 C CNN
F 3 "" H 9750 4300 50  0001 C CNN
	1    9750 4300
	1    0    0    -1  
$EndComp
$Comp
L power:GND #PWR0296
U 1 1 5DE53EC9
P 3350 7550
F 0 "#PWR0296" H 3350 7300 50  0001 C CNN
F 1 "GND" H 3355 7377 50  0001 C CNN
F 2 "" H 3350 7550 50  0001 C CNN
F 3 "" H 3350 7550 50  0001 C CNN
	1    3350 7550
	1    0    0    -1  
$EndComp
$Comp
L power:GND #PWR0299
U 1 1 5DF992AE
P 6800 3550
F 0 "#PWR0299" H 6800 3300 50  0001 C CNN
F 1 "GND" H 6805 3377 50  0001 C CNN
F 2 "" H 6800 3550 50  0001 C CNN
F 3 "" H 6800 3550 50  0001 C CNN
	1    6800 3550
	1    0    0    -1  
$EndComp
$Comp
L power:GND #PWR0293
U 1 1 5E847531
P 9750 2900
F 0 "#PWR0293" H 9750 2650 50  0001 C CNN
F 1 "GND" H 9755 2727 50  0001 C CNN
F 2 "" H 9750 2900 50  0001 C CNN
F 3 "" H 9750 2900 50  0001 C CNN
	1    9750 2900
	1    0    0    -1  
$EndComp
$Comp
L power:GND #PWR0292
U 1 1 5E846F50
P 9750 6350
F 0 "#PWR0292" H 9750 6100 50  0001 C CNN
F 1 "GND" H 9755 6177 50  0001 C CNN
F 2 "" H 9750 6350 50  0001 C CNN
F 3 "" H 9750 6350 50  0001 C CNN
	1    9750 6350
	1    0    0    -1  
$EndComp
$Comp
L Device:R_Network08 RA24
U 1 1 5FCDBC62
P 7400 5300
F 0 "RA24" V 6783 5300 50  0000 C CNN
F 1 "10k" V 6874 5300 50  0000 C CNN
F 2 "Resistor_THT:R_Array_SIP9" V 7875 5300 50  0001 C CNN
F 3 "http://www.vishay.com/docs/31509/csc.pdf" H 7400 5300 50  0001 C CNN
	1    7400 5300
	0    1    1    0   
$EndComp
$Comp
L CPS2-Custom:HM514260 UV13
U 1 1 5E83F4C9
P 9750 1900
F 0 "UV13" H 9450 3000 50  0000 C CNN
F 1 "HM514260" H 10100 900 50  0000 C CNN
F 2 "" H 9800 1950 50  0001 C CNN
F 3 "" H 9800 1950 50  0001 C CNN
	1    9750 1900
	1    0    0    -1  
$EndComp
$Comp
L CPS2-Custom:HM514260 UV14
U 1 1 5E842879
P 9750 5350
F 0 "UV14" H 9450 6400 50  0000 C CNN
F 1 "HM514260" H 10150 4350 50  0000 C CNN
F 2 "" H 9800 5400 50  0001 C CNN
F 3 "" H 9800 5400 50  0001 C CNN
	1    9750 5350
	1    0    0    -1  
$EndComp
$Comp
L CPS2-Custom:DL-2227 UT13
U 1 1 5E8C2BBE
P 6800 2150
F 0 "UT13" H 6800 2200 100 0000 C CNN
F 1 "DL-2227" H 6800 2050 100 0000 C CNN
F 2 "" H 6700 3200 50  0001 C CNN
F 3 "" H 6700 3200 50  0001 C CNN
	1    6800 2150
	1    0    0    -1  
$EndComp
$Comp
L CPS2-Custom:DL-1625 UU9
U 1 1 5E891EE4
P 3350 4450
F 0 "UU9" H 3350 4600 200 0000 C CNN
F 1 "DL-1625" H 3350 4300 200 0000 C CNN
F 2 "" H 4350 6550 50  0001 C CNN
F 3 "" H 4350 6550 50  0001 C CNN
	1    3350 4450
	1    0    0    -1  
$EndComp
Text Label 9050 2650 0    50   ~ 0
~A-WE
Text Label 9050 2550 0    50   ~ 0
~A-OE
Wire Wire Line
	9050 2650 9350 2650
Wire Wire Line
	9050 2550 9350 2550
Text Label 9050 6100 0    50   ~ 0
~B-WE
Text Label 9050 6000 0    50   ~ 0
~B-OE
Wire Wire Line
	9050 6100 9350 6100
Wire Wire Line
	9050 6000 9350 6000
Text Label 8150 1550 2    50   ~ 0
~B-WE
Text Label 8150 1450 2    50   ~ 0
~B-OE
Wire Wire Line
	8150 1450 7850 1450
Text Label 1450 1700 0    50   ~ 0
LUTB0
Text Label 1450 1800 0    50   ~ 0
LUTB1
Text Label 1450 1900 0    50   ~ 0
LUTB2
Text Label 1450 2000 0    50   ~ 0
LUTB3
Text Label 1450 2100 0    50   ~ 0
LUTB4
Text Label 1450 2200 0    50   ~ 0
LUTB5
Text Label 1450 2300 0    50   ~ 0
LUTB6
Text Label 1450 2400 0    50   ~ 0
LUTB7
Text Label 1450 2500 0    50   ~ 0
LUTB8
Text Label 1450 2600 0    50   ~ 0
LUTB9
Text Label 1450 2700 0    50   ~ 0
LUTB10
Text Label 1450 2800 0    50   ~ 0
LUTB11
Wire Bus Line
	6750 3800 6750 5100
Wire Bus Line
	6600 4000 6600 5500
Wire Bus Line
	5250 3350 5250 3800
Wire Bus Line
	5250 3800 5250 4450
Wire Bus Line
	8950 3900 8950 5200
Wire Bus Line
	8950 1150 8950 3700
Wire Bus Line
	8250 2500 8250 3900
Wire Bus Line
	5350 3900 5350 5850
Wire Bus Line
	5350 2500 5350 3700
Wire Bus Line
	1250 1450 1250 2700
Wire Bus Line
	1250 3100 1250 4300
Wire Bus Line
	5450 4000 5450 7100
Wire Bus Line
	10600 4000 10600 5900
Wire Bus Line
	10600 1150 10600 3800
Wire Bus Line
	1250 5100 1250 6700
$EndSCHEMATC
