EESchema Schematic File Version 4
EELAYER 30 0
EELAYER END
$Descr A4 11693 8268
encoding utf-8
Sheet 68 83
Title "CPS Reverse Engineering: DL-0311"
Date "2021-09-12"
Rev ""
Comp ""
Comment1 ""
Comment2 ""
Comment3 "Licence: CC-BY"
Comment4 "Author: Loïc *WydD* Petit"
$EndDescr
Connection ~ 6850 4100
Connection ~ 6650 4800
Connection ~ 7450 4100
Connection ~ 1900 2400
Connection ~ 3900 3750
Connection ~ 3300 3750
Connection ~ 2600 3850
Connection ~ 1800 3950
Connection ~ 3000 1750
Connection ~ 3100 1650
Connection ~ 4250 5200
Connection ~ 4250 4800
Connection ~ 2250 4500
Connection ~ 3650 5200
Connection ~ 5200 4300
Connection ~ 3650 4800
Connection ~ 7250 4800
Connection ~ 7250 5200
Connection ~ 7850 5200
Connection ~ 7850 4800
Connection ~ 5450 4800
Connection ~ 5450 5200
Connection ~ 9050 4800
Connection ~ 8450 4800
Connection ~ 8450 5200
Connection ~ 9050 5200
Connection ~ 9650 5200
Connection ~ 6650 5200
Connection ~ 4800 2100
Connection ~ 5650 2150
Connection ~ 8250 2950
Connection ~ 9650 4100
Connection ~ 3900 3500
Connection ~ 6900 950 
Connection ~ 5900 1350
NoConn ~ 2500 3050
NoConn ~ 5900 850 
Entry Wire Line
	10300 2350 10400 2250
Entry Wire Line
	10300 2450 10400 2350
Entry Wire Line
	10300 2550 10400 2450
Entry Wire Line
	10300 2650 10400 2550
Entry Wire Line
	10300 2750 10400 2650
Entry Wire Line
	10300 2850 10400 2750
Wire Wire Line
	1150 1100 2200 1100
Wire Wire Line
	1150 1750 3000 1750
Wire Wire Line
	1150 2950 2000 2950
Wire Wire Line
	1150 3950 1800 3950
Wire Wire Line
	1800 3150 1800 3950
Wire Wire Line
	1800 3150 2000 3150
Wire Wire Line
	1800 3950 2000 3950
Wire Wire Line
	1800 6900 2100 6900
Wire Wire Line
	1850 1000 2200 1000
Wire Wire Line
	1900 2100 1900 2400
Wire Wire Line
	1900 2400 1150 2400
Wire Wire Line
	1900 3400 2600 3400
Wire Wire Line
	1900 3750 1900 3400
Wire Wire Line
	1900 3750 2000 3750
Wire Wire Line
	2250 2100 1900 2100
Wire Wire Line
	2250 2200 2350 2200
Wire Wire Line
	2250 4150 2250 4500
Wire Wire Line
	2250 4500 2250 5250
Wire Wire Line
	2250 4500 5800 4500
Wire Wire Line
	2500 5250 2250 5250
Wire Wire Line
	2600 3400 2600 3850
Wire Wire Line
	2600 3850 2500 3850
Wire Wire Line
	2600 3850 2600 4300
Wire Wire Line
	2600 4300 4900 4300
Wire Wire Line
	2700 3750 2500 3750
Wire Wire Line
	2750 1050 3100 1050
Wire Wire Line
	3000 1750 3200 1750
Wire Wire Line
	3000 2500 3000 1750
Wire Wire Line
	3000 2500 7600 2500
Wire Wire Line
	3050 5300 3050 5450
Wire Wire Line
	3050 5450 9650 5450
Wire Wire Line
	3100 1650 3100 1050
Wire Wire Line
	3100 1650 3200 1650
Wire Wire Line
	3100 2300 3100 1650
Wire Wire Line
	3100 2300 3200 2300
Wire Wire Line
	3150 2950 2500 2950
Wire Wire Line
	3200 2400 1900 2400
Wire Wire Line
	3300 3500 3300 3750
Wire Wire Line
	3300 3750 3300 4000
Wire Wire Line
	3650 4700 3650 4800
Wire Wire Line
	3650 4700 3800 4700
Wire Wire Line
	3650 4800 3650 5200
Wire Wire Line
	3750 2950 4400 2950
Wire Wire Line
	3800 4700 3800 4800
Wire Wire Line
	3800 4800 3650 4800
Wire Wire Line
	3900 3500 3900 3750
Wire Wire Line
	3900 3750 3900 4000
Wire Wire Line
	3900 3750 4300 3750
Wire Wire Line
	4000 3500 3900 3500
Wire Wire Line
	4100 1700 3750 1700
Wire Wire Line
	4100 2350 3750 2350
Wire Wire Line
	4250 4700 4250 4800
Wire Wire Line
	4250 4700 4400 4700
Wire Wire Line
	4250 4800 4250 5200
Wire Wire Line
	4350 2100 4350 1900
Wire Wire Line
	4350 2100 4800 2100
Wire Wire Line
	4400 4700 4400 4800
Wire Wire Line
	4400 4800 4250 4800
Wire Wire Line
	4550 1050 5400 1050
Wire Wire Line
	4600 1500 4700 1500
Wire Wire Line
	4700 850  5400 850 
Wire Wire Line
	4700 1500 4700 850 
Wire Wire Line
	4800 1500 4800 2100
Wire Wire Line
	4800 1500 4900 1500
Wire Wire Line
	4800 2100 4900 2100
Wire Wire Line
	4900 1600 4600 1600
Wire Wire Line
	5200 3750 5200 4300
Wire Wire Line
	5200 4300 5550 4300
Wire Wire Line
	5450 1550 7700 1550
Wire Wire Line
	5450 3750 5450 4100
Wire Wire Line
	5450 4100 5550 4100
Wire Wire Line
	5450 4700 5450 4800
Wire Wire Line
	5450 4700 5600 4700
Wire Wire Line
	5450 4800 5450 5200
Wire Wire Line
	5600 4700 5600 4800
Wire Wire Line
	5600 4800 5450 4800
Wire Wire Line
	5650 1250 5650 2150
Wire Wire Line
	5650 2150 5450 2150
Wire Wire Line
	5650 2150 6400 2150
Wire Wire Line
	5650 2300 5650 2150
Wire Wire Line
	5750 2300 5650 2300
Wire Wire Line
	5900 950  5900 1350
Wire Wire Line
	5900 1350 5900 2050
Wire Wire Line
	5900 2050 5450 2050
Wire Wire Line
	6000 1350 5900 1350
Wire Wire Line
	6050 4200 6150 4200
Wire Wire Line
	6150 3750 5450 3750
Wire Wire Line
	6150 4200 6150 3750
Wire Wire Line
	6250 4100 6050 4100
Wire Wire Line
	6600 950  6900 950 
Wire Wire Line
	6650 4700 6650 4800
Wire Wire Line
	6650 4700 6800 4700
Wire Wire Line
	6650 4800 6650 5200
Wire Wire Line
	6800 4700 6800 4800
Wire Wire Line
	6800 4800 6650 4800
Wire Wire Line
	6850 3850 6850 4100
Wire Wire Line
	6850 4100 6850 4350
Wire Wire Line
	6900 950  6900 1150
Wire Wire Line
	6900 950  7800 950 
Wire Wire Line
	7250 4700 7250 4800
Wire Wire Line
	7250 4700 7400 4700
Wire Wire Line
	7250 4800 7250 5200
Wire Wire Line
	7400 4700 7400 4800
Wire Wire Line
	7400 4800 7250 4800
Wire Wire Line
	7450 3850 7450 4100
Wire Wire Line
	7450 4100 7450 4350
Wire Wire Line
	7450 4100 7700 4100
Wire Wire Line
	7600 1050 7800 1050
Wire Wire Line
	7700 1250 7700 1550
Wire Wire Line
	7800 1150 7500 1150
Wire Wire Line
	7800 1250 7700 1250
Wire Wire Line
	7850 4700 7850 4800
Wire Wire Line
	7850 4700 8000 4700
Wire Wire Line
	7850 4800 7850 5200
Wire Wire Line
	8000 4700 8000 4800
Wire Wire Line
	8000 4800 7850 4800
Wire Wire Line
	8250 2850 8250 2950
Wire Wire Line
	8450 4700 8450 4800
Wire Wire Line
	8450 4700 8600 4700
Wire Wire Line
	8450 4800 8450 5200
Wire Wire Line
	8600 4700 8600 4800
Wire Wire Line
	8600 4800 8450 4800
Wire Wire Line
	9050 4700 9050 4800
Wire Wire Line
	9050 4700 9200 4700
Wire Wire Line
	9050 4800 9050 5200
Wire Wire Line
	9200 4700 9200 4800
Wire Wire Line
	9200 4800 9050 4800
Wire Wire Line
	9250 2350 10300 2350
Wire Wire Line
	9250 2450 10300 2450
Wire Wire Line
	9250 2650 10300 2650
Wire Wire Line
	9250 2750 10300 2750
Wire Wire Line
	9250 2850 10300 2850
Wire Wire Line
	9350 2550 9250 2550
Wire Wire Line
	9550 4100 9650 4100
Wire Wire Line
	9650 4100 9650 5200
Wire Wire Line
	9650 4100 9750 4100
Wire Wire Line
	9650 5200 9650 5450
Wire Wire Line
	9950 2550 10300 2550
Wire Bus Line
	2000 6750 2100 6750
Wire Bus Line
	3450 6750 4150 6750
Wire Bus Line
	5550 6750 5450 6750
Wire Bus Line
	10400 2000 10550 2000
Text Notes 1400 1050 2    50   ~ 0
~CS
Text Notes 1400 1700 2    50   ~ 0
~WR
Text Notes 1400 2350 2    50   ~ 0
~RD
Text Notes 1400 3900 2    50   ~ 0
CLK
Text Notes 1500 2900 2    50   ~ 0
~RESET
Text Notes 3500 4650 0    50   ~ 0
TEST PADS
Text Notes 4400 2350 0    50   ~ 0
To CD[0..14]
Text Notes 7700 4650 0    50   ~ 0
TEST PADS
Text Label 1800 6900 0    50   ~ 0
~CLK4M
Text Label 2200 1000 2    50   ~ 0
BUS-~I~O
Text Label 2250 2200 2    50   ~ 0
~RD-E
Text Label 2650 2100 0    50   ~ 0
~RD-OUT
Text Label 3450 6900 0    50   ~ 0
~RD-OUT
Text Label 3800 2950 0    50   ~ 0
MAIN-RESET
Text Label 3950 1050 2    50   ~ 0
CLK4M
Text Label 4150 6900 2    50   ~ 0
~RD-E
Text Label 4150 7050 2    50   ~ 0
BUS-~I~O
Text Label 5400 1050 2    50   ~ 0
~CLK4M
Text Label 6600 950  0    50   ~ 0
~DEBUG3
Text Label 7000 2150 0    50   ~ 0
MAIN-RESET
Text Label 8950 4100 2    50   ~ 0
MAIN-RESET
Text Label 9950 2350 0    50   ~ 0
~DEBUG1
Text Label 9950 2450 0    50   ~ 0
~DEBUG2
Text Label 9950 2550 0    50   ~ 0
~DEBUG3
Text Label 9950 2650 0    50   ~ 0
~DEBUG4
Text Label 9950 2750 0    50   ~ 0
~DEBUG5
Text Label 9950 2850 0    50   ~ 0
~DEBUG6
Text HLabel 1150 1100 0    50   Input ~ 0
~CS
Text HLabel 1150 1750 0    50   Input ~ 0
~WR
Text HLabel 1150 2400 0    50   Input ~ 0
~RD
Text HLabel 1150 2950 0    50   Input ~ 0
~RESET
Text HLabel 1150 3950 0    50   Input ~ 0
CLK
Text HLabel 1850 1000 0    50   Input ~ 0
BUS-~I~O
Text HLabel 2000 6750 0    50   Input ~ 0
ADDR[1..23]
Text HLabel 4000 3500 2    50   Output ~ 0
CLK8M
Text HLabel 4100 2350 2    50   Output ~ 0
READ
Text HLabel 4400 2950 2    50   Output ~ 0
MAIN-RESET
Text HLabel 5550 6750 2    50   3State ~ 0
CA[1..23]
Text HLabel 5750 2300 2    50   Output ~ 0
~CPS-ID-RESET
Text HLabel 6000 1350 2    50   Output ~ 0
~DECODE
Text HLabel 7700 4100 2    50   Output ~ 0
CLK4M
Text HLabel 8250 2250 0    50   Input ~ 0
~TEST3
Text HLabel 8250 2350 0    50   Input ~ 0
~TEST2
Text HLabel 8250 2450 0    50   Input ~ 0
~TEST1
Text HLabel 8600 1100 2    50   Output ~ 0
WRITE
Text HLabel 9750 4100 2    50   Output ~ 0
~RESETI
Text HLabel 10550 2000 2    50   Output ~ 0
~DEBUG[1..6]
$Comp
L power:VCC #PWR0102
U 1 1 602CE5F2
P 4100 1500
F 0 "#PWR0102" H 4100 1350 50  0001 C CNN
F 1 "VCC" H 4115 1673 50  0000 C CNN
F 2 "" H 4100 1500 50  0001 C CNN
F 3 "" H 4100 1500 50  0001 C CNN
	1    4100 1500
	1    0    0    -1  
$EndComp
$Comp
L power:VCC #PWR0101
U 1 1 6030E236
P 8250 2750
F 0 "#PWR0101" H 8250 2600 50  0001 C CNN
F 1 "VCC" H 8265 2923 50  0000 C CNN
F 2 "" H 8250 2750 50  0001 C CNN
F 3 "" H 8250 2750 50  0001 C CNN
	1    8250 2750
	1    0    0    -1  
$EndComp
$Comp
L power:GND #PWR0142
U 1 1 6030D957
P 8250 2950
F 0 "#PWR0142" H 8250 2700 50  0001 C CNN
F 1 "GND" H 8255 2777 50  0000 C CNN
F 2 "" H 8250 2950 50  0001 C CNN
F 3 "" H 8250 2950 50  0001 C CNN
	1    8250 2950
	1    0    0    -1  
$EndComp
$Comp
L Jumper:SolderJumper_2_Open JP1
U 1 1 6050B2C6
P 5050 3750
F 0 "JP1" H 5050 3863 50  0000 C CNN
F 1 "SolderJumper_2_Open" H 5050 3864 50  0001 C CNN
F 2 "" H 5050 3750 50  0001 C CNN
F 3 "~" H 5050 3750 50  0001 C CNN
	1    5050 3750
	1    0    0    -1  
$EndComp
$Comp
L Jumper:SolderJumper_2_Bridged JP2
U 1 1 6050A381
P 5050 4300
F 0 "JP2" H 5050 4413 50  0000 C CNN
F 1 "SolderJumper_2_Bridged" H 5050 4414 50  0001 C CNN
F 2 "" H 5050 4300 50  0001 C CNN
F 3 "~" H 5050 4300 50  0001 C CNN
	1    5050 4300
	1    0    0    -1  
$EndComp
$Comp
L A5C:OUTTRI UAA72
U 1 1 602BBD98
P 2450 2100
F 0 "UAA72" H 2450 2365 50  0000 C CNN
F 1 "OUTTRI" H 2450 2274 50  0000 C CNN
F 2 "" H 1950 2050 50  0001 C CNN
F 3 "" H 1950 2050 50  0001 C CNN
	1    2450 2100
	-1   0    0    -1  
$EndComp
$Comp
L A5C:OR02 UAA67
U 1 1 602B7A53
P 2450 1050
F 0 "UAA67" H 2475 1317 50  0000 C CNN
F 1 "OR02" H 2475 1226 50  0000 C CNN
F 2 "" H 2500 1050 50  0001 C CNN
F 3 "" H 2500 1050 50  0001 C CNN
	1    2450 1050
	1    0    0    -1  
$EndComp
$Comp
L A5C:OR02 UAB335
U 1 1 603A664F
P 2800 5250
F 0 "UAB335" H 2825 5517 50  0000 C CNN
F 1 "OR02" H 2825 5426 50  0000 C CNN
F 2 "" H 2850 5250 50  0001 C CNN
F 3 "" H 2850 5250 50  0001 C CNN
	1    2800 5250
	-1   0    0    -1  
$EndComp
$Comp
L A5C:OR02 UAA100
U 1 1 602BE935
P 3450 1700
F 0 "UAA100" H 3475 1967 50  0000 C CNN
F 1 "OR02P" H 3475 1876 50  0000 C CNN
F 2 "" H 3500 1700 50  0001 C CNN
F 3 "" H 3500 1700 50  0001 C CNN
	1    3450 1700
	1    0    0    -1  
$EndComp
$Comp
L A5C:NOR02 UAA63
U 1 1 604E62DD
P 3450 2350
F 0 "UAA63" H 3475 2617 50  0000 C CNN
F 1 "NOR02P" H 3475 2526 50  0000 C CNN
F 2 "" H 3450 2350 50  0001 C CNN
F 3 "" H 3450 2350 50  0001 C CNN
	1    3450 2350
	1    0    0    -1  
$EndComp
$Comp
L A5C:NAND02 UBB3
U 1 1 602DAB3E
P 5150 1550
F 0 "UBB3" H 5175 1817 50  0000 C CNN
F 1 "NAND02" H 5175 1726 50  0000 C CNN
F 2 "" H 5150 1550 50  0001 C CNN
F 3 "" H 5150 1550 50  0001 C CNN
	1    5150 1550
	1    0    0    -1  
$EndComp
$Comp
L A5C:AND02 UBE27
U 1 1 602D1535
P 5200 2100
F 0 "UBE27" H 5225 2367 50  0000 C CNN
F 1 "AND02" H 5225 2276 50  0000 C CNN
F 2 "" H 5200 2100 50  0001 C CNN
F 3 "" H 5200 2100 50  0001 C CNN
	1    5200 2100
	-1   0    0    -1  
$EndComp
$Comp
L A5C:BUF12 UAA38
U 1 1 6037713E
P 3000 3750
F 0 "UAA38" H 3000 4067 50  0000 C CNN
F 1 "BUF12" H 3000 3976 50  0000 C CNN
F 2 "" H 3000 3750 50  0001 C CNN
F 3 "" H 3000 3750 50  0001 C CNN
	1    3000 3750
	1    0    0    -1  
$EndComp
$Comp
L A5C:INV01 UAA166
U 1 1 603AC77E
P 3350 5200
F 0 "UAA166" H 3350 5517 50  0000 C CNN
F 1 "INV01" H 3350 5426 50  0000 C CNN
F 2 "" H 3350 5000 50  0001 C CNN
F 3 "" H 3350 5000 50  0001 C CNN
	1    3350 5200
	-1   0    0    -1  
$EndComp
$Comp
L A5C:NBUF03 UAB33
U 1 1 603A3806
P 3450 2950
F 0 "UAB33" H 3450 3267 50  0000 C CNN
F 1 "NBUF03" H 3450 3176 50  0000 C CNN
F 2 "" H 3450 2750 50  0001 C CNN
F 3 "" H 3450 2750 50  0001 C CNN
	1    3450 2950
	1    0    0    -1  
$EndComp
$Comp
L A5C:BUF12 UAA41
U 1 1 6037747E
P 3600 3500
F 0 "UAA41" H 3600 3817 50  0000 C CNN
F 1 "BUF12" H 3600 3726 50  0000 C CNN
F 2 "" H 3600 3500 50  0001 C CNN
F 3 "" H 3600 3500 50  0001 C CNN
	1    3600 3500
	1    0    0    -1  
$EndComp
$Comp
L A5C:BUF12 UAA44
U 1 1 60377F15
P 3600 4000
F 0 "UAA44" H 3600 4317 50  0000 C CNN
F 1 "BUF12" H 3600 4226 50  0000 C CNN
F 2 "" H 3600 4000 50  0001 C CNN
F 3 "" H 3600 4000 50  0001 C CNN
	1    3600 4000
	1    0    0    -1  
$EndComp
$Comp
L A5C:BUF01 UAA152
U 1 1 603CC667
P 3950 5200
F 0 "UAA152" H 3950 5517 50  0000 C CNN
F 1 "BUF11" H 3950 5426 50  0000 C CNN
F 2 "" H 3950 5200 50  0001 C CNN
F 3 "" H 3950 5200 50  0001 C CNN
	1    3950 5200
	-1   0    0    -1  
$EndComp
$Comp
L A5C:INV01 UBI10
U 1 1 602D9888
P 4250 1050
F 0 "UBI10" H 4250 1367 50  0000 C CNN
F 1 "INV01" H 4250 1276 50  0000 C CNN
F 2 "" H 4250 850 50  0001 C CNN
F 3 "" H 4250 850 50  0001 C CNN
	1    4250 1050
	1    0    0    -1  
$EndComp
$Comp
L A5C:BUF01 UAA155
U 1 1 603CD59E
P 4550 5200
F 0 "UAA155" H 4550 5517 50  0000 C CNN
F 1 "BUF11" H 4550 5426 50  0000 C CNN
F 2 "" H 4550 5200 50  0001 C CNN
F 3 "" H 4550 5200 50  0001 C CNN
	1    4550 5200
	-1   0    0    -1  
$EndComp
$Comp
L A5C:INV01 UAD40
U 1 1 604C449F
P 4600 3750
F 0 "UAD40" H 4600 4067 50  0000 C CNN
F 1 "INV01" H 4600 3976 50  0000 C CNN
F 2 "" H 4600 3550 50  0001 C CNN
F 3 "" H 4600 3550 50  0001 C CNN
	1    4600 3750
	1    0    0    -1  
$EndComp
$Comp
L A5C:BUF01 UAA154
U 1 1 603CDAD1
P 5150 5200
F 0 "UAA154" H 5150 5517 50  0000 C CNN
F 1 "BUF11" H 5150 5426 50  0000 C CNN
F 2 "" H 5150 5200 50  0001 C CNN
F 3 "" H 5150 5200 50  0001 C CNN
	1    5150 5200
	-1   0    0    -1  
$EndComp
$Comp
L A5C:BUF01 UAA163
U 1 1 603CE0A6
P 5750 5200
F 0 "UAA163" H 5750 5517 50  0000 C CNN
F 1 "BUF11" H 5750 5426 50  0000 C CNN
F 2 "" H 5750 5200 50  0001 C CNN
F 3 "" H 5750 5200 50  0001 C CNN
	1    5750 5200
	-1   0    0    -1  
$EndComp
$Comp
L A5C:BUF01 UAA160
U 1 1 603DA30E
P 6350 5200
F 0 "UAA160" H 6350 5517 50  0000 C CNN
F 1 "BUF11" H 6350 5426 50  0000 C CNN
F 2 "" H 6350 5200 50  0001 C CNN
F 3 "" H 6350 5200 50  0001 C CNN
	1    6350 5200
	-1   0    0    -1  
$EndComp
$Comp
L A5C:BUF12 UAB44
U 1 1 604A935F
P 6550 4100
F 0 "UAB44" H 6550 4417 50  0000 C CNN
F 1 "BUF12" H 6550 4326 50  0000 C CNN
F 2 "" H 6550 4100 50  0001 C CNN
F 3 "" H 6550 4100 50  0001 C CNN
	1    6550 4100
	1    0    0    -1  
$EndComp
$Comp
L A5C:INV01 UBH103
U 1 1 602D30CD
P 6700 2150
F 0 "UBH103" H 6700 2467 50  0000 C CNN
F 1 "INV01" H 6700 2376 50  0000 C CNN
F 2 "" H 6700 1950 50  0001 C CNN
F 3 "" H 6700 1950 50  0001 C CNN
	1    6700 2150
	-1   0    0    -1  
$EndComp
$Comp
L A5C:BUF01 UAA162
U 1 1 603DAB0B
P 6950 5200
F 0 "UAA162" H 6950 5517 50  0000 C CNN
F 1 "BUF11" H 6950 5426 50  0000 C CNN
F 2 "" H 6950 5200 50  0001 C CNN
F 3 "" H 6950 5200 50  0001 C CNN
	1    6950 5200
	-1   0    0    -1  
$EndComp
$Comp
L A5C:BUF12 UAC25
U 1 1 6055BD0F
P 7150 3850
F 0 "UAC25" H 7150 4167 50  0000 C CNN
F 1 "BUF12" H 7150 4076 50  0000 C CNN
F 2 "" H 7150 3850 50  0001 C CNN
F 3 "" H 7150 3850 50  0001 C CNN
	1    7150 3850
	1    0    0    -1  
$EndComp
$Comp
L A5C:BUF12 UAC38
U 1 1 6055BD15
P 7150 4350
F 0 "UAC38" H 7150 4667 50  0000 C CNN
F 1 "BUF12" H 7150 4576 50  0000 C CNN
F 2 "" H 7150 4350 50  0001 C CNN
F 3 "" H 7150 4350 50  0001 C CNN
	1    7150 4350
	1    0    0    -1  
$EndComp
$Comp
L A5C:INV01 UAA114
U 1 1 602E74B2
P 7200 1150
F 0 "UAA114" H 7200 1467 50  0000 C CNN
F 1 "INV01" H 7200 1376 50  0000 C CNN
F 2 "" H 7200 950 50  0001 C CNN
F 3 "" H 7200 950 50  0001 C CNN
	1    7200 1150
	1    0    0    1   
$EndComp
$Comp
L A5C:BUF01 UAA168
U 1 1 603DB301
P 7550 5200
F 0 "UAA168" H 7550 5517 50  0000 C CNN
F 1 "BUF11" H 7550 5426 50  0000 C CNN
F 2 "" H 7550 5200 50  0001 C CNN
F 3 "" H 7550 5200 50  0001 C CNN
	1    7550 5200
	-1   0    0    -1  
$EndComp
$Comp
L A5C:BUF01 UAA178
U 1 1 603E5AE1
P 8150 5200
F 0 "UAA178" H 8150 5517 50  0000 C CNN
F 1 "BUF11" H 8150 5426 50  0000 C CNN
F 2 "" H 8150 5200 50  0001 C CNN
F 3 "" H 8150 5200 50  0001 C CNN
	1    8150 5200
	-1   0    0    -1  
$EndComp
$Comp
L A5C:BUF01 UAA193
U 1 1 603F7EE3
P 8750 5200
F 0 "UAA193" H 8750 5517 50  0000 C CNN
F 1 "BUF11" H 8750 5426 50  0000 C CNN
F 2 "" H 8750 5200 50  0001 C CNN
F 3 "" H 8750 5200 50  0001 C CNN
	1    8750 5200
	-1   0    0    -1  
$EndComp
$Comp
L A5C:NBUF03 UBC19
U 1 1 603AD036
P 9250 4100
F 0 "UBC19" H 9250 4417 50  0000 C CNN
F 1 "NBUF03" H 9250 4326 50  0000 C CNN
F 2 "" H 9250 3900 50  0001 C CNN
F 3 "" H 9250 3900 50  0001 C CNN
	1    9250 4100
	1    0    0    -1  
$EndComp
$Comp
L A5C:BUF01 UAA350
U 1 1 6040439E
P 9350 5200
F 0 "UAA350" H 9350 5517 50  0000 C CNN
F 1 "BUF11" H 9350 5426 50  0000 C CNN
F 2 "" H 9350 5200 50  0001 C CNN
F 3 "" H 9350 5200 50  0001 C CNN
	1    9350 5200
	-1   0    0    -1  
$EndComp
$Comp
L A5C:BUF12 UAD41
U 1 1 602EB822
P 9650 2550
F 0 "UAD41" H 9650 2867 50  0000 C CNN
F 1 "BUF12" H 9650 2776 50  0000 C CNN
F 2 "" H 9650 2550 50  0001 C CNN
F 3 "" H 9650 2550 50  0001 C CNN
	1    9650 2550
	1    0    0    -1  
$EndComp
$Comp
L A5C:DFFCOO UAB29
U 1 1 60356453
P 2250 3050
F 0 "UAB29" H 2250 3415 50  0000 C CNN
F 1 "DFFCOO" H 2250 3324 50  0000 C CNN
F 2 "" H 2250 3050 50  0001 C CNN
F 3 "" H 2250 3050 50  0001 C CNN
	1    2250 3050
	1    0    0    -1  
$EndComp
$Comp
L A5C:DFFCOR UAB24
U 1 1 6036A18C
P 2250 3850
F 0 "UAB24" H 2250 4215 50  0000 C CNN
F 1 "DFFCOR" H 2250 4124 50  0000 C CNN
F 2 "" H 2250 3850 50  0001 C CNN
F 3 "" H 2250 3850 50  0001 C CNN
	1    2250 3850
	1    0    0    -1  
$EndComp
$Comp
L A5C:DFFCOR UBC0
U 1 1 602CD490
P 4350 1600
F 0 "UBC0" H 4350 1965 50  0000 C CNN
F 1 "DFFCOR" H 4350 1874 50  0000 C CNN
F 2 "" H 4350 1600 50  0001 C CNN
F 3 "" H 4350 1600 50  0001 C CNN
	1    4350 1600
	1    0    0    -1  
$EndComp
$Comp
L A5C:DFFCOR UBG16
U 1 1 602D56A8
P 5650 950
F 0 "UBG16" H 5650 1315 50  0000 C CNN
F 1 "DFFCOR" H 5650 1224 50  0000 C CNN
F 2 "" H 5650 950 50  0001 C CNN
F 3 "" H 5650 950 50  0001 C CNN
	1    5650 950 
	1    0    0    -1  
$EndComp
$Comp
L A5C:DFFCOR UAB40
U 1 1 60497468
P 5800 4200
F 0 "UAB40" H 5800 4565 50  0000 C CNN
F 1 "DFFCOR" H 5800 4474 50  0000 C CNN
F 2 "" H 5800 4200 50  0001 C CNN
F 3 "" H 5800 4200 50  0001 C CNN
	1    5800 4200
	1    0    0    -1  
$EndComp
$Comp
L A5C:OAI22 UAA184
U 1 1 602C3F82
P 8200 1100
F 0 "UAA184" H 8200 1467 50  0000 C CNN
F 1 "OAI22" H 8200 1376 50  0000 C CNN
F 2 "" H 8250 950 50  0001 C CNN
F 3 "" H 8250 950 50  0001 C CNN
	1    8200 1100
	1    0    0    -1  
$EndComp
$Comp
L A5C:D38GL UAC0
U 1 1 60305E75
P 8750 2600
F 0 "UAC0" H 8750 3217 50  0000 C CNN
F 1 "D38GL" H 8750 3126 50  0000 C CNN
F 2 "" H 8750 3125 50  0001 C CNN
F 3 "" H 8750 3125 50  0001 C CNN
	1    8750 2600
	1    0    0    -1  
$EndComp
$Sheet
S 4150 6600 1300 600 
U 611BE795
F0 "bus-addr-io" 50
F1 "bus-addr-io.sch" 50
F2 "CA[1..23]" B R 5450 6750 50 
F3 "ADDR-OUT[1..23]" I L 4150 6750 50 
F4 "~I~O" I L 4150 7050 50 
F5 "~RD-E" O L 4150 6900 50 
$EndSheet
$Sheet
S 2100 6600 1350 450 
U 611BE799
F0 "bus-addr-out" 50
F1 "bus-addr-out.sch" 50
F2 "ADDR[1..23]" I L 2100 6750 50 
F3 "ADDR-OUT[1..23]" O R 3450 6750 50 
F4 "~CLK4M" I L 2100 6900 50 
F5 "~RD-OUT" O R 3450 6900 50 
$EndSheet
Wire Wire Line
	7600 1050 7600 2500
NoConn ~ 9250 2950
NoConn ~ 9250 2250
Wire Bus Line
	10400 2000 10400 2750
$EndSCHEMATC
