EESchema Schematic File Version 4
EELAYER 30 0
EELAYER END
$Descr A3 16535 11693
encoding utf-8
Sheet 30 69
Title ""
Date "2020-11-26"
Rev ""
Comp ""
Comment1 "Licence: CC-BY"
Comment2 "Author: Loïc *WydD* Petit"
Comment3 ""
Comment4 ""
$EndDescr
Connection ~ 5450 1850
Connection ~ 5550 1950
Connection ~ 5650 2050
Connection ~ 5750 2150
Connection ~ 5850 2250
Connection ~ 5950 2350
Connection ~ 6050 2450
Connection ~ 6150 2550
Connection ~ 7550 2550
Connection ~ 7650 2450
Connection ~ 7750 2350
Connection ~ 7850 2250
Connection ~ 7950 2150
Connection ~ 8050 2050
Connection ~ 8150 1950
Connection ~ 8250 1850
Connection ~ 5700 5550
Connection ~ 5800 5650
Connection ~ 5900 5750
Connection ~ 6000 5850
Connection ~ 6300 6050
Connection ~ 6300 5450
Connection ~ 6300 5350
Connection ~ 4100 2750
Connection ~ 4000 4400
Connection ~ 10800 1550
Connection ~ 6300 5950
Connection ~ 8100 5550
Connection ~ 9500 7450
Connection ~ 8750 7250
Connection ~ 9500 6700
Connection ~ 8750 6500
Connection ~ 9500 5950
Connection ~ 7800 5850
Connection ~ 7900 5750
Connection ~ 8000 5650
Connection ~ 8750 5750
Connection ~ 8750 2750
Connection ~ 4200 3800
Connection ~ 4800 4500
Connection ~ 8750 8000
Entry Wire Line
	4600 2250 4700 2350
Entry Wire Line
	4600 2350 4700 2450
Entry Wire Line
	4850 1750 4950 1850
Entry Wire Line
	4850 1850 4950 1950
Entry Wire Line
	4850 1950 4950 2050
Entry Wire Line
	4850 2050 4950 2150
Entry Wire Line
	4850 2150 4950 2250
Entry Wire Line
	4900 5750 5000 5650
Entry Wire Line
	4900 5850 5000 5750
Entry Wire Line
	4900 5950 5000 5850
Entry Wire Line
	10000 6300 10100 6400
Entry Wire Line
	10000 7050 10100 7150
Entry Wire Line
	10000 7800 10100 7900
Entry Wire Line
	12600 1750 12500 1850
Entry Wire Line
	12600 1850 12500 1950
Entry Wire Line
	12600 1950 12500 2050
Entry Wire Line
	12600 2050 12500 2150
Entry Wire Line
	12600 2150 12500 2250
Entry Wire Line
	12850 2250 12750 2350
Entry Wire Line
	12850 2350 12750 2450
Wire Wire Line
	3250 2750 4100 2750
Wire Wire Line
	3250 3800 4200 3800
Wire Wire Line
	3250 4400 4000 4400
Wire Wire Line
	4000 4400 4000 7900
Wire Wire Line
	4000 4400 6350 4400
Wire Wire Line
	4000 7900 6400 7900
Wire Wire Line
	4100 2750 6350 2750
Wire Wire Line
	4100 6250 4100 2750
Wire Wire Line
	4100 6250 6400 6250
Wire Wire Line
	4200 2850 4200 3800
Wire Wire Line
	4200 3800 4200 6350
Wire Wire Line
	4300 4500 4300 8000
Wire Wire Line
	4300 4500 4800 4500
Wire Wire Line
	4300 8000 6400 8000
Wire Wire Line
	4700 2350 5950 2350
Wire Wire Line
	4700 2450 6050 2450
Wire Wire Line
	4800 3800 4800 4500
Wire Wire Line
	4800 4500 6350 4500
Wire Wire Line
	4800 5550 5700 5550
Wire Wire Line
	4950 1850 5450 1850
Wire Wire Line
	4950 1950 5550 1950
Wire Wire Line
	4950 2050 5650 2050
Wire Wire Line
	4950 2150 5750 2150
Wire Wire Line
	4950 2250 5850 2250
Wire Wire Line
	4950 2550 6150 2550
Wire Wire Line
	5000 5650 5800 5650
Wire Wire Line
	5000 5750 5900 5750
Wire Wire Line
	5000 5850 6000 5850
Wire Wire Line
	5450 1850 6350 1850
Wire Wire Line
	5450 3500 5450 1850
Wire Wire Line
	5450 3500 6350 3500
Wire Wire Line
	5500 5350 6300 5350
Wire Wire Line
	5500 7000 5500 5350
Wire Wire Line
	5500 7000 6400 7000
Wire Wire Line
	5550 1950 6350 1950
Wire Wire Line
	5550 3600 5550 1950
Wire Wire Line
	5550 3600 6350 3600
Wire Wire Line
	5600 5450 6300 5450
Wire Wire Line
	5600 7100 5600 5450
Wire Wire Line
	5600 7100 6400 7100
Wire Wire Line
	5650 2050 5650 3700
Wire Wire Line
	5650 2050 6350 2050
Wire Wire Line
	5650 3700 6350 3700
Wire Wire Line
	5700 5550 5700 7200
Wire Wire Line
	5700 5550 6400 5550
Wire Wire Line
	5700 7200 6400 7200
Wire Wire Line
	5750 2150 6350 2150
Wire Wire Line
	5750 3800 5750 2150
Wire Wire Line
	5750 3800 6350 3800
Wire Wire Line
	5800 5650 6400 5650
Wire Wire Line
	5800 7300 5800 5650
Wire Wire Line
	5800 7300 6400 7300
Wire Wire Line
	5850 2250 5850 3900
Wire Wire Line
	5850 2250 6350 2250
Wire Wire Line
	5850 3900 6350 3900
Wire Wire Line
	5900 5750 5900 7400
Wire Wire Line
	5900 5750 6400 5750
Wire Wire Line
	5900 7400 6400 7400
Wire Wire Line
	5950 2350 6350 2350
Wire Wire Line
	5950 4000 5950 2350
Wire Wire Line
	5950 4000 6350 4000
Wire Wire Line
	6000 5850 6400 5850
Wire Wire Line
	6000 7500 6000 5850
Wire Wire Line
	6000 7500 6400 7500
Wire Wire Line
	6050 2450 6050 4100
Wire Wire Line
	6050 2450 6350 2450
Wire Wire Line
	6050 4100 6350 4100
Wire Wire Line
	6100 5950 6100 7600
Wire Wire Line
	6100 5950 6300 5950
Wire Wire Line
	6100 7600 6400 7600
Wire Wire Line
	6150 2550 6350 2550
Wire Wire Line
	6150 4200 6150 2550
Wire Wire Line
	6150 4200 6350 4200
Wire Wire Line
	6200 6050 6300 6050
Wire Wire Line
	6200 7700 6200 6050
Wire Wire Line
	6200 7700 6400 7700
Wire Wire Line
	6300 5350 6400 5350
Wire Wire Line
	6300 5450 6300 5350
Wire Wire Line
	6300 5450 6400 5450
Wire Wire Line
	6300 5950 6300 5450
Wire Wire Line
	6300 5950 6400 5950
Wire Wire Line
	6300 6050 6300 5950
Wire Wire Line
	6300 6050 6400 6050
Wire Wire Line
	6350 2850 4200 2850
Wire Wire Line
	6400 6350 4200 6350
Wire Wire Line
	7350 1850 8250 1850
Wire Wire Line
	7350 1950 8150 1950
Wire Wire Line
	7350 2050 8050 2050
Wire Wire Line
	7350 2150 7950 2150
Wire Wire Line
	7350 2250 7850 2250
Wire Wire Line
	7350 2350 7750 2350
Wire Wire Line
	7350 2450 7650 2450
Wire Wire Line
	7350 2550 7550 2550
Wire Wire Line
	7400 5350 8300 5350
Wire Wire Line
	7400 5450 8200 5450
Wire Wire Line
	7400 5550 8100 5550
Wire Wire Line
	7400 5650 8000 5650
Wire Wire Line
	7400 5750 7900 5750
Wire Wire Line
	7400 5850 7800 5850
Wire Wire Line
	7400 5950 7700 5950
Wire Wire Line
	7400 6050 7600 6050
Wire Wire Line
	7550 2550 9250 2550
Wire Wire Line
	7550 4200 7350 4200
Wire Wire Line
	7550 4200 7550 2550
Wire Wire Line
	7600 7700 7400 7700
Wire Wire Line
	7600 7700 7600 6050
Wire Wire Line
	7650 2450 7650 4100
Wire Wire Line
	7650 2450 9250 2450
Wire Wire Line
	7650 4100 7350 4100
Wire Wire Line
	7700 5950 7700 7600
Wire Wire Line
	7700 7600 7400 7600
Wire Wire Line
	7750 2350 9250 2350
Wire Wire Line
	7750 4000 7350 4000
Wire Wire Line
	7750 4000 7750 2350
Wire Wire Line
	7800 5850 8400 5850
Wire Wire Line
	7800 7500 7400 7500
Wire Wire Line
	7800 7500 7800 5850
Wire Wire Line
	7850 2250 7850 3900
Wire Wire Line
	7850 2250 9250 2250
Wire Wire Line
	7850 3900 7350 3900
Wire Wire Line
	7900 5750 7900 7400
Wire Wire Line
	7900 7400 7400 7400
Wire Wire Line
	7950 2150 9250 2150
Wire Wire Line
	7950 3800 7350 3800
Wire Wire Line
	7950 3800 7950 2150
Wire Wire Line
	8000 5650 8600 5650
Wire Wire Line
	8000 7300 7400 7300
Wire Wire Line
	8000 7300 8000 5650
Wire Wire Line
	8050 2050 8050 3700
Wire Wire Line
	8050 2050 9250 2050
Wire Wire Line
	8050 3700 7350 3700
Wire Wire Line
	8100 5550 8100 7200
Wire Wire Line
	8100 5550 8850 5550
Wire Wire Line
	8100 7200 7400 7200
Wire Wire Line
	8150 1950 9250 1950
Wire Wire Line
	8150 3600 7350 3600
Wire Wire Line
	8150 3600 8150 1950
Wire Wire Line
	8200 7100 7400 7100
Wire Wire Line
	8200 7100 8200 5450
Wire Wire Line
	8250 1850 9250 1850
Wire Wire Line
	8250 3500 7350 3500
Wire Wire Line
	8250 3500 8250 1850
Wire Wire Line
	8300 7000 7400 7000
Wire Wire Line
	8300 7000 8300 5350
Wire Wire Line
	8400 5850 8400 7800
Wire Wire Line
	8500 5750 7900 5750
Wire Wire Line
	8500 7050 8500 5750
Wire Wire Line
	8600 5650 8600 6300
Wire Wire Line
	8600 6300 8850 6300
Wire Wire Line
	8650 8750 8750 8750
Wire Wire Line
	8750 1500 10700 1500
Wire Wire Line
	8750 2750 8750 1500
Wire Wire Line
	8750 2750 8750 5750
Wire Wire Line
	8750 2750 9250 2750
Wire Wire Line
	8750 6500 8750 5750
Wire Wire Line
	8750 6500 8850 6500
Wire Wire Line
	8750 7250 8750 6500
Wire Wire Line
	8750 8000 8750 7250
Wire Wire Line
	8750 8750 8750 8000
Wire Wire Line
	8850 5750 8750 5750
Wire Wire Line
	8850 7050 8500 7050
Wire Wire Line
	8850 7250 8750 7250
Wire Wire Line
	8850 7800 8400 7800
Wire Wire Line
	8850 8000 8750 8000
Wire Wire Line
	9100 5950 9500 5950
Wire Wire Line
	9100 7450 9500 7450
Wire Wire Line
	9100 8200 9500 8200
Wire Wire Line
	9250 2850 9250 3050
Wire Wire Line
	9250 3050 10800 3050
Wire Wire Line
	9350 5550 9800 5550
Wire Wire Line
	9350 6300 10000 6300
Wire Wire Line
	9350 7050 10000 7050
Wire Wire Line
	9350 7800 10000 7800
Wire Wire Line
	9500 6700 9100 6700
Wire Wire Line
	9500 6700 9500 5950
Wire Wire Line
	9500 7450 9500 6700
Wire Wire Line
	9500 8200 9500 7450
Wire Wire Line
	10250 1850 10900 1850
Wire Wire Line
	10250 1950 10900 1950
Wire Wire Line
	10250 2050 10900 2050
Wire Wire Line
	10250 2150 10900 2150
Wire Wire Line
	10250 2250 10900 2250
Wire Wire Line
	10250 2350 10900 2350
Wire Wire Line
	10250 2450 10900 2450
Wire Wire Line
	10250 2550 10900 2550
Wire Wire Line
	10700 1650 10700 1500
Wire Wire Line
	10800 1550 10800 3050
Wire Wire Line
	10900 1550 10800 1550
Wire Wire Line
	10900 1650 10700 1650
Wire Wire Line
	12500 1850 11900 1850
Wire Wire Line
	12500 1950 11900 1950
Wire Wire Line
	12500 2050 11900 2050
Wire Wire Line
	12500 2150 11900 2150
Wire Wire Line
	12500 2250 11900 2250
Wire Wire Line
	12750 2350 11900 2350
Wire Wire Line
	12750 2450 11900 2450
Wire Wire Line
	12750 2550 11900 2550
Wire Bus Line
	4600 2150 4450 2150
Wire Bus Line
	4850 1600 4750 1600
Wire Bus Line
	4900 6050 4800 6050
Wire Bus Line
	10100 8050 10200 8050
Wire Bus Line
	12600 1600 12700 1600
Wire Bus Line
	12850 2150 13000 2150
Text Label 5100 5550 0    50   ~ 0
XSEL
Text Label 5100 5650 0    50   ~ 0
XS0
Text Label 5100 5750 0    50   ~ 0
XS1
Text Label 5100 5850 0    50   ~ 0
XS2
Text Label 5300 1850 2    50   ~ 0
CB0
Text Label 5300 1950 2    50   ~ 0
CB1
Text Label 5300 2050 2    50   ~ 0
CB2
Text Label 5300 2150 2    50   ~ 0
CB3
Text Label 5300 2250 2    50   ~ 0
CB4
Text Label 5300 2350 2    50   ~ 0
CPC0
Text Label 5300 2450 2    50   ~ 0
CPC1
Text Label 5300 2550 2    50   ~ 0
CDEN
Text Label 9600 6300 0    50   ~ 0
XS-OUT0
Text Label 9600 7050 0    50   ~ 0
XS-OUT1
Text Label 9600 7800 0    50   ~ 0
XS-OUT2
Text Label 12000 1850 0    50   ~ 0
CB-OUT0
Text Label 12000 1950 0    50   ~ 0
CB-OUT1
Text Label 12000 2050 0    50   ~ 0
CB-OUT2
Text Label 12000 2150 0    50   ~ 0
CB-OUT3
Text Label 12000 2250 0    50   ~ 0
CB-OUT4
Text Label 12000 2350 0    50   ~ 0
CPC-OUT0
Text Label 12000 2450 0    50   ~ 0
CPC-OUT1
Text Label 12000 2550 0    50   ~ 0
CDEN-OUT
Text HLabel 3250 2750 0    50   Input ~ 0
LOAD-CHNLB
Text HLabel 3250 3800 0    50   Input ~ 0
SERIAL-CHNL
Text HLabel 3250 4400 0    50   Input ~ 0
LOAD-CHNLA
Text HLabel 4450 2150 0    50   Input ~ 0
CPC[0..1]
Text HLabel 4750 1600 0    50   Input ~ 0
CB[0..4]
Text HLabel 4800 5550 0    50   Input ~ 0
XSEL
Text HLabel 4800 6050 0    50   Input ~ 0
XS[0..2]
Text HLabel 4950 2550 0    50   Input ~ 0
CDEN
Text HLabel 8100 8700 0    50   Input ~ 0
SERIAL-LOAD
Text HLabel 8100 8800 0    50   Input ~ 0
CLK8M
Text HLabel 9800 5550 2    50   Output ~ 0
XSEL-OUT
Text HLabel 10200 8050 2    50   Output ~ 0
XS-OUT[0..2]
Text HLabel 12700 1600 2    50   Output ~ 0
CB-OUT[0..4]
Text HLabel 12750 2550 2    50   Output ~ 0
CDEN-OUT
Text HLabel 13000 2150 2    50   Output ~ 0
CPC-OUT[0..1]
$Comp
L power:VCC #PWR?
U 1 1 5FBCC941
P 6300 5350
AR Path="/647995D9/5FBCC941" Ref="#PWR?"  Part="1" 
AR Path="/5FBBD4DB/5FBBDBE7/5FBCC941" Ref="#PWR0116"  Part="1" 
F 0 "#PWR0116" H 6300 5200 50  0001 C CNN
F 1 "VCC" H 6315 5523 50  0000 C CNN
F 2 "" H 6300 5350 50  0001 C CNN
F 3 "" H 6300 5350 50  0001 C CNN
	1    6300 5350
	1    0    0    -1  
$EndComp
$Comp
L power:VCC #PWR?
U 1 1 62CF85E9
P 9500 5950
AR Path="/60BA673A/62CF85E9" Ref="#PWR?"  Part="1" 
AR Path="/647995D9/62CF85E9" Ref="#PWR?"  Part="1" 
AR Path="/5FBBD4DB/5FBBDBE7/62CF85E9" Ref="#PWR0117"  Part="1" 
F 0 "#PWR0117" H 9500 5800 50  0001 C CNN
F 1 "VCC" H 9515 6123 50  0000 C CNN
F 2 "" H 9500 5950 50  0001 C CNN
F 3 "" H 9500 5950 50  0001 C CNN
	1    9500 5950
	1    0    0    -1  
$EndComp
$Comp
L power:VCC #PWR?
U 1 1 5FD7D825
P 10800 1550
AR Path="/647995D9/5FD7D825" Ref="#PWR?"  Part="1" 
AR Path="/5FBBD4DB/5FBBDBE7/5FD7D825" Ref="#PWR0118"  Part="1" 
F 0 "#PWR0118" H 10800 1400 50  0001 C CNN
F 1 "VCC" H 10815 1723 50  0000 C CNN
F 2 "" H 10800 1550 50  0001 C CNN
F 3 "" H 10800 1550 50  0001 C CNN
	1    10800 1550
	1    0    0    -1  
$EndComp
$Comp
L A5C:NAND02 UAN?
U 1 1 60889F24
P 8350 8750
AR Path="/60BA673A/60889F24" Ref="UAN?"  Part="1" 
AR Path="/647995D9/60889F24" Ref="UAN81"  Part="1" 
AR Path="/5FBBD4DB/5FBBDBE7/60889F24" Ref="UAN81"  Part="1" 
F 0 "UAN81" H 8375 9017 50  0000 C CNN
F 1 "NAND02" H 8375 8926 50  0000 C CNN
F 2 "" H 8350 8750 50  0001 C CNN
F 3 "" H 8350 8750 50  0001 C CNN
	1    8350 8750
	1    0    0    -1  
$EndComp
$Comp
L A5C:INV01 UAS126
U 1 1 5FA05800
P 4500 3800
AR Path="/647995D9/5FA05800" Ref="UAS126"  Part="1" 
AR Path="/5FBBD4DB/5FBBDBE7/5FA05800" Ref="UAS126"  Part="1" 
F 0 "UAS126" H 4500 4117 50  0000 C CNN
F 1 "INV01" H 4500 4026 50  0000 C CNN
F 2 "" H 4500 3600 50  0001 C CNN
F 3 "" H 4500 3600 50  0001 C CNN
	1    4500 3800
	1    0    0    -1  
$EndComp
$Comp
L A5C:DFFCOR UAX?
U 1 1 62CF85D7
P 9100 5650
AR Path="/60BA673A/62CF85D7" Ref="UAX?"  Part="1" 
AR Path="/647995D9/62CF85D7" Ref="UAX81"  Part="1" 
AR Path="/5FBBD4DB/5FBBDBE7/62CF85D7" Ref="UAX81"  Part="1" 
F 0 "UAX81" H 9100 6015 50  0000 C CNN
F 1 "DFFCOR" H 9100 5924 50  0000 C CNN
F 2 "" H 9100 5650 50  0001 C CNN
F 3 "" H 9100 5650 50  0001 C CNN
	1    9100 5650
	1    0    0    -1  
$EndComp
$Comp
L A5C:DFFCOR UAX?
U 1 1 62CF85C5
P 9100 6400
AR Path="/60BA673A/62CF85C5" Ref="UAX?"  Part="1" 
AR Path="/647995D9/62CF85C5" Ref="UAX85"  Part="1" 
AR Path="/5FBBD4DB/5FBBDBE7/62CF85C5" Ref="UAX85"  Part="1" 
F 0 "UAX85" H 9100 6765 50  0000 C CNN
F 1 "DFFCOR" H 9100 6674 50  0000 C CNN
F 2 "" H 9100 6400 50  0001 C CNN
F 3 "" H 9100 6400 50  0001 C CNN
F 4 "UAX79;UAX99" H 9100 6400 50  0001 C CNN "MiscRef"
	1    9100 6400
	1    0    0    -1  
$EndComp
$Comp
L A5C:DFFCOR UAX?
U 1 1 62CF85CB
P 9100 7150
AR Path="/60BA673A/62CF85CB" Ref="UAX?"  Part="1" 
AR Path="/647995D9/62CF85CB" Ref="UAX90"  Part="1" 
AR Path="/5FBBD4DB/5FBBDBE7/62CF85CB" Ref="UAX90"  Part="1" 
F 0 "UAX90" H 9100 7515 50  0000 C CNN
F 1 "DFFCOR" H 9100 7424 50  0000 C CNN
F 2 "" H 9100 7150 50  0001 C CNN
F 3 "" H 9100 7150 50  0001 C CNN
	1    9100 7150
	1    0    0    -1  
$EndComp
$Comp
L A5C:DFFCOR UAX?
U 1 1 62CF85D1
P 9100 7900
AR Path="/60BA673A/62CF85D1" Ref="UAX?"  Part="1" 
AR Path="/647995D9/62CF85D1" Ref="UAX94"  Part="1" 
AR Path="/5FBBD4DB/5FBBDBE7/62CF85D1" Ref="UAX94"  Part="1" 
F 0 "UAX94" H 9100 8265 50  0000 C CNN
F 1 "DFFCOR" H 9100 8174 50  0000 C CNN
F 2 "" H 9100 7900 50  0001 C CNN
F 3 "" H 9100 7900 50  0001 C CNN
	1    9100 7900
	1    0    0    -1  
$EndComp
$Comp
L A5C:M273CG UAO79
U 1 1 5FA0204E
P 6850 2350
AR Path="/647995D9/5FA0204E" Ref="UAO79"  Part="1" 
AR Path="/5FBBD4DB/5FBBDBE7/5FA0204E" Ref="UAO79"  Part="1" 
F 0 "UAO79" H 6850 3117 50  0000 C CNN
F 1 "M273CG" H 6850 3026 50  0000 C CNN
F 2 "" H 6850 2350 50  0001 C CNN
F 3 "" H 6850 2350 50  0001 C CNN
	1    6850 2350
	1    0    0    -1  
$EndComp
$Comp
L A5C:M273CG UAP79
U 1 1 5FA025C7
P 6850 4000
AR Path="/647995D9/5FA025C7" Ref="UAP79"  Part="1" 
AR Path="/5FBBD4DB/5FBBDBE7/5FA025C7" Ref="UAP79"  Part="1" 
F 0 "UAP79" H 6850 4767 50  0000 C CNN
F 1 "M273CG" H 6850 4676 50  0000 C CNN
F 2 "" H 6850 4000 50  0001 C CNN
F 3 "" H 6850 4000 50  0001 C CNN
	1    6850 4000
	1    0    0    -1  
$EndComp
$Comp
L A5C:M273CG UAQ79
U 1 1 5FA490AA
P 6900 5850
AR Path="/647995D9/5FA490AA" Ref="UAQ79"  Part="1" 
AR Path="/5FBBD4DB/5FBBDBE7/5FA490AA" Ref="UAQ79"  Part="1" 
F 0 "UAQ79" H 6900 6617 50  0000 C CNN
F 1 "M273CG" H 6900 6526 50  0000 C CNN
F 2 "" H 6900 5850 50  0001 C CNN
F 3 "" H 6900 5850 50  0001 C CNN
	1    6900 5850
	1    0    0    -1  
$EndComp
$Comp
L A5C:M273CG UAR79
U 1 1 5FA490B0
P 6900 7500
AR Path="/647995D9/5FA490B0" Ref="UAR79"  Part="1" 
AR Path="/5FBBD4DB/5FBBDBE7/5FA490B0" Ref="UAR79"  Part="1" 
F 0 "UAR79" H 6900 8267 50  0000 C CNN
F 1 "M273CG" H 6900 8176 50  0000 C CNN
F 2 "" H 6900 7500 50  0001 C CNN
F 3 "" H 6900 7500 50  0001 C CNN
	1    6900 7500
	1    0    0    -1  
$EndComp
$Comp
L A5C:M273C UAS79
U 1 1 5FD7D7E1
P 9750 2350
AR Path="/647995D9/5FD7D7E1" Ref="UAS79"  Part="1" 
AR Path="/5FBBD4DB/5FBBDBE7/5FD7D7E1" Ref="UAS79"  Part="1" 
F 0 "UAS79" H 9750 3117 50  0000 C CNN
F 1 "M273C" H 9750 3026 50  0000 C CNN
F 2 "" H 9750 2350 50  0001 C CNN
F 3 "" H 9750 2350 50  0001 C CNN
	1    9750 2350
	1    0    0    -1  
$EndComp
$Comp
L A5C:M273C UAT79
U 1 1 5FD7D7E7
P 11400 2050
AR Path="/647995D9/5FD7D7E7" Ref="UAT79"  Part="1" 
AR Path="/5FBBD4DB/5FBBDBE7/5FD7D7E7" Ref="UAT79"  Part="1" 
F 0 "UAT79" H 11400 1283 50  0000 C CNN
F 1 "M273C" H 11400 1374 50  0000 C CNN
F 2 "" H 11400 2050 50  0001 C CNN
F 3 "" H 11400 2050 50  0001 C CNN
	1    11400 2050
	1    0    0    1   
$EndComp
NoConn ~ 9350 5650
NoConn ~ 9350 6400
NoConn ~ 9350 7150
NoConn ~ 9350 7900
Wire Bus Line
	4600 2150 4600 2350
Wire Bus Line
	12850 2150 12850 2350
Wire Bus Line
	4900 5750 4900 6050
Wire Bus Line
	10100 6400 10100 8050
Wire Bus Line
	4850 1600 4850 2150
Wire Bus Line
	12600 1600 12600 2150
$EndSCHEMATC
