EESchema Schematic File Version 4
EELAYER 30 0
EELAYER END
$Descr A4 11693 8268
encoding utf-8
Sheet 27 83
Title "CPS Reverse Engineering: DL-0311"
Date "2021-09-12"
Rev ""
Comp ""
Comment1 ""
Comment2 ""
Comment3 "Licence: CC-BY"
Comment4 "Author: Loïc *WydD* Petit"
$EndDescr
Connection ~ 3400 4300
Connection ~ 3400 3850
Connection ~ 3400 3400
Connection ~ 3400 4750
Connection ~ 6250 4900
Connection ~ 4800 4900
Connection ~ 4800 5100
NoConn ~ 5500 4800
NoConn ~ 6950 4800
Entry Wire Line
	2500 2750 2600 2850
Entry Wire Line
	2500 3200 2600 3300
Entry Wire Line
	2500 3650 2600 3750
Entry Wire Line
	2500 4100 2600 4200
Entry Wire Line
	2500 4550 2600 4650
Entry Wire Line
	8900 2700 9000 2800
Entry Wire Line
	8900 3200 9000 3300
Entry Wire Line
	8900 3700 9000 3800
Entry Wire Line
	8900 4200 9000 4300
Entry Wire Line
	8900 4700 9000 4800
Wire Wire Line
	3100 4750 3400 4750
Wire Wire Line
	3400 2950 3500 2950
Wire Wire Line
	3400 3400 3400 2950
Wire Wire Line
	3400 3850 3400 3400
Wire Wire Line
	3400 4300 3400 3850
Wire Wire Line
	3400 4750 3400 4300
Wire Wire Line
	3400 4750 3500 4750
Wire Wire Line
	3500 3400 3400 3400
Wire Wire Line
	3500 3850 3400 3850
Wire Wire Line
	3500 4300 3400 4300
Wire Wire Line
	4050 3350 4250 3350
Wire Wire Line
	4050 4250 4250 4250
Wire Wire Line
	4050 4700 5000 4700
Wire Wire Line
	4250 3350 4250 3700
Wire Wire Line
	4250 3700 4900 3700
Wire Wire Line
	4250 3900 4900 3900
Wire Wire Line
	4250 4250 4250 3900
Wire Wire Line
	4350 2900 4050 2900
Wire Wire Line
	4350 3600 4350 2900
Wire Wire Line
	4450 4200 4900 4200
Wire Wire Line
	4800 4100 4800 4900
Wire Wire Line
	4800 4900 5000 4900
Wire Wire Line
	4800 5100 4700 5100
Wire Wire Line
	4800 5100 4800 4900
Wire Wire Line
	4900 3600 4350 3600
Wire Wire Line
	4900 3800 4050 3800
Wire Wire Line
	4900 4100 4800 4100
Wire Wire Line
	5500 4700 6450 4700
Wire Wire Line
	5900 4200 6350 4200
Wire Wire Line
	6250 4100 6250 4900
Wire Wire Line
	6250 4900 6250 5100
Wire Wire Line
	6250 4900 6450 4900
Wire Wire Line
	6250 5100 4800 5100
Wire Wire Line
	6350 3600 5700 3600
Wire Wire Line
	6350 3700 5700 3700
Wire Wire Line
	6350 3800 5700 3800
Wire Wire Line
	6350 3900 5700 3900
Wire Wire Line
	6350 4100 6250 4100
Wire Wire Line
	6950 4700 7850 4700
Wire Wire Line
	7150 3700 7350 3700
Wire Wire Line
	7150 3900 7450 3900
Wire Wire Line
	7250 2700 7250 3600
Wire Wire Line
	7250 3600 7150 3600
Wire Wire Line
	7350 3200 7850 3200
Wire Wire Line
	7350 3700 7350 3200
Wire Wire Line
	7450 3700 7450 3800
Wire Wire Line
	7450 3800 7150 3800
Wire Wire Line
	7450 3900 7450 4200
Wire Wire Line
	7450 4200 7850 4200
Wire Wire Line
	7850 2700 7250 2700
Wire Wire Line
	7850 3700 7450 3700
Wire Wire Line
	8450 2700 8900 2700
Wire Wire Line
	8450 3200 8900 3200
Wire Wire Line
	8450 3700 8900 3700
Wire Wire Line
	8450 4200 8900 4200
Wire Wire Line
	8450 4700 8900 4700
Wire Bus Line
	2500 2600 2400 2600
Wire Bus Line
	9000 4900 9150 4900
Text Notes 2800 3900 0    50   ~ 0
XS-BUS[4..0]
Text Label 8500 2700 0    50   ~ 0
XS-OUT4
Text Label 8500 3200 0    50   ~ 0
XS-OUT3
Text Label 8500 3700 0    50   ~ 0
XS-OUT2
Text Label 8500 4200 0    50   ~ 0
XS-OUT1
Text Label 8500 4700 0    50   ~ 0
XS-OUT0
Text HLabel 2400 2600 0    50   Input ~ 0
XS[0..4]
Text HLabel 3100 4750 0    50   Input ~ 0
~FLIP
Text HLabel 4700 5100 0    50   Input ~ 0
~CLK4M
Text HLabel 9150 4900 2    50   Output ~ 0
XS-OUT[0..4]
$Comp
L power:VCC #PWR0136
U 1 1 76CCBDD7
P 4450 4200
F 0 "#PWR0136" H 4450 4050 50  0001 C CNN
F 1 "VCC" H 4465 4373 50  0000 C CNN
F 2 "" H 4450 4200 50  0001 C CNN
F 3 "" H 4450 4200 50  0001 C CNN
	1    4450 4200
	1    0    0    -1  
$EndComp
$Comp
L power:VCC #PWR0137
U 1 1 771953C4
P 5900 4200
F 0 "#PWR0137" H 5900 4050 50  0001 C CNN
F 1 "VCC" H 5915 4373 50  0000 C CNN
F 2 "" H 5900 4200 50  0001 C CNN
F 3 "" H 5900 4200 50  0001 C CNN
	1    5900 4200
	1    0    0    -1  
$EndComp
$Comp
L A5C:XNOR02 UEI41
U 1 1 6320AEAC
P 3750 2900
AR Path="/611B344C/6320AEAC" Ref="UEI41"  Part="1" 
AR Path="/612D3239/612D3CB0/6320AEAC" Ref="UEI41"  Part="1" 
F 0 "UEI41" H 3775 3167 50  0000 C CNN
F 1 "XNOR02" H 3775 3076 50  0000 C CNN
F 2 "" H 3775 2900 50  0001 C CNN
F 3 "" H 3775 2900 50  0001 C CNN
	1    3750 2900
	1    0    0    -1  
$EndComp
$Comp
L A5C:XNOR02 UEG46
U 1 1 636132BA
P 3750 3350
AR Path="/611B344C/636132BA" Ref="UEG46"  Part="1" 
AR Path="/612D3239/612D3CB0/636132BA" Ref="UEG46"  Part="1" 
F 0 "UEG46" H 3775 3617 50  0000 C CNN
F 1 "XNOR02" H 3775 3526 50  0000 C CNN
F 2 "" H 3775 3350 50  0001 C CNN
F 3 "" H 3775 3350 50  0001 C CNN
	1    3750 3350
	1    0    0    -1  
$EndComp
$Comp
L A5C:XNOR02 UEG68
U 1 1 78990085
P 3750 3800
AR Path="/611B344C/78990085" Ref="UEG68"  Part="1" 
AR Path="/612D3239/612D3CB0/78990085" Ref="UEG68"  Part="1" 
F 0 "UEG68" H 3775 4067 50  0000 C CNN
F 1 "XNOR02" H 3775 3976 50  0000 C CNN
F 2 "" H 3775 3800 50  0001 C CNN
F 3 "" H 3775 3800 50  0001 C CNN
	1    3750 3800
	1    0    0    -1  
$EndComp
$Comp
L A5C:XNOR02 UEG61
U 1 1 615E31E5
P 3750 4250
AR Path="/611B344C/615E31E5" Ref="UEG61"  Part="1" 
AR Path="/612D3239/612D3CB0/615E31E5" Ref="UEG61"  Part="1" 
F 0 "UEG61" H 3775 4517 50  0000 C CNN
F 1 "XNOR02" H 3775 4426 50  0000 C CNN
F 2 "" H 3775 4250 50  0001 C CNN
F 3 "" H 3775 4250 50  0001 C CNN
	1    3750 4250
	1    0    0    -1  
$EndComp
$Comp
L A5C:XNOR02 UEG74
U 1 1 78BFA851
P 3750 4700
AR Path="/611B344C/78BFA851" Ref="UEG74"  Part="1" 
AR Path="/612D3239/612D3CB0/78BFA851" Ref="UEG74"  Part="1" 
F 0 "UEG74" H 3775 4967 50  0000 C CNN
F 1 "XNOR02" H 3775 4876 50  0000 C CNN
F 2 "" H 3775 4700 50  0001 C CNN
F 3 "" H 3775 4700 50  0001 C CNN
	1    3750 4700
	1    0    0    -1  
$EndComp
$Comp
L A5C:BUF12 UEI65
U 1 1 662FEF49
P 8150 2700
AR Path="/611B344C/662FEF49" Ref="UEI65"  Part="1" 
AR Path="/612D3239/612D3CB0/662FEF49" Ref="UEI65"  Part="1" 
F 0 "UEI65" H 8150 3017 50  0000 C CNN
F 1 "BUF12" H 8150 2926 50  0000 C CNN
F 2 "" H 8150 2700 50  0001 C CNN
F 3 "" H 8150 2700 50  0001 C CNN
	1    8150 2700
	1    0    0    -1  
$EndComp
$Comp
L A5C:BUF12 UEJ38
U 1 1 662FEF43
P 8150 3200
AR Path="/611B344C/662FEF43" Ref="UEJ38"  Part="1" 
AR Path="/612D3239/612D3CB0/662FEF43" Ref="UEJ38"  Part="1" 
F 0 "UEJ38" H 8150 3517 50  0000 C CNN
F 1 "BUF12" H 8150 3426 50  0000 C CNN
F 2 "" H 8150 3200 50  0001 C CNN
F 3 "" H 8150 3200 50  0001 C CNN
	1    8150 3200
	1    0    0    -1  
$EndComp
$Comp
L A5C:BUF12 UEH66
U 1 1 662FEF3D
P 8150 3700
AR Path="/611B344C/662FEF3D" Ref="UEH66"  Part="1" 
AR Path="/612D3239/612D3CB0/662FEF3D" Ref="UEH66"  Part="1" 
F 0 "UEH66" H 8150 4017 50  0000 C CNN
F 1 "BUF12" H 8150 3926 50  0000 C CNN
F 2 "" H 8150 3700 50  0001 C CNN
F 3 "" H 8150 3700 50  0001 C CNN
	1    8150 3700
	1    0    0    -1  
$EndComp
$Comp
L A5C:BUF12 UEG71
U 1 1 662FEF37
P 8150 4200
AR Path="/611B344C/662FEF37" Ref="UEG71"  Part="1" 
AR Path="/612D3239/612D3CB0/662FEF37" Ref="UEG71"  Part="1" 
F 0 "UEG71" H 8150 4517 50  0000 C CNN
F 1 "BUF12" H 8150 4426 50  0000 C CNN
F 2 "" H 8150 4200 50  0001 C CNN
F 3 "" H 8150 4200 50  0001 C CNN
	1    8150 4200
	1    0    0    -1  
$EndComp
$Comp
L A5C:BUF12 UED72
U 1 1 662FEF31
P 8150 4700
AR Path="/611B344C/662FEF31" Ref="UED72"  Part="1" 
AR Path="/612D3239/612D3CB0/662FEF31" Ref="UED72"  Part="1" 
F 0 "UED72" H 8150 5017 50  0000 C CNN
F 1 "BUF12" H 8150 4926 50  0000 C CNN
F 2 "" H 8150 4700 50  0001 C CNN
F 3 "" H 8150 4700 50  0001 C CNN
	1    8150 4700
	1    0    0    -1  
$EndComp
$Comp
L A5C:DFFCOO UEG77
U 1 1 7825F385
P 5250 4800
AR Path="/611B344C/7825F385" Ref="UEG77"  Part="1" 
AR Path="/612D3239/612D3CB0/7825F385" Ref="UEG77"  Part="1" 
F 0 "UEG77" H 5250 5165 50  0000 C CNN
F 1 "DFFCOO" H 5250 5074 50  0000 C CNN
F 2 "" H 5250 4800 50  0001 C CNN
F 3 "" H 5250 4800 50  0001 C CNN
	1    5250 4800
	1    0    0    -1  
$EndComp
$Comp
L A5C:DFFCOO UED85
U 1 1 77D8C768
P 6700 4800
AR Path="/611B344C/77D8C768" Ref="UED85"  Part="1" 
AR Path="/612D3239/612D3CB0/77D8C768" Ref="UED85"  Part="1" 
F 0 "UED85" H 6700 5165 50  0000 C CNN
F 1 "DFFCOO" H 6700 5074 50  0000 C CNN
F 2 "" H 6700 4800 50  0001 C CNN
F 3 "" H 6700 4800 50  0001 C CNN
	1    6700 4800
	1    0    0    -1  
$EndComp
$Comp
L A5C:M175C UEC40
U 1 1 76CCA6F0
P 5300 3900
AR Path="/611B344C/76CCA6F0" Ref="UEC40"  Part="1" 
AR Path="/612D3239/612D3CB0/76CCA6F0" Ref="UEC40"  Part="1" 
F 0 "UEC40" H 5300 4465 50  0000 C CNN
F 1 "M175C" H 5300 4374 50  0000 C CNN
F 2 "" H 5300 3700 50  0001 C CNN
F 3 "" H 5300 3700 50  0001 C CNN
	1    5300 3900
	1    0    0    -1  
$EndComp
$Comp
L A5C:M175C UEB42
U 1 1 76F31DB0
P 6750 3900
AR Path="/611B344C/76F31DB0" Ref="UEB42"  Part="1" 
AR Path="/612D3239/612D3CB0/76F31DB0" Ref="UEB42"  Part="1" 
F 0 "UEB42" H 6750 4465 50  0000 C CNN
F 1 "M175C" H 6750 4374 50  0000 C CNN
F 2 "" H 6750 3700 50  0001 C CNN
F 3 "" H 6750 3700 50  0001 C CNN
	1    6750 3900
	1    0    0    -1  
$EndComp
Wire Bus Line
	9000 2800 9000 4900
Wire Bus Line
	2500 2600 2500 4550
Text Label 2650 4650 0    50   ~ 0
XS0
Text Label 2650 4200 0    50   ~ 0
XS1
Text Label 2650 3750 0    50   ~ 0
XS2
Text Label 2650 3300 0    50   ~ 0
XS3
Text Label 2650 2850 0    50   ~ 0
XS4
Wire Wire Line
	3500 4650 2600 4650
Wire Wire Line
	3500 4200 2600 4200
Wire Wire Line
	3500 3750 2600 3750
Wire Wire Line
	3500 3300 2600 3300
Wire Wire Line
	3500 2850 2600 2850
$EndSCHEMATC
