EESchema Schematic File Version 4
EELAYER 30 0
EELAYER END
$Descr A4 11693 8268
encoding utf-8
Sheet 1 6
Title "DL-2027"
Date "2020-04-28"
Rev ""
Comp ""
Comment1 ""
Comment2 "Licence: CC-BY"
Comment3 "Author: Loic *WydD* Petit"
Comment4 "Project: CPS2 Reverse Engineering: DL-2027"
$EndDescr
$Sheet
S 9450 1200 1050 3600
U 5EA83AA7
F0 "bus-output" 50
F1 "bus-output.sch" 50
F2 "DATA[0..31]" I L 9450 2800 50 
F3 "OUT23" O R 10500 3650 50 
F4 "OUT22" O R 10500 3550 50 
F5 "OUT21" O R 10500 3450 50 
F6 "OUT20" O R 10500 3350 50 
F7 "OUT19" O R 10500 3250 50 
F8 "OUT18" O R 10500 3150 50 
F9 "OUT17" O R 10500 3050 50 
F10 "OUT16" O R 10500 2950 50 
F11 "OUT0" O R 10500 1350 50 
F12 "OUT1" O R 10500 1450 50 
F13 "OUT2" O R 10500 1550 50 
F14 "OUT3" O R 10500 1650 50 
F15 "OUT4" O R 10500 1750 50 
F16 "OUT5" O R 10500 1850 50 
F17 "OUT6" O R 10500 1950 50 
F18 "OUT7" O R 10500 2050 50 
F19 "OUT8" O R 10500 2150 50 
F20 "OUT9" O R 10500 2250 50 
F21 "OUT10" O R 10500 2350 50 
F22 "OUT11" O R 10500 2450 50 
F23 "OUT12" O R 10500 2550 50 
F24 "OUT13" O R 10500 2650 50 
F25 "OUT14" O R 10500 2750 50 
F26 "OUT15" O R 10500 2850 50 
F27 "OUT24" O R 10500 3750 50 
F28 "OUT25" O R 10500 3850 50 
F29 "OUT26" O R 10500 3950 50 
F30 "OUT27" O R 10500 4050 50 
F31 "OUT28" O R 10500 4150 50 
F32 "OUT29" O R 10500 4250 50 
F33 "OUT30" O R 10500 4350 50 
F34 "OUT31" O R 10500 4450 50 
F35 "ENABLE" I L 9450 4650 50 
$EndSheet
$Sheet
S 1550 5350 1000 800 
U 5EA8E75D
F0 "misc-input" 50
F1 "misc-input.sch" 50
F2 "OUT-ENABLE" O R 2550 6000 50 
F3 "~ENABLE-B-IN" O R 2550 5600 50 
F4 "~ENABLE-A-IN" O R 2550 5500 50 
F5 "SB" O R 2550 5850 50 
F6 "SA" O R 2550 5750 50 
F7 "~G3" I L 1550 5700 50 
F8 "G1" I L 1550 5500 50 
F9 "~G2" I L 1550 5600 50 
F10 "ENABLE" I L 1550 6000 50 
F11 "A~B" I L 1550 5850 50 
$EndSheet
Text GLabel 4800 1350 0    50   Input ~ 0
2
Text GLabel 4800 1450 0    50   Input ~ 0
3
Text GLabel 4800 1550 0    50   Input ~ 0
4
Text GLabel 4800 1650 0    50   Input ~ 0
5
Text GLabel 4800 1750 0    50   Input ~ 0
6
Text GLabel 4800 1850 0    50   Input ~ 0
7
Text GLabel 4800 1950 0    50   Input ~ 0
8
Text GLabel 4800 2050 0    50   Input ~ 0
9
Text GLabel 4800 2150 0    50   Input ~ 0
10
Text GLabel 4800 2250 0    50   Input ~ 0
12
Text GLabel 4800 2350 0    50   Input ~ 0
13
Text GLabel 4800 2450 0    50   Input ~ 0
14
Text GLabel 4800 2550 0    50   Input ~ 0
15
Text GLabel 4800 2650 0    50   Input ~ 0
17
Text GLabel 4800 2750 0    50   Input ~ 0
18
Text GLabel 4800 2850 0    50   Input ~ 0
19
Text GLabel 4800 2950 0    50   Input ~ 0
20
Text GLabel 4800 3050 0    50   Input ~ 0
22
Text GLabel 4800 3150 0    50   Input ~ 0
23
Text GLabel 4800 3250 0    50   Input ~ 0
24
Text GLabel 4800 3350 0    50   Input ~ 0
25
Text GLabel 4800 3450 0    50   Input ~ 0
26
Text GLabel 4800 3550 0    50   Input ~ 0
27
Text GLabel 4800 3650 0    50   Input ~ 0
28
Text GLabel 4800 3750 0    50   Input ~ 0
29
Text GLabel 4800 3850 0    50   Input ~ 0
30
Text GLabel 4800 3950 0    50   Input ~ 0
32
Text GLabel 4800 4050 0    50   Input ~ 0
33
Text GLabel 4800 4150 0    50   Input ~ 0
34
Text GLabel 4800 4250 0    50   Input ~ 0
35
Text GLabel 4800 4350 0    50   Input ~ 0
36
Text GLabel 4800 4450 0    50   Input ~ 0
37
Wire Wire Line
	4800 1350 4900 1350
Wire Wire Line
	4800 1450 4900 1450
Wire Wire Line
	4800 1550 4900 1550
Wire Wire Line
	4800 1650 4900 1650
Wire Wire Line
	4800 1750 4900 1750
Wire Wire Line
	4800 1850 4900 1850
Wire Wire Line
	4800 1950 4900 1950
Wire Wire Line
	4800 2050 4900 2050
Wire Wire Line
	4800 2150 4900 2150
Wire Wire Line
	4800 2250 4900 2250
Wire Wire Line
	4800 2350 4900 2350
Wire Wire Line
	4800 2450 4900 2450
Wire Wire Line
	4800 2550 4900 2550
Wire Wire Line
	4800 2650 4900 2650
Wire Wire Line
	4800 2750 4900 2750
Wire Wire Line
	4800 2850 4900 2850
Wire Wire Line
	4800 2950 4900 2950
Wire Wire Line
	4800 3050 4900 3050
Wire Wire Line
	4800 3150 4900 3150
Wire Wire Line
	4800 3250 4900 3250
Wire Wire Line
	4800 3350 4900 3350
Wire Wire Line
	4800 3450 4900 3450
Wire Wire Line
	4800 3550 4900 3550
Wire Wire Line
	4800 3650 4900 3650
Wire Wire Line
	4800 3750 4900 3750
Wire Wire Line
	4800 3850 4900 3850
Wire Wire Line
	4800 3950 4900 3950
Wire Wire Line
	4800 4050 4900 4050
Wire Wire Line
	4800 4150 4900 4150
Wire Wire Line
	4800 4250 4900 4250
Wire Wire Line
	4800 4350 4900 4350
Wire Wire Line
	4800 4450 4900 4450
Text GLabel 2900 4450 0    50   Input ~ 0
77
Text GLabel 2900 4350 0    50   Input ~ 0
78
Text GLabel 2900 4250 0    50   Input ~ 0
79
Text GLabel 2900 4150 0    50   Input ~ 0
80
Text GLabel 2900 4050 0    50   Input ~ 0
82
Text GLabel 2900 3950 0    50   Input ~ 0
83
Text GLabel 2900 3850 0    50   Input ~ 0
84
Text GLabel 2900 3750 0    50   Input ~ 0
85
Text GLabel 2900 3650 0    50   Input ~ 0
86
Text GLabel 2900 3550 0    50   Input ~ 0
87
Text GLabel 2900 3450 0    50   Input ~ 0
88
Text GLabel 2900 3350 0    50   Input ~ 0
89
Text GLabel 2900 3250 0    50   Input ~ 0
90
Text GLabel 2900 3150 0    50   Input ~ 0
92
Text GLabel 2900 3050 0    50   Input ~ 0
93
Text GLabel 2900 2950 0    50   Input ~ 0
94
Text GLabel 2900 2850 0    50   Input ~ 0
95
Text GLabel 2900 2750 0    50   Input ~ 0
96
Text GLabel 2900 2650 0    50   Input ~ 0
97
Text GLabel 2900 2550 0    50   Input ~ 0
98
Text GLabel 2900 2450 0    50   Input ~ 0
99
Text GLabel 2900 2350 0    50   Input ~ 0
100
Text GLabel 2900 2250 0    50   Input ~ 0
102
Text GLabel 2900 2150 0    50   Input ~ 0
103
Text GLabel 2900 2050 0    50   Input ~ 0
104
Text GLabel 2900 1950 0    50   Input ~ 0
105
Text GLabel 2900 1850 0    50   Input ~ 0
107
Text GLabel 2900 1750 0    50   Input ~ 0
108
Text GLabel 2900 1650 0    50   Input ~ 0
109
Text GLabel 2900 1550 0    50   Input ~ 0
110
Text GLabel 2900 1450 0    50   Input ~ 0
112
Text GLabel 2900 1350 0    50   Input ~ 0
113
Wire Wire Line
	2900 1350 3000 1350
Wire Wire Line
	2900 1450 3000 1450
Wire Wire Line
	2900 1550 3000 1550
Wire Wire Line
	2900 1650 3000 1650
Wire Wire Line
	2900 1750 3000 1750
Wire Wire Line
	2900 1850 3000 1850
Wire Wire Line
	2900 1950 3000 1950
Wire Wire Line
	2900 2050 3000 2050
Wire Wire Line
	2900 2150 3000 2150
Wire Wire Line
	2900 2250 3000 2250
Wire Wire Line
	2900 2350 3000 2350
Wire Wire Line
	2900 2450 3000 2450
Wire Wire Line
	2900 2550 3000 2550
Wire Wire Line
	2900 2650 3000 2650
Wire Wire Line
	2900 2750 3000 2750
Wire Wire Line
	2900 2850 3000 2850
Wire Wire Line
	2900 2950 3000 2950
Wire Wire Line
	2900 3050 3000 3050
Wire Wire Line
	2900 3150 3000 3150
Wire Wire Line
	2900 3250 3000 3250
Wire Wire Line
	2900 3350 3000 3350
Wire Wire Line
	2900 3450 3000 3450
Wire Wire Line
	2900 3550 3000 3550
Wire Wire Line
	2900 3650 3000 3650
Wire Wire Line
	2900 3750 3000 3750
Wire Wire Line
	2900 3850 3000 3850
Wire Wire Line
	2900 3950 3000 3950
Wire Wire Line
	2900 4050 3000 4050
Wire Wire Line
	2900 4150 3000 4150
Wire Wire Line
	2900 4250 3000 4250
Wire Wire Line
	2900 4350 3000 4350
Wire Wire Line
	2900 4450 3000 4450
Text GLabel 10600 1350 2    50   3State ~ 0
38
Text GLabel 10600 1450 2    50   3State ~ 0
39
Text GLabel 10600 1550 2    50   3State ~ 0
40
Text GLabel 10600 1650 2    50   3State ~ 0
42
Text GLabel 10600 1750 2    50   3State ~ 0
43
Text GLabel 10600 1850 2    50   3State ~ 0
44
Text GLabel 10600 1950 2    50   3State ~ 0
45
Text GLabel 10600 2050 2    50   3State ~ 0
47
Text GLabel 10600 2150 2    50   3State ~ 0
48
Text GLabel 10600 2250 2    50   3State ~ 0
49
Text GLabel 10600 2350 2    50   3State ~ 0
50
Text GLabel 10600 2450 2    50   3State ~ 0
52
Text GLabel 10600 2550 2    50   3State ~ 0
53
Text GLabel 10600 2650 2    50   3State ~ 0
54
Text GLabel 10600 2750 2    50   3State ~ 0
55
Text GLabel 10600 2850 2    50   3State ~ 0
56
Text GLabel 10600 2950 2    50   3State ~ 0
57
Text GLabel 10600 3050 2    50   3State ~ 0
58
Text GLabel 10600 3150 2    50   3State ~ 0
59
Text GLabel 10600 3250 2    50   3State ~ 0
62
Text GLabel 10600 3350 2    50   3State ~ 0
63
Text GLabel 10600 3450 2    50   3State ~ 0
64
Text GLabel 10600 3550 2    50   3State ~ 0
65
Text GLabel 10600 3650 2    50   3State ~ 0
66
Text GLabel 10600 3750 2    50   3State ~ 0
67
Text GLabel 10600 3850 2    50   3State ~ 0
68
Text GLabel 10600 3950 2    50   3State ~ 0
69
Text GLabel 10600 4050 2    50   3State ~ 0
70
Text GLabel 10600 4150 2    50   3State ~ 0
72
Text GLabel 10600 4250 2    50   3State ~ 0
73
Text GLabel 10600 4350 2    50   3State ~ 0
74
Text GLabel 10600 4450 2    50   3State ~ 0
75
Wire Wire Line
	10500 1350 10600 1350
Wire Wire Line
	10500 1450 10600 1450
Wire Wire Line
	10500 1550 10600 1550
Wire Wire Line
	10500 1650 10600 1650
Wire Wire Line
	10500 1750 10600 1750
Wire Wire Line
	10500 1850 10600 1850
Wire Wire Line
	10500 1950 10600 1950
Wire Wire Line
	10500 2050 10600 2050
Wire Wire Line
	10500 2150 10600 2150
Wire Wire Line
	10500 2250 10600 2250
Wire Wire Line
	10500 2350 10600 2350
Wire Wire Line
	10500 2450 10600 2450
Wire Wire Line
	10500 2550 10600 2550
Wire Wire Line
	10500 2650 10600 2650
Wire Wire Line
	10500 2750 10600 2750
Wire Wire Line
	10500 2850 10600 2850
Wire Wire Line
	10500 2950 10600 2950
Wire Wire Line
	10500 3050 10600 3050
Wire Wire Line
	10500 3150 10600 3150
Wire Wire Line
	10500 3250 10600 3250
Wire Wire Line
	10500 3350 10600 3350
Wire Wire Line
	10500 3450 10600 3450
Wire Wire Line
	10500 3550 10600 3550
Wire Wire Line
	10500 3650 10600 3650
Wire Wire Line
	10500 3750 10600 3750
Wire Wire Line
	10500 3850 10600 3850
Wire Wire Line
	10500 3950 10600 3950
Wire Wire Line
	10500 4050 10600 4050
Wire Wire Line
	10500 4150 10600 4150
Wire Wire Line
	10500 4250 10600 4250
Wire Wire Line
	10500 4350 10600 4350
Wire Wire Line
	10500 4450 10600 4450
Text Notes 1200 5650 2    50   ~ 0
~DATA-ENABLE
Text Notes 1200 5900 2    50   ~ 0
CLK2M
Text GLabel 1450 5700 0    50   Input ~ 0
114
Text GLabel 1450 6000 0    50   Input ~ 0
115
Text GLabel 1450 5600 0    50   Input ~ 0
116
Text GLabel 1450 5500 0    50   Input ~ 0
117
Text GLabel 1450 5850 0    50   Input ~ 0
119
Text Notes 1200 5550 2    50   ~ 0
HIGH
Text Notes 1200 5750 2    50   ~ 0
LOW
Text Notes 1200 6050 2    50   ~ 0
HIGH
Wire Wire Line
	1450 5500 1550 5500
Wire Wire Line
	1550 5700 1450 5700
Wire Wire Line
	1450 5600 1550 5600
Wire Wire Line
	1450 6000 1550 6000
Wire Wire Line
	1450 5850 1550 5850
Wire Bus Line
	6950 1000 6950 2700
Wire Bus Line
	5950 2900 7150 2900
$Sheet
S 7150 2500 1100 850 
U 5EF28285
F0 "data-selector" 50
F1 "data-selector.sch" 50
F2 "Q[0..31]" O R 8250 2800 50 
F3 "A[0..31]" I L 7150 2700 50 
F4 "B[0..31]" I L 7150 2900 50 
F5 "SA" I L 7150 3100 50 
F6 "SB" I L 7150 3200 50 
$EndSheet
Wire Wire Line
	9100 4650 9100 6000
Wire Bus Line
	4050 2900 4250 2900
Wire Bus Line
	4250 2900 4250 1000
Wire Wire Line
	3000 4650 2800 4650
Wire Wire Line
	2800 4650 2800 5500
Wire Wire Line
	4700 4650 4900 4650
Wire Wire Line
	4700 4650 4700 5600
Wire Wire Line
	7150 3200 7050 3200
Wire Wire Line
	7050 3200 7050 5850
Wire Wire Line
	6950 3100 7150 3100
Wire Bus Line
	6950 2700 7150 2700
Wire Bus Line
	4250 1000 6950 1000
Wire Wire Line
	9100 4650 9450 4650
Wire Bus Line
	8250 2800 9450 2800
Wire Wire Line
	6950 5750 6950 3100
$Sheet
S 3000 1200 1050 3600
U 5EA83A0E
F0 "a-bus-input" 50
F1 "a-bus-input.sch" 50
F2 "IN-A31" I L 3000 4450 50 
F3 "IN-A30" I L 3000 4350 50 
F4 "IN-A29" I L 3000 4250 50 
F5 "IN-A28" I L 3000 4150 50 
F6 "IN-A27" I L 3000 4050 50 
F7 "IN-A26" I L 3000 3950 50 
F8 "IN-A25" I L 3000 3850 50 
F9 "IN-A24" I L 3000 3750 50 
F10 "IN-A15" I L 3000 2850 50 
F11 "IN-A14" I L 3000 2750 50 
F12 "IN-A13" I L 3000 2650 50 
F13 "IN-A12" I L 3000 2550 50 
F14 "IN-A11" I L 3000 2450 50 
F15 "IN-A10" I L 3000 2350 50 
F16 "IN-A9" I L 3000 2250 50 
F17 "IN-A8" I L 3000 2150 50 
F18 "IN-A7" I L 3000 2050 50 
F19 "IN-A6" I L 3000 1950 50 
F20 "IN-A5" I L 3000 1850 50 
F21 "IN-A4" I L 3000 1750 50 
F22 "IN-A3" I L 3000 1650 50 
F23 "IN-A2" I L 3000 1550 50 
F24 "IN-A1" I L 3000 1450 50 
F25 "IN-A0" I L 3000 1350 50 
F26 "IN-A16" I L 3000 2950 50 
F27 "IN-A17" I L 3000 3050 50 
F28 "IN-A18" I L 3000 3150 50 
F29 "IN-A19" I L 3000 3250 50 
F30 "IN-A20" I L 3000 3350 50 
F31 "IN-A21" I L 3000 3450 50 
F32 "IN-A22" I L 3000 3550 50 
F33 "IN-A23" I L 3000 3650 50 
F34 "~ENABLE" I L 3000 4650 50 
F35 "A[0..31]" O R 4050 2900 50 
$EndSheet
$Sheet
S 4900 1200 1050 3600
U 5EA83975
F0 "b-bus-input" 50
F1 "b-bus-input.sch" 50
F2 "IN-B31" I L 4900 4450 50 
F3 "IN-B30" I L 4900 4350 50 
F4 "IN-B29" I L 4900 4250 50 
F5 "IN-B28" I L 4900 4150 50 
F6 "IN-B27" I L 4900 4050 50 
F7 "IN-B26" I L 4900 3950 50 
F8 "IN-B25" I L 4900 3850 50 
F9 "IN-B24" I L 4900 3750 50 
F10 "IN-B15" I L 4900 2850 50 
F11 "IN-B14" I L 4900 2750 50 
F12 "IN-B13" I L 4900 2650 50 
F13 "IN-B12" I L 4900 2550 50 
F14 "IN-B11" I L 4900 2450 50 
F15 "IN-B10" I L 4900 2350 50 
F16 "IN-B9" I L 4900 2250 50 
F17 "IN-B8" I L 4900 2150 50 
F18 "IN-B7" I L 4900 2050 50 
F19 "IN-B6" I L 4900 1950 50 
F20 "IN-B5" I L 4900 1850 50 
F21 "IN-B4" I L 4900 1750 50 
F22 "IN-B3" I L 4900 1650 50 
F23 "IN-B2" I L 4900 1550 50 
F24 "IN-B1" I L 4900 1450 50 
F25 "IN-B0" I L 4900 1350 50 
F26 "IN-B16" I L 4900 2950 50 
F27 "IN-B17" I L 4900 3050 50 
F28 "IN-B18" I L 4900 3150 50 
F29 "IN-B19" I L 4900 3250 50 
F30 "IN-B20" I L 4900 3350 50 
F31 "IN-B21" I L 4900 3450 50 
F32 "IN-B22" I L 4900 3550 50 
F33 "IN-B23" I L 4900 3650 50 
F34 "~ENABLE" I L 4900 4650 50 
F35 "B[0..31]" O R 5950 2900 50 
$EndSheet
Text GLabel 1250 3150 0    50   Input ~ 0
118
Wire Wire Line
	1250 3150 1350 3150
NoConn ~ 1350 3150
Text GLabel 1250 1550 0    50   Input ~ 0
1
Text GLabel 1250 1650 0    50   Input ~ 0
11
Text GLabel 1900 1550 0    50   Input ~ 0
16
Text GLabel 1250 1750 0    50   Input ~ 0
21
Text GLabel 1250 1850 0    50   Input ~ 0
31
Text GLabel 1250 1950 0    50   Input ~ 0
41
Text GLabel 1900 1650 0    50   Input ~ 0
46
Text GLabel 1250 2050 0    50   Input ~ 0
51
Text GLabel 1900 1750 0    50   Input ~ 0
60
Text GLabel 1250 2150 0    50   Input ~ 0
61
Text GLabel 1250 2250 0    50   Input ~ 0
71
Text GLabel 1900 1850 0    50   Input ~ 0
76
Text GLabel 1250 2350 0    50   Input ~ 0
81
Text GLabel 1250 2450 0    50   Input ~ 0
91
Text GLabel 1250 2550 0    50   Input ~ 0
101
Text GLabel 1900 1950 0    50   Input ~ 0
106
Text GLabel 1250 2650 0    50   Input ~ 0
111
Text GLabel 1900 2050 0    50   Input ~ 0
120
$Comp
L power:GND #PWR01
U 1 1 5F3AF6BB
P 1350 2750
F 0 "#PWR01" H 1350 2500 50  0001 C CNN
F 1 "GND" H 1355 2577 50  0000 C CNN
F 2 "" H 1350 2750 50  0001 C CNN
F 3 "" H 1350 2750 50  0001 C CNN
	1    1350 2750
	1    0    0    -1  
$EndComp
Wire Wire Line
	1250 1550 1350 1550
Wire Wire Line
	1250 1650 1350 1650
Wire Wire Line
	1250 1750 1350 1750
Wire Wire Line
	1250 1850 1350 1850
Wire Wire Line
	1250 1950 1350 1950
Wire Wire Line
	1250 2050 1350 2050
Wire Wire Line
	1250 2150 1350 2150
Wire Wire Line
	1250 2250 1350 2250
Wire Wire Line
	1250 2350 1350 2350
Wire Wire Line
	1250 2450 1350 2450
Wire Wire Line
	1250 2550 1350 2550
Wire Wire Line
	1250 2650 1350 2650
Wire Wire Line
	1350 1550 1350 1650
Connection ~ 1350 1650
Wire Wire Line
	1350 1650 1350 1750
Connection ~ 1350 1750
Wire Wire Line
	1350 1750 1350 1850
Connection ~ 1350 1850
Wire Wire Line
	1350 1850 1350 1950
Connection ~ 1350 1950
Wire Wire Line
	1350 1950 1350 2050
Connection ~ 1350 2050
Wire Wire Line
	1350 2050 1350 2150
Connection ~ 1350 2150
Wire Wire Line
	1350 2150 1350 2250
Connection ~ 1350 2250
Wire Wire Line
	1350 2250 1350 2350
Connection ~ 1350 2350
Wire Wire Line
	1350 2350 1350 2450
Connection ~ 1350 2450
Wire Wire Line
	1350 2450 1350 2550
Connection ~ 1350 2550
Wire Wire Line
	1350 2550 1350 2650
Connection ~ 1350 2650
Wire Wire Line
	1350 2650 1350 2750
Wire Wire Line
	1900 1550 2000 1550
Wire Wire Line
	1900 1650 2000 1650
Wire Wire Line
	1900 1750 2000 1750
Wire Wire Line
	1900 1850 2000 1850
Wire Wire Line
	1900 1950 2000 1950
Wire Wire Line
	1900 2050 2000 2050
$Comp
L power:VCC #PWR02
U 1 1 5F4621E5
P 2000 1550
F 0 "#PWR02" H 2000 1400 50  0001 C CNN
F 1 "VCC" H 2017 1723 50  0000 C CNN
F 2 "" H 2000 1550 50  0001 C CNN
F 3 "" H 2000 1550 50  0001 C CNN
	1    2000 1550
	1    0    0    -1  
$EndComp
Wire Wire Line
	2000 1550 2000 1650
Connection ~ 2000 1550
Connection ~ 2000 1650
Wire Wire Line
	2000 1650 2000 1750
Connection ~ 2000 1750
Wire Wire Line
	2000 1750 2000 1850
Connection ~ 2000 1850
Wire Wire Line
	2000 1850 2000 1950
Connection ~ 2000 1950
Wire Wire Line
	2000 1950 2000 2050
$Comp
L power:PWR_FLAG #FLG01
U 1 1 5F46BFB9
P 1350 1550
F 0 "#FLG01" H 1350 1625 50  0001 C CNN
F 1 "PWR_FLAG" H 1350 1723 50  0001 C CNN
F 2 "" H 1350 1550 50  0001 C CNN
F 3 "~" H 1350 1550 50  0001 C CNN
	1    1350 1550
	1    0    0    -1  
$EndComp
Connection ~ 1350 1550
$Comp
L power:PWR_FLAG #FLG02
U 1 1 5F46C33F
P 2000 2050
F 0 "#FLG02" H 2000 2125 50  0001 C CNN
F 1 "PWR_FLAG" H 2000 2223 50  0001 C CNN
F 2 "" H 2000 2050 50  0001 C CNN
F 3 "~" H 2000 2050 50  0001 C CNN
	1    2000 2050
	-1   0    0    1   
$EndComp
Connection ~ 2000 2050
Text Notes 2600 6000 0    50   ~ 0
~PIN116
Text Notes 2600 5750 0    50   ~ 0
PIN119
Text Notes 2600 5850 0    50   ~ 0
~PIN119
Text Notes 2600 5500 0    50   ~ 0
LOW
Text Notes 2600 5600 0    50   ~ 0
LOW
Wire Wire Line
	2550 5500 2800 5500
Wire Wire Line
	2550 5600 4700 5600
Wire Wire Line
	2550 5750 6950 5750
Wire Wire Line
	2550 5850 7050 5850
Wire Wire Line
	2550 6000 9100 6000
$EndSCHEMATC
