EESchema Schematic File Version 4
EELAYER 30 0
EELAYER END
$Descr A4 11693 8268
encoding utf-8
Sheet 33 83
Title "CPS Reverse Engineering: DL-0311"
Date "2021-09-12"
Rev ""
Comp ""
Comment1 ""
Comment2 ""
Comment3 "Licence: CC-BY"
Comment4 "Author: Loïc *WydD* Petit"
$EndDescr
Connection ~ 4850 6700
Connection ~ 4850 6600
Entry Wire Line
	1450 2450 1550 2550
Entry Wire Line
	1450 2950 1550 3050
Entry Wire Line
	1450 3450 1550 3550
Entry Wire Line
	1450 3950 1550 4050
Entry Wire Line
	1450 4450 1550 4550
Entry Wire Line
	1450 4950 1550 5050
Entry Wire Line
	1450 5450 1550 5550
Entry Wire Line
	1450 5950 1550 6050
Wire Wire Line
	1350 2150 1750 2150
Wire Wire Line
	1900 2550 1550 2550
Wire Wire Line
	1900 3050 1550 3050
Wire Wire Line
	1900 3550 1550 3550
Wire Wire Line
	1900 4050 1550 4050
Wire Wire Line
	1900 4550 1550 4550
Wire Wire Line
	1900 5050 1550 5050
Wire Wire Line
	1900 5550 1550 5550
Wire Wire Line
	1900 6050 1550 6050
Wire Wire Line
	2850 2550 2500 2550
Wire Wire Line
	2850 3050 2500 3050
Wire Wire Line
	2850 3550 2500 3550
Wire Wire Line
	2850 4050 2500 4050
Wire Wire Line
	2850 4550 2500 4550
Wire Wire Line
	2850 5050 2500 5050
Wire Wire Line
	2850 5550 2500 5550
Wire Wire Line
	4600 3850 4900 3850
Wire Wire Line
	4600 3950 4900 3950
Wire Wire Line
	4600 4050 4900 4050
Wire Wire Line
	4650 2550 4850 2550
Wire Wire Line
	4650 3650 4850 3650
Wire Wire Line
	4650 6700 4850 6700
Wire Wire Line
	4850 1250 4600 1250
Wire Wire Line
	4850 1350 4600 1350
Wire Wire Line
	4850 1700 4600 1700
Wire Wire Line
	4850 1800 4600 1800
Wire Wire Line
	4850 1900 4600 1900
Wire Wire Line
	4850 2000 4600 2000
Wire Wire Line
	4850 2100 4600 2100
Wire Wire Line
	4850 2200 4600 2200
Wire Wire Line
	4850 2300 4600 2300
Wire Wire Line
	4850 2550 4850 2400
Wire Wire Line
	4850 2800 4600 2800
Wire Wire Line
	4850 2900 4600 2900
Wire Wire Line
	4850 3000 4600 3000
Wire Wire Line
	4850 3100 4600 3100
Wire Wire Line
	4850 3200 4600 3200
Wire Wire Line
	4850 3300 4600 3300
Wire Wire Line
	4850 3400 4600 3400
Wire Wire Line
	4850 3650 4850 3500
Wire Wire Line
	4850 4350 4600 4350
Wire Wire Line
	4850 4450 4600 4450
Wire Wire Line
	4850 4550 4600 4550
Wire Wire Line
	4850 4650 4600 4650
Wire Wire Line
	4850 4750 4600 4750
Wire Wire Line
	4850 5050 4600 5050
Wire Wire Line
	4850 5150 4600 5150
Wire Wire Line
	4850 5250 4600 5250
Wire Wire Line
	4850 5600 4600 5600
Wire Wire Line
	4850 5700 4600 5700
Wire Wire Line
	4850 5800 4600 5800
Wire Wire Line
	4850 5900 4600 5900
Wire Wire Line
	4850 6000 4600 6000
Wire Wire Line
	4850 6100 4600 6100
Wire Wire Line
	4850 6200 4600 6200
Wire Wire Line
	4850 6300 4600 6300
Wire Wire Line
	4850 6400 4600 6400
Wire Wire Line
	4850 6500 4850 6600
Wire Wire Line
	4850 6600 4850 6700
Wire Wire Line
	4850 6700 4850 6800
Wire Wire Line
	5400 1300 6450 1300
Wire Wire Line
	5400 5150 6450 5150
Wire Wire Line
	5450 3500 5450 3150
Wire Wire Line
	5450 3600 5450 3950
Wire Wire Line
	6450 2050 6050 2050
Wire Wire Line
	6450 3550 6000 3550
Wire Wire Line
	6450 4550 5500 4550
Wire Wire Line
	6450 6200 5450 6200
Wire Bus Line
	1450 2250 1350 2250
Text Notes 5500 1300 0    50   ~ 0
COL = 0-7 mod 32
Text Notes 5500 3200 0    50   ~ 0
COL = 0-1 or 256-257\nor COL = 4-5 mod 16
Text Notes 5500 5050 0    50   ~ 0
COL = ~3, 7, 11, 15 mod 32
Text Notes 5550 6150 0    50   ~ 0
COL = ~3
Text Notes 5600 4500 0    50   ~ 0
COL = ~11 mod 32
Text Notes 6050 1900 0    50   ~ 0
COL = 0 or 256
Text Notes 7150 1350 0    50   ~ 0
Recall: SPRITE-T is 0-3 mod 32
Text Label 1600 2550 0    50   ~ 0
COL8
Text Label 1600 3050 0    50   ~ 0
COL7
Text Label 1600 3550 0    50   ~ 0
COL6
Text Label 1600 4050 0    50   ~ 0
COL5
Text Label 1600 4550 0    50   ~ 0
COL4
Text Label 1600 5050 0    50   ~ 0
COL3
Text Label 1600 5550 0    50   ~ 0
COL2
Text Label 1600 6050 0    50   ~ 0
COL1
Text Label 1750 2150 2    50   ~ 0
CLK4M
Text Label 2800 2550 2    50   ~ 0
~COL2
Text Label 2800 3050 2    50   ~ 0
~COL3
Text Label 2800 3550 2    50   ~ 0
~COL4
Text Label 2800 4050 2    50   ~ 0
~COL5
Text Label 2800 4550 2    50   ~ 0
~COL6
Text Label 2800 5050 2    50   ~ 0
~COL7
Text Label 2800 5550 2    50   ~ 0
~COL8
Text Label 4600 1250 0    50   ~ 0
~COL3
Text Label 4600 1350 0    50   ~ 0
~COL4
Text Label 4600 1700 0    50   ~ 0
~COL2
Text Label 4600 1800 0    50   ~ 0
~COL3
Text Label 4600 1900 0    50   ~ 0
~COL4
Text Label 4600 2000 0    50   ~ 0
~COL5
Text Label 4600 2100 0    50   ~ 0
~COL6
Text Label 4600 2200 0    50   ~ 0
~COL7
Text Label 4600 2300 0    50   ~ 0
~COL8
Text Label 4600 2800 0    50   ~ 0
~COL2
Text Label 4600 2900 0    50   ~ 0
~COL3
Text Label 4600 3000 0    50   ~ 0
~COL4
Text Label 4600 3100 0    50   ~ 0
~COL5
Text Label 4600 3200 0    50   ~ 0
~COL6
Text Label 4600 3300 0    50   ~ 0
~COL7
Text Label 4600 3400 0    50   ~ 0
~COL8
Text Label 4600 3850 0    50   ~ 0
~COL2
Text Label 4600 3950 0    50   ~ 0
COL3
Text Label 4600 4050 0    50   ~ 0
~COL4
Text Label 4600 4350 0    50   ~ 0
CLK4M
Text Label 4600 4450 0    50   ~ 0
COL1
Text Label 4600 4550 0    50   ~ 0
~COL2
Text Label 4600 4650 0    50   ~ 0
COL3
Text Label 4600 4750 0    50   ~ 0
~COL4
Text Label 4600 5050 0    50   ~ 0
CLK4M
Text Label 4600 5150 0    50   ~ 0
COL1
Text Label 4600 5250 0    50   ~ 0
~COL4
Text Label 4600 5600 0    50   ~ 0
CLK4M
Text Label 4600 5700 0    50   ~ 0
COL1
Text Label 4600 5800 0    50   ~ 0
~COL2
Text Label 4600 5900 0    50   ~ 0
~COL3
Text Label 4600 6000 0    50   ~ 0
~COL4
Text Label 4600 6100 0    50   ~ 0
~COL5
Text Label 4600 6200 0    50   ~ 0
~COL6
Text Label 4600 6300 0    50   ~ 0
~COL7
Text Label 4600 6400 0    50   ~ 0
~COL8
Text HLabel 1350 2150 0    50   Input ~ 0
CLK4M
Text HLabel 1350 2250 0    50   Input ~ 0
COL[1..8]
Text HLabel 6450 1300 2    50   Output ~ 0
WRITE-MODE
Text HLabel 6450 2050 2    50   Output ~ 0
~R-OE
Text HLabel 6450 3550 2    50   Output ~ 0
~W-OE
Text HLabel 6450 4550 2    50   Output ~ 0
~W-CAS-E
Text HLabel 6450 5150 2    50   Output ~ 0
FRAS
Text HLabel 6450 6200 2    50   Output ~ 0
~COL=3
$Comp
L power:VCC #PWR0226
U 1 1 6317826E
P 4650 2550
F 0 "#PWR0226" H 4650 2400 50  0001 C CNN
F 1 "VCC" H 4665 2723 50  0000 C CNN
F 2 "" H 4650 2550 50  0001 C CNN
F 3 "" H 4650 2550 50  0001 C CNN
	1    4650 2550
	1    0    0    -1  
$EndComp
$Comp
L power:VCC #PWR0227
U 1 1 631E4DAA
P 4650 3650
F 0 "#PWR0227" H 4650 3500 50  0001 C CNN
F 1 "VCC" H 4665 3823 50  0000 C CNN
F 2 "" H 4650 3650 50  0001 C CNN
F 3 "" H 4650 3650 50  0001 C CNN
	1    4650 3650
	1    0    0    -1  
$EndComp
$Comp
L power:VCC #PWR0228
U 1 1 63B02617
P 4650 6700
F 0 "#PWR0228" H 4650 6550 50  0001 C CNN
F 1 "VCC" H 4665 6873 50  0000 C CNN
F 2 "" H 4650 6700 50  0001 C CNN
F 3 "" H 4650 6700 50  0001 C CNN
	1    4650 6700
	1    0    0    -1  
$EndComp
$Comp
L A5C:AND02 UDK78
U 1 1 61B3A274
P 5100 1300
F 0 "UDK78" H 5125 1567 50  0000 C CNN
F 1 "AND02" H 5125 1476 50  0000 C CNN
F 2 "" H 5100 1300 50  0001 C CNN
F 3 "" H 5100 1300 50  0001 C CNN
	1    5100 1300
	1    0    0    -1  
$EndComp
$Comp
L A5C:NAND02 UDL94
U 1 1 64131C31
P 5700 3550
F 0 "UDL94" H 5725 3817 50  0000 C CNN
F 1 "NAND02" H 5725 3726 50  0000 C CNN
F 2 "" H 5700 3550 50  0001 C CNN
F 3 "" H 5700 3550 50  0001 C CNN
	1    5700 3550
	1    0    0    -1  
$EndComp
$Comp
L A5C:NAND03 UDL120
U 1 1 645194B1
P 5100 5150
F 0 "UDL120" H 5125 5442 50  0000 C CNN
F 1 "NAND03" H 5125 5351 50  0000 C CNN
F 2 "" H 5100 5150 50  0001 C CNN
F 3 "" H 5100 5150 50  0001 C CNN
	1    5100 5150
	1    0    0    -1  
$EndComp
$Comp
L A5C:NAND03 UDL91
U 1 1 63E4C895
P 5150 3950
F 0 "UDL91" H 5175 4242 50  0000 C CNN
F 1 "NAND03" H 5175 4151 50  0000 C CNN
F 2 "" H 5150 3950 50  0001 C CNN
F 3 "" H 5150 3950 50  0001 C CNN
	1    5150 3950
	1    0    0    -1  
$EndComp
$Comp
L A5C:INV01 UDJ87
U 1 1 6206593D
P 2200 2550
F 0 "UDJ87" H 2200 2867 50  0000 C CNN
F 1 "INV01" H 2200 2776 50  0000 C CNN
F 2 "" H 2200 2350 50  0001 C CNN
F 3 "" H 2200 2350 50  0001 C CNN
	1    2200 2550
	1    0    0    -1  
$EndComp
$Comp
L A5C:INV01 UDK98
U 1 1 61DA0976
P 2200 3050
F 0 "UDK98" H 2200 3367 50  0000 C CNN
F 1 "INV01" H 2200 3276 50  0000 C CNN
F 2 "" H 2200 2850 50  0001 C CNN
F 3 "" H 2200 2850 50  0001 C CNN
	1    2200 3050
	1    0    0    -1  
$EndComp
$Comp
L A5C:INV01 UDK99
U 1 1 61DA096D
P 2200 3550
F 0 "UDK99" H 2200 3867 50  0000 C CNN
F 1 "INV01" H 2200 3776 50  0000 C CNN
F 2 "" H 2200 3350 50  0001 C CNN
F 3 "" H 2200 3350 50  0001 C CNN
	1    2200 3550
	1    0    0    -1  
$EndComp
$Comp
L A5C:INV01 UDK100
U 1 1 61DA0966
P 2200 4050
F 0 "UDK100" H 2200 4367 50  0000 C CNN
F 1 "INV01" H 2200 4276 50  0000 C CNN
F 2 "" H 2200 3850 50  0001 C CNN
F 3 "" H 2200 3850 50  0001 C CNN
	1    2200 4050
	1    0    0    -1  
$EndComp
$Comp
L A5C:INV01 UDL87
U 1 1 61B87934
P 2200 4550
F 0 "UDL87" H 2200 4867 50  0000 C CNN
F 1 "INV01" H 2200 4776 50  0000 C CNN
F 2 "" H 2200 4350 50  0001 C CNN
F 3 "" H 2200 4350 50  0001 C CNN
	1    2200 4550
	1    0    0    -1  
$EndComp
$Comp
L A5C:INV01 UDL88
U 1 1 61B8A35C
P 2200 5050
F 0 "UDL88" H 2200 5367 50  0000 C CNN
F 1 "INV01" H 2200 5276 50  0000 C CNN
F 2 "" H 2200 4850 50  0001 C CNN
F 3 "" H 2200 4850 50  0001 C CNN
	1    2200 5050
	1    0    0    -1  
$EndComp
$Comp
L A5C:INV01 UDL61
U 1 1 61D53410
P 2200 5550
F 0 "UDL61" H 2200 5867 50  0000 C CNN
F 1 "INV01" H 2200 5776 50  0000 C CNN
F 2 "" H 2200 5350 50  0001 C CNN
F 3 "" H 2200 5350 50  0001 C CNN
	1    2200 5550
	1    0    0    -1  
$EndComp
$Comp
L A5C:INV01 UDL85
U 1 1 6422CDF3
P 5750 2050
F 0 "UDL85" H 5750 2367 50  0000 C CNN
F 1 "INV01" H 5750 2276 50  0000 C CNN
F 2 "" H 5750 1850 50  0001 C CNN
F 3 "" H 5750 1850 50  0001 C CNN
	1    5750 2050
	1    0    0    -1  
$EndComp
$Comp
L A5C:NAND05 UDL117
U 1 1 6422D72F
P 5150 4550
F 0 "UDL117" H 5175 4940 50  0000 C CNN
F 1 "NAND05" H 5175 4849 50  0000 C CNN
F 2 "" H 5150 4250 50  0001 C CNN
F 3 "" H 5150 4250 50  0001 C CNN
	1    5150 4550
	1    0    0    -1  
$EndComp
$Comp
L A5C:NAND08 UDK80
U 1 1 62DFB685
P 5150 2050
F 0 "UDK80" H 5150 2590 50  0000 C CNN
F 1 "NAND08" H 5150 2499 50  0000 C CNN
F 2 "" H 5100 2250 50  0001 C CNN
F 3 "" H 5100 2250 50  0001 C CNN
	1    5150 2050
	1    0    0    -1  
$EndComp
$Comp
L A5C:NAND08 UDK93
U 1 1 631E4D9D
P 5150 3150
F 0 "UDK93" H 5150 3690 50  0000 C CNN
F 1 "NAND08" H 5150 3599 50  0000 C CNN
F 2 "" H 5100 3350 50  0001 C CNN
F 3 "" H 5100 3350 50  0001 C CNN
	1    5150 3150
	1    0    0    -1  
$EndComp
$Comp
L A5C:NAND13 UDK85
U 1 1 632C27DB
P 5150 6200
F 0 "UDK85" H 5150 6990 50  0000 C CNN
F 1 "NAND13" H 5150 6899 50  0000 C CNN
F 2 "" H 5100 6650 50  0001 C CNN
F 3 "" H 5100 6650 50  0001 C CNN
	1    5150 6200
	1    0    0    -1  
$EndComp
Wire Bus Line
	1450 2250 1450 5950
$EndSCHEMATC
