EESchema Schematic File Version 4
EELAYER 30 0
EELAYER END
$Descr A4 11693 8268
encoding utf-8
Sheet 7 22
Title ""
Date "2020-12-13"
Rev ""
Comp ""
Comment1 ""
Comment2 "Licence: CC-BY"
Comment3 "Author: Loïc *WydD* Petit"
Comment4 "Project: CPS2 Reverse Engineering: 93646A"
$EndDescr
Connection ~ 10100 6300
Connection ~ 4800 1150
Connection ~ 6650 3600
Connection ~ 6850 3600
Connection ~ 7350 1550
Connection ~ 7750 1550
Connection ~ 8350 1350
Connection ~ 8350 1500
Connection ~ 6750 1450
Connection ~ 6150 1250
Connection ~ 6750 1250
Connection ~ 6150 1050
Connection ~ 10100 2600
Connection ~ 10100 4450
Connection ~ 7200 3000
Connection ~ 6300 3100
Connection ~ 7400 2250
Connection ~ 6150 1450
Connection ~ 8650 2450
Connection ~ 5250 1150
Connection ~ 5350 1150
Connection ~ 4550 1150
Connection ~ 4650 1150
Connection ~ 4900 1150
NoConn ~ 3700 1150
NoConn ~ 3550 6400
NoConn ~ 3650 6400
NoConn ~ 3750 6400
NoConn ~ 7500 3650
NoConn ~ 7500 3550
NoConn ~ 7500 3450
NoConn ~ 7500 3350
NoConn ~ 7500 3250
NoConn ~ 8500 3250
NoConn ~ 8500 3350
NoConn ~ 8500 3450
NoConn ~ 8500 3550
NoConn ~ 8500 3650
NoConn ~ 7500 3950
NoConn ~ 950  1450
NoConn ~ 950  1550
NoConn ~ 950  1650
NoConn ~ 950  1750
NoConn ~ 950  1850
NoConn ~ 950  1950
NoConn ~ 950  2050
NoConn ~ 950  2150
NoConn ~ 950  2250
NoConn ~ 950  2350
NoConn ~ 950  2450
NoConn ~ 950  2550
NoConn ~ 950  2650
NoConn ~ 950  2750
NoConn ~ 950  2850
NoConn ~ 950  2950
NoConn ~ 950  3050
NoConn ~ 950  3150
NoConn ~ 950  3250
NoConn ~ 950  3350
NoConn ~ 950  3450
NoConn ~ 950  3550
NoConn ~ 950  3650
NoConn ~ 950  3900
NoConn ~ 950  4000
NoConn ~ 950  4100
NoConn ~ 950  4200
NoConn ~ 950  4300
NoConn ~ 950  4400
NoConn ~ 950  4500
NoConn ~ 950  4600
NoConn ~ 950  4700
NoConn ~ 950  4800
NoConn ~ 950  4900
NoConn ~ 950  5000
NoConn ~ 950  5100
NoConn ~ 950  5200
NoConn ~ 950  5300
NoConn ~ 950  5400
NoConn ~ 950  5500
NoConn ~ 950  5600
NoConn ~ 950  5700
NoConn ~ 950  5800
NoConn ~ 950  5900
NoConn ~ 950  6000
NoConn ~ 950  6100
NoConn ~ 6150 5900
NoConn ~ 3950 6400
NoConn ~ 6150 4600
NoConn ~ 6150 4700
NoConn ~ 6150 3900
NoConn ~ 6150 3800
NoConn ~ 6150 3700
NoConn ~ 6150 3400
NoConn ~ 6150 3300
NoConn ~ 6150 1700
NoConn ~ 6150 1800
NoConn ~ 6150 1900
NoConn ~ 6150 2000
NoConn ~ 9600 5000
NoConn ~ 10600 5000
Entry Wire Line
	1450 7100 1550 7000
Entry Wire Line
	1500 850  1600 750 
Entry Wire Line
	1550 7100 1650 7000
Entry Wire Line
	1600 850  1700 750 
Entry Wire Line
	1650 7100 1750 7000
Entry Wire Line
	1700 850  1800 750 
Entry Wire Line
	1750 7100 1850 7000
Entry Wire Line
	1800 850  1900 750 
Entry Wire Line
	1850 7100 1950 7000
Entry Wire Line
	1900 850  2000 750 
Entry Wire Line
	1950 7100 2050 7000
Entry Wire Line
	2000 850  2100 750 
Entry Wire Line
	2050 7100 2150 7000
Entry Wire Line
	2100 850  2200 750 
Entry Wire Line
	2150 7100 2250 7000
Entry Wire Line
	2200 850  2300 750 
Entry Wire Line
	2250 7100 2350 7000
Entry Wire Line
	2300 850  2400 750 
Entry Wire Line
	2350 7100 2450 7000
Entry Wire Line
	2400 850  2500 750 
Entry Wire Line
	2450 7100 2550 7000
Entry Wire Line
	2500 850  2600 750 
Entry Wire Line
	2550 7100 2650 7000
Entry Wire Line
	2600 850  2700 750 
Entry Wire Line
	2650 7100 2750 7000
Entry Wire Line
	2700 850  2800 750 
Entry Wire Line
	2750 7100 2850 7000
Entry Wire Line
	2800 850  2900 750 
Entry Wire Line
	2850 7100 2950 7000
Entry Wire Line
	2900 850  3000 750 
Entry Wire Line
	2950 7100 3050 7000
Entry Wire Line
	3000 850  3100 750 
Entry Wire Line
	3050 7100 3150 7000
Entry Wire Line
	3100 850  3200 750 
Entry Wire Line
	3150 7100 3250 7000
Entry Wire Line
	3200 850  3300 750 
Entry Wire Line
	3250 7100 3350 7000
Entry Wire Line
	3300 850  3400 750 
Entry Wire Line
	3350 7100 3450 7000
Entry Wire Line
	3400 850  3500 750 
Entry Wire Line
	3500 850  3600 750 
Entry Wire Line
	3600 850  3700 750 
Entry Wire Line
	4050 7000 4150 7100
Entry Wire Line
	4150 7000 4250 7100
Entry Wire Line
	4250 7000 4350 7100
Entry Wire Line
	4350 7000 4450 7100
Entry Wire Line
	4450 7000 4550 7100
Entry Wire Line
	4550 7000 4650 7100
Entry Wire Line
	4650 7000 4750 7100
Entry Wire Line
	4750 7000 4850 7100
Entry Wire Line
	4850 7000 4950 7100
Entry Wire Line
	4950 7000 5050 7100
Entry Wire Line
	5050 7000 5150 7100
Entry Wire Line
	5150 7000 5250 7100
Entry Wire Line
	5250 7000 5350 7100
Entry Wire Line
	5350 7000 5450 7100
Entry Wire Line
	5450 7000 5550 7100
Entry Wire Line
	5550 7000 5650 7100
Entry Wire Line
	6400 4000 6500 3900
Entry Wire Line
	6400 4100 6500 4000
Entry Wire Line
	6400 4200 6500 4100
Entry Wire Line
	6400 4300 6500 4200
Entry Wire Line
	6400 4400 6500 4300
Entry Wire Line
	6400 4800 6500 4700
Entry Wire Line
	6400 4900 6500 4800
Entry Wire Line
	6400 5000 6500 4900
Entry Wire Line
	6400 5100 6500 5000
Entry Wire Line
	6400 5200 6500 5100
Entry Wire Line
	8900 1200 9000 1300
Entry Wire Line
	8900 1300 9000 1400
Entry Wire Line
	8900 1400 9000 1500
Entry Wire Line
	8900 1500 9000 1600
Entry Wire Line
	8900 1600 9000 1700
Entry Wire Line
	8900 1700 9000 1800
Entry Wire Line
	8900 1800 9000 1900
Entry Wire Line
	8900 1900 9000 2000
Entry Wire Line
	8900 3050 9000 3150
Entry Wire Line
	8900 3150 9000 3250
Entry Wire Line
	8900 3250 9000 3350
Entry Wire Line
	8900 3350 9000 3450
Entry Wire Line
	8900 3450 9000 3550
Entry Wire Line
	8900 3550 9000 3650
Entry Wire Line
	8900 3650 9000 3750
Entry Wire Line
	8900 3750 9000 3850
Entry Wire Line
	8900 5000 9000 5100
Entry Wire Line
	8900 5100 9000 5200
Entry Wire Line
	8900 5200 9000 5300
Entry Wire Line
	8900 5300 9000 5400
Entry Wire Line
	8900 5400 9000 5500
Entry Wire Line
	8900 5500 9000 5600
Entry Wire Line
	8900 5600 9000 5700
Entry Wire Line
	11000 1200 10900 1300
Entry Wire Line
	11000 1300 10900 1400
Entry Wire Line
	11000 1400 10900 1500
Entry Wire Line
	11000 1500 10900 1600
Entry Wire Line
	11000 1600 10900 1700
Entry Wire Line
	11000 1700 10900 1800
Entry Wire Line
	11000 1800 10900 1900
Entry Wire Line
	11000 1900 10900 2000
Entry Wire Line
	11000 3050 10900 3150
Entry Wire Line
	11000 3150 10900 3250
Entry Wire Line
	11000 3250 10900 3350
Entry Wire Line
	11000 3350 10900 3450
Entry Wire Line
	11000 3450 10900 3550
Entry Wire Line
	11000 3550 10900 3650
Entry Wire Line
	11000 3650 10900 3750
Entry Wire Line
	11000 3750 10900 3850
Entry Wire Line
	11000 5000 10900 5100
Entry Wire Line
	11000 5100 10900 5200
Entry Wire Line
	11000 5200 10900 5300
Entry Wire Line
	11000 5300 10900 5400
Entry Wire Line
	11000 5400 10900 5500
Entry Wire Line
	11000 5500 10900 5600
Wire Wire Line
	1500 1150 1500 850 
Wire Wire Line
	1550 7000 1550 6400
Wire Wire Line
	1600 1150 1600 850 
Wire Wire Line
	1650 7000 1650 6400
Wire Wire Line
	1700 1150 1700 850 
Wire Wire Line
	1750 7000 1750 6400
Wire Wire Line
	1800 1150 1800 850 
Wire Wire Line
	1850 7000 1850 6400
Wire Wire Line
	1900 1150 1900 850 
Wire Wire Line
	1950 7000 1950 6400
Wire Wire Line
	2000 1150 2000 850 
Wire Wire Line
	2050 7000 2050 6400
Wire Wire Line
	2100 1150 2100 850 
Wire Wire Line
	2150 7000 2150 6400
Wire Wire Line
	2200 1150 2200 850 
Wire Wire Line
	2250 7000 2250 6400
Wire Wire Line
	2300 1150 2300 850 
Wire Wire Line
	2350 7000 2350 6400
Wire Wire Line
	2400 1150 2400 850 
Wire Wire Line
	2450 7000 2450 6400
Wire Wire Line
	2500 1150 2500 850 
Wire Wire Line
	2550 7000 2550 6400
Wire Wire Line
	2600 1150 2600 850 
Wire Wire Line
	2650 7000 2650 6400
Wire Wire Line
	2700 1150 2700 850 
Wire Wire Line
	2750 7000 2750 6400
Wire Wire Line
	2800 1150 2800 850 
Wire Wire Line
	2850 7000 2850 6400
Wire Wire Line
	2900 1150 2900 850 
Wire Wire Line
	2950 7000 2950 6400
Wire Wire Line
	3000 1150 3000 850 
Wire Wire Line
	3050 7000 3050 6400
Wire Wire Line
	3100 1150 3100 850 
Wire Wire Line
	3150 7000 3150 6400
Wire Wire Line
	3200 1150 3200 850 
Wire Wire Line
	3250 7000 3250 6400
Wire Wire Line
	3300 1150 3300 850 
Wire Wire Line
	3350 7000 3350 6400
Wire Wire Line
	3400 1150 3400 850 
Wire Wire Line
	3450 7000 3450 6400
Wire Wire Line
	3500 1150 3500 850 
Wire Wire Line
	3600 1150 3600 850 
Wire Wire Line
	4050 7000 4050 6400
Wire Wire Line
	4150 7000 4150 6400
Wire Wire Line
	4250 7000 4250 6400
Wire Wire Line
	4350 7000 4350 6400
Wire Wire Line
	4450 1150 4550 1150
Wire Wire Line
	4450 7000 4450 6400
Wire Wire Line
	4550 1150 4650 1150
Wire Wire Line
	4550 7000 4550 6400
Wire Wire Line
	4650 1150 4800 1150
Wire Wire Line
	4650 7000 4650 6400
Wire Wire Line
	4750 7000 4750 6400
Wire Wire Line
	4800 1150 4900 1150
Wire Wire Line
	4850 7000 4850 6400
Wire Wire Line
	4950 7000 4950 6400
Wire Wire Line
	5000 1150 4900 1150
Wire Wire Line
	5050 7000 5050 6400
Wire Wire Line
	5150 1150 5250 1150
Wire Wire Line
	5150 7000 5150 6400
Wire Wire Line
	5250 1150 5350 1150
Wire Wire Line
	5250 7000 5250 6400
Wire Wire Line
	5350 1150 5550 1150
Wire Wire Line
	5350 7000 5350 6400
Wire Wire Line
	5450 7000 5450 6400
Wire Wire Line
	5550 7000 5550 6400
Wire Wire Line
	6150 1050 6050 1050
Wire Wire Line
	6150 1050 6150 1250
Wire Wire Line
	6150 1250 6150 1450
Wire Wire Line
	6150 1250 6350 1250
Wire Wire Line
	6150 1450 6350 1450
Wire Wire Line
	6150 2150 6700 2150
Wire Wire Line
	6150 2450 8650 2450
Wire Wire Line
	6150 2800 6700 2800
Wire Wire Line
	6150 2900 6950 2900
Wire Wire Line
	6150 3000 7200 3000
Wire Wire Line
	6150 4000 6400 4000
Wire Wire Line
	6150 4100 6400 4100
Wire Wire Line
	6150 4200 6400 4200
Wire Wire Line
	6150 4300 6400 4300
Wire Wire Line
	6150 4400 6400 4400
Wire Wire Line
	6150 4800 6400 4800
Wire Wire Line
	6150 4900 6400 4900
Wire Wire Line
	6150 5000 6400 5000
Wire Wire Line
	6150 5100 6400 5100
Wire Wire Line
	6150 5200 6400 5200
Wire Wire Line
	6300 1050 6150 1050
Wire Wire Line
	6300 3100 6150 3100
Wire Wire Line
	6300 3250 6300 3100
Wire Wire Line
	6300 3600 6150 3600
Wire Wire Line
	6350 3250 6300 3250
Wire Wire Line
	6550 1250 6750 1250
Wire Wire Line
	6550 1450 6750 1450
Wire Wire Line
	6650 3600 6500 3600
Wire Wire Line
	6700 2250 6150 2250
Wire Wire Line
	6700 2250 6700 2350
Wire Wire Line
	6700 2350 7400 2350
Wire Wire Line
	6750 1050 6600 1050
Wire Wire Line
	6750 1250 6750 1050
Wire Wire Line
	6750 1250 6750 1450
Wire Wire Line
	6850 3100 6300 3100
Wire Wire Line
	6850 3300 6850 3600
Wire Wire Line
	6850 3600 6650 3600
Wire Wire Line
	7150 2800 6900 2800
Wire Wire Line
	7200 3000 7200 3100
Wire Wire Line
	7200 3300 7200 3600
Wire Wire Line
	7200 3600 6850 3600
Wire Wire Line
	7300 2050 8050 2050
Wire Wire Line
	7300 2250 7400 2250
Wire Wire Line
	7300 3000 7200 3000
Wire Wire Line
	7350 1350 7750 1350
Wire Wire Line
	7350 1550 7750 1550
Wire Wire Line
	7400 2250 8050 2250
Wire Wire Line
	7400 2350 7400 2250
Wire Wire Line
	7500 4050 7500 5900
Wire Wire Line
	7650 5900 7500 5900
Wire Wire Line
	7750 1500 7750 1550
Wire Wire Line
	7750 1550 7750 1650
Wire Wire Line
	8250 5900 9600 5900
Wire Wire Line
	8350 1350 8450 1350
Wire Wire Line
	8350 1500 8350 1350
Wire Wire Line
	8350 1650 8350 1500
Wire Wire Line
	8500 3750 8800 3750
Wire Wire Line
	8650 2450 8800 2450
Wire Wire Line
	8800 3750 8800 2450
Wire Wire Line
	9000 1300 9600 1300
Wire Wire Line
	9000 1400 9600 1400
Wire Wire Line
	9000 1500 9600 1500
Wire Wire Line
	9000 1600 9600 1600
Wire Wire Line
	9000 1700 9600 1700
Wire Wire Line
	9000 1800 9600 1800
Wire Wire Line
	9000 1900 9600 1900
Wire Wire Line
	9000 2000 9600 2000
Wire Wire Line
	9000 2200 9600 2200
Wire Wire Line
	9000 3150 9600 3150
Wire Wire Line
	9000 3250 9600 3250
Wire Wire Line
	9000 3350 9600 3350
Wire Wire Line
	9000 3450 9600 3450
Wire Wire Line
	9000 3550 9600 3550
Wire Wire Line
	9000 3650 9600 3650
Wire Wire Line
	9000 3750 9600 3750
Wire Wire Line
	9000 3850 9600 3850
Wire Wire Line
	9000 4050 9600 4050
Wire Wire Line
	9000 5100 9600 5100
Wire Wire Line
	9000 5200 9600 5200
Wire Wire Line
	9000 5300 9600 5300
Wire Wire Line
	9000 5400 9600 5400
Wire Wire Line
	9000 5500 9600 5500
Wire Wire Line
	9000 5600 9600 5600
Wire Wire Line
	9000 5700 9600 5700
Wire Wire Line
	9600 2300 9600 2600
Wire Wire Line
	9600 2600 10100 2600
Wire Wire Line
	9600 4150 9600 4450
Wire Wire Line
	9600 4450 10100 4450
Wire Wire Line
	9600 6000 9600 6300
Wire Wire Line
	9600 6300 10100 6300
Wire Wire Line
	10600 1300 10900 1300
Wire Wire Line
	10600 1400 10900 1400
Wire Wire Line
	10600 1500 10900 1500
Wire Wire Line
	10600 1600 10900 1600
Wire Wire Line
	10600 1700 10900 1700
Wire Wire Line
	10600 1800 10900 1800
Wire Wire Line
	10600 1900 10900 1900
Wire Wire Line
	10600 2000 10900 2000
Wire Wire Line
	10600 3150 10900 3150
Wire Wire Line
	10600 3250 10900 3250
Wire Wire Line
	10600 3350 10900 3350
Wire Wire Line
	10600 3450 10900 3450
Wire Wire Line
	10600 3550 10900 3550
Wire Wire Line
	10600 3650 10900 3650
Wire Wire Line
	10600 3750 10900 3750
Wire Wire Line
	10600 3850 10900 3850
Wire Wire Line
	10600 5100 10900 5100
Wire Wire Line
	10600 5200 10900 5200
Wire Wire Line
	10600 5300 10900 5300
Wire Wire Line
	10600 5400 10900 5400
Wire Wire Line
	10600 5500 10900 5500
Wire Wire Line
	10600 5600 10900 5600
Wire Wire Line
	10900 5700 10600 5700
Wire Wire Line
	10900 5900 10900 6300
Wire Wire Line
	10900 6300 10100 6300
Wire Bus Line
	6500 3800 6600 3800
Wire Bus Line
	6500 4600 6600 4600
Wire Bus Line
	8900 900  8700 900 
Text Notes 6800 4000 0    50   ~ 0
TO B
Text Notes 6800 4100 0    50   ~ 0
TO B
Text Notes 6800 4200 0    50   ~ 0
TO B
Text Notes 6800 4300 0    50   ~ 0
TO B
Text Notes 6800 4400 0    50   ~ 0
TO B
Text Notes 6800 4500 0    50   ~ 0
TO B
Text Notes 6800 4800 0    50   ~ 0
TO B
Text Notes 6800 4900 0    50   ~ 0
TO B
Text Notes 6800 5000 0    50   ~ 0
TO B
Text Notes 6800 5100 0    50   ~ 0
TO B
Text Notes 6800 5200 0    50   ~ 0
TO B
Text Notes 6800 5300 0    50   ~ 0
TO B
Text Notes 6800 5400 0    50   ~ 0
TO B
Text Notes 6800 5500 0    50   ~ 0
TO B
Text Notes 6800 5600 0    50   ~ 0
TO B
Text Notes 6800 5700 0    50   ~ 0
TO B
Text Notes 6800 5800 0    50   ~ 0
TO B
Text Notes 6800 5900 0    50   ~ 0
TO B
Text Notes 6800 6000 0    50   ~ 0
TO B
Text Label 1500 1100 1    50   ~ 0
CA1
Text Label 1550 6950 1    50   ~ 0
GFX-ADDR0
Text Label 1600 1100 1    50   ~ 0
CA2
Text Label 1650 6950 1    50   ~ 0
GFX-ADDR1
Text Label 1700 1100 1    50   ~ 0
CA3
Text Label 1750 6950 1    50   ~ 0
GFX-ADDR2
Text Label 1800 1100 1    50   ~ 0
CA4
Text Label 1850 6950 1    50   ~ 0
GFX-ADDR3
Text Label 1900 1100 1    50   ~ 0
CA5
Text Label 1950 6950 1    50   ~ 0
GFX-ADDR4
Text Label 2000 1100 1    50   ~ 0
CA6
Text Label 2050 6950 1    50   ~ 0
GFX-ADDR5
Text Label 2100 1100 1    50   ~ 0
CA7
Text Label 2150 6950 1    50   ~ 0
GFX-ADDR6
Text Label 2200 1100 1    50   ~ 0
CA8
Text Label 2250 6950 1    50   ~ 0
GFX-ADDR7
Text Label 2300 1100 1    50   ~ 0
CA9
Text Label 2350 6950 1    50   ~ 0
GFX-ADDR8
Text Label 2400 1100 1    50   ~ 0
CA10
Text Label 2450 6950 1    50   ~ 0
GFX-ADDR9
Text Label 2500 1100 1    50   ~ 0
CA11
Text Label 2550 6950 1    50   ~ 0
GFX-ADDR10
Text Label 2600 1100 1    50   ~ 0
CA12
Text Label 2650 6950 1    50   ~ 0
GFX-ADDR11
Text Label 2700 1100 1    50   ~ 0
CA13
Text Label 2750 6950 1    50   ~ 0
GFX-ADDR12
Text Label 2800 1100 1    50   ~ 0
CA14
Text Label 2850 6950 1    50   ~ 0
GFX-ADDR13
Text Label 2900 1100 1    50   ~ 0
CA15
Text Label 2950 6950 1    50   ~ 0
GFX-ADDR14
Text Label 3000 1100 1    50   ~ 0
CA16
Text Label 3050 6950 1    50   ~ 0
GFX-ADDR15
Text Label 3100 1100 1    50   ~ 0
CA17
Text Label 3150 6950 1    50   ~ 0
GFX-ADDR16
Text Label 3200 1100 1    50   ~ 0
CA18
Text Label 3250 6950 1    50   ~ 0
GFX-ADDR17
Text Label 3300 1100 1    50   ~ 0
CA19
Text Label 3350 6950 1    50   ~ 0
GFX-ADDR18
Text Label 3400 1100 1    50   ~ 0
CA20
Text Label 3450 6950 1    50   ~ 0
GFX-ADDR19
Text Label 3500 1100 1    50   ~ 0
CA21
Text Label 3600 1100 1    50   ~ 0
CA22
Text Label 4050 6950 1    50   ~ 0
BUS-DATA0
Text Label 4150 6950 1    50   ~ 0
BUS-DATA1
Text Label 4250 6950 1    50   ~ 0
BUS-DATA2
Text Label 4350 6950 1    50   ~ 0
BUS-DATA3
Text Label 4450 6950 1    50   ~ 0
BUS-DATA4
Text Label 4550 6950 1    50   ~ 0
BUS-DATA5
Text Label 4650 6950 1    50   ~ 0
BUS-DATA6
Text Label 4750 6950 1    50   ~ 0
BUS-DATA7
Text Label 4850 6950 1    50   ~ 0
BUS-DATA8
Text Label 4950 6950 1    50   ~ 0
BUS-DATA9
Text Label 5050 6950 1    50   ~ 0
BUS-DATA10
Text Label 5150 6950 1    50   ~ 0
BUS-DATA11
Text Label 5250 6950 1    50   ~ 0
BUS-DATA12
Text Label 5350 6950 1    50   ~ 0
BUS-DATA13
Text Label 5450 6950 1    50   ~ 0
BUS-DATA14
Text Label 5550 6950 1    50   ~ 0
BUS-DATA15
Text Label 6200 2150 0    50   ~ 0
~BGACK
Text Label 6200 2250 0    50   ~ 0
~BR
Text Label 6200 4000 0    50   ~ 0
XS0
Text Label 6200 4100 0    50   ~ 0
XS1
Text Label 6200 4200 0    50   ~ 0
XS2
Text Label 6200 4300 0    50   ~ 0
XS3
Text Label 6200 4400 0    50   ~ 0
XS4
Text Label 6200 4800 0    50   ~ 0
CB0
Text Label 6200 4900 0    50   ~ 0
CB1
Text Label 6200 5000 0    50   ~ 0
CB2
Text Label 6200 5100 0    50   ~ 0
CB3
Text Label 6200 5200 0    50   ~ 0
CB4
Text Label 7400 2050 0    50   ~ 0
~BUS-BGACK
Text Label 8600 3750 0    50   ~ 0
~RD
Text Label 9050 1300 0    50   ~ 0
BUS-ADDR1
Text Label 9050 1400 0    50   ~ 0
BUS-ADDR2
Text Label 9050 1500 0    50   ~ 0
BUS-ADDR3
Text Label 9050 1600 0    50   ~ 0
BUS-ADDR4
Text Label 9050 1700 0    50   ~ 0
BUS-ADDR5
Text Label 9050 1800 0    50   ~ 0
BUS-ADDR6
Text Label 9050 1900 0    50   ~ 0
BUS-ADDR7
Text Label 9050 2000 0    50   ~ 0
BUS-ADDR8
Text Label 9050 3150 0    50   ~ 0
BUS-ADDR9
Text Label 9050 3250 0    50   ~ 0
BUS-ADDR10
Text Label 9050 3350 0    50   ~ 0
BUS-ADDR11
Text Label 9050 3450 0    50   ~ 0
BUS-ADDR12
Text Label 9050 3550 0    50   ~ 0
BUS-ADDR13
Text Label 9050 3650 0    50   ~ 0
BUS-ADDR14
Text Label 9050 3750 0    50   ~ 0
BUS-ADDR15
Text Label 9050 3850 0    50   ~ 0
BUS-ADDR16
Text Label 9050 5100 0    50   ~ 0
BUS-ADDR17
Text Label 9050 5200 0    50   ~ 0
BUS-ADDR18
Text Label 9050 5300 0    50   ~ 0
BUS-ADDR19
Text Label 9050 5400 0    50   ~ 0
BUS-ADDR20
Text Label 9050 5500 0    50   ~ 0
BUS-ADDR21
Text Label 9050 5600 0    50   ~ 0
BUS-ADDR22
Text Label 9050 5700 0    50   ~ 0
BUS-ADDR23
Text Label 9050 2200 0    50   ~ 0
~BUS-BGACK
Text Label 9050 4050 0    50   ~ 0
~BUS-BGACK
Text Label 9050 5900 0    50   ~ 0
~BUS-BGACK
Text Label 10650 1300 0    50   ~ 0
CA1
Text Label 10650 1400 0    50   ~ 0
CA2
Text Label 10650 1500 0    50   ~ 0
CA3
Text Label 10650 1600 0    50   ~ 0
CA4
Text Label 10650 1700 0    50   ~ 0
CA5
Text Label 10650 1800 0    50   ~ 0
CA6
Text Label 10650 1900 0    50   ~ 0
CA7
Text Label 10650 2000 0    50   ~ 0
CA8
Text Label 10650 3150 0    50   ~ 0
CA9
Text Label 10650 3250 0    50   ~ 0
CA10
Text Label 10650 3350 0    50   ~ 0
CA11
Text Label 10650 3450 0    50   ~ 0
CA12
Text Label 10650 3550 0    50   ~ 0
CA13
Text Label 10650 3650 0    50   ~ 0
CA14
Text Label 10650 3750 0    50   ~ 0
CA15
Text Label 10650 3850 0    50   ~ 0
CA16
Text Label 10650 5100 0    50   ~ 0
CA17
Text Label 10650 5200 0    50   ~ 0
CA18
Text Label 10650 5300 0    50   ~ 0
CA19
Text Label 10650 5400 0    50   ~ 0
CA20
Text Label 10650 5500 0    50   ~ 0
CA21
Text Label 10650 5600 0    50   ~ 0
CA22
Text HLabel 1250 7100 0    50   BiDi ~ 0
GFX-ADDR[0..19]
Text HLabel 5850 7100 2    50   BiDi ~ 0
BUS-DATA[0..15]
Text HLabel 6050 1050 0    50   Output ~ 0
CLK16M
Text HLabel 6150 2350 2    50   Input ~ 0
~CPSA-CS
Text HLabel 6150 2550 2    50   Input ~ 0
~BUS-WR
Text HLabel 6150 2700 2    50   Input ~ 0
~RESET
Text HLabel 6150 4500 2    50   Output ~ 0
XSEL
Text HLabel 6150 5300 2    50   Output ~ 0
FLIP
Text HLabel 6150 5400 2    50   Output ~ 0
~RESETI
Text HLabel 6150 5500 2    50   Output ~ 0
FI
Text HLabel 6150 5600 2    50   Output ~ 0
LI
Text HLabel 6150 5700 2    50   Output ~ 0
~WSTROM
Text HLabel 6150 5800 2    50   Output ~ 0
WSTLUT
Text HLabel 6150 6000 2    50   Output ~ 0
LUTPRO
Text HLabel 6350 3250 2    50   Input ~ 0
VSYNC
Text HLabel 6600 3800 2    50   Output ~ 0
XS[0..4]
Text HLabel 6600 4600 2    50   Output ~ 0
CB[0..4]
Text HLabel 7150 2800 2    50   Output ~ 0
CLK4M
Text HLabel 7150 2900 2    50   Output ~ 0
CLK8M
Text HLabel 7300 3000 2    50   Input ~ 0
HSYNC
Text HLabel 7500 3750 0    50   Input ~ 0
~BUS-OE
Text HLabel 8050 2050 2    50   Input ~ 0
~BUS-BGACK
Text HLabel 8050 2250 2    50   Output ~ 0
~CPSA-BR
Text HLabel 8700 900  0    50   Input ~ 0
BUS-ADDR[1..23]
$Comp
L power:VCC #PWR?
U 1 1 5E58F91C
P 4800 1150
AR Path="/5DDBF667/5E58F91C" Ref="#PWR?"  Part="1" 
AR Path="/5DD771EC/5E58F91C" Ref="#PWR0310"  Part="1" 
F 0 "#PWR0310" H 4800 1000 50  0001 C CNN
F 1 "VCC" H 4800 1300 50  0000 C CNN
F 2 "" H 4800 1150 50  0001 C CNN
F 3 "" H 4800 1150 50  0001 C CNN
	1    4800 1150
	1    0    0    -1  
$EndComp
$Comp
L power:VCC #PWR0273
U 1 1 5DE8D886
P 6650 3600
F 0 "#PWR0273" H 6650 3450 50  0001 C CNN
F 1 "VCC" H 6667 3773 50  0000 C CNN
F 2 "" H 6650 3600 50  0001 C CNN
F 3 "" H 6650 3600 50  0001 C CNN
	1    6650 3600
	1    0    0    -1  
$EndComp
$Comp
L power:VCC #PWR?
U 1 1 5E0E9DA6
P 8000 2950
AR Path="/5DDBF667/5E0E9DA6" Ref="#PWR?"  Part="1" 
AR Path="/5DD771EC/5E0E9DA6" Ref="#PWR0308"  Part="1" 
F 0 "#PWR0308" H 8000 2800 50  0001 C CNN
F 1 "VCC" H 7850 3000 50  0000 C CNN
F 2 "" H 8000 2950 50  0001 C CNN
F 3 "" H 8000 2950 50  0001 C CNN
	1    8000 2950
	1    0    0    -1  
$EndComp
$Comp
L power:VCC #PWR?
U 1 1 5DF3E050
P 8450 1350
AR Path="/5DDBF667/5DF3E050" Ref="#PWR?"  Part="1" 
AR Path="/5DD771EC/5DF3E050" Ref="#PWR0302"  Part="1" 
F 0 "#PWR0302" H 8450 1200 50  0001 C CNN
F 1 "VCC" H 8450 1500 50  0000 C CNN
F 2 "" H 8450 1350 50  0001 C CNN
F 3 "" H 8450 1350 50  0001 C CNN
	1    8450 1350
	1    0    0    -1  
$EndComp
$Comp
L power:VCC #PWR06
U 1 1 5DFB0309
P 8650 2250
F 0 "#PWR06" H 8650 2100 50  0001 C CNN
F 1 "VCC" H 8667 2423 50  0000 C CNN
F 2 "" H 8650 2250 50  0001 C CNN
F 3 "" H 8650 2250 50  0001 C CNN
	1    8650 2250
	1    0    0    -1  
$EndComp
$Comp
L power:VCC #PWR?
U 1 1 5E0E7DA0
P 10100 1000
AR Path="/5DDBF667/5E0E7DA0" Ref="#PWR?"  Part="1" 
AR Path="/5DD771EC/5E0E7DA0" Ref="#PWR0307"  Part="1" 
F 0 "#PWR0307" H 10100 850 50  0001 C CNN
F 1 "VCC" H 9950 1050 50  0000 C CNN
F 2 "" H 10100 1000 50  0001 C CNN
F 3 "" H 10100 1000 50  0001 C CNN
	1    10100 1000
	1    0    0    -1  
$EndComp
$Comp
L power:VCC #PWR?
U 1 1 5E0D3085
P 10100 2850
AR Path="/5DDBF667/5E0D3085" Ref="#PWR?"  Part="1" 
AR Path="/5DD771EC/5E0D3085" Ref="#PWR0303"  Part="1" 
F 0 "#PWR0303" H 10100 2700 50  0001 C CNN
F 1 "VCC" H 9950 2900 50  0000 C CNN
F 2 "" H 10100 2850 50  0001 C CNN
F 3 "" H 10100 2850 50  0001 C CNN
	1    10100 2850
	1    0    0    -1  
$EndComp
$Comp
L power:VCC #PWR?
U 1 1 5E0E40D2
P 10100 4700
AR Path="/5DDBF667/5E0E40D2" Ref="#PWR?"  Part="1" 
AR Path="/5DD771EC/5E0E40D2" Ref="#PWR0306"  Part="1" 
F 0 "#PWR0306" H 10100 4550 50  0001 C CNN
F 1 "VCC" H 9950 4750 50  0000 C CNN
F 2 "" H 10100 4700 50  0001 C CNN
F 3 "" H 10100 4700 50  0001 C CNN
	1    10100 4700
	1    0    0    -1  
$EndComp
$Comp
L power:GND #PWR0311
U 1 1 5E598F92
P 5550 1150
F 0 "#PWR0311" H 5550 900 50  0001 C CNN
F 1 "GND" H 5555 977 50  0001 C CNN
F 2 "" H 5550 1150 50  0001 C CNN
F 3 "" H 5550 1150 50  0001 C CNN
	1    5550 1150
	1    0    0    -1  
$EndComp
$Comp
L power:GND #PWR?
U 1 1 5DF3E032
P 7350 1550
AR Path="/5DF3E032" Ref="#PWR?"  Part="1" 
AR Path="/5E4999E7/5DF3E032" Ref="#PWR?"  Part="1" 
AR Path="/5DDBF667/5DF3E032" Ref="#PWR?"  Part="1" 
AR Path="/5DD771EC/5DF3E032" Ref="#PWR0301"  Part="1" 
F 0 "#PWR0301" H 7350 1300 50  0001 C CNN
F 1 "GND" H 7355 1377 50  0001 C CNN
F 2 "" H 7350 1550 50  0001 C CNN
F 3 "" H 7350 1550 50  0001 C CNN
	1    7350 1550
	-1   0    0    -1  
$EndComp
$Comp
L power:GND #PWR0309
U 1 1 5E0EA0D1
P 8000 4350
F 0 "#PWR0309" H 8000 4100 50  0001 C CNN
F 1 "GND" H 8005 4177 50  0001 C CNN
F 2 "" H 8000 4350 50  0001 C CNN
F 3 "" H 8000 4350 50  0001 C CNN
	1    8000 4350
	1    0    0    -1  
$EndComp
$Comp
L power:GND #PWR0304
U 1 1 5E0D3C9C
P 10100 2600
F 0 "#PWR0304" H 10100 2350 50  0001 C CNN
F 1 "GND" H 10105 2427 50  0001 C CNN
F 2 "" H 10100 2600 50  0001 C CNN
F 3 "" H 10100 2600 50  0001 C CNN
	1    10100 2600
	1    0    0    -1  
$EndComp
$Comp
L power:GND #PWR0305
U 1 1 5E0DBD1F
P 10100 4450
F 0 "#PWR0305" H 10100 4200 50  0001 C CNN
F 1 "GND" H 10105 4277 50  0001 C CNN
F 2 "" H 10100 4450 50  0001 C CNN
F 3 "" H 10100 4450 50  0001 C CNN
	1    10100 4450
	1    0    0    -1  
$EndComp
$Comp
L power:GND #PWR0411
U 1 1 5E3820A3
P 10100 6300
F 0 "#PWR0411" H 10100 6050 50  0001 C CNN
F 1 "GND" H 10105 6127 50  0001 C CNN
F 2 "" H 10100 6300 50  0001 C CNN
F 3 "" H 10100 6300 50  0001 C CNN
	1    10100 6300
	1    0    0    -1  
$EndComp
$Comp
L Device:R_Small R49
U 1 1 5DE88875
P 6400 3600
F 0 "R49" V 6204 3600 50  0000 C CNN
F 1 "4.7k" V 6295 3600 50  0000 C CNN
F 2 "" H 6400 3600 50  0001 C CNN
F 3 "~" H 6400 3600 50  0001 C CNN
	1    6400 3600
	0    1    1    0   
$EndComp
$Comp
L Device:R_Small R47
U 1 1 5DED422E
P 6850 3200
F 0 "R47" H 6909 3246 50  0000 L CNN
F 1 "4.7k" H 6909 3155 50  0000 L CNN
F 2 "" H 6850 3200 50  0001 C CNN
F 3 "~" H 6850 3200 50  0001 C CNN
	1    6850 3200
	1    0    0    -1  
$EndComp
$Comp
L Device:R_Small R48
U 1 1 5DED35BD
P 7200 3200
F 0 "R48" H 7259 3246 50  0000 L CNN
F 1 "4.7k" H 7259 3155 50  0000 L CNN
F 2 "" H 7200 3200 50  0001 C CNN
F 3 "~" H 7200 3200 50  0001 C CNN
	1    7200 3200
	1    0    0    -1  
$EndComp
$Comp
L Device:R_Small R50
U 1 1 5DFAFEC3
P 8650 2350
F 0 "R50" H 8709 2396 50  0000 L CNN
F 1 "1k" H 8709 2305 50  0000 L CNN
F 2 "" H 8650 2350 50  0001 C CNN
F 3 "~" H 8650 2350 50  0001 C CNN
	1    8650 2350
	1    0    0    -1  
$EndComp
$Comp
L Device:R_Small R54
U 1 1 5DE2986A
P 10900 5800
F 0 "R54" H 10959 5846 50  0000 L CNN
F 1 "4.7k" H 10959 5755 50  0000 L CNN
F 2 "" H 10900 5800 50  0001 C CNN
F 3 "~" H 10900 5800 50  0001 C CNN
	1    10900 5800
	1    0    0    -1  
$EndComp
$Comp
L Jumper:SolderJumper_2_Open JP?
U 1 1 5DF3E05F
P 6450 1050
AR Path="/5DDBF667/5DF3E05F" Ref="JP?"  Part="1" 
AR Path="/5DD771EC/5DF3E05F" Ref="JP4"  Part="1" 
F 0 "JP4" H 6450 1163 50  0000 C CNN
F 1 "SolderJumper_2_Open" H 6450 1164 50  0001 C CNN
F 2 "" H 6450 1050 50  0001 C CNN
F 3 "~" H 6450 1050 50  0001 C CNN
	1    6450 1050
	1    0    0    -1  
$EndComp
$Comp
L Device:Ferrite_Bead_Small FBJP?
U 1 1 5DF3E059
P 6450 1250
AR Path="/5DDBF667/5DF3E059" Ref="FBJP?"  Part="1" 
AR Path="/5DD771EC/5DF3E059" Ref="FBJP4"  Part="1" 
F 0 "FBJP4" V 6350 1100 50  0000 L CNN
F 1 "Ferrite_Bead_Small" H 6550 1205 50  0001 L CNN
F 2 "" V 6380 1250 50  0001 C CNN
F 3 "~" H 6450 1250 50  0001 C CNN
	1    6450 1250
	0    -1   -1   0   
$EndComp
$Comp
L Device:Ferrite_Bead_Small FB?
U 1 1 5DF3E03A
P 6450 1450
AR Path="/5DDBF667/5DF3E03A" Ref="FB?"  Part="1" 
AR Path="/5DD771EC/5DF3E03A" Ref="FB35"  Part="1" 
F 0 "FB35" V 6350 1300 50  0000 L CNN
F 1 "Ferrite_Bead_Small" H 6550 1405 50  0001 L CNN
F 2 "" V 6380 1450 50  0001 C CNN
F 3 "~" H 6450 1450 50  0001 C CNN
	1    6450 1450
	0    -1   -1   0   
$EndComp
$Comp
L Device:Ferrite_Bead_Small FB30
U 1 1 5DE44D5A
P 6800 2800
F 0 "FB30" V 6750 2650 50  0000 C CNN
F 1 "Ferrite_Bead_Small" V 6654 2800 50  0001 C CNN
F 2 "" V 6730 2800 50  0001 C CNN
F 3 "~" H 6800 2800 50  0001 C CNN
	1    6800 2800
	0    1    1    0   
$EndComp
$Comp
L Device:Ferrite_Bead_Small FB31
U 1 1 5DE45686
P 7050 2900
F 0 "FB31" V 7000 2750 50  0000 C CNN
F 1 "Ferrite_Bead_Small" V 6904 2900 50  0001 C CNN
F 2 "" V 6980 2900 50  0001 C CNN
F 3 "~" H 7050 2900 50  0001 C CNN
	1    7050 2900
	0    1    1    0   
$EndComp
$Comp
L 74xx:74LS04 UK?
U 2 1 5FF8FF36
P 7950 5900
AR Path="/5E5EEEC7/5FF8FF36" Ref="UK?"  Part="2" 
AR Path="/5DD771EC/5FF8FF36" Ref="UK13"  Part="2" 
F 0 "UK13" H 7950 6217 50  0000 C CNN
F 1 "74LS04" H 7950 6126 50  0000 C CNN
F 2 "" H 7950 5900 50  0001 C CNN
F 3 "http://www.ti.com/lit/gpn/sn74LS04" H 7950 5900 50  0001 C CNN
	2    7950 5900
	-1   0    0    -1  
$EndComp
$Comp
L 74xx:74LS32 US8
U 3 1 5DDF2386
P 7000 2150
F 0 "US8" H 7000 1850 50  0000 C CNN
F 1 "F32" H 7000 1950 50  0000 C CNN
F 2 "" H 7000 2150 50  0001 C CNN
F 3 "http://www.ti.com/lit/gpn/sn74LS32" H 7000 2150 50  0001 C CNN
	3    7000 2150
	-1   0    0    1   
$EndComp
$Comp
L 74xx:74LS32 US?
U 2 1 5DF3E02C
P 7050 1450
AR Path="/5DF3E02C" Ref="US?"  Part="2" 
AR Path="/5DDBF667/5DF3E02C" Ref="US?"  Part="2" 
AR Path="/5DD771EC/5DF3E02C" Ref="US8"  Part="2" 
F 0 "US8" H 7050 1775 50  0000 C CNN
F 1 "F32" H 7050 1684 50  0000 C CNN
F 2 "" H 7050 1450 50  0001 C CNN
F 3 "http://www.ti.com/lit/gpn/sn74LS32" H 7050 1450 50  0001 C CNN
	2    7050 1450
	-1   0    0    -1  
$EndComp
$Comp
L CPS2-Custom:MCO8100 U?
U 1 1 5DF3E040
P 8050 1500
AR Path="/5DDBF667/5DF3E040" Ref="U?"  Part="1" 
AR Path="/5DD771EC/5DF3E040" Ref="US9"  Part="1" 
F 0 "US9" H 8050 1750 50  0000 C CNN
F 1 "16MHz" H 8050 1250 50  0000 C CNN
F 2 "" V 8200 1550 50  0001 C CNN
F 3 "" V 8200 1550 50  0001 C CNN
	1    8050 1500
	-1   0    0    -1  
$EndComp
$Comp
L 74xx:74LS367 US13
U 1 1 5DD82AC5
P 8000 3650
F 0 "US13" H 7800 4200 50  0000 C CNN
F 1 "74LS367" H 8200 3050 50  0000 C CNN
F 2 "" H 8000 3650 50  0001 C CNN
F 3 "http://www.ti.com/lit/gpn/sn74LS367" H 8000 3650 50  0001 C CNN
	1    8000 3650
	1    0    0    -1  
$EndComp
$Comp
L 74xx:74LS245 UP11
U 1 1 5DD838CD
P 10100 1800
F 0 "UP11" H 9800 2500 50  0000 C CNN
F 1 "74LS245" H 10300 1100 50  0000 C CNN
F 2 "" H 10100 1800 50  0001 C CNN
F 3 "http://www.ti.com/lit/gpn/sn74LS245" H 10100 1800 50  0001 C CNN
	1    10100 1800
	1    0    0    -1  
$EndComp
$Comp
L 74xx:74LS245 UR11
U 1 1 5DD8451E
P 10100 3650
F 0 "UR11" H 9850 4350 50  0000 C CNN
F 1 "74LS245" H 10300 2950 50  0000 C CNN
F 2 "" H 10100 3650 50  0001 C CNN
F 3 "http://www.ti.com/lit/gpn/sn74LS245" H 10100 3650 50  0001 C CNN
	1    10100 3650
	1    0    0    -1  
$EndComp
$Comp
L 74xx:74LS245 US11
U 1 1 5DD83DB2
P 10100 5500
F 0 "US11" H 9800 6200 50  0000 C CNN
F 1 "74LS245" H 10300 4800 50  0000 C CNN
F 2 "" H 10100 5500 50  0001 C CNN
F 3 "http://www.ti.com/lit/gpn/sn74LS245" H 10100 5500 50  0001 C CNN
	1    10100 5500
	1    0    0    -1  
$EndComp
$Comp
L CPS2-Custom:DL-0311 UP8
U 1 1 5DFE7F2E
P 3650 3750
F 0 "UP8" H 3650 4000 200 0000 C CNN
F 1 "DL-0311" H 3650 3450 200 0000 C CNN
F 2 "" V 2300 1450 50  0001 C CNN
F 3 "" V 2300 1450 50  0001 C CNN
	1    3650 3750
	1    0    0    -1  
$EndComp
Wire Bus Line
	6500 3800 6500 4300
Wire Bus Line
	6500 4600 6500 5100
Wire Bus Line
	1250 7100 3350 7100
Wire Bus Line
	1600 750  11000 750 
Wire Bus Line
	4150 7100 5850 7100
Wire Bus Line
	8900 900  8900 5600
Wire Bus Line
	11000 750  11000 5500
$EndSCHEMATC
