EESchema Schematic File Version 4
EELAYER 30 0
EELAYER END
$Descr A3 16535 11693
encoding utf-8
Sheet 19 69
Title ""
Date "2020-11-26"
Rev ""
Comp ""
Comment1 "Licence: CC-BY"
Comment2 "Author: Loïc *WydD* Petit"
Comment3 ""
Comment4 ""
$EndDescr
Connection ~ 7750 4700
Connection ~ 7850 4600
Connection ~ 7950 4500
Connection ~ 8250 3600
Connection ~ 8050 3700
Connection ~ 6950 4000
Connection ~ 6950 3200
Connection ~ 8250 2200
Connection ~ 8050 2300
Connection ~ 8050 3000
Connection ~ 8250 2900
Connection ~ 7850 3900
Connection ~ 7950 3800
Connection ~ 7950 3100
Connection ~ 8050 4400
Connection ~ 6050 3850
Connection ~ 6050 3050
Connection ~ 6050 4650
Connection ~ 6950 4800
Connection ~ 7750 9800
Connection ~ 8250 8700
Connection ~ 8050 8800
Connection ~ 6950 9100
Connection ~ 6950 8300
Connection ~ 8250 7300
Connection ~ 8050 7400
Connection ~ 8050 8100
Connection ~ 8250 8000
Connection ~ 7850 9000
Connection ~ 7950 8900
Connection ~ 7950 8200
Connection ~ 6050 8950
Connection ~ 6050 8150
Connection ~ 6950 9900
Connection ~ 6950 7500
Connection ~ 6050 9750
Connection ~ 8050 9500
Connection ~ 7950 9600
Connection ~ 7850 9700
Connection ~ 7950 10400
Connection ~ 7850 10500
Connection ~ 7750 10600
Connection ~ 6950 5500
NoConn ~ 7650 3800
NoConn ~ 7650 2200
NoConn ~ 7650 4600
NoConn ~ 7650 8900
NoConn ~ 7650 8100
NoConn ~ 7650 7300
NoConn ~ 7650 9700
NoConn ~ 7650 3000
Entry Wire Line
	8750 5200 8850 5300
Entry Wire Line
	8750 5300 8850 5400
Entry Wire Line
	8750 5400 8850 5500
Entry Wire Line
	8750 5500 8850 5600
Entry Wire Line
	8750 10300 8850 10400
Entry Wire Line
	8750 10400 8850 10500
Entry Wire Line
	8750 10500 8850 10600
Entry Wire Line
	8750 10600 8850 10700
Wire Wire Line
	5200 1300 5200 4550
Wire Wire Line
	5200 1300 10300 1300
Wire Wire Line
	5200 4550 6150 4550
Wire Wire Line
	5200 6400 5200 9650
Wire Wire Line
	5200 6400 10300 6400
Wire Wire Line
	5200 9650 6150 9650
Wire Wire Line
	5300 1400 10200 1400
Wire Wire Line
	5300 3750 5300 1400
Wire Wire Line
	5300 3750 6150 3750
Wire Wire Line
	5300 6500 10200 6500
Wire Wire Line
	5300 8850 5300 6500
Wire Wire Line
	5300 8850 6150 8850
Wire Wire Line
	5400 1500 5400 2950
Wire Wire Line
	5400 1500 10100 1500
Wire Wire Line
	5400 2950 6150 2950
Wire Wire Line
	5400 6600 5400 8050
Wire Wire Line
	5400 6600 10100 6600
Wire Wire Line
	5400 8050 6150 8050
Wire Wire Line
	5500 1600 10000 1600
Wire Wire Line
	5500 2150 5500 1600
Wire Wire Line
	5500 6700 10000 6700
Wire Wire Line
	5500 7250 5500 6700
Wire Wire Line
	5500 10100 5200 10100
Wire Wire Line
	5500 10850 5500 10200
Wire Wire Line
	6050 2250 6050 3050
Wire Wire Line
	6050 3050 6050 3850
Wire Wire Line
	6050 3850 6050 4650
Wire Wire Line
	6050 4650 5750 4650
Wire Wire Line
	6050 4650 6150 4650
Wire Wire Line
	6050 7350 6050 8150
Wire Wire Line
	6050 8150 6050 8950
Wire Wire Line
	6050 8950 6050 9750
Wire Wire Line
	6050 9750 6150 9750
Wire Wire Line
	6050 10150 6050 9750
Wire Wire Line
	6150 2150 5500 2150
Wire Wire Line
	6150 2250 6050 2250
Wire Wire Line
	6150 3050 6050 3050
Wire Wire Line
	6150 3850 6050 3850
Wire Wire Line
	6150 7250 5500 7250
Wire Wire Line
	6150 7350 6050 7350
Wire Wire Line
	6150 8150 6050 8150
Wire Wire Line
	6150 8950 6050 8950
Wire Wire Line
	6700 2200 7150 2200
Wire Wire Line
	6700 3000 7150 3000
Wire Wire Line
	6700 3800 7150 3800
Wire Wire Line
	6700 4600 7150 4600
Wire Wire Line
	6700 7300 7150 7300
Wire Wire Line
	6700 8100 7150 8100
Wire Wire Line
	6700 8900 7150 8900
Wire Wire Line
	6700 9700 7150 9700
Wire Wire Line
	6800 5500 6950 5500
Wire Wire Line
	6800 10100 6950 10100
Wire Wire Line
	6850 1100 6850 1200
Wire Wire Line
	6850 1200 6250 1200
Wire Wire Line
	6950 2400 7150 2400
Wire Wire Line
	6950 3200 6950 2400
Wire Wire Line
	6950 3200 7150 3200
Wire Wire Line
	6950 4000 6950 3200
Wire Wire Line
	6950 4800 6950 4000
Wire Wire Line
	6950 4800 6950 5500
Wire Wire Line
	6950 4800 7150 4800
Wire Wire Line
	6950 7500 6950 5500
Wire Wire Line
	6950 7500 7150 7500
Wire Wire Line
	6950 8300 6950 7500
Wire Wire Line
	6950 8300 7150 8300
Wire Wire Line
	6950 9100 6950 8300
Wire Wire Line
	6950 9900 6950 9100
Wire Wire Line
	6950 9900 7150 9900
Wire Wire Line
	6950 10100 6950 9900
Wire Wire Line
	7050 10850 5500 10850
Wire Wire Line
	7150 4000 6950 4000
Wire Wire Line
	7150 9100 6950 9100
Wire Wire Line
	7650 1050 7400 1050
Wire Wire Line
	7650 2300 8050 2300
Wire Wire Line
	7650 3100 7950 3100
Wire Wire Line
	7650 3900 7850 3900
Wire Wire Line
	7650 4700 7750 4700
Wire Wire Line
	7650 7400 8050 7400
Wire Wire Line
	7650 8200 7950 8200
Wire Wire Line
	7650 9000 7850 9000
Wire Wire Line
	7650 9800 7750 9800
Wire Wire Line
	7650 10800 7850 10800
Wire Wire Line
	7650 11000 7950 11000
Wire Wire Line
	7750 1900 7750 4700
Wire Wire Line
	7750 4700 7750 5500
Wire Wire Line
	7750 5500 8750 5500
Wire Wire Line
	7750 7000 7750 9800
Wire Wire Line
	7750 9800 7750 10600
Wire Wire Line
	7750 10600 7750 10700
Wire Wire Line
	7750 10600 8750 10600
Wire Wire Line
	7750 10700 7650 10700
Wire Wire Line
	7850 3900 7850 1900
Wire Wire Line
	7850 3900 7850 4600
Wire Wire Line
	7850 4600 7850 5400
Wire Wire Line
	7850 5400 8750 5400
Wire Wire Line
	7850 9000 7850 7000
Wire Wire Line
	7850 9000 7850 9700
Wire Wire Line
	7850 9700 7850 10500
Wire Wire Line
	7850 10500 8750 10500
Wire Wire Line
	7850 10800 7850 10500
Wire Wire Line
	7950 3100 7950 1900
Wire Wire Line
	7950 3100 7950 3800
Wire Wire Line
	7950 3800 7950 4500
Wire Wire Line
	7950 3800 8800 3800
Wire Wire Line
	7950 4500 7950 5300
Wire Wire Line
	7950 5300 8750 5300
Wire Wire Line
	7950 8200 7950 7000
Wire Wire Line
	7950 8200 7950 8900
Wire Wire Line
	7950 8900 7950 9600
Wire Wire Line
	7950 8900 8800 8900
Wire Wire Line
	7950 9600 7950 10400
Wire Wire Line
	7950 10400 7950 10900
Wire Wire Line
	7950 10400 8750 10400
Wire Wire Line
	7950 10900 7650 10900
Wire Wire Line
	8050 1900 8050 2300
Wire Wire Line
	8050 2300 8050 3000
Wire Wire Line
	8050 3000 8050 3700
Wire Wire Line
	8050 3700 8050 4400
Wire Wire Line
	8050 3700 8800 3700
Wire Wire Line
	8050 4400 8050 5200
Wire Wire Line
	8050 5200 8750 5200
Wire Wire Line
	8050 7000 8050 7400
Wire Wire Line
	8050 7400 8050 8100
Wire Wire Line
	8050 8100 8050 8800
Wire Wire Line
	8050 8800 8050 9500
Wire Wire Line
	8050 8800 8800 8800
Wire Wire Line
	8050 9500 8050 10300
Wire Wire Line
	8050 10300 8750 10300
Wire Wire Line
	8250 1050 8250 2200
Wire Wire Line
	8250 2200 8250 2900
Wire Wire Line
	8250 2900 8250 3600
Wire Wire Line
	8250 3600 8250 4300
Wire Wire Line
	8250 3600 8800 3600
Wire Wire Line
	8250 6200 8250 7300
Wire Wire Line
	8250 7300 8250 8000
Wire Wire Line
	8250 8000 8250 8700
Wire Wire Line
	8250 8700 8250 9400
Wire Wire Line
	8250 8700 8800 8700
Wire Wire Line
	8750 4300 8250 4300
Wire Wire Line
	8750 4400 8050 4400
Wire Wire Line
	8750 4500 7950 4500
Wire Wire Line
	8750 4600 7850 4600
Wire Wire Line
	8750 9400 8250 9400
Wire Wire Line
	8750 9500 8050 9500
Wire Wire Line
	8750 9600 7950 9600
Wire Wire Line
	8750 9700 7850 9700
Wire Wire Line
	8800 2900 8250 2900
Wire Wire Line
	8800 3000 8050 3000
Wire Wire Line
	8800 8000 8250 8000
Wire Wire Line
	8800 8100 8050 8100
Wire Wire Line
	9350 2200 8250 2200
Wire Wire Line
	9350 2300 8050 2300
Wire Wire Line
	9350 3000 9350 2950
Wire Wire Line
	9350 3100 7950 3100
Wire Wire Line
	9350 3800 9350 3700
Wire Wire Line
	9350 3900 7850 3900
Wire Wire Line
	9350 4450 9350 4600
Wire Wire Line
	9350 4700 7750 4700
Wire Wire Line
	9350 7300 8250 7300
Wire Wire Line
	9350 7400 8050 7400
Wire Wire Line
	9350 8100 9350 8050
Wire Wire Line
	9350 8200 7950 8200
Wire Wire Line
	9350 8900 9350 8800
Wire Wire Line
	9350 9000 7850 9000
Wire Wire Line
	9350 9550 9350 9700
Wire Wire Line
	9350 9800 7750 9800
Wire Wire Line
	9900 2250 10000 2250
Wire Wire Line
	9900 3850 10200 3850
Wire Wire Line
	9900 4650 10300 4650
Wire Wire Line
	9900 7350 10000 7350
Wire Wire Line
	9900 8950 10200 8950
Wire Wire Line
	9900 9750 10300 9750
Wire Wire Line
	10000 1600 10000 2250
Wire Wire Line
	10000 6700 10000 7350
Wire Wire Line
	10100 1500 10100 3050
Wire Wire Line
	10100 3050 9900 3050
Wire Wire Line
	10100 6600 10100 8150
Wire Wire Line
	10100 8150 9900 8150
Wire Wire Line
	10200 1400 10200 3850
Wire Wire Line
	10200 6500 10200 8950
Wire Wire Line
	10300 1300 10300 4650
Wire Wire Line
	10300 6400 10300 9750
Wire Bus Line
	8850 5700 8950 5700
Wire Bus Line
	8850 10800 8950 10800
Text Label 7650 1050 2    50   ~ 0
IC
Text Label 7650 6200 2    50   ~ 0
IC
Text Label 7950 11000 2    50   ~ 0
IC
Text Label 8350 5200 0    50   ~ 0
CNT0-Q0
Text Label 8350 5300 0    50   ~ 0
CNT0-Q1
Text Label 8350 5400 0    50   ~ 0
CNT0-Q2
Text Label 8350 5500 0    50   ~ 0
CNT0-Q3
Text Label 8350 10300 0    50   ~ 0
CNT1-Q0
Text Label 8350 10400 0    50   ~ 0
CNT1-Q1
Text Label 8350 10500 0    50   ~ 0
CNT1-Q2
Text Label 8350 10600 0    50   ~ 0
CNT1-Q3
Text HLabel 5200 10100 0    50   Input ~ 0
~RESETI
Text HLabel 5750 4650 0    50   Input ~ 0
~RESETI
Text HLabel 6250 1200 0    50   Input ~ 0
INC
Text HLabel 6800 5500 0    50   Input ~ 0
~CLK8M
Text HLabel 6800 10100 0    50   Input ~ 0
~CLK8M
Text HLabel 8950 5700 2    50   Output ~ 0
CNT0-Q[0..3]
Text HLabel 8950 10800 2    50   Output ~ 0
CNT1-Q[0..3]
$Comp
L A5C:AND02 UBD?
U 1 1 61AB2EEA
P 5750 10150
AR Path="/61AB2EEA" Ref="UBD?"  Part="1" 
AR Path="/619820FD/61AB2EEA" Ref="UBD302"  Part="1" 
AR Path="/5FBCE4A9/5FBD0B58/61AB2EEA" Ref="UBD302"  Part="1" 
F 0 "UBD302" H 5775 10417 50  0000 C CNN
F 1 "AND02" H 5775 10326 50  0000 C CNN
F 2 "" H 5750 10150 50  0001 C CNN
F 3 "" H 5750 10150 50  0001 C CNN
	1    5750 10150
	1    0    0    -1  
$EndComp
$Comp
L A5C:NAND02 UBK?
U 1 1 6198F239
P 6400 2200
AR Path="/5FB7F2B2/6198F239" Ref="UBK?"  Part="1" 
AR Path="/619820FD/6198F239" Ref="UBH275"  Part="1" 
AR Path="/5FBCE4A9/5FBD0B58/6198F239" Ref="UBH275"  Part="1" 
F 0 "UBH275" H 6425 2467 50  0000 C CNN
F 1 "NAND02" H 6425 2376 50  0000 C CNN
F 2 "" H 6400 2200 50  0001 C CNN
F 3 "" H 6400 2200 50  0001 C CNN
	1    6400 2200
	1    0    0    -1  
$EndComp
$Comp
L A5C:NAND02 UBK?
U 1 1 6198F23F
P 6400 3000
AR Path="/5FB7F2B2/6198F23F" Ref="UBK?"  Part="1" 
AR Path="/619820FD/6198F23F" Ref="UBH277"  Part="1" 
AR Path="/5FBCE4A9/5FBD0B58/6198F23F" Ref="UBH277"  Part="1" 
F 0 "UBH277" H 6425 3267 50  0000 C CNN
F 1 "NAND02" H 6425 3176 50  0000 C CNN
F 2 "" H 6400 3000 50  0001 C CNN
F 3 "" H 6400 3000 50  0001 C CNN
	1    6400 3000
	1    0    0    -1  
$EndComp
$Comp
L A5C:NAND02 UBK?
U 1 1 6198F245
P 6400 3800
AR Path="/5FB7F2B2/6198F245" Ref="UBK?"  Part="1" 
AR Path="/619820FD/6198F245" Ref="UBH278"  Part="1" 
AR Path="/5FBCE4A9/5FBD0B58/6198F245" Ref="UBH278"  Part="1" 
F 0 "UBH278" H 6425 4067 50  0000 C CNN
F 1 "NAND02" H 6425 3976 50  0000 C CNN
F 2 "" H 6400 3800 50  0001 C CNN
F 3 "" H 6400 3800 50  0001 C CNN
	1    6400 3800
	1    0    0    -1  
$EndComp
$Comp
L A5C:NAND02 UBK?
U 1 1 6198F24B
P 6400 4600
AR Path="/5FB7F2B2/6198F24B" Ref="UBK?"  Part="1" 
AR Path="/619820FD/6198F24B" Ref="UBH280"  Part="1" 
AR Path="/5FBCE4A9/5FBD0B58/6198F24B" Ref="UBH280"  Part="1" 
F 0 "UBH280" H 6425 4867 50  0000 C CNN
F 1 "NAND02" H 6425 4776 50  0000 C CNN
F 2 "" H 6400 4600 50  0001 C CNN
F 3 "" H 6400 4600 50  0001 C CNN
	1    6400 4600
	1    0    0    -1  
$EndComp
$Comp
L A5C:NAND02 UBW?
U 1 1 6198F2F5
P 6400 7300
AR Path="/5FB7F2B2/6198F2F5" Ref="UBW?"  Part="1" 
AR Path="/619820FD/6198F2F5" Ref="UBD277"  Part="1" 
AR Path="/5FBCE4A9/5FBD0B58/6198F2F5" Ref="UBD277"  Part="1" 
F 0 "UBD277" H 6425 7567 50  0000 C CNN
F 1 "NAND02" H 6425 7476 50  0000 C CNN
F 2 "" H 6400 7300 50  0001 C CNN
F 3 "" H 6400 7300 50  0001 C CNN
	1    6400 7300
	1    0    0    -1  
$EndComp
$Comp
L A5C:NAND02 UBW?
U 1 1 6198F2FB
P 6400 8100
AR Path="/5FB7F2B2/6198F2FB" Ref="UBW?"  Part="1" 
AR Path="/619820FD/6198F2FB" Ref="UBD279"  Part="1" 
AR Path="/5FBCE4A9/5FBD0B58/6198F2FB" Ref="UBD279"  Part="1" 
F 0 "UBD279" H 6425 8367 50  0000 C CNN
F 1 "NAND02" H 6425 8276 50  0000 C CNN
F 2 "" H 6400 8100 50  0001 C CNN
F 3 "" H 6400 8100 50  0001 C CNN
	1    6400 8100
	1    0    0    -1  
$EndComp
$Comp
L A5C:NAND02 UBW?
U 1 1 6198F301
P 6400 8900
AR Path="/5FB7F2B2/6198F301" Ref="UBW?"  Part="1" 
AR Path="/619820FD/6198F301" Ref="UBD280"  Part="1" 
AR Path="/5FBCE4A9/5FBD0B58/6198F301" Ref="UBD280"  Part="1" 
F 0 "UBD280" H 6425 9167 50  0000 C CNN
F 1 "NAND02" H 6425 9076 50  0000 C CNN
F 2 "" H 6400 8900 50  0001 C CNN
F 3 "" H 6400 8900 50  0001 C CNN
	1    6400 8900
	1    0    0    -1  
$EndComp
$Comp
L A5C:NAND02 UBW?
U 1 1 6198F307
P 6400 9700
AR Path="/5FB7F2B2/6198F307" Ref="UBW?"  Part="1" 
AR Path="/619820FD/6198F307" Ref="UBD282"  Part="1" 
AR Path="/5FBCE4A9/5FBD0B58/6198F307" Ref="UBD282"  Part="1" 
F 0 "UBD282" H 6425 9967 50  0000 C CNN
F 1 "NAND02" H 6425 9876 50  0000 C CNN
F 2 "" H 6400 9700 50  0001 C CNN
F 3 "" H 6400 9700 50  0001 C CNN
	1    6400 9700
	1    0    0    -1  
$EndComp
$Comp
L A5C:OR02 UBN?
U 1 1 6198F36B
P 7100 1050
AR Path="/5FB7F2B2/6198F36B" Ref="UBN?"  Part="1" 
AR Path="/619820FD/6198F36B" Ref="UBK295"  Part="1" 
AR Path="/5FBCE4A9/5FBD0B58/6198F36B" Ref="UBK295"  Part="1" 
F 0 "UBK295" H 7125 1317 50  0000 C CNN
F 1 "OR02" H 7125 1226 50  0000 C CNN
F 2 "" H 7150 1050 50  0001 C CNN
F 3 "" H 7150 1050 50  0001 C CNN
	1    7100 1050
	1    0    0    -1  
$EndComp
$Comp
L A5C:NAND02 UBD?
U 1 1 6198F220
P 9050 2950
AR Path="/5FB7F2B2/6198F220" Ref="UBD?"  Part="1" 
AR Path="/619820FD/6198F220" Ref="UBH304"  Part="1" 
AR Path="/5FBCE4A9/5FBD0B58/6198F220" Ref="UBH304"  Part="1" 
F 0 "UBH304" H 9075 3217 50  0000 C CNN
F 1 "NAND02" H 9075 3126 50  0000 C CNN
F 2 "" H 9050 2950 50  0001 C CNN
F 3 "" H 9050 2950 50  0001 C CNN
	1    9050 2950
	1    0    0    -1  
$EndComp
$Comp
L A5C:NAND02 UBW?
U 1 1 6198F2E0
P 9050 8050
AR Path="/5FB7F2B2/6198F2E0" Ref="UBW?"  Part="1" 
AR Path="/619820FD/6198F2E0" Ref="UBD306"  Part="1" 
AR Path="/5FBCE4A9/5FBD0B58/6198F2E0" Ref="UBD306"  Part="1" 
F 0 "UBD306" H 9075 8317 50  0000 C CNN
F 1 "NAND02" H 9075 8226 50  0000 C CNN
F 2 "" H 9050 8050 50  0001 C CNN
F 3 "" H 9050 8050 50  0001 C CNN
	1    9050 8050
	1    0    0    -1  
$EndComp
$Comp
L A5C:XOR02 UBK?
U 1 1 6198F1E9
P 9600 2250
AR Path="/5FD56F21/6198F1E9" Ref="UBK?"  Part="1" 
AR Path="/621ABC04/6198F1E9" Ref="UBK?"  Part="1" 
AR Path="/5FAC57E1/6198F1E9" Ref="UBK?"  Part="1" 
AR Path="/5FB7F2B2/6198F1E9" Ref="UBK?"  Part="1" 
AR Path="/619820FD/6198F1E9" Ref="UBH282"  Part="1" 
AR Path="/5FBCE4A9/5FBD0B58/6198F1E9" Ref="UBH282"  Part="1" 
F 0 "UBH282" H 9625 2517 50  0000 C CNN
F 1 "XOR02" H 9625 2426 50  0000 C CNN
F 2 "" H 9600 2250 50  0001 C CNN
F 3 "" H 9600 2250 50  0001 C CNN
	1    9600 2250
	1    0    0    -1  
$EndComp
$Comp
L A5C:XNOR02 UBK?
U 1 1 6198F1EF
P 9600 3050
AR Path="/5FD56F21/6198F1EF" Ref="UBK?"  Part="1" 
AR Path="/621ABC04/6198F1EF" Ref="UBK?"  Part="1" 
AR Path="/5FAC57E1/6198F1EF" Ref="UBK?"  Part="1" 
AR Path="/5FB7F2B2/6198F1EF" Ref="UBK?"  Part="1" 
AR Path="/619820FD/6198F1EF" Ref="UBH299"  Part="1" 
AR Path="/5FBCE4A9/5FBD0B58/6198F1EF" Ref="UBH299"  Part="1" 
F 0 "UBH299" H 9600 3367 50  0000 C CNN
F 1 "XNOR02" H 9600 3276 50  0000 C CNN
F 2 "" H 9600 3050 50  0001 C CNN
F 3 "" H 9600 3050 50  0001 C CNN
	1    9600 3050
	1    0    0    -1  
$EndComp
$Comp
L A5C:XNOR02 UBK?
U 1 1 6198F1F5
P 9600 3850
AR Path="/5FD56F21/6198F1F5" Ref="UBK?"  Part="1" 
AR Path="/621ABC04/6198F1F5" Ref="UBK?"  Part="1" 
AR Path="/5FAC57E1/6198F1F5" Ref="UBK?"  Part="1" 
AR Path="/5FB7F2B2/6198F1F5" Ref="UBK?"  Part="1" 
AR Path="/619820FD/6198F1F5" Ref="UBH297"  Part="1" 
AR Path="/5FBCE4A9/5FBD0B58/6198F1F5" Ref="UBH297"  Part="1" 
F 0 "UBH297" H 9600 4167 50  0000 C CNN
F 1 "XNOR02" H 9600 4076 50  0000 C CNN
F 2 "" H 9600 3850 50  0001 C CNN
F 3 "" H 9600 3850 50  0001 C CNN
	1    9600 3850
	1    0    0    -1  
$EndComp
$Comp
L A5C:XNOR02 UBK?
U 1 1 6198F1FB
P 9600 4650
AR Path="/5FD56F21/6198F1FB" Ref="UBK?"  Part="1" 
AR Path="/621ABC04/6198F1FB" Ref="UBK?"  Part="1" 
AR Path="/5FAC57E1/6198F1FB" Ref="UBK?"  Part="1" 
AR Path="/5FB7F2B2/6198F1FB" Ref="UBK?"  Part="1" 
AR Path="/619820FD/6198F1FB" Ref="UBH291"  Part="1" 
AR Path="/5FBCE4A9/5FBD0B58/6198F1FB" Ref="UBH291"  Part="1" 
F 0 "UBH291" H 9600 4967 50  0000 C CNN
F 1 "XNOR02" H 9600 4876 50  0000 C CNN
F 2 "" H 9600 4650 50  0001 C CNN
F 3 "" H 9600 4650 50  0001 C CNN
	1    9600 4650
	1    0    0    -1  
$EndComp
$Comp
L A5C:XOR02 UBW?
U 1 1 6198F2A9
P 9600 7350
AR Path="/5FD56F21/6198F2A9" Ref="UBW?"  Part="1" 
AR Path="/621ABC04/6198F2A9" Ref="UBW?"  Part="1" 
AR Path="/5FAC57E1/6198F2A9" Ref="UBW?"  Part="1" 
AR Path="/5FB7F2B2/6198F2A9" Ref="UBW?"  Part="1" 
AR Path="/619820FD/6198F2A9" Ref="UBD310"  Part="1" 
AR Path="/5FBCE4A9/5FBD0B58/6198F2A9" Ref="UBD310"  Part="1" 
F 0 "UBD310" H 9625 7617 50  0000 C CNN
F 1 "XOR02" H 9625 7526 50  0000 C CNN
F 2 "" H 9600 7350 50  0001 C CNN
F 3 "" H 9600 7350 50  0001 C CNN
	1    9600 7350
	1    0    0    -1  
$EndComp
$Comp
L A5C:XNOR02 UBW?
U 1 1 6198F2AF
P 9600 8150
AR Path="/5FD56F21/6198F2AF" Ref="UBW?"  Part="1" 
AR Path="/621ABC04/6198F2AF" Ref="UBW?"  Part="1" 
AR Path="/5FAC57E1/6198F2AF" Ref="UBW?"  Part="1" 
AR Path="/5FB7F2B2/6198F2AF" Ref="UBW?"  Part="1" 
AR Path="/619820FD/6198F2AF" Ref="UBD299"  Part="1" 
AR Path="/5FBCE4A9/5FBD0B58/6198F2AF" Ref="UBD299"  Part="1" 
F 0 "UBD299" H 9600 8467 50  0000 C CNN
F 1 "XNOR02" H 9600 8376 50  0000 C CNN
F 2 "" H 9600 8150 50  0001 C CNN
F 3 "" H 9600 8150 50  0001 C CNN
	1    9600 8150
	1    0    0    -1  
$EndComp
$Comp
L A5C:XNOR02 UBW?
U 1 1 6198F2B5
P 9600 8950
AR Path="/5FD56F21/6198F2B5" Ref="UBW?"  Part="1" 
AR Path="/621ABC04/6198F2B5" Ref="UBW?"  Part="1" 
AR Path="/5FAC57E1/6198F2B5" Ref="UBW?"  Part="1" 
AR Path="/5FB7F2B2/6198F2B5" Ref="UBW?"  Part="1" 
AR Path="/619820FD/6198F2B5" Ref="UBD294"  Part="1" 
AR Path="/5FBCE4A9/5FBD0B58/6198F2B5" Ref="UBD294"  Part="1" 
F 0 "UBD294" H 9600 9267 50  0000 C CNN
F 1 "XNOR02" H 9600 9176 50  0000 C CNN
F 2 "" H 9600 8950 50  0001 C CNN
F 3 "" H 9600 8950 50  0001 C CNN
	1    9600 8950
	1    0    0    -1  
$EndComp
$Comp
L A5C:XNOR02 UBW?
U 1 1 6198F2BB
P 9600 9750
AR Path="/5FD56F21/6198F2BB" Ref="UBW?"  Part="1" 
AR Path="/621ABC04/6198F2BB" Ref="UBW?"  Part="1" 
AR Path="/5FAC57E1/6198F2BB" Ref="UBW?"  Part="1" 
AR Path="/5FB7F2B2/6198F2BB" Ref="UBW?"  Part="1" 
AR Path="/619820FD/6198F2BB" Ref="UBD274"  Part="1" 
AR Path="/5FBCE4A9/5FBD0B58/6198F2BB" Ref="UBD274"  Part="1" 
F 0 "UBD274" H 9600 10067 50  0000 C CNN
F 1 "XNOR02" H 9600 9976 50  0000 C CNN
F 2 "" H 9600 9750 50  0001 C CNN
F 3 "" H 9600 9750 50  0001 C CNN
	1    9600 9750
	1    0    0    -1  
$EndComp
$Comp
L A5C:NAND03 UBK?
U 1 1 6198F226
P 9050 3700
AR Path="/5FB7F2B2/6198F226" Ref="UBK?"  Part="1" 
AR Path="/619820FD/6198F226" Ref="UBH302"  Part="1" 
AR Path="/5FBCE4A9/5FBD0B58/6198F226" Ref="UBH302"  Part="1" 
F 0 "UBH302" H 9075 3992 50  0000 C CNN
F 1 "NAND03" H 9075 3901 50  0000 C CNN
F 2 "" H 9050 3700 50  0001 C CNN
F 3 "" H 9050 3700 50  0001 C CNN
	1    9050 3700
	1    0    0    -1  
$EndComp
$Comp
L A5C:NAND03 UBW?
U 1 1 6198F2E6
P 9050 8800
AR Path="/5FB7F2B2/6198F2E6" Ref="UBW?"  Part="1" 
AR Path="/619820FD/6198F2E6" Ref="UBD304"  Part="1" 
AR Path="/5FBCE4A9/5FBD0B58/6198F2E6" Ref="UBD304"  Part="1" 
F 0 "UBD304" H 9075 9092 50  0000 C CNN
F 1 "NAND03" H 9075 9001 50  0000 C CNN
F 2 "" H 9050 8800 50  0001 C CNN
F 3 "" H 9050 8800 50  0001 C CNN
	1    9050 8800
	1    0    0    -1  
$EndComp
$Comp
L A5C:INV01 UBN?
U 1 1 6198F371
P 6550 1000
AR Path="/6198F371" Ref="UBN?"  Part="1" 
AR Path="/5FB7F2B2/6198F371" Ref="UBN?"  Part="1" 
AR Path="/619820FD/6198F371" Ref="UBK311"  Part="1" 
AR Path="/5FBCE4A9/5FBD0B58/6198F371" Ref="UBK311"  Part="1" 
F 0 "UBK311" H 6550 1316 50  0000 C CNN
F 1 "INV01" H 6550 1225 50  0000 C CNN
F 2 "" H 6550 800 50  0001 C CNN
F 3 "" H 6550 800 50  0001 C CNN
	1    6550 1000
	1    0    0    -1  
$EndComp
$Comp
L A5C:BUF01 UBK?
U 1 1 6198F21A
P 7950 1050
AR Path="/5FB7F2B2/6198F21A" Ref="UBK?"  Part="1" 
AR Path="/619820FD/6198F21A" Ref="UBH306"  Part="1" 
AR Path="/5FBCE4A9/5FBD0B58/6198F21A" Ref="UBH306"  Part="1" 
F 0 "UBH306" H 7950 1367 50  0000 C CNN
F 1 "BUF11" H 7950 1276 50  0000 C CNN
F 2 "" H 7950 1050 50  0001 C CNN
F 3 "" H 7950 1050 50  0001 C CNN
	1    7950 1050
	1    0    0    -1  
$EndComp
$Comp
L A5C:BUF01 UBN?
U 1 1 6198F2DA
P 7950 6200
AR Path="/5FB7F2B2/6198F2DA" Ref="UBN?"  Part="1" 
AR Path="/619820FD/6198F2DA" Ref="UBD308"  Part="1" 
AR Path="/5FBCE4A9/5FBD0B58/6198F2DA" Ref="UBD308"  Part="1" 
F 0 "UBD308" H 7950 6517 50  0000 C CNN
F 1 "BUF11" H 7950 6426 50  0000 C CNN
F 2 "" H 7950 6200 50  0001 C CNN
F 3 "" H 7950 6200 50  0001 C CNN
	1    7950 6200
	1    0    0    -1  
$EndComp
$Comp
L A5C:DFFCOO UBK?
U 1 1 6198F202
P 7400 2300
AR Path="/5FD56F21/6198F202" Ref="UBK?"  Part="1" 
AR Path="/621ABC04/6198F202" Ref="UBK?"  Part="1" 
AR Path="/5FAC57E1/6198F202" Ref="UBK?"  Part="1" 
AR Path="/5FB7F2B2/6198F202" Ref="UBK?"  Part="1" 
AR Path="/619820FD/6198F202" Ref="UBH259"  Part="1" 
AR Path="/5FBCE4A9/5FBD0B58/6198F202" Ref="UBH259"  Part="1" 
F 0 "UBH259" H 7400 2661 50  0000 C CNN
F 1 "DFFCOO" H 7400 2570 50  0000 C CNN
F 2 "" H 7400 2300 50  0001 C CNN
F 3 "" H 7400 2300 50  0001 C CNN
F 4 "UBH258" H 7400 2300 50  0001 C CNN "MiscRef"
	1    7400 2300
	1    0    0    -1  
$EndComp
$Comp
L A5C:DFFCOO UBK?
U 1 1 6198F208
P 7400 3100
AR Path="/5FD56F21/6198F208" Ref="UBK?"  Part="1" 
AR Path="/621ABC04/6198F208" Ref="UBK?"  Part="1" 
AR Path="/5FAC57E1/6198F208" Ref="UBK?"  Part="1" 
AR Path="/5FB7F2B2/6198F208" Ref="UBK?"  Part="1" 
AR Path="/619820FD/6198F208" Ref="UBH263"  Part="1" 
AR Path="/5FBCE4A9/5FBD0B58/6198F208" Ref="UBH263"  Part="1" 
F 0 "UBH263" H 7400 3461 50  0000 C CNN
F 1 "DFFCOO" H 7400 3370 50  0000 C CNN
F 2 "" H 7400 3100 50  0001 C CNN
F 3 "" H 7400 3100 50  0001 C CNN
	1    7400 3100
	1    0    0    -1  
$EndComp
$Comp
L A5C:DFFCOO UBK?
U 1 1 6198F20E
P 7400 3900
AR Path="/5FD56F21/6198F20E" Ref="UBK?"  Part="1" 
AR Path="/621ABC04/6198F20E" Ref="UBK?"  Part="1" 
AR Path="/5FAC57E1/6198F20E" Ref="UBK?"  Part="1" 
AR Path="/5FB7F2B2/6198F20E" Ref="UBK?"  Part="1" 
AR Path="/619820FD/6198F20E" Ref="UBH267"  Part="1" 
AR Path="/5FBCE4A9/5FBD0B58/6198F20E" Ref="UBH267"  Part="1" 
F 0 "UBH267" H 7400 4261 50  0000 C CNN
F 1 "DFFCOO" H 7400 4170 50  0000 C CNN
F 2 "" H 7400 3900 50  0001 C CNN
F 3 "" H 7400 3900 50  0001 C CNN
	1    7400 3900
	1    0    0    -1  
$EndComp
$Comp
L A5C:DFFCOO UBK?
U 1 1 6198F214
P 7400 4700
AR Path="/5FD56F21/6198F214" Ref="UBK?"  Part="1" 
AR Path="/621ABC04/6198F214" Ref="UBK?"  Part="1" 
AR Path="/5FAC57E1/6198F214" Ref="UBK?"  Part="1" 
AR Path="/5FB7F2B2/6198F214" Ref="UBK?"  Part="1" 
AR Path="/619820FD/6198F214" Ref="UBH271"  Part="1" 
AR Path="/5FBCE4A9/5FBD0B58/6198F214" Ref="UBH271"  Part="1" 
F 0 "UBH271" H 7400 5061 50  0000 C CNN
F 1 "DFFCOO" H 7400 4970 50  0000 C CNN
F 2 "" H 7400 4700 50  0001 C CNN
F 3 "" H 7400 4700 50  0001 C CNN
	1    7400 4700
	1    0    0    -1  
$EndComp
$Comp
L A5C:DFFCOO UBN?
U 1 1 6198F2C2
P 7400 7400
AR Path="/5FD56F21/6198F2C2" Ref="UBN?"  Part="1" 
AR Path="/621ABC04/6198F2C2" Ref="UBN?"  Part="1" 
AR Path="/5FAC57E1/6198F2C2" Ref="UBN?"  Part="1" 
AR Path="/5FB7F2B2/6198F2C2" Ref="UBN?"  Part="1" 
AR Path="/619820FD/6198F2C2" Ref="UBD255"  Part="1" 
AR Path="/5FBCE4A9/5FBD0B58/6198F2C2" Ref="UBD255"  Part="1" 
F 0 "UBD255" H 7400 7761 50  0000 C CNN
F 1 "DFFCOO" H 7400 7670 50  0000 C CNN
F 2 "" H 7400 7400 50  0001 C CNN
F 3 "" H 7400 7400 50  0001 C CNN
F 4 "UBD254" H 7400 7400 50  0001 C CNN "MiscRef"
	1    7400 7400
	1    0    0    -1  
$EndComp
$Comp
L A5C:DFFCOO UBN?
U 1 1 6198F2C8
P 7400 8200
AR Path="/5FD56F21/6198F2C8" Ref="UBN?"  Part="1" 
AR Path="/621ABC04/6198F2C8" Ref="UBN?"  Part="1" 
AR Path="/5FAC57E1/6198F2C8" Ref="UBN?"  Part="1" 
AR Path="/5FB7F2B2/6198F2C8" Ref="UBN?"  Part="1" 
AR Path="/619820FD/6198F2C8" Ref="UBD259"  Part="1" 
AR Path="/5FBCE4A9/5FBD0B58/6198F2C8" Ref="UBD259"  Part="1" 
F 0 "UBD259" H 7400 8561 50  0000 C CNN
F 1 "DFFCOO" H 7400 8470 50  0000 C CNN
F 2 "" H 7400 8200 50  0001 C CNN
F 3 "" H 7400 8200 50  0001 C CNN
	1    7400 8200
	1    0    0    -1  
$EndComp
$Comp
L A5C:DFFCOO UBN?
U 1 1 6198F2CE
P 7400 9000
AR Path="/5FD56F21/6198F2CE" Ref="UBN?"  Part="1" 
AR Path="/621ABC04/6198F2CE" Ref="UBN?"  Part="1" 
AR Path="/5FAC57E1/6198F2CE" Ref="UBN?"  Part="1" 
AR Path="/5FB7F2B2/6198F2CE" Ref="UBN?"  Part="1" 
AR Path="/619820FD/6198F2CE" Ref="UBD263"  Part="1" 
AR Path="/5FBCE4A9/5FBD0B58/6198F2CE" Ref="UBD263"  Part="1" 
F 0 "UBD263" H 7400 9361 50  0000 C CNN
F 1 "DFFCOO" H 7400 9270 50  0000 C CNN
F 2 "" H 7400 9000 50  0001 C CNN
F 3 "" H 7400 9000 50  0001 C CNN
	1    7400 9000
	1    0    0    -1  
$EndComp
$Comp
L A5C:DFFCOO UBN?
U 1 1 6198F2D4
P 7400 9800
AR Path="/5FD56F21/6198F2D4" Ref="UBN?"  Part="1" 
AR Path="/621ABC04/6198F2D4" Ref="UBN?"  Part="1" 
AR Path="/5FAC57E1/6198F2D4" Ref="UBN?"  Part="1" 
AR Path="/5FB7F2B2/6198F2D4" Ref="UBN?"  Part="1" 
AR Path="/619820FD/6198F2D4" Ref="UBD267"  Part="1" 
AR Path="/5FBCE4A9/5FBD0B58/6198F2D4" Ref="UBD267"  Part="1" 
F 0 "UBD267" H 7400 10161 50  0000 C CNN
F 1 "DFFCOO" H 7400 10070 50  0000 C CNN
F 2 "" H 7400 9800 50  0001 C CNN
F 3 "" H 7400 9800 50  0001 C CNN
	1    7400 9800
	1    0    0    -1  
$EndComp
$Comp
L A5C:NAND04 UBN?
U 1 1 6198F346
P 7350 10850
AR Path="/5FB7F2B2/6198F346" Ref="UBN?"  Part="1" 
AR Path="/619820FD/6198F346" Ref="UBD296"  Part="1" 
AR Path="/5FBCE4A9/5FBD0B58/6198F346" Ref="UBD296"  Part="1" 
F 0 "UBD296" H 7350 11192 50  0000 C CNN
F 1 "NAND04" H 7350 11101 50  0000 C CNN
F 2 "" H 7350 10600 50  0001 C CNN
F 3 "" H 7350 10600 50  0001 C CNN
	1    7350 10850
	-1   0    0    -1  
$EndComp
$Comp
L A5C:NAND04 UBK?
U 1 1 6198F22C
P 9050 4450
AR Path="/5FB7F2B2/6198F22C" Ref="UBK?"  Part="1" 
AR Path="/619820FD/6198F22C" Ref="UBH294"  Part="1" 
AR Path="/5FBCE4A9/5FBD0B58/6198F22C" Ref="UBH294"  Part="1" 
F 0 "UBH294" H 9050 4792 50  0000 C CNN
F 1 "NAND04" H 9050 4701 50  0000 C CNN
F 2 "" H 9050 4200 50  0001 C CNN
F 3 "" H 9050 4200 50  0001 C CNN
	1    9050 4450
	1    0    0    -1  
$EndComp
$Comp
L A5C:NAND04 UBU?
U 1 1 6198F2EC
P 9050 9550
AR Path="/5FB7F2B2/6198F2EC" Ref="UBU?"  Part="1" 
AR Path="/619820FD/6198F2EC" Ref="UBD291"  Part="1" 
AR Path="/5FBCE4A9/5FBD0B58/6198F2EC" Ref="UBD291"  Part="1" 
F 0 "UBD291" H 9050 9892 50  0000 C CNN
F 1 "NAND04" H 9050 9801 50  0000 C CNN
F 2 "" H 9050 9300 50  0001 C CNN
F 3 "" H 9050 9300 50  0001 C CNN
	1    9050 9550
	1    0    0    -1  
$EndComp
Text HLabel 6250 1000 0    50   Input ~ 0
~DEBUG
Wire Bus Line
	8850 5300 8850 5700
Wire Bus Line
	8850 10400 8850 10800
$EndSCHEMATC
