EESchema Schematic File Version 4
EELAYER 30 0
EELAYER END
$Descr A3 11693 16535 portrait
encoding utf-8
Sheet 44 69
Title ""
Date "2020-11-26"
Rev ""
Comp ""
Comment1 "Licence: CC-BY"
Comment2 "Author: Loïc *WydD* Petit"
Comment3 ""
Comment4 ""
$EndDescr
Connection ~ 4800 5800
Connection ~ 7450 2550
Connection ~ 4800 5450
Connection ~ 5000 5550
Connection ~ 5600 1750
Connection ~ 7450 5950
Connection ~ 4800 8850
Connection ~ 4800 9200
Connection ~ 5000 8950
Connection ~ 6750 3900
Connection ~ 6850 3800
Connection ~ 6950 3650
Connection ~ 7050 4050
Connection ~ 3450 1550
Connection ~ 3350 1450
Connection ~ 2950 850 
Connection ~ 4050 1900
Connection ~ 4800 12600
Connection ~ 7450 9350
Connection ~ 7450 12750
Connection ~ 4800 15650
Connection ~ 4800 12250
Connection ~ 5000 12350
Connection ~ 6750 10700
Connection ~ 6750 7300
Connection ~ 6850 10600
Connection ~ 6850 7200
Connection ~ 6950 10450
Connection ~ 6950 7050
Connection ~ 7050 7450
Connection ~ 7050 10850
Connection ~ 8150 6300
Connection ~ 8250 6500
Connection ~ 8150 9700
Connection ~ 8250 9900
Connection ~ 8150 13100
Connection ~ 8250 13300
Connection ~ 9300 4600
Connection ~ 8150 4150
Connection ~ 8250 4600
Connection ~ 3400 3950
Connection ~ 3400 7350
Connection ~ 3400 10750
Connection ~ 3400 14150
Connection ~ 7900 1600
Connection ~ 8500 1600
Connection ~ 7550 1600
Connection ~ 4800 950 
Connection ~ 6100 2300
Connection ~ 4900 3850
Connection ~ 4700 3750
Connection ~ 5800 2800
Connection ~ 5900 2900
Connection ~ 6000 3000
Connection ~ 6100 3100
Connection ~ 6200 3200
Connection ~ 6300 3300
Connection ~ 6400 3400
Connection ~ 6500 3500
Connection ~ 5800 6200
Connection ~ 5900 6300
Connection ~ 6000 6400
Connection ~ 6100 6500
Connection ~ 6200 6600
Connection ~ 6300 6700
Connection ~ 6400 6800
Connection ~ 6500 6900
Connection ~ 4700 7150
Connection ~ 4900 7250
Connection ~ 5800 9600
Connection ~ 5900 9700
Connection ~ 6000 9800
Connection ~ 6100 9900
Connection ~ 6200 10000
Connection ~ 6300 10100
Connection ~ 6400 10200
Connection ~ 6500 10300
Connection ~ 4700 10550
Connection ~ 4900 10650
Connection ~ 5800 13000
Connection ~ 5900 13100
Connection ~ 6000 13200
Connection ~ 6100 13300
Connection ~ 6200 13400
Connection ~ 6300 13500
Connection ~ 6400 13600
Connection ~ 6500 13700
Connection ~ 3550 850 
Connection ~ 7050 2150
Connection ~ 4100 1450
NoConn ~ 7900 2900
NoConn ~ 7900 3000
NoConn ~ 7900 3100
NoConn ~ 7900 3200
NoConn ~ 7900 3300
NoConn ~ 7900 3400
NoConn ~ 7900 6300
NoConn ~ 7900 6400
NoConn ~ 7900 6500
NoConn ~ 7900 6600
NoConn ~ 7900 6700
NoConn ~ 7900 6800
NoConn ~ 7900 9700
NoConn ~ 7900 9800
NoConn ~ 7900 9900
NoConn ~ 7900 10000
NoConn ~ 7900 10100
NoConn ~ 7900 10200
NoConn ~ 7900 13100
NoConn ~ 7900 13200
NoConn ~ 7900 13300
NoConn ~ 7900 13400
NoConn ~ 7900 13500
NoConn ~ 7900 13600
Entry Wire Line
	3400 2900 3500 2800
Entry Wire Line
	3400 3000 3500 2900
Entry Wire Line
	3400 3100 3500 3000
Entry Wire Line
	3400 3200 3500 3100
Entry Wire Line
	3400 3300 3500 3200
Entry Wire Line
	3400 3400 3500 3300
Entry Wire Line
	3400 3500 3500 3400
Entry Wire Line
	3400 3600 3500 3500
Entry Wire Line
	3400 4400 3500 4500
Entry Wire Line
	3400 4500 3500 4600
Entry Wire Line
	3400 4600 3500 4700
Entry Wire Line
	3400 4700 3500 4800
Entry Wire Line
	3400 4800 3500 4900
Entry Wire Line
	3400 4900 3500 5000
Entry Wire Line
	3400 5000 3500 5100
Entry Wire Line
	3400 5100 3500 5200
Entry Wire Line
	3400 6300 3500 6200
Entry Wire Line
	3400 6400 3500 6300
Entry Wire Line
	3400 6500 3500 6400
Entry Wire Line
	3400 6600 3500 6500
Entry Wire Line
	3400 6700 3500 6600
Entry Wire Line
	3400 6800 3500 6700
Entry Wire Line
	3400 6900 3500 6800
Entry Wire Line
	3400 7000 3500 6900
Entry Wire Line
	3400 7800 3500 7900
Entry Wire Line
	3400 7900 3500 8000
Entry Wire Line
	3400 8000 3500 8100
Entry Wire Line
	3400 8100 3500 8200
Entry Wire Line
	3400 8200 3500 8300
Entry Wire Line
	3400 8300 3500 8400
Entry Wire Line
	3400 8400 3500 8500
Entry Wire Line
	3400 8500 3500 8600
Entry Wire Line
	3400 9700 3500 9600
Entry Wire Line
	3400 9800 3500 9700
Entry Wire Line
	3400 9900 3500 9800
Entry Wire Line
	3400 10000 3500 9900
Entry Wire Line
	3400 10100 3500 10000
Entry Wire Line
	3400 10200 3500 10100
Entry Wire Line
	3400 10300 3500 10200
Entry Wire Line
	3400 10400 3500 10300
Entry Wire Line
	3400 11200 3500 11300
Entry Wire Line
	3400 11300 3500 11400
Entry Wire Line
	3400 11400 3500 11500
Entry Wire Line
	3400 11500 3500 11600
Entry Wire Line
	3400 11600 3500 11700
Entry Wire Line
	3400 11700 3500 11800
Entry Wire Line
	3400 11800 3500 11900
Entry Wire Line
	3400 11900 3500 12000
Entry Wire Line
	3400 13100 3500 13000
Entry Wire Line
	3400 13200 3500 13100
Entry Wire Line
	3400 13300 3500 13200
Entry Wire Line
	3400 13400 3500 13300
Entry Wire Line
	3400 13500 3500 13400
Entry Wire Line
	3400 13600 3500 13500
Entry Wire Line
	3400 13700 3500 13600
Entry Wire Line
	3400 13800 3500 13700
Entry Wire Line
	3400 14600 3500 14700
Entry Wire Line
	3400 14700 3500 14800
Entry Wire Line
	3400 14800 3500 14900
Entry Wire Line
	3400 14900 3500 15000
Entry Wire Line
	3400 15000 3500 15100
Entry Wire Line
	3400 15100 3500 15200
Entry Wire Line
	3400 15200 3500 15300
Entry Wire Line
	3400 15300 3500 15400
Wire Wire Line
	2950 850  2850 850 
Wire Wire Line
	2950 1350 2950 850 
Wire Wire Line
	3350 950  3550 950 
Wire Wire Line
	3350 1450 2850 1450
Wire Wire Line
	3350 1450 3350 950 
Wire Wire Line
	3450 1050 3550 1050
Wire Wire Line
	3450 1550 2850 1550
Wire Wire Line
	3450 1550 3450 1050
Wire Wire Line
	3450 1900 4050 1900
Wire Wire Line
	3500 2800 5100 2800
Wire Wire Line
	3500 2900 5100 2900
Wire Wire Line
	3500 3000 5100 3000
Wire Wire Line
	3500 3100 5100 3100
Wire Wire Line
	3500 3200 5100 3200
Wire Wire Line
	3500 3300 5100 3300
Wire Wire Line
	3500 3400 5100 3400
Wire Wire Line
	3500 3500 5100 3500
Wire Wire Line
	3500 6200 5100 6200
Wire Wire Line
	3500 6300 5100 6300
Wire Wire Line
	3500 6400 5100 6400
Wire Wire Line
	3500 6500 5100 6500
Wire Wire Line
	3500 6600 5100 6600
Wire Wire Line
	3500 6700 5100 6700
Wire Wire Line
	3500 6800 5100 6800
Wire Wire Line
	3500 6900 5100 6900
Wire Wire Line
	3500 9600 5100 9600
Wire Wire Line
	3500 9700 5100 9700
Wire Wire Line
	3500 9800 5100 9800
Wire Wire Line
	3500 9900 5100 9900
Wire Wire Line
	3500 10000 5100 10000
Wire Wire Line
	3500 10100 5100 10100
Wire Wire Line
	3500 10200 5100 10200
Wire Wire Line
	3500 10300 5100 10300
Wire Wire Line
	3500 13000 5100 13000
Wire Wire Line
	3500 13100 5100 13100
Wire Wire Line
	3500 13200 5100 13200
Wire Wire Line
	3500 13300 5100 13300
Wire Wire Line
	3500 13400 5100 13400
Wire Wire Line
	3500 13500 5100 13500
Wire Wire Line
	3500 13600 5100 13600
Wire Wire Line
	3500 13700 5100 13700
Wire Wire Line
	3550 550  3550 850 
Wire Wire Line
	3550 1350 2950 1350
Wire Wire Line
	3550 1450 3350 1450
Wire Wire Line
	3550 1550 3450 1550
Wire Wire Line
	3800 5450 3800 5800
Wire Wire Line
	3800 5450 4000 5450
Wire Wire Line
	3800 5800 4800 5800
Wire Wire Line
	3800 8850 3800 9200
Wire Wire Line
	3800 8850 4000 8850
Wire Wire Line
	3800 9200 4800 9200
Wire Wire Line
	3800 12250 3800 12600
Wire Wire Line
	3800 12250 4000 12250
Wire Wire Line
	3800 12600 4800 12600
Wire Wire Line
	3800 15650 3800 16000
Wire Wire Line
	3800 15650 4000 15650
Wire Wire Line
	3800 16000 4800 16000
Wire Wire Line
	4000 4500 3500 4500
Wire Wire Line
	4000 4600 3500 4600
Wire Wire Line
	4000 4700 3500 4700
Wire Wire Line
	4000 4800 3500 4800
Wire Wire Line
	4000 4900 3500 4900
Wire Wire Line
	4000 5000 3500 5000
Wire Wire Line
	4000 5100 3500 5100
Wire Wire Line
	4000 5200 3500 5200
Wire Wire Line
	4000 7900 3500 7900
Wire Wire Line
	4000 8000 3500 8000
Wire Wire Line
	4000 8100 3500 8100
Wire Wire Line
	4000 8200 3500 8200
Wire Wire Line
	4000 8300 3500 8300
Wire Wire Line
	4000 8400 3500 8400
Wire Wire Line
	4000 8500 3500 8500
Wire Wire Line
	4000 8600 3500 8600
Wire Wire Line
	4000 11300 3500 11300
Wire Wire Line
	4000 11400 3500 11400
Wire Wire Line
	4000 11500 3500 11500
Wire Wire Line
	4000 11600 3500 11600
Wire Wire Line
	4000 11700 3500 11700
Wire Wire Line
	4000 11800 3500 11800
Wire Wire Line
	4000 11900 3500 11900
Wire Wire Line
	4000 12000 3500 12000
Wire Wire Line
	4000 14700 3500 14700
Wire Wire Line
	4000 14800 3500 14800
Wire Wire Line
	4000 14900 3500 14900
Wire Wire Line
	4000 15000 3500 15000
Wire Wire Line
	4000 15100 3500 15100
Wire Wire Line
	4000 15200 3500 15200
Wire Wire Line
	4000 15300 3500 15300
Wire Wire Line
	4000 15400 3500 15400
Wire Wire Line
	4050 1900 4050 2300
Wire Wire Line
	4100 950  4800 950 
Wire Wire Line
	4100 1050 5000 1050
Wire Wire Line
	4100 1450 4100 1050
Wire Wire Line
	4600 4500 5100 4500
Wire Wire Line
	4600 4600 5100 4600
Wire Wire Line
	4600 4700 5100 4700
Wire Wire Line
	4600 4800 5100 4800
Wire Wire Line
	4600 4900 5100 4900
Wire Wire Line
	4600 5000 5100 5000
Wire Wire Line
	4600 5100 5100 5100
Wire Wire Line
	4600 5200 5100 5200
Wire Wire Line
	4600 7900 5100 7900
Wire Wire Line
	4600 8000 5100 8000
Wire Wire Line
	4600 8100 5100 8100
Wire Wire Line
	4600 8200 5100 8200
Wire Wire Line
	4600 8300 5100 8300
Wire Wire Line
	4600 8400 5100 8400
Wire Wire Line
	4600 8500 5100 8500
Wire Wire Line
	4600 8600 5100 8600
Wire Wire Line
	4600 11300 5100 11300
Wire Wire Line
	4600 11400 5100 11400
Wire Wire Line
	4600 11500 5100 11500
Wire Wire Line
	4600 11600 5100 11600
Wire Wire Line
	4600 11700 5100 11700
Wire Wire Line
	4600 11800 5100 11800
Wire Wire Line
	4600 11900 5100 11900
Wire Wire Line
	4600 12000 5100 12000
Wire Wire Line
	4600 14700 5100 14700
Wire Wire Line
	4600 14800 5100 14800
Wire Wire Line
	4600 14900 5100 14900
Wire Wire Line
	4600 15000 5100 15000
Wire Wire Line
	4600 15100 5100 15100
Wire Wire Line
	4600 15200 5100 15200
Wire Wire Line
	4600 15300 5100 15300
Wire Wire Line
	4600 15400 5100 15400
Wire Wire Line
	4650 2300 4900 2300
Wire Wire Line
	4700 1450 4700 3750
Wire Wire Line
	4700 3750 4700 7150
Wire Wire Line
	4700 7150 4700 10550
Wire Wire Line
	4700 10550 4700 13950
Wire Wire Line
	4800 950  4800 5450
Wire Wire Line
	4800 950  5000 950 
Wire Wire Line
	4800 5450 4800 5800
Wire Wire Line
	4800 5450 5100 5450
Wire Wire Line
	4800 5800 4800 8850
Wire Wire Line
	4800 8850 4800 9200
Wire Wire Line
	4800 8850 5100 8850
Wire Wire Line
	4800 9200 4800 12250
Wire Wire Line
	4800 12250 4800 12600
Wire Wire Line
	4800 12250 5100 12250
Wire Wire Line
	4800 12600 4800 15650
Wire Wire Line
	4800 15650 4800 16000
Wire Wire Line
	4800 15650 5100 15650
Wire Wire Line
	4900 2300 4900 3850
Wire Wire Line
	4900 3850 4900 7250
Wire Wire Line
	4900 7250 4900 10650
Wire Wire Line
	4900 10650 4900 14050
Wire Wire Line
	5000 1900 4050 1900
Wire Wire Line
	5000 1900 5000 5550
Wire Wire Line
	5000 5550 5000 8950
Wire Wire Line
	5000 8950 5000 12350
Wire Wire Line
	5000 12350 5000 15750
Wire Wire Line
	5100 3750 4700 3750
Wire Wire Line
	5100 3850 4900 3850
Wire Wire Line
	5100 5550 5000 5550
Wire Wire Line
	5100 7150 4700 7150
Wire Wire Line
	5100 7250 4900 7250
Wire Wire Line
	5100 8950 5000 8950
Wire Wire Line
	5100 10550 4700 10550
Wire Wire Line
	5100 10650 4900 10650
Wire Wire Line
	5100 12350 5000 12350
Wire Wire Line
	5100 13950 4700 13950
Wire Wire Line
	5100 14050 4900 14050
Wire Wire Line
	5100 15750 5000 15750
Wire Wire Line
	5600 1750 5400 1750
Wire Wire Line
	5600 2200 5600 1750
Wire Wire Line
	5650 2300 6100 2300
Wire Wire Line
	5700 3000 6000 3000
Wire Wire Line
	5700 3200 6200 3200
Wire Wire Line
	5700 3400 6400 3400
Wire Wire Line
	5700 4500 5800 4500
Wire Wire Line
	5700 4700 6000 4700
Wire Wire Line
	5700 4900 6200 4900
Wire Wire Line
	5700 5100 6400 5100
Wire Wire Line
	5700 6400 6000 6400
Wire Wire Line
	5700 6600 6200 6600
Wire Wire Line
	5700 6800 6400 6800
Wire Wire Line
	5700 7900 5800 7900
Wire Wire Line
	5700 8100 6000 8100
Wire Wire Line
	5700 8300 6200 8300
Wire Wire Line
	5700 8500 6400 8500
Wire Wire Line
	5700 9800 6000 9800
Wire Wire Line
	5700 10000 6200 10000
Wire Wire Line
	5700 10200 6400 10200
Wire Wire Line
	5700 11300 5800 11300
Wire Wire Line
	5700 11500 6000 11500
Wire Wire Line
	5700 11700 6200 11700
Wire Wire Line
	5700 11900 6400 11900
Wire Wire Line
	5700 13200 6000 13200
Wire Wire Line
	5700 13400 6200 13400
Wire Wire Line
	5700 13600 6400 13600
Wire Wire Line
	5700 14700 5800 14700
Wire Wire Line
	5700 14900 6000 14900
Wire Wire Line
	5700 15100 6200 15100
Wire Wire Line
	5700 15300 6400 15300
Wire Wire Line
	5800 2800 5700 2800
Wire Wire Line
	5800 2800 7100 2800
Wire Wire Line
	5800 4500 5800 2800
Wire Wire Line
	5800 6200 5700 6200
Wire Wire Line
	5800 6200 7100 6200
Wire Wire Line
	5800 7900 5800 6200
Wire Wire Line
	5800 9600 5700 9600
Wire Wire Line
	5800 9600 7100 9600
Wire Wire Line
	5800 11300 5800 9600
Wire Wire Line
	5800 13000 5700 13000
Wire Wire Line
	5800 13000 7100 13000
Wire Wire Line
	5800 14700 5800 13000
Wire Wire Line
	5900 2900 5700 2900
Wire Wire Line
	5900 2900 5900 4600
Wire Wire Line
	5900 2900 7100 2900
Wire Wire Line
	5900 4600 5700 4600
Wire Wire Line
	5900 6300 5700 6300
Wire Wire Line
	5900 6300 5900 8000
Wire Wire Line
	5900 6300 7100 6300
Wire Wire Line
	5900 8000 5700 8000
Wire Wire Line
	5900 9700 5700 9700
Wire Wire Line
	5900 9700 5900 11400
Wire Wire Line
	5900 9700 7100 9700
Wire Wire Line
	5900 11400 5700 11400
Wire Wire Line
	5900 13100 5700 13100
Wire Wire Line
	5900 13100 5900 14800
Wire Wire Line
	5900 13100 7100 13100
Wire Wire Line
	5900 14800 5700 14800
Wire Wire Line
	6000 3000 7100 3000
Wire Wire Line
	6000 4700 6000 3000
Wire Wire Line
	6000 6400 7100 6400
Wire Wire Line
	6000 8100 6000 6400
Wire Wire Line
	6000 9800 7100 9800
Wire Wire Line
	6000 11500 6000 9800
Wire Wire Line
	6000 13200 7100 13200
Wire Wire Line
	6000 14900 6000 13200
Wire Wire Line
	6050 550  3550 550 
Wire Wire Line
	6050 750  6050 550 
Wire Wire Line
	6100 1850 6100 2300
Wire Wire Line
	6100 1850 6200 1850
Wire Wire Line
	6100 3100 5700 3100
Wire Wire Line
	6100 3100 6100 4800
Wire Wire Line
	6100 3100 7100 3100
Wire Wire Line
	6100 4800 5700 4800
Wire Wire Line
	6100 6500 5700 6500
Wire Wire Line
	6100 6500 6100 8200
Wire Wire Line
	6100 6500 7100 6500
Wire Wire Line
	6100 8200 5700 8200
Wire Wire Line
	6100 9900 5700 9900
Wire Wire Line
	6100 9900 6100 11600
Wire Wire Line
	6100 9900 7100 9900
Wire Wire Line
	6100 11600 5700 11600
Wire Wire Line
	6100 13300 5700 13300
Wire Wire Line
	6100 13300 6100 15000
Wire Wire Line
	6100 13300 7100 13300
Wire Wire Line
	6100 15000 5700 15000
Wire Wire Line
	6200 2200 5600 2200
Wire Wire Line
	6200 2300 6100 2300
Wire Wire Line
	6200 3200 7100 3200
Wire Wire Line
	6200 4900 6200 3200
Wire Wire Line
	6200 6600 7100 6600
Wire Wire Line
	6200 8300 6200 6600
Wire Wire Line
	6200 10000 7100 10000
Wire Wire Line
	6200 11700 6200 10000
Wire Wire Line
	6200 13400 7100 13400
Wire Wire Line
	6200 15100 6200 13400
Wire Wire Line
	6250 750  6050 750 
Wire Wire Line
	6300 3300 5700 3300
Wire Wire Line
	6300 3300 6300 5000
Wire Wire Line
	6300 3300 7100 3300
Wire Wire Line
	6300 5000 5700 5000
Wire Wire Line
	6300 6700 5700 6700
Wire Wire Line
	6300 6700 6300 8400
Wire Wire Line
	6300 6700 7100 6700
Wire Wire Line
	6300 8400 5700 8400
Wire Wire Line
	6300 10100 5700 10100
Wire Wire Line
	6300 10100 6300 11800
Wire Wire Line
	6300 10100 7100 10100
Wire Wire Line
	6300 11800 5700 11800
Wire Wire Line
	6300 13500 5700 13500
Wire Wire Line
	6300 13500 6300 15200
Wire Wire Line
	6300 13500 7100 13500
Wire Wire Line
	6300 15200 5700 15200
Wire Wire Line
	6350 1300 6450 1300
Wire Wire Line
	6400 3400 7100 3400
Wire Wire Line
	6400 5100 6400 3400
Wire Wire Line
	6400 6800 7100 6800
Wire Wire Line
	6400 8500 6400 6800
Wire Wire Line
	6400 10200 7100 10200
Wire Wire Line
	6400 11900 6400 10200
Wire Wire Line
	6400 13600 7100 13600
Wire Wire Line
	6400 15300 6400 13600
Wire Wire Line
	6500 3500 5700 3500
Wire Wire Line
	6500 3500 6500 5200
Wire Wire Line
	6500 3500 7100 3500
Wire Wire Line
	6500 5200 5700 5200
Wire Wire Line
	6500 6900 5700 6900
Wire Wire Line
	6500 6900 6500 8600
Wire Wire Line
	6500 6900 7100 6900
Wire Wire Line
	6500 8600 5700 8600
Wire Wire Line
	6500 10300 5700 10300
Wire Wire Line
	6500 10300 6500 12000
Wire Wire Line
	6500 10300 7100 10300
Wire Wire Line
	6500 12000 5700 12000
Wire Wire Line
	6500 13700 5700 13700
Wire Wire Line
	6500 13700 6500 15400
Wire Wire Line
	6500 13700 7100 13700
Wire Wire Line
	6500 15400 5700 15400
Wire Wire Line
	6750 1800 6850 1800
Wire Wire Line
	6750 2250 6750 3900
Wire Wire Line
	6750 3900 6750 7300
Wire Wire Line
	6750 3900 7100 3900
Wire Wire Line
	6750 7300 7100 7300
Wire Wire Line
	6750 10700 6750 7300
Wire Wire Line
	6750 10700 6750 14100
Wire Wire Line
	6750 10700 7100 10700
Wire Wire Line
	6750 14100 7100 14100
Wire Wire Line
	6850 1800 6850 3800
Wire Wire Line
	6850 3800 6850 7200
Wire Wire Line
	6850 7200 6850 10600
Wire Wire Line
	6850 10600 6850 14000
Wire Wire Line
	6950 1600 6950 3650
Wire Wire Line
	6950 1600 7550 1600
Wire Wire Line
	6950 3650 6950 7050
Wire Wire Line
	6950 10450 6950 7050
Wire Wire Line
	6950 10450 6950 13850
Wire Wire Line
	7050 1300 7050 2150
Wire Wire Line
	7050 2150 7150 2150
Wire Wire Line
	7050 4050 7050 2150
Wire Wire Line
	7050 4050 7050 7450
Wire Wire Line
	7050 7450 7050 10850
Wire Wire Line
	7050 10850 7050 14250
Wire Wire Line
	7100 3650 6950 3650
Wire Wire Line
	7100 3800 6850 3800
Wire Wire Line
	7100 4050 7050 4050
Wire Wire Line
	7100 7050 6950 7050
Wire Wire Line
	7100 7200 6850 7200
Wire Wire Line
	7100 7450 7050 7450
Wire Wire Line
	7100 10450 6950 10450
Wire Wire Line
	7100 10600 6850 10600
Wire Wire Line
	7100 10850 7050 10850
Wire Wire Line
	7100 13850 6950 13850
Wire Wire Line
	7100 14000 6850 14000
Wire Wire Line
	7100 14250 7050 14250
Wire Wire Line
	7450 1850 7550 1850
Wire Wire Line
	7450 2550 7550 2550
Wire Wire Line
	7450 5950 7550 5950
Wire Wire Line
	7450 9350 7550 9350
Wire Wire Line
	7450 12750 7550 12750
Wire Wire Line
	7550 1600 7900 1600
Wire Wire Line
	7550 1850 7550 1600
Wire Wire Line
	8000 3000 8000 3500
Wire Wire Line
	8000 3000 8350 3000
Wire Wire Line
	8000 3500 7900 3500
Wire Wire Line
	8000 6400 8000 6900
Wire Wire Line
	8000 6900 7900 6900
Wire Wire Line
	8000 9800 8000 10300
Wire Wire Line
	8000 10300 7900 10300
Wire Wire Line
	8000 13200 8000 13700
Wire Wire Line
	8000 13700 7900 13700
Wire Wire Line
	8150 2900 8150 4150
Wire Wire Line
	8150 4150 8150 6300
Wire Wire Line
	8150 6300 8150 9700
Wire Wire Line
	8150 9700 8150 13100
Wire Wire Line
	8150 13100 8150 13950
Wire Wire Line
	8150 13100 8350 13100
Wire Wire Line
	8250 3100 8250 4600
Wire Wire Line
	8250 3100 8350 3100
Wire Wire Line
	8250 4600 8250 6500
Wire Wire Line
	8250 6500 8250 9900
Wire Wire Line
	8250 9900 8250 13300
Wire Wire Line
	8250 13300 8250 13950
Wire Wire Line
	8350 2800 7900 2800
Wire Wire Line
	8350 2900 8150 2900
Wire Wire Line
	8350 6200 7900 6200
Wire Wire Line
	8350 6300 8150 6300
Wire Wire Line
	8350 6400 8000 6400
Wire Wire Line
	8350 6500 8250 6500
Wire Wire Line
	8350 9600 7900 9600
Wire Wire Line
	8350 9700 8150 9700
Wire Wire Line
	8350 9800 8000 9800
Wire Wire Line
	8350 9900 8250 9900
Wire Wire Line
	8350 13000 7900 13000
Wire Wire Line
	8350 13200 8000 13200
Wire Wire Line
	8350 13300 8250 13300
Wire Wire Line
	8500 1600 8700 1600
Wire Wire Line
	8700 4600 8250 4600
Wire Wire Line
	9300 4150 8150 4150
Wire Wire Line
	9300 4600 9300 4150
Wire Bus Line
	3400 3950 3100 3950
Wire Bus Line
	3400 7350 3100 7350
Wire Bus Line
	3400 10750 3100 10750
Wire Bus Line
	3400 14150 3100 14150
Text Notes 1100 8250 0    50   ~ 0
TOP MATRIX BUS\n0: MAIN-~RESETI\n1: CLK8M\n2: UBD337-Q (SERIAL-CHNL)\n3: UAA254-Q (SERIAL-LOAD)\n4: UBD383-Q (GFX-CHNL)\n\n5: BPD0 (P129)\n6: BPD1 (P130)\n7: BPD2 (P131)\n8: BPD3 (P132)\n9: BPD4 (P133)\n10: BPD5 (P134)\n11: BPD6 (P135)\n12: BPD7 (P136)\n\n13: APD0 (P137)\n14: APD1 (P138)\n15: APD2 (P139)\n16: APD3 (P140)\n17: APD4 (P141)\n18: APD5 (P142)\n19: APD6 (P143)\n20: APD7 (P144)\n\n21: DPD0 (P145)\n22: DPD1 (P146)\n23: DPD2 (P147)\n24: DPD3 (P148)\n25: DPD4 (P149)\n26: DPD5 (P150)\n27: DPD6 (P151)\n28: DPD7 (P152)\n\n29: CPD0 (P137)\n30: CPD1 (P138)\n31: CPD2 (P139)\n32: CPD3 (P140)\n33: CPD4 (P141)\n34: CPD5 (P142)\n35: CPD6 (P143)\n36: CPD7 (P144)
Text Notes 1750 1500 0    50   ~ 0
9, 11\nLoop at 16
Text Notes 1800 900  0    50   ~ 0
2-3\nLoop at 4
Text Notes 2350 1950 0    50   ~ 0
8-15\nLoop at 16
Text Notes 5100 2200 0    50   ~ 0
3\nLoop at 8
Text Label 3650 9600 0    50   ~ 0
APD0
Text Label 3650 9700 0    50   ~ 0
APD1
Text Label 3650 9800 0    50   ~ 0
APD2
Text Label 3650 9900 0    50   ~ 0
APD3
Text Label 3650 10000 0    50   ~ 0
APD4
Text Label 3650 10100 0    50   ~ 0
APD5
Text Label 3650 10200 0    50   ~ 0
APD6
Text Label 3650 10300 0    50   ~ 0
APD7
Text Label 3650 11300 0    50   ~ 0
APD0
Text Label 3650 11400 0    50   ~ 0
APD1
Text Label 3650 11500 0    50   ~ 0
APD2
Text Label 3650 11600 0    50   ~ 0
APD3
Text Label 3650 11700 0    50   ~ 0
APD4
Text Label 3650 11800 0    50   ~ 0
APD5
Text Label 3650 11900 0    50   ~ 0
APD6
Text Label 3650 12000 0    50   ~ 0
APD7
Text Label 3850 2800 2    50   ~ 0
BPD0
Text Label 3850 2900 2    50   ~ 0
BPD1
Text Label 3850 3000 2    50   ~ 0
BPD2
Text Label 3850 3100 2    50   ~ 0
BPD3
Text Label 3850 3200 2    50   ~ 0
BPD4
Text Label 3850 3300 2    50   ~ 0
BPD5
Text Label 3850 3400 2    50   ~ 0
BPD6
Text Label 3850 3500 2    50   ~ 0
BPD7
Text Label 3850 4500 2    50   ~ 0
BPD0
Text Label 3850 4600 2    50   ~ 0
BPD1
Text Label 3850 4700 2    50   ~ 0
BPD2
Text Label 3850 4800 2    50   ~ 0
BPD3
Text Label 3850 4900 2    50   ~ 0
BPD4
Text Label 3850 5000 2    50   ~ 0
BPD5
Text Label 3850 5100 2    50   ~ 0
BPD6
Text Label 3850 5200 2    50   ~ 0
BPD7
Text Label 3850 6200 2    50   ~ 0
DPD0
Text Label 3850 6300 2    50   ~ 0
DPD1
Text Label 3850 6400 2    50   ~ 0
DPD2
Text Label 3850 6500 2    50   ~ 0
DPD3
Text Label 3850 6600 2    50   ~ 0
DPD4
Text Label 3850 6700 2    50   ~ 0
DPD5
Text Label 3850 6800 2    50   ~ 0
DPD6
Text Label 3850 6900 2    50   ~ 0
DPD7
Text Label 3850 7900 2    50   ~ 0
DPD0
Text Label 3850 8000 2    50   ~ 0
DPD1
Text Label 3850 8100 2    50   ~ 0
DPD2
Text Label 3850 8200 2    50   ~ 0
DPD3
Text Label 3850 8300 2    50   ~ 0
DPD4
Text Label 3850 8400 2    50   ~ 0
DPD5
Text Label 3850 8500 2    50   ~ 0
DPD6
Text Label 3850 8600 2    50   ~ 0
DPD7
Text Label 3850 13000 2    50   ~ 0
CPD0
Text Label 3850 13100 2    50   ~ 0
CPD1
Text Label 3850 13200 2    50   ~ 0
CPD2
Text Label 3850 13300 2    50   ~ 0
CPD3
Text Label 3850 13400 2    50   ~ 0
CPD4
Text Label 3850 13500 2    50   ~ 0
CPD5
Text Label 3850 13600 2    50   ~ 0
CPD6
Text Label 3850 13700 2    50   ~ 0
CPD7
Text Label 3850 14700 2    50   ~ 0
CPD0
Text Label 3850 14800 2    50   ~ 0
CPD1
Text Label 3850 14900 2    50   ~ 0
CPD2
Text Label 3850 15000 2    50   ~ 0
CPD3
Text Label 3850 15100 2    50   ~ 0
CPD4
Text Label 3850 15200 2    50   ~ 0
CPD5
Text Label 3850 15300 2    50   ~ 0
CPD6
Text Label 3850 15400 2    50   ~ 0
CPD7
Text HLabel 2850 850  0    50   Input ~ 0
GFX-CHNL
Text HLabel 2850 1450 0    50   Input ~ 0
GFX-LOAD
Text HLabel 2850 1550 0    50   Input ~ 0
CLK8M
Text HLabel 3100 3950 0    50   Input ~ 0
BPD[0..7]
Text HLabel 3100 7350 0    50   Input ~ 0
DPD[0..7]
Text HLabel 3100 10750 0    50   Input ~ 0
APD[0..7]
Text HLabel 3100 14150 0    50   Input ~ 0
CPD[0..7]
Text HLabel 3450 1900 0    50   Input ~ 0
SERIAL-CHNL
Text HLabel 5000 950  2    50   Output ~ 0
LOAD-CHNLB
Text HLabel 5000 1050 2    50   Output ~ 0
LOAD-CHNLA
Text HLabel 5400 1750 0    50   Input ~ 0
XSEL
Text HLabel 5650 2300 0    50   Input ~ 0
SERIAL-LOAD
Text HLabel 6250 850  0    50   Input ~ 0
GFX-LOAD
Text HLabel 6350 1300 0    50   Output ~ 0
~RESET-BUF
Text HLabel 6800 800  2    50   Output ~ 0
~SERIAL-LOAD
Text HLabel 7150 2150 2    50   Input ~ 0
~RESET
Text HLabel 7450 1850 0    50   Output ~ 0
~CLK8M
Text HLabel 8700 1600 2    50   Input ~ 0
CLK8M
Text HLabel 9200 2950 2    50   Output ~ 0
B
Text HLabel 9200 6350 2    50   Output ~ 0
D
Text HLabel 9200 9750 2    50   Output ~ 0
A
Text HLabel 9200 13150 2    50   Output ~ 0
C
Text HLabel 9900 4600 2    50   Input ~ 0
XSEL
$Comp
L power:VCC #PWR?
U 1 1 5FD6CF16
P 7450 2550
AR Path="/6428BC4C/5FD6CF16" Ref="#PWR?"  Part="1" 
AR Path="/620F934F/5FD6CF16" Ref="#PWR?"  Part="1" 
AR Path="/5FD278C8/5FD6CF16" Ref="#PWR?"  Part="1" 
AR Path="/5FBBD4DB/5FBBDB9D/5FD6CF16" Ref="#PWR0167"  Part="1" 
F 0 "#PWR0167" H 7450 2400 50  0001 C CNN
F 1 "VCC" H 7465 2723 50  0000 C CNN
F 2 "" H 7450 2550 50  0001 C CNN
F 3 "" H 7450 2550 50  0001 C CNN
	1    7450 2550
	1    0    0    -1  
$EndComp
$Comp
L power:VCC #PWR?
U 1 1 5FD6CF1C
P 7450 5950
AR Path="/6428BC4C/5FD6CF1C" Ref="#PWR?"  Part="1" 
AR Path="/620F934F/5FD6CF1C" Ref="#PWR?"  Part="1" 
AR Path="/5FD278C8/5FD6CF1C" Ref="#PWR?"  Part="1" 
AR Path="/5FBBD4DB/5FBBDB9D/5FD6CF1C" Ref="#PWR0168"  Part="1" 
F 0 "#PWR0168" H 7450 5800 50  0001 C CNN
F 1 "VCC" H 7465 6123 50  0000 C CNN
F 2 "" H 7450 5950 50  0001 C CNN
F 3 "" H 7450 5950 50  0001 C CNN
	1    7450 5950
	1    0    0    -1  
$EndComp
$Comp
L power:VCC #PWR?
U 1 1 5FD6CF22
P 7450 9350
AR Path="/6428BC4C/5FD6CF22" Ref="#PWR?"  Part="1" 
AR Path="/620F934F/5FD6CF22" Ref="#PWR?"  Part="1" 
AR Path="/5FD278C8/5FD6CF22" Ref="#PWR?"  Part="1" 
AR Path="/5FBBD4DB/5FBBDB9D/5FD6CF22" Ref="#PWR0169"  Part="1" 
F 0 "#PWR0169" H 7450 9200 50  0001 C CNN
F 1 "VCC" H 7465 9523 50  0000 C CNN
F 2 "" H 7450 9350 50  0001 C CNN
F 3 "" H 7450 9350 50  0001 C CNN
	1    7450 9350
	1    0    0    -1  
$EndComp
$Comp
L power:VCC #PWR?
U 1 1 5FD6CF28
P 7450 12750
AR Path="/6428BC4C/5FD6CF28" Ref="#PWR?"  Part="1" 
AR Path="/620F934F/5FD6CF28" Ref="#PWR?"  Part="1" 
AR Path="/5FD278C8/5FD6CF28" Ref="#PWR?"  Part="1" 
AR Path="/5FBBD4DB/5FBBDB9D/5FD6CF28" Ref="#PWR0170"  Part="1" 
F 0 "#PWR0170" H 7450 12600 50  0001 C CNN
F 1 "VCC" H 7465 12923 50  0000 C CNN
F 2 "" H 7450 12750 50  0001 C CNN
F 3 "" H 7450 12750 50  0001 C CNN
	1    7450 12750
	1    0    0    -1  
$EndComp
$Comp
L power:GND #PWR?
U 1 1 5FD6CF34
P 4000 5550
AR Path="/6428BC4C/5FD6CF34" Ref="#PWR?"  Part="1" 
AR Path="/620F934F/5FD6CF34" Ref="#PWR?"  Part="1" 
AR Path="/5FD278C8/5FD6CF34" Ref="#PWR?"  Part="1" 
AR Path="/5FBBD4DB/5FBBDB9D/5FD6CF34" Ref="#PWR0171"  Part="1" 
F 0 "#PWR0171" H 4000 5300 50  0001 C CNN
F 1 "GND" H 4005 5377 50  0000 C CNN
F 2 "" H 4000 5550 50  0001 C CNN
F 3 "" H 4000 5550 50  0001 C CNN
	1    4000 5550
	1    0    0    -1  
$EndComp
$Comp
L power:GND #PWR?
U 1 1 5FD6CF40
P 4000 8950
AR Path="/6428BC4C/5FD6CF40" Ref="#PWR?"  Part="1" 
AR Path="/620F934F/5FD6CF40" Ref="#PWR?"  Part="1" 
AR Path="/5FD278C8/5FD6CF40" Ref="#PWR?"  Part="1" 
AR Path="/5FBBD4DB/5FBBDB9D/5FD6CF40" Ref="#PWR0172"  Part="1" 
F 0 "#PWR0172" H 4000 8700 50  0001 C CNN
F 1 "GND" H 4005 8777 50  0000 C CNN
F 2 "" H 4000 8950 50  0001 C CNN
F 3 "" H 4000 8950 50  0001 C CNN
	1    4000 8950
	1    0    0    -1  
$EndComp
$Comp
L power:GND #PWR?
U 1 1 5FD6CF4C
P 4000 12350
AR Path="/6428BC4C/5FD6CF4C" Ref="#PWR?"  Part="1" 
AR Path="/620F934F/5FD6CF4C" Ref="#PWR?"  Part="1" 
AR Path="/5FD278C8/5FD6CF4C" Ref="#PWR?"  Part="1" 
AR Path="/5FBBD4DB/5FBBDB9D/5FD6CF4C" Ref="#PWR0173"  Part="1" 
F 0 "#PWR0173" H 4000 12100 50  0001 C CNN
F 1 "GND" H 4005 12177 50  0000 C CNN
F 2 "" H 4000 12350 50  0001 C CNN
F 3 "" H 4000 12350 50  0001 C CNN
	1    4000 12350
	1    0    0    -1  
$EndComp
$Comp
L power:GND #PWR?
U 1 1 5FD6CF58
P 4000 15750
AR Path="/6428BC4C/5FD6CF58" Ref="#PWR?"  Part="1" 
AR Path="/620F934F/5FD6CF58" Ref="#PWR?"  Part="1" 
AR Path="/5FD278C8/5FD6CF58" Ref="#PWR?"  Part="1" 
AR Path="/5FBBD4DB/5FBBDB9D/5FD6CF58" Ref="#PWR0174"  Part="1" 
F 0 "#PWR0174" H 4000 15500 50  0001 C CNN
F 1 "GND" H 4005 15577 50  0000 C CNN
F 2 "" H 4000 15750 50  0001 C CNN
F 3 "" H 4000 15750 50  0001 C CNN
	1    4000 15750
	1    0    0    -1  
$EndComp
$Comp
L A5C:OR02 UAI?
U 1 1 5FD6CF5E
P 6450 1800
AR Path="/6428BC4C/5FD6CF5E" Ref="UAI?"  Part="1" 
AR Path="/620F934F/5FD6CF5E" Ref="UAI?"  Part="1" 
AR Path="/5FD278C8/5FD6CF5E" Ref="UAI246"  Part="1" 
AR Path="/5FBBD4DB/5FBBDB9D/5FD6CF5E" Ref="UAI246"  Part="1" 
F 0 "UAI246" H 6475 2067 50  0000 C CNN
F 1 "OR02" H 6475 1976 50  0000 C CNN
F 2 "" H 6500 1800 50  0001 C CNN
F 3 "" H 6500 1800 50  0001 C CNN
	1    6450 1800
	1    0    0    -1  
$EndComp
$Comp
L A5C:OR02 UAH?
U 1 1 5FD6CF64
P 6450 2250
AR Path="/6428BC4C/5FD6CF64" Ref="UAH?"  Part="1" 
AR Path="/620F934F/5FD6CF64" Ref="UAH?"  Part="1" 
AR Path="/5FD278C8/5FD6CF64" Ref="UAG245"  Part="1" 
AR Path="/5FBBD4DB/5FBBDB9D/5FD6CF64" Ref="UAG245"  Part="1" 
F 0 "UAG245" H 6475 2517 50  0000 C CNN
F 1 "OR02" H 6475 2426 50  0000 C CNN
F 2 "" H 6500 2250 50  0001 C CNN
F 3 "" H 6500 2250 50  0001 C CNN
	1    6450 2250
	1    0    0    -1  
$EndComp
$Comp
L A5C:NAND02 UAF249
U 1 1 60244B8C
P 6500 800
AR Path="/5FD278C8/60244B8C" Ref="UAF249"  Part="1" 
AR Path="/5FBBD4DB/5FBBDB9D/60244B8C" Ref="UAF249"  Part="1" 
F 0 "UAF249" H 6525 1067 50  0000 C CNN
F 1 "NAND02" H 6525 976 50  0000 C CNN
F 2 "" H 6500 800 50  0001 C CNN
F 3 "" H 6500 800 50  0001 C CNN
	1    6500 800 
	1    0    0    -1  
$EndComp
$Comp
L A5C:NAND03 UAG?
U 1 1 5FD6CF6A
P 3800 950
AR Path="/6428BC4C/5FD6CF6A" Ref="UAG?"  Part="1" 
AR Path="/620F934F/5FD6CF6A" Ref="UAG?"  Part="1" 
AR Path="/5FD278C8/5FD6CF6A" Ref="UAF245"  Part="1" 
AR Path="/5FBBD4DB/5FBBDB9D/5FD6CF6A" Ref="UAF245"  Part="1" 
F 0 "UAF245" H 3825 1242 50  0000 C CNN
F 1 "NAND03" H 3825 1151 50  0000 C CNN
F 2 "" H 3800 950 50  0001 C CNN
F 3 "" H 3800 950 50  0001 C CNN
	1    3800 950 
	1    0    0    -1  
$EndComp
$Comp
L A5C:NAND03 UAE?
U 1 1 5FD6CF70
P 3800 1450
AR Path="/6428BC4C/5FD6CF70" Ref="UAE?"  Part="1" 
AR Path="/620F934F/5FD6CF70" Ref="UAE?"  Part="1" 
AR Path="/5FD278C8/5FD6CF70" Ref="UAE246"  Part="1" 
AR Path="/5FBBD4DB/5FBBDB9D/5FD6CF70" Ref="UAE246"  Part="1" 
F 0 "UAE246" H 3825 1742 50  0000 C CNN
F 1 "NAND03" H 3825 1651 50  0000 C CNN
F 2 "" H 3800 1450 50  0001 C CNN
F 3 "" H 3800 1450 50  0001 C CNN
	1    3800 1450
	1    0    0    -1  
$EndComp
$Comp
L A5C:INV01 UAG?
U 1 1 5FD6CF76
P 3250 850
AR Path="/6428BC4C/5FD6CF76" Ref="UAG?"  Part="1" 
AR Path="/620F934F/5FD6CF76" Ref="UAG?"  Part="1" 
AR Path="/5FD278C8/5FD6CF76" Ref="UAG247"  Part="1" 
AR Path="/5FBBD4DB/5FBBDB9D/5FD6CF76" Ref="UAG247"  Part="1" 
F 0 "UAG247" H 3250 1167 50  0000 C CNN
F 1 "INV01" H 3250 1076 50  0000 C CNN
F 2 "" H 3250 650 50  0001 C CNN
F 3 "" H 3250 650 50  0001 C CNN
	1    3250 850 
	1    0    0    -1  
$EndComp
$Comp
L A5C:INV01 UAH?
U 1 1 5FD6CF7C
P 4350 2300
AR Path="/6428BC4C/5FD6CF7C" Ref="UAH?"  Part="1" 
AR Path="/620F934F/5FD6CF7C" Ref="UAH?"  Part="1" 
AR Path="/5FD278C8/5FD6CF7C" Ref="UAH247"  Part="1" 
AR Path="/5FBBD4DB/5FBBDB9D/5FD6CF7C" Ref="UAH247"  Part="1" 
F 0 "UAH247" H 4350 2617 50  0000 C CNN
F 1 "INV01" H 4350 2526 50  0000 C CNN
F 2 "" H 4350 2100 50  0001 C CNN
F 3 "" H 4350 2100 50  0001 C CNN
	1    4350 2300
	1    0    0    -1  
$EndComp
$Comp
L A5C:INV01 UAH?
U 1 1 61030EB2
P 4400 1450
AR Path="/6428BC4C/61030EB2" Ref="UAH?"  Part="1" 
AR Path="/620F934F/61030EB2" Ref="UAH?"  Part="1" 
AR Path="/5FD278C8/61030EB2" Ref="UAE245"  Part="1" 
AR Path="/5FBBD4DB/5FBBDB9D/61030EB2" Ref="UAE245"  Part="1" 
F 0 "UAE245" H 4400 1767 50  0000 C CNN
F 1 "INV01" H 4400 1676 50  0000 C CNN
F 2 "" H 4400 1250 50  0001 C CNN
F 3 "" H 4400 1250 50  0001 C CNN
	1    4400 1450
	1    0    0    -1  
$EndComp
$Comp
L A5C:INV01 UAI?
U 1 1 5FD6CF82
P 5900 1750
AR Path="/6428BC4C/5FD6CF82" Ref="UAI?"  Part="1" 
AR Path="/620F934F/5FD6CF82" Ref="UAI?"  Part="1" 
AR Path="/5FD278C8/5FD6CF82" Ref="UAI245"  Part="1" 
AR Path="/5FBBD4DB/5FBBDB9D/5FD6CF82" Ref="UAI245"  Part="1" 
F 0 "UAI245" H 5900 2067 50  0000 C CNN
F 1 "INV01" H 5900 1976 50  0000 C CNN
F 2 "" H 5900 1550 50  0001 C CNN
F 3 "" H 5900 1550 50  0001 C CNN
	1    5900 1750
	1    0    0    -1  
$EndComp
$Comp
L A5C:BUF12 UAO?
U 1 1 616032B2
P 6750 1300
AR Path="/616032B2" Ref="UAO?"  Part="1" 
AR Path="/60BA673A/616032B2" Ref="UAO?"  Part="1" 
AR Path="/5FB6D140/616032B2" Ref="UAO?"  Part="1" 
AR Path="/5FD021E1/616032B2" Ref="UAO?"  Part="1" 
AR Path="/5FD278C8/616032B2" Ref="UAO208"  Part="1" 
AR Path="/5FBBD4DB/5FBBDB9D/616032B2" Ref="UAO208"  Part="1" 
F 0 "UAO208" H 6750 1617 50  0000 C CNN
F 1 "BUF12" H 6750 1526 50  0000 C CNN
F 2 "" H 6750 1300 50  0001 C CNN
F 3 "" H 6750 1300 50  0001 C CNN
	1    6750 1300
	-1   0    0    -1  
$EndComp
$Comp
L A5C:INV01 UAN?
U 1 1 5FD6CFA0
P 9000 4600
AR Path="/6428BC4C/5FD6CFA0" Ref="UAN?"  Part="1" 
AR Path="/620F934F/5FD6CFA0" Ref="UAN?"  Part="1" 
AR Path="/5FD278C8/5FD6CFA0" Ref="UAN284"  Part="1" 
AR Path="/5FBBD4DB/5FBBDB9D/5FD6CFA0" Ref="UAN284"  Part="1" 
F 0 "UAN284" H 9000 4917 50  0000 C CNN
F 1 "INV01" H 9000 4826 50  0000 C CNN
F 2 "" H 9000 4400 50  0001 C CNN
F 3 "" H 9000 4400 50  0001 C CNN
	1    9000 4600
	-1   0    0    -1  
$EndComp
$Comp
L A5C:INV01 UAO?
U 1 1 5FD6CFA6
P 9600 4600
AR Path="/6428BC4C/5FD6CFA6" Ref="UAO?"  Part="1" 
AR Path="/620F934F/5FD6CFA6" Ref="UAO?"  Part="1" 
AR Path="/5FD278C8/5FD6CFA6" Ref="UAO284"  Part="1" 
AR Path="/5FBBD4DB/5FBBDB9D/5FD6CFA6" Ref="UAO284"  Part="1" 
F 0 "UAO284" H 9600 4917 50  0000 C CNN
F 1 "INV01" H 9600 4826 50  0000 C CNN
F 2 "" H 9600 4400 50  0001 C CNN
F 3 "" H 9600 4400 50  0001 C CNN
	1    9600 4600
	-1   0    0    -1  
$EndComp
$Comp
L A5C:AO22 UAN?
U 1 1 5FD6CFAC
P 8750 2900
AR Path="/60BA673A/5FD6CFAC" Ref="UAN?"  Part="1" 
AR Path="/6428BC4C/5FD6CFAC" Ref="UAN?"  Part="1" 
AR Path="/620F934F/5FD6CFAC" Ref="UAN?"  Part="1" 
AR Path="/5FD278C8/5FD6CFAC" Ref="UAN245"  Part="1" 
AR Path="/5FBBD4DB/5FBBDB9D/5FD6CFAC" Ref="UAN245"  Part="1" 
F 0 "UAN245" H 8775 3217 50  0000 C CNN
F 1 "AO22" H 8775 3126 50  0000 C CNN
F 2 "" H 8900 2900 50  0001 C CNN
F 3 "" H 8900 2900 50  0001 C CNN
	1    8750 2900
	1    0    0    -1  
$EndComp
$Comp
L A5C:AO22 UAL?
U 1 1 5FD6CFB2
P 8750 6300
AR Path="/60BA673A/5FD6CFB2" Ref="UAL?"  Part="1" 
AR Path="/6428BC4C/5FD6CFB2" Ref="UAL?"  Part="1" 
AR Path="/620F934F/5FD6CFB2" Ref="UAL?"  Part="1" 
AR Path="/5FD278C8/5FD6CFB2" Ref="UAL245"  Part="1" 
AR Path="/5FBBD4DB/5FBBDB9D/5FD6CFB2" Ref="UAL245"  Part="1" 
F 0 "UAL245" H 8775 6617 50  0000 C CNN
F 1 "AO22" H 8775 6526 50  0000 C CNN
F 2 "" H 8900 6300 50  0001 C CNN
F 3 "" H 8900 6300 50  0001 C CNN
	1    8750 6300
	1    0    0    -1  
$EndComp
$Comp
L A5C:AO22 UAO?
U 1 1 5FD6CFB8
P 8750 9700
AR Path="/60BA673A/5FD6CFB8" Ref="UAO?"  Part="1" 
AR Path="/6428BC4C/5FD6CFB8" Ref="UAO?"  Part="1" 
AR Path="/620F934F/5FD6CFB8" Ref="UAO?"  Part="1" 
AR Path="/5FD278C8/5FD6CFB8" Ref="UAO245"  Part="1" 
AR Path="/5FBBD4DB/5FBBDB9D/5FD6CFB8" Ref="UAO245"  Part="1" 
F 0 "UAO245" H 8775 10017 50  0000 C CNN
F 1 "AO22" H 8775 9926 50  0000 C CNN
F 2 "" H 8900 9700 50  0001 C CNN
F 3 "" H 8900 9700 50  0001 C CNN
	1    8750 9700
	1    0    0    -1  
$EndComp
$Comp
L A5C:AO22 UAM?
U 1 1 5FD6CFBE
P 8750 13100
AR Path="/60BA673A/5FD6CFBE" Ref="UAM?"  Part="1" 
AR Path="/6428BC4C/5FD6CFBE" Ref="UAM?"  Part="1" 
AR Path="/620F934F/5FD6CFBE" Ref="UAM?"  Part="1" 
AR Path="/5FD278C8/5FD6CFBE" Ref="UAM245"  Part="1" 
AR Path="/5FBBD4DB/5FBBDB9D/5FD6CFBE" Ref="UAM245"  Part="1" 
F 0 "UAM245" H 8775 13417 50  0000 C CNN
F 1 "AO22" H 8775 13326 50  0000 C CNN
F 2 "" H 8900 13100 50  0001 C CNN
F 3 "" H 8900 13100 50  0001 C CNN
	1    8750 13100
	1    0    0    -1  
$EndComp
$Comp
L A5C:L8G UAN?
U 1 1 5FD6CFCA
P 4300 4900
AR Path="/6428BC4C/5FD6CFCA" Ref="UAN?"  Part="1" 
AR Path="/620F934F/5FD6CFCA" Ref="UAN?"  Part="1" 
AR Path="/5FD278C8/5FD6CFCA" Ref="UAN209"  Part="1" 
AR Path="/5FBBD4DB/5FBBDB9D/5FD6CFCA" Ref="UAN209"  Part="1" 
F 0 "UAN209" H 4300 5565 50  0000 C CNN
F 1 "L8G" H 4300 5474 50  0000 C CNN
F 2 "" H 4250 5200 50  0001 C CNN
F 3 "" H 4250 5200 50  0001 C CNN
	1    4300 4900
	1    0    0    -1  
$EndComp
$Comp
L A5C:L8G UAH?
U 1 1 5FD6CFD6
P 4300 8300
AR Path="/6428BC4C/5FD6CFD6" Ref="UAH?"  Part="1" 
AR Path="/620F934F/5FD6CFD6" Ref="UAH?"  Part="1" 
AR Path="/5FD278C8/5FD6CFD6" Ref="UAG209"  Part="1" 
AR Path="/5FBBD4DB/5FBBDB9D/5FD6CFD6" Ref="UAG209"  Part="1" 
F 0 "UAG209" H 4300 8965 50  0000 C CNN
F 1 "L8G" H 4300 8874 50  0000 C CNN
F 2 "" H 4250 8600 50  0001 C CNN
F 3 "" H 4250 8600 50  0001 C CNN
	1    4300 8300
	1    0    0    -1  
$EndComp
$Comp
L A5C:L8G UAN?
U 1 1 5FD6CFE2
P 4300 11700
AR Path="/6428BC4C/5FD6CFE2" Ref="UAN?"  Part="1" 
AR Path="/620F934F/5FD6CFE2" Ref="UAN?"  Part="1" 
AR Path="/5FD278C8/5FD6CFE2" Ref="UAN248"  Part="1" 
AR Path="/5FBBD4DB/5FBBDB9D/5FD6CFE2" Ref="UAN248"  Part="1" 
F 0 "UAN248" H 4300 12365 50  0000 C CNN
F 1 "L8G" H 4300 12274 50  0000 C CNN
F 2 "" H 4250 12000 50  0001 C CNN
F 3 "" H 4250 12000 50  0001 C CNN
	1    4300 11700
	1    0    0    -1  
$EndComp
$Comp
L A5C:L8G UAH?
U 1 1 5FD6CFEE
P 4300 15100
AR Path="/6428BC4C/5FD6CFEE" Ref="UAH?"  Part="1" 
AR Path="/620F934F/5FD6CFEE" Ref="UAH?"  Part="1" 
AR Path="/5FD278C8/5FD6CFEE" Ref="UAG248"  Part="1" 
AR Path="/5FBBD4DB/5FBBDB9D/5FD6CFEE" Ref="UAG248"  Part="1" 
F 0 "UAG248" H 4300 15765 50  0000 C CNN
F 1 "L8G" H 4300 15674 50  0000 C CNN
F 2 "" H 4250 15400 50  0001 C CNN
F 3 "" H 4250 15400 50  0001 C CNN
	1    4300 15100
	1    0    0    -1  
$EndComp
$Comp
L A5C:L8G UAL?
U 1 1 5FD6CFC4
P 5400 3200
AR Path="/6428BC4C/5FD6CFC4" Ref="UAL?"  Part="1" 
AR Path="/620F934F/5FD6CFC4" Ref="UAL?"  Part="1" 
AR Path="/5FD278C8/5FD6CFC4" Ref="UAL209"  Part="1" 
AR Path="/5FBBD4DB/5FBBDB9D/5FD6CFC4" Ref="UAL209"  Part="1" 
F 0 "UAL209" H 5400 3865 50  0000 C CNN
F 1 "L8G" H 5400 3774 50  0000 C CNN
F 2 "" H 5350 3500 50  0001 C CNN
F 3 "" H 5350 3500 50  0001 C CNN
	1    5400 3200
	1    0    0    -1  
$EndComp
$Comp
L A5C:L8G UAO?
U 1 1 5FD6CFFA
P 5400 4900
AR Path="/6428BC4C/5FD6CFFA" Ref="UAO?"  Part="1" 
AR Path="/620F934F/5FD6CFFA" Ref="UAO?"  Part="1" 
AR Path="/5FD278C8/5FD6CFFA" Ref="UAO209"  Part="1" 
AR Path="/5FBBD4DB/5FBBDB9D/5FD6CFFA" Ref="UAO209"  Part="1" 
F 0 "UAO209" H 5400 5565 50  0000 C CNN
F 1 "L8G" H 5400 5474 50  0000 C CNN
F 2 "" H 5350 5200 50  0001 C CNN
F 3 "" H 5350 5200 50  0001 C CNN
	1    5400 4900
	1    0    0    -1  
$EndComp
$Comp
L A5C:L8G UAE?
U 1 1 5FD6CFD0
P 5400 6600
AR Path="/6428BC4C/5FD6CFD0" Ref="UAE?"  Part="1" 
AR Path="/620F934F/5FD6CFD0" Ref="UAE?"  Part="1" 
AR Path="/5FD278C8/5FD6CFD0" Ref="UAE209"  Part="1" 
AR Path="/5FBBD4DB/5FBBDB9D/5FD6CFD0" Ref="UAE209"  Part="1" 
F 0 "UAE209" H 5400 7265 50  0000 C CNN
F 1 "L8G" H 5400 7174 50  0000 C CNN
F 2 "" H 5350 6900 50  0001 C CNN
F 3 "" H 5350 6900 50  0001 C CNN
	1    5400 6600
	1    0    0    -1  
$EndComp
$Comp
L A5C:L8G UAI?
U 1 1 5FD6D006
P 5400 8300
AR Path="/6428BC4C/5FD6D006" Ref="UAI?"  Part="1" 
AR Path="/620F934F/5FD6D006" Ref="UAI?"  Part="1" 
AR Path="/5FD278C8/5FD6D006" Ref="UAI209"  Part="1" 
AR Path="/5FBBD4DB/5FBBDB9D/5FD6D006" Ref="UAI209"  Part="1" 
F 0 "UAI209" H 5400 8965 50  0000 C CNN
F 1 "L8G" H 5400 8874 50  0000 C CNN
F 2 "" H 5350 8600 50  0001 C CNN
F 3 "" H 5350 8600 50  0001 C CNN
	1    5400 8300
	1    0    0    -1  
$EndComp
$Comp
L A5C:L8G UAL?
U 1 1 5FD6CFDC
P 5400 10000
AR Path="/6428BC4C/5FD6CFDC" Ref="UAL?"  Part="1" 
AR Path="/620F934F/5FD6CFDC" Ref="UAL?"  Part="1" 
AR Path="/5FD278C8/5FD6CFDC" Ref="UAL248"  Part="1" 
AR Path="/5FBBD4DB/5FBBDB9D/5FD6CFDC" Ref="UAL248"  Part="1" 
F 0 "UAL248" H 5400 10665 50  0000 C CNN
F 1 "L8G" H 5400 10574 50  0000 C CNN
F 2 "" H 5350 10300 50  0001 C CNN
F 3 "" H 5350 10300 50  0001 C CNN
	1    5400 10000
	1    0    0    -1  
$EndComp
$Comp
L A5C:L8G UAO?
U 1 1 5FD6D012
P 5400 11700
AR Path="/6428BC4C/5FD6D012" Ref="UAO?"  Part="1" 
AR Path="/620F934F/5FD6D012" Ref="UAO?"  Part="1" 
AR Path="/5FD278C8/5FD6D012" Ref="UAO248"  Part="1" 
AR Path="/5FBBD4DB/5FBBDB9D/5FD6D012" Ref="UAO248"  Part="1" 
F 0 "UAO248" H 5400 12365 50  0000 C CNN
F 1 "L8G" H 5400 12274 50  0000 C CNN
F 2 "" H 5350 12000 50  0001 C CNN
F 3 "" H 5350 12000 50  0001 C CNN
	1    5400 11700
	1    0    0    -1  
$EndComp
$Comp
L A5C:L8G UAE?
U 1 1 5FD6CFE8
P 5400 13400
AR Path="/6428BC4C/5FD6CFE8" Ref="UAE?"  Part="1" 
AR Path="/620F934F/5FD6CFE8" Ref="UAE?"  Part="1" 
AR Path="/5FD278C8/5FD6CFE8" Ref="UAE248"  Part="1" 
AR Path="/5FBBD4DB/5FBBDB9D/5FD6CFE8" Ref="UAE248"  Part="1" 
F 0 "UAE248" H 5400 14065 50  0000 C CNN
F 1 "L8G" H 5400 13974 50  0000 C CNN
F 2 "" H 5350 13700 50  0001 C CNN
F 3 "" H 5350 13700 50  0001 C CNN
	1    5400 13400
	1    0    0    -1  
$EndComp
$Comp
L A5C:L8G UAI?
U 1 1 5FD6D01E
P 5400 15100
AR Path="/6428BC4C/5FD6D01E" Ref="UAI?"  Part="1" 
AR Path="/620F934F/5FD6D01E" Ref="UAI?"  Part="1" 
AR Path="/5FD278C8/5FD6D01E" Ref="UAI248"  Part="1" 
AR Path="/5FBBD4DB/5FBBDB9D/5FD6D01E" Ref="UAI248"  Part="1" 
F 0 "UAI248" H 5400 15765 50  0000 C CNN
F 1 "L8G" H 5400 15674 50  0000 C CNN
F 2 "" H 5350 15400 50  0001 C CNN
F 3 "" H 5350 15400 50  0001 C CNN
	1    5400 15100
	1    0    0    -1  
$EndComp
$Comp
L A5C:M198C UAP?
U 1 1 5FD6D024
P 7350 3050
AR Path="/6428BC4C/5FD6D024" Ref="UAP?"  Part="1" 
AR Path="/620F934F/5FD6D024" Ref="UAP?"  Part="1" 
AR Path="/5FD278C8/5FD6D024" Ref="UAP208"  Part="1" 
AR Path="/5FBBD4DB/5FBBDB9D/5FD6D024" Ref="UAP208"  Part="1" 
F 0 "UAP208" H 7500 1877 50  0000 C CNN
F 1 "M198C" H 7500 1786 50  0000 C CNN
F 2 "" H 7350 3050 50  0001 C CNN
F 3 "" H 7350 3050 50  0001 C CNN
	1    7350 3050
	1    0    0    -1  
$EndComp
$Comp
L A5C:M198C UAJ?
U 1 1 5FD6D02A
P 7350 6450
AR Path="/6428BC4C/5FD6D02A" Ref="UAJ?"  Part="1" 
AR Path="/620F934F/5FD6D02A" Ref="UAJ?"  Part="1" 
AR Path="/5FD278C8/5FD6D02A" Ref="UAJ208"  Part="1" 
AR Path="/5FBBD4DB/5FBBDB9D/5FD6D02A" Ref="UAJ208"  Part="1" 
F 0 "UAJ208" H 7500 5277 50  0000 C CNN
F 1 "M198C" H 7500 5186 50  0000 C CNN
F 2 "" H 7350 6450 50  0001 C CNN
F 3 "" H 7350 6450 50  0001 C CNN
	1    7350 6450
	1    0    0    -1  
$EndComp
$Comp
L A5C:M198C UAP?
U 1 1 5FD6D030
P 7350 9850
AR Path="/6428BC4C/5FD6D030" Ref="UAP?"  Part="1" 
AR Path="/620F934F/5FD6D030" Ref="UAP?"  Part="1" 
AR Path="/5FD278C8/5FD6D030" Ref="UAP247"  Part="1" 
AR Path="/5FBBD4DB/5FBBDB9D/5FD6D030" Ref="UAP247"  Part="1" 
F 0 "UAP247" H 7500 8677 50  0000 C CNN
F 1 "M198C" H 7500 8586 50  0000 C CNN
F 2 "" H 7350 9850 50  0001 C CNN
F 3 "" H 7350 9850 50  0001 C CNN
	1    7350 9850
	1    0    0    -1  
$EndComp
$Comp
L A5C:M198C UAJ?
U 1 1 5FD6D036
P 7350 13250
AR Path="/6428BC4C/5FD6D036" Ref="UAJ?"  Part="1" 
AR Path="/620F934F/5FD6D036" Ref="UAJ?"  Part="1" 
AR Path="/5FD278C8/5FD6D036" Ref="UAJ247"  Part="1" 
AR Path="/5FBBD4DB/5FBBDB9D/5FD6D036" Ref="UAJ247"  Part="1" 
F 0 "UAJ247" H 7500 12077 50  0000 C CNN
F 1 "M198C" H 7500 11986 50  0000 C CNN
F 2 "" H 7350 13250 50  0001 C CNN
F 3 "" H 7350 13250 50  0001 C CNN
	1    7350 13250
	1    0    0    -1  
$EndComp
$Comp
L A5C:NBUF02 UAE208
U 1 1 64769401
P 8200 850
F 0 "UAE208" H 8200 1167 50  0000 C CNN
F 1 "INV01" H 8200 1076 50  0000 C CNN
F 2 "" H 8200 650 50  0001 C CNN
F 3 "" H 8200 650 50  0001 C CNN
	1    8200 850 
	-1   0    0    -1  
$EndComp
$Comp
L A5C:NBUF02 UAG208
U 1 1 64769C9E
P 8200 1350
F 0 "UAG208" H 8200 1667 50  0000 C CNN
F 1 "INV01" H 8200 1576 50  0000 C CNN
F 2 "" H 8200 1150 50  0001 C CNN
F 3 "" H 8200 1150 50  0001 C CNN
	1    8200 1350
	-1   0    0    -1  
$EndComp
$Comp
L A5C:NBUF02 UAH208
U 1 1 6478F5A2
P 8200 1850
F 0 "UAH208" H 8200 2167 50  0000 C CNN
F 1 "INV01" H 8200 2076 50  0000 C CNN
F 2 "" H 8200 1650 50  0001 C CNN
F 3 "" H 8200 1650 50  0001 C CNN
	1    8200 1850
	-1   0    0    -1  
$EndComp
$Comp
L A5C:NBUF02 UAI208
U 1 1 6478F8ED
P 8200 2350
F 0 "UAI208" H 8200 2667 50  0000 C CNN
F 1 "INV01" H 8200 2576 50  0000 C CNN
F 2 "" H 8200 2150 50  0001 C CNN
F 3 "" H 8200 2150 50  0001 C CNN
	1    8200 2350
	-1   0    0    -1  
$EndComp
Wire Wire Line
	8500 850  8500 1350
Wire Wire Line
	7900 850  7900 1350
Wire Wire Line
	8500 1600 8500 1850
Wire Wire Line
	7900 1600 7900 1850
Connection ~ 7900 1350
Wire Wire Line
	7900 1350 7900 1600
Connection ~ 7900 1850
Wire Wire Line
	7900 1850 7900 2350
Connection ~ 8500 1350
Wire Wire Line
	8500 1350 8500 1600
Connection ~ 8500 1850
Wire Wire Line
	8500 1850 8500 2350
Wire Bus Line
	3400 2900 3400 3950
Wire Bus Line
	3400 3950 3400 5100
Wire Bus Line
	3400 6300 3400 7350
Wire Bus Line
	3400 7350 3400 8500
Wire Bus Line
	3400 9700 3400 10750
Wire Bus Line
	3400 10750 3400 11900
Wire Bus Line
	3400 13100 3400 14150
Wire Bus Line
	3400 14150 3400 15300
$EndSCHEMATC
