EESchema Schematic File Version 4
EELAYER 30 0
EELAYER END
$Descr A4 11693 8268
encoding utf-8
Sheet 19 83
Title "CPS Reverse Engineering: DL-0311"
Date "2021-09-12"
Rev ""
Comp ""
Comment1 ""
Comment2 ""
Comment3 "Licence: CC-BY"
Comment4 "Author: Loïc *WydD* Petit"
$EndDescr
Connection ~ 3050 2450
Connection ~ 3050 2900
Connection ~ 3050 3350
Connection ~ 3050 2000
Connection ~ 3050 4700
Connection ~ 3050 4250
Connection ~ 3050 5150
Connection ~ 3050 3800
Connection ~ 6900 4400
Connection ~ 6900 4900
Connection ~ 8550 3400
NoConn ~ 7900 4750
NoConn ~ 7900 4650
Entry Wire Line
	2600 1350 2700 1450
Entry Wire Line
	2600 1800 2700 1900
Entry Wire Line
	2600 2250 2700 2350
Entry Wire Line
	2600 2700 2700 2800
Entry Wire Line
	2600 3150 2700 3250
Entry Wire Line
	2600 3600 2700 3700
Entry Wire Line
	2600 4050 2700 4150
Entry Wire Line
	2600 4500 2700 4600
Entry Wire Line
	2600 4950 2700 5050
Entry Wire Line
	4400 1700 4500 1600
Entry Wire Line
	4400 2650 4500 2750
Entry Wire Line
	4400 2750 4500 2850
Entry Wire Line
	4400 3500 4500 3600
Entry Wire Line
	4400 3600 4500 3700
Entry Wire Line
	4400 4350 4500 4450
Entry Wire Line
	4400 4450 4500 4550
Entry Wire Line
	4400 5200 4500 5300
Entry Wire Line
	4400 5300 4500 5400
Entry Wire Line
	7900 1700 8000 1600
Entry Wire Line
	7900 1800 8000 1700
Entry Wire Line
	7900 1900 8000 1800
Entry Wire Line
	7900 2000 8000 1900
Entry Wire Line
	7900 2100 8000 2000
Entry Wire Line
	7900 2200 8000 2100
Entry Wire Line
	8450 2700 8550 2800
Entry Wire Line
	8450 2800 8550 2900
Entry Wire Line
	8450 2900 8550 3000
Entry Wire Line
	8450 3000 8550 3100
Entry Wire Line
	8450 4450 8550 4350
Entry Wire Line
	8450 4550 8550 4450
Wire Wire Line
	2700 1900 3150 1900
Wire Wire Line
	2700 2350 3150 2350
Wire Wire Line
	2700 2800 3150 2800
Wire Wire Line
	2700 3250 3150 3250
Wire Wire Line
	2700 3700 3150 3700
Wire Wire Line
	2700 4150 3150 4150
Wire Wire Line
	2700 4600 3150 4600
Wire Wire Line
	2700 5050 3150 5050
Wire Wire Line
	3050 1550 3150 1550
Wire Wire Line
	3050 2000 3050 1550
Wire Wire Line
	3050 2000 3150 2000
Wire Wire Line
	3050 2450 3050 2000
Wire Wire Line
	3050 2900 3050 2450
Wire Wire Line
	3050 3350 3050 2900
Wire Wire Line
	3050 3800 3050 3350
Wire Wire Line
	3050 4250 3050 3800
Wire Wire Line
	3050 4700 3050 4250
Wire Wire Line
	3050 5150 2700 5150
Wire Wire Line
	3050 5150 3050 4700
Wire Wire Line
	3150 1450 2700 1450
Wire Wire Line
	3150 2450 3050 2450
Wire Wire Line
	3150 2900 3050 2900
Wire Wire Line
	3150 3350 3050 3350
Wire Wire Line
	3150 3800 3050 3800
Wire Wire Line
	3150 4250 3050 4250
Wire Wire Line
	3150 4700 3050 4700
Wire Wire Line
	3150 5150 3050 5150
Wire Wire Line
	3700 1500 4700 1500
Wire Wire Line
	3700 4200 3850 4200
Wire Wire Line
	3850 2400 3700 2400
Wire Wire Line
	3850 2550 3850 2400
Wire Wire Line
	3850 3300 3700 3300
Wire Wire Line
	3850 3400 3850 3300
Wire Wire Line
	3850 4200 3850 4250
Wire Wire Line
	3850 4650 3700 4650
Wire Wire Line
	3850 5000 3850 4650
Wire Wire Line
	3850 5000 4700 5000
Wire Wire Line
	3950 1950 3700 1950
Wire Wire Line
	3950 2450 3950 1950
Wire Wire Line
	3950 2450 4700 2450
Wire Wire Line
	3950 2850 3700 2850
Wire Wire Line
	3950 3300 3950 2850
Wire Wire Line
	3950 3300 4700 3300
Wire Wire Line
	3950 3750 3700 3750
Wire Wire Line
	3950 4150 3950 3750
Wire Wire Line
	3950 4150 4700 4150
Wire Wire Line
	4500 1600 4700 1600
Wire Wire Line
	4500 2750 4700 2750
Wire Wire Line
	4500 2850 4700 2850
Wire Wire Line
	4500 3600 4700 3600
Wire Wire Line
	4500 3700 4700 3700
Wire Wire Line
	4500 4450 4700 4450
Wire Wire Line
	4500 4550 4700 4550
Wire Wire Line
	4500 5300 4700 5300
Wire Wire Line
	4500 5400 4700 5400
Wire Wire Line
	4700 2550 3850 2550
Wire Wire Line
	4700 3400 3850 3400
Wire Wire Line
	4700 4250 3850 4250
Wire Wire Line
	4700 5100 3700 5100
Wire Wire Line
	5500 1550 5250 1550
Wire Wire Line
	5500 1650 5500 2450
Wire Wire Line
	5500 2600 5650 2600
Wire Wire Line
	5500 2700 5750 2700
Wire Wire Line
	5500 3300 5500 2850
Wire Wire Line
	5500 3550 5950 3550
Wire Wire Line
	5500 4150 5500 3700
Wire Wire Line
	5500 5000 5500 4550
Wire Wire Line
	5650 1800 5650 2600
Wire Wire Line
	5650 1800 7900 1800
Wire Wire Line
	5750 1900 5750 2700
Wire Wire Line
	5750 1900 7900 1900
Wire Wire Line
	5850 2000 5850 3450
Wire Wire Line
	5850 2000 7900 2000
Wire Wire Line
	5850 3450 5500 3450
Wire Wire Line
	5700 6750 6200 6750
Wire Wire Line
	5950 2100 7900 2100
Wire Wire Line
	5950 3550 5950 2100
Wire Wire Line
	6050 1700 6050 1600
Wire Wire Line
	6050 1700 7900 1700
Wire Wire Line
	6050 2200 6050 4300
Wire Wire Line
	6050 2200 7900 2200
Wire Wire Line
	6050 4300 5500 4300
Wire Wire Line
	6700 4400 6900 4400
Wire Wire Line
	6700 4900 6900 4900
Wire Wire Line
	6900 4400 6900 4500
Wire Wire Line
	6900 4900 6900 5000
Wire Wire Line
	7900 2700 8450 2700
Wire Wire Line
	7900 2800 8450 2800
Wire Wire Line
	7900 2900 8450 2900
Wire Wire Line
	7900 3000 8450 3000
Wire Wire Line
	7900 4450 8450 4450
Wire Wire Line
	7900 4550 8450 4550
Wire Bus Line
	2600 1200 2500 1200
Wire Bus Line
	4400 1000 4250 1000
Wire Bus Line
	8000 1450 8150 1450
Wire Bus Line
	8550 3400 8950 3400
Text Notes 3350 6600 0    50   ~ 0
0 if 4-7 MOD16 and >= 32
Text Notes 3350 6700 0    50   ~ 0
0 if 8-11 MOD16 and >= 32
Text Notes 3350 6800 0    50   ~ 0
0 if 12-15 MOD16 and >= 32
Text Label 2750 1450 0    50   ~ 0
LINE8
Text Label 2750 1900 0    50   ~ 0
LINE7
Text Label 2750 2350 0    50   ~ 0
LINE6
Text Label 2750 2800 0    50   ~ 0
LINE5
Text Label 2750 3250 0    50   ~ 0
LINE4
Text Label 2750 3700 0    50   ~ 0
LINE3
Text Label 2750 4150 0    50   ~ 0
LINE2
Text Label 2750 4600 0    50   ~ 0
LINE1
Text Label 2750 5050 0    50   ~ 0
LINE0
Text Label 4650 1600 2    50   ~ 0
Y8
Text Label 4650 2750 2    50   ~ 0
Y7
Text Label 4650 2850 2    50   ~ 0
Y6
Text Label 4650 3600 2    50   ~ 0
Y5
Text Label 4650 3700 2    50   ~ 0
Y4
Text Label 4650 4450 2    50   ~ 0
Y3
Text Label 4650 4550 2    50   ~ 0
Y2
Text Label 4650 5300 2    50   ~ 0
Y1
Text Label 4650 5400 2    50   ~ 0
Y0
Text Label 5500 2600 0    50   ~ 0
Q7
Text Label 5500 2700 0    50   ~ 0
Q6
Text Label 5500 3450 0    50   ~ 0
Q5
Text Label 5500 3550 0    50   ~ 0
Q4
Text Label 5500 4300 0    50   ~ 0
Q3
Text Label 5500 4400 0    50   ~ 0
Q2
Text Label 5500 5150 0    50   ~ 0
Q1
Text Label 5500 5250 0    50   ~ 0
Q0
Text Label 6050 1600 0    50   ~ 0
Q8
Text Label 6900 2450 2    50   ~ 0
Q4
Text Label 6900 2550 2    50   ~ 0
Q3
Text Label 6900 2650 2    50   ~ 0
Q2
Text Label 6900 2750 2    50   ~ 0
Q1
Text Label 6900 3050 2    50   ~ 0
Q4
Text Label 6900 3150 2    50   ~ 0
Q3
Text Label 6900 3250 2    50   ~ 0
Q2
Text Label 6900 4200 2    50   ~ 0
Q0
Text Label 6900 4700 2    50   ~ 0
Q1
Text Label 6900 4800 2    50   ~ 0
Q0
Text Label 7250 1700 2    50   ~ 0
Q8
Text Label 7250 1800 2    50   ~ 0
Q7
Text Label 7250 1900 2    50   ~ 0
Q6
Text Label 7250 2000 2    50   ~ 0
Q5
Text Label 7250 2100 2    50   ~ 0
Q4
Text Label 7250 2200 2    50   ~ 0
Q3
Text Label 7800 1700 2    50   ~ 0
Y-OUT8
Text Label 7800 1800 2    50   ~ 0
Y-OUT7
Text Label 7800 1900 2    50   ~ 0
Y-OUT6
Text Label 7800 2000 2    50   ~ 0
Y-OUT5
Text Label 7800 2100 2    50   ~ 0
Y-OUT4
Text Label 7800 2200 2    50   ~ 0
Y-OUT3
Text Label 8400 2700 2    50   ~ 0
ROMA-Y5
Text Label 8400 2800 2    50   ~ 0
ROMA-Y4
Text Label 8400 2900 2    50   ~ 0
ROMA-Y3
Text Label 8400 3000 2    50   ~ 0
ROMA-Y2
Text Label 8400 4450 2    50   ~ 0
ROMA-Y1
Text Label 8400 4550 2    50   ~ 0
ROMA-Y0
Text HLabel 2500 1200 0    50   Input ~ 0
LINE[0..8]
Text HLabel 2700 5150 0    50   Input ~ 0
~FLIP
Text HLabel 4250 1000 0    50   Input ~ 0
Y[0..8]
Text HLabel 5100 6600 0    50   Input ~ 0
~SCROLL1-T
Text HLabel 5100 6700 0    50   Input ~ 0
~SCROLL2-T
Text HLabel 5100 6800 0    50   Input ~ 0
~SCROLL3-T
Text HLabel 5100 6900 0    50   Input ~ 0
~STARS-T
Text HLabel 5500 5400 2    50   Input ~ 0
FLIP
Text HLabel 6900 3450 0    50   Input ~ 0
~SCROLL3-T
Text HLabel 6900 5200 0    50   Input ~ 0
~SCROLL3-T
Text HLabel 8150 1450 2    50   Output ~ 0
Y-OUT[3..8]
Text HLabel 8950 3400 2    50   3State ~ 0
ROMA-Y[0..5]
$Comp
L power:GND #PWR0250
U 1 1 6210A869
P 6700 4400
F 0 "#PWR0250" H 6700 4150 50  0001 C CNN
F 1 "GND" H 6705 4227 50  0001 C CNN
F 2 "" H 6700 4400 50  0001 C CNN
F 3 "" H 6700 4400 50  0001 C CNN
	1    6700 4400
	1    0    0    -1  
$EndComp
$Comp
L power:GND #PWR0251
U 1 1 6210D60D
P 6700 4900
F 0 "#PWR0251" H 6700 4650 50  0001 C CNN
F 1 "GND" H 6705 4727 50  0001 C CNN
F 2 "" H 6700 4900 50  0001 C CNN
F 3 "" H 6700 4900 50  0001 C CNN
	1    6700 4900
	1    0    0    -1  
$EndComp
$Comp
L A5C:XNOR02 UEJ?
U 1 1 6AC249BC
P 3400 1500
AR Path="/6767F143/6AC249BC" Ref="UEJ?"  Part="1" 
AR Path="/6AC249BC" Ref="UEJ11"  Part="1" 
AR Path="/611F886E/6AC249BC" Ref="UEJ11"  Part="1" 
AR Path="/612D3239/612D3C76/6AC249BC" Ref="UEJ11"  Part="1" 
F 0 "UEJ11" H 3425 1767 50  0000 C CNN
F 1 "XNOR02" H 3425 1676 50  0000 C CNN
F 2 "" H 3425 1500 50  0001 C CNN
F 3 "" H 3425 1500 50  0001 C CNN
	1    3400 1500
	1    0    0    -1  
$EndComp
$Comp
L A5C:XNOR02 UEI10
U 1 1 66977F7A
P 3400 1950
AR Path="/611F886E/66977F7A" Ref="UEI10"  Part="1" 
AR Path="/612D3239/612D3C76/66977F7A" Ref="UEI10"  Part="1" 
F 0 "UEI10" H 3425 2217 50  0000 C CNN
F 1 "XNOR02" H 3425 2126 50  0000 C CNN
F 2 "" H 3425 1950 50  0001 C CNN
F 3 "" H 3425 1950 50  0001 C CNN
	1    3400 1950
	1    0    0    -1  
$EndComp
$Comp
L A5C:XNOR02 UEG1
U 1 1 6697900E
P 3400 2400
AR Path="/611F886E/6697900E" Ref="UEG1"  Part="1" 
AR Path="/612D3239/612D3C76/6697900E" Ref="UEG1"  Part="1" 
F 0 "UEG1" H 3425 2667 50  0000 C CNN
F 1 "XNOR02" H 3425 2576 50  0000 C CNN
F 2 "" H 3425 2400 50  0001 C CNN
F 3 "" H 3425 2400 50  0001 C CNN
	1    3400 2400
	1    0    0    -1  
$EndComp
$Comp
L A5C:XNOR02 UEI13
U 1 1 6697A6E8
P 3400 2850
AR Path="/611F886E/6697A6E8" Ref="UEI13"  Part="1" 
AR Path="/612D3239/612D3C76/6697A6E8" Ref="UEI13"  Part="1" 
F 0 "UEI13" H 3425 3117 50  0000 C CNN
F 1 "XNOR02" H 3425 3026 50  0000 C CNN
F 2 "" H 3425 2850 50  0001 C CNN
F 3 "" H 3425 2850 50  0001 C CNN
	1    3400 2850
	1    0    0    -1  
$EndComp
$Comp
L A5C:XNOR02 UED1
U 1 1 6697A6EE
P 3400 3300
AR Path="/611F886E/6697A6EE" Ref="UED1"  Part="1" 
AR Path="/612D3239/612D3C76/6697A6EE" Ref="UED1"  Part="1" 
F 0 "UED1" H 3425 3567 50  0000 C CNN
F 1 "XNOR02" H 3425 3476 50  0000 C CNN
F 2 "" H 3425 3300 50  0001 C CNN
F 3 "" H 3425 3300 50  0001 C CNN
	1    3400 3300
	1    0    0    -1  
$EndComp
$Comp
L A5C:XNOR02 UEB192
U 1 1 6704C690
P 3400 3750
AR Path="/611F886E/6704C690" Ref="UEB192"  Part="1" 
AR Path="/612D3239/612D3C76/6704C690" Ref="UEB192"  Part="1" 
F 0 "UEB192" H 3425 4017 50  0000 C CNN
F 1 "XNOR02" H 3425 3926 50  0000 C CNN
F 2 "" H 3425 3750 50  0001 C CNN
F 3 "" H 3425 3750 50  0001 C CNN
	1    3400 3750
	1    0    0    -1  
$EndComp
$Comp
L A5C:XNOR02 UEC18
U 1 1 6704C696
P 3400 4200
AR Path="/611F886E/6704C696" Ref="UEC18"  Part="1" 
AR Path="/612D3239/612D3C76/6704C696" Ref="UEC18"  Part="1" 
F 0 "UEC18" H 3425 4467 50  0000 C CNN
F 1 "XNOR02" H 3425 4376 50  0000 C CNN
F 2 "" H 3425 4200 50  0001 C CNN
F 3 "" H 3425 4200 50  0001 C CNN
	1    3400 4200
	1    0    0    -1  
$EndComp
$Comp
L A5C:XNOR02 UEI17
U 1 1 6704C69C
P 3400 4650
AR Path="/611F886E/6704C69C" Ref="UEI17"  Part="1" 
AR Path="/612D3239/612D3C76/6704C69C" Ref="UEI17"  Part="1" 
F 0 "UEI17" H 3425 4917 50  0000 C CNN
F 1 "XNOR02" H 3425 4826 50  0000 C CNN
F 2 "" H 3425 4650 50  0001 C CNN
F 3 "" H 3425 4650 50  0001 C CNN
	1    3400 4650
	1    0    0    -1  
$EndComp
$Comp
L A5C:XNOR02 UEI23
U 1 1 6704C6A2
P 3400 5100
AR Path="/611F886E/6704C6A2" Ref="UEI23"  Part="1" 
AR Path="/612D3239/612D3C76/6704C6A2" Ref="UEI23"  Part="1" 
F 0 "UEI23" H 3425 5367 50  0000 C CNN
F 1 "XNOR02" H 3425 5276 50  0000 C CNN
F 2 "" H 3425 5100 50  0001 C CNN
F 3 "" H 3425 5100 50  0001 C CNN
	1    3400 5100
	1    0    0    -1  
$EndComp
$Comp
L A5C:XNOR02 UEJ?
U 1 1 6AC249C4
P 4950 1550
AR Path="/6767F143/6AC249C4" Ref="UEJ?"  Part="1" 
AR Path="/6AC249C4" Ref="UEJ22"  Part="1" 
AR Path="/611F886E/6AC249C4" Ref="UEJ22"  Part="1" 
AR Path="/612D3239/612D3C76/6AC249C4" Ref="UEJ22"  Part="1" 
F 0 "UEJ22" H 4975 1817 50  0000 C CNN
F 1 "XNOR02" H 4975 1726 50  0000 C CNN
F 2 "" H 4975 1550 50  0001 C CNN
F 3 "" H 4975 1550 50  0001 C CNN
	1    4950 1550
	1    0    0    -1  
$EndComp
$Comp
L A5C:XNOR02 UED10
U 1 1 61118DAB
P 5750 1600
AR Path="/611F886E/61118DAB" Ref="UED10"  Part="1" 
AR Path="/612D3239/612D3C76/61118DAB" Ref="UED10"  Part="1" 
F 0 "UED10" H 5775 1867 50  0000 C CNN
F 1 "XNOR02" H 5775 1776 50  0000 C CNN
F 2 "" H 5775 1600 50  0001 C CNN
F 3 "" H 5775 1600 50  0001 C CNN
	1    5750 1600
	1    0    0    -1  
$EndComp
$Comp
L A5C:NAND04 UEH16
U 1 1 61118DB0
P 5400 6750
AR Path="/611F886E/61118DB0" Ref="UEH16"  Part="1" 
AR Path="/612D3239/612D3C76/61118DB0" Ref="UEH16"  Part="1" 
F 0 "UEH16" H 5400 7092 50  0000 C CNN
F 1 "NAND04" H 5400 7001 50  0000 C CNN
F 2 "" H 5400 6500 50  0001 C CNN
F 3 "" H 5400 6500 50  0001 C CNN
	1    5400 6750
	1    0    0    -1  
$EndComp
$Comp
L A5C:FA2 UEC0
U 1 1 61118DAA
P 5100 2750
AR Path="/611F886E/61118DAA" Ref="UEC0"  Part="1" 
AR Path="/612D3239/612D3C76/61118DAA" Ref="UEC0"  Part="1" 
F 0 "UEC0" H 5100 3315 50  0000 C CNN
F 1 "FA2" H 5100 3224 50  0000 C CNN
F 2 "" H 4950 2950 50  0001 C CNN
F 3 "" H 4950 2950 50  0001 C CNN
	1    5100 2750
	1    0    0    -1  
$EndComp
$Comp
L A5C:FA2 UEB0
U 1 1 61118DAC
P 5100 3600
AR Path="/611F886E/61118DAC" Ref="UEB0"  Part="1" 
AR Path="/612D3239/612D3C76/61118DAC" Ref="UEB0"  Part="1" 
F 0 "UEB0" H 5100 4165 50  0000 C CNN
F 1 "FA2" H 5100 4074 50  0000 C CNN
F 2 "" H 4950 3800 50  0001 C CNN
F 3 "" H 4950 3800 50  0001 C CNN
	1    5100 3600
	1    0    0    -1  
$EndComp
$Comp
L A5C:FA2 UEB17
U 1 1 61118DAD
P 5100 4450
AR Path="/611F886E/61118DAD" Ref="UEB17"  Part="1" 
AR Path="/612D3239/612D3C76/61118DAD" Ref="UEB17"  Part="1" 
F 0 "UEB17" H 5100 5015 50  0000 C CNN
F 1 "FA2" H 5100 4924 50  0000 C CNN
F 2 "" H 4950 4650 50  0001 C CNN
F 3 "" H 4950 4650 50  0001 C CNN
	1    5100 4450
	1    0    0    -1  
$EndComp
$Comp
L A5C:FA2 UEC24
U 1 1 61118DAF
P 5100 5300
AR Path="/611F886E/61118DAF" Ref="UEC24"  Part="1" 
AR Path="/612D3239/612D3C76/61118DAF" Ref="UEC24"  Part="1" 
F 0 "UEC24" H 5100 5865 50  0000 C CNN
F 1 "FA2" H 5100 5774 50  0000 C CNN
F 2 "" H 4950 5500 50  0001 C CNN
F 3 "" H 4950 5500 50  0001 C CNN
	1    5100 5300
	1    0    0    -1  
$EndComp
$Comp
L A5C:MUX24GH UEA16
U 1 1 61118DAE
P 7400 3050
AR Path="/611F886E/61118DAE" Ref="UEA16"  Part="1" 
AR Path="/612D3239/612D3C76/61118DAE" Ref="UEA16"  Part="1" 
F 0 "UEA16" H 7400 2285 50  0000 C CNN
F 1 "MUX24GH" H 7400 2376 50  0000 C CNN
F 2 "" H 7400 3050 50  0001 C CNN
F 3 "" H 7400 3050 50  0001 C CNN
	1    7400 3050
	1    0    0    -1  
$EndComp
$Comp
L A5C:MUX24GH UEH32
U 1 1 7F06F50F
P 7400 4800
AR Path="/611F886E/7F06F50F" Ref="UEH32"  Part="1" 
AR Path="/612D3239/612D3C76/7F06F50F" Ref="UEH32"  Part="1" 
F 0 "UEH32" H 7400 5665 50  0000 C CNN
F 1 "MUX24GH" H 7400 5574 50  0000 C CNN
F 2 "" H 7400 4800 50  0001 C CNN
F 3 "" H 7400 4800 50  0001 C CNN
	1    7400 4800
	1    0    0    -1  
$EndComp
Text HLabel 6900 2950 0    50   Input ~ 0
SECOND-BLOCK
Text HLabel 6900 4300 0    50   Input ~ 0
SECOND-BLOCK
Wire Wire Line
	6200 3550 6900 3550
Wire Wire Line
	6200 3550 6200 5300
Wire Wire Line
	6200 5300 6900 5300
Connection ~ 6200 5300
Wire Wire Line
	6200 5300 6200 6750
Wire Bus Line
	8550 3400 8550 4450
Wire Bus Line
	8550 2800 8550 3400
Wire Bus Line
	8000 1450 8000 2100
Wire Bus Line
	2600 1200 2600 4950
Wire Bus Line
	4400 1000 4400 5300
$EndSCHEMATC
