EESchema Schematic File Version 4
EELAYER 30 0
EELAYER END
$Descr A4 11693 8268
encoding utf-8
Sheet 4 83
Title "CPS Reverse Engineering: DL-0311"
Date "2021-09-12"
Rev ""
Comp ""
Comment1 ""
Comment2 ""
Comment3 "Licence: CC-BY"
Comment4 "Author: Loïc *WydD* Petit"
$EndDescr
Connection ~ 4200 4650
Connection ~ 4100 5750
Connection ~ 4200 5850
Connection ~ 3150 2800
Connection ~ 3900 2800
Connection ~ 4100 4550
Connection ~ 4000 2150
Connection ~ 8900 3500
Connection ~ 2400 2850
Connection ~ 6000 3050
Connection ~ 6000 2750
Connection ~ 4200 5000
NoConn ~ 2150 2750
NoConn ~ 9500 3500
Wire Wire Line
	1500 2750 1650 2750
Wire Wire Line
	1550 2950 1550 3200
Wire Wire Line
	1550 2950 1650 2950
Wire Wire Line
	2150 2850 2400 2850
Wire Wire Line
	2400 1400 2400 2750
Wire Wire Line
	2400 1400 8900 1400
Wire Wire Line
	2400 2750 2500 2750
Wire Wire Line
	2400 2850 2500 2850
Wire Wire Line
	2400 3050 2400 2850
Wire Wire Line
	2400 3050 2600 3050
Wire Wire Line
	2750 5750 3050 5750
Wire Wire Line
	2750 6300 3050 6300
Wire Wire Line
	3150 2800 3050 2800
Wire Wire Line
	3150 2800 3150 3050
Wire Wire Line
	3150 2800 3900 2800
Wire Wire Line
	3150 3050 3250 3050
Wire Wire Line
	3750 3700 4400 3700
Wire Wire Line
	3750 3950 4400 3950
Wire Wire Line
	3750 4050 4400 4050
Wire Wire Line
	3750 4250 4400 4250
Wire Wire Line
	3750 4350 4400 4350
Wire Wire Line
	3900 2400 4400 2400
Wire Wire Line
	3900 2800 3900 2400
Wire Wire Line
	3900 5400 3900 2800
Wire Wire Line
	3900 5400 4400 5400
Wire Wire Line
	4000 1500 4000 2150
Wire Wire Line
	4000 1500 8800 1500
Wire Wire Line
	4000 2150 4000 5550
Wire Wire Line
	4000 2150 4400 2150
Wire Wire Line
	4000 5550 4400 5550
Wire Wire Line
	4100 3200 1550 3200
Wire Wire Line
	4100 4550 4100 3200
Wire Wire Line
	4100 4550 4100 5750
Wire Wire Line
	4100 4550 4400 4550
Wire Wire Line
	4100 5750 3650 5750
Wire Wire Line
	4100 5750 4400 5750
Wire Wire Line
	4200 2750 4200 4650
Wire Wire Line
	4200 2750 4400 2750
Wire Wire Line
	4200 4650 4200 5000
Wire Wire Line
	4200 4650 4400 4650
Wire Wire Line
	4200 5000 4200 5850
Wire Wire Line
	4200 5000 7050 5000
Wire Wire Line
	4200 5850 4200 6300
Wire Wire Line
	4200 5850 4400 5850
Wire Wire Line
	4200 6300 3650 6300
Wire Wire Line
	5900 1950 6100 1950
Wire Wire Line
	5900 2050 6100 2050
Wire Wire Line
	5900 2150 6100 2150
Wire Wire Line
	5900 2250 6100 2250
Wire Wire Line
	5900 2350 6100 2350
Wire Wire Line
	5900 2450 6100 2450
Wire Wire Line
	5900 2550 6100 2550
Wire Wire Line
	5950 5850 7050 5850
Wire Wire Line
	6000 3400 7050 3400
Wire Wire Line
	6000 3500 7050 3500
Wire Wire Line
	6000 3600 7050 3600
Wire Wire Line
	6000 3700 7050 3700
Wire Wire Line
	6000 3800 7050 3800
Wire Wire Line
	6000 3900 7050 3900
Wire Wire Line
	6000 4000 7050 4000
Wire Wire Line
	6000 4200 6100 4200
Wire Wire Line
	6100 4400 6000 4400
Wire Wire Line
	6950 4200 7050 4200
Wire Wire Line
	6950 5550 7050 5550
Wire Wire Line
	6950 5650 7050 5650
Wire Wire Line
	6950 5750 7050 5750
Wire Wire Line
	8550 3350 8800 3350
Wire Wire Line
	8650 4200 8550 4200
Wire Wire Line
	8650 5550 8550 5550
Wire Wire Line
	8800 3350 8800 1500
Wire Wire Line
	8900 1400 8900 3500
Wire Wire Line
	8900 3500 8550 3500
Wire Wire Line
	9000 3500 8900 3500
Wire Bus Line
	3750 3600 4400 3600
Wire Bus Line
	4250 1600 4250 1950
Wire Bus Line
	4250 1600 8700 1600
Wire Bus Line
	4250 1950 4400 1950
Wire Bus Line
	4300 3050 4300 5300
Wire Bus Line
	4300 3050 6000 3050
Wire Bus Line
	4400 3400 3750 3400
Wire Bus Line
	4400 5300 4300 5300
Wire Bus Line
	5900 2750 6000 2750
Wire Bus Line
	6000 2750 6000 3050
Wire Bus Line
	6000 3050 6000 3200
Wire Bus Line
	6000 3200 7050 3200
Wire Bus Line
	6050 5300 5950 5300
Wire Bus Line
	6100 2750 6000 2750
Wire Bus Line
	8550 3200 8700 3200
Wire Bus Line
	8700 3200 8700 1600
Text Label 3050 5750 2    50   ~ 0
CLK4M
Text Label 9000 3700 2    50   ~ 0
CLK4M
Text HLabel 1500 2750 0    50   Input ~ 0
~BGACK
Text HLabel 2600 3050 2    50   Output ~ 0
BUS-~I~O
Text HLabel 2750 5750 0    50   Input ~ 0
CLK4M
Text HLabel 2750 6300 0    50   Input ~ 0
MAIN-RESET
Text HLabel 3250 3050 2    50   Output ~ 0
BUS-READY
Text HLabel 3750 3400 0    50   Input ~ 0
LINE[0..8]
Text HLabel 3750 3600 0    50   Input ~ 0
BUS-DATA[0..15]
Text HLabel 3750 3700 0    50   Input ~ 0
~VIDEO-CONTROL
Text HLabel 3750 3950 0    50   Input ~ 0
~PALETTE-BASE
Text HLabel 3750 4050 0    50   Input ~ 0
~WSTROM-COPY
Text HLabel 3750 4250 0    50   Input ~ 0
WSTROM-END
Text HLabel 3750 4350 0    50   Input ~ 0
WSTLUT-END
Text HLabel 6050 5300 2    50   Output ~ 0
SCROLL-CNT[0..6]
Text HLabel 6100 1950 2    50   Output ~ 0
~BUS-WSTROM
Text HLabel 6100 2050 2    50   Output ~ 0
~BUS-WSTOBJ
Text HLabel 6100 2150 2    50   Output ~ 0
~BUS-ROWSCROLL
Text HLabel 6100 2250 2    50   Output ~ 0
~BUS-SCROLL1
Text HLabel 6100 2350 2    50   Output ~ 0
~BUS-SCROLL2
Text HLabel 6100 2450 2    50   Output ~ 0
~BUS-SCROLL3
Text HLabel 6100 2550 2    50   Output ~ 0
~BUS-WSTLUT
Text HLabel 6100 2750 2    50   Output ~ 0
BUS-STATE[0..2]
Text HLabel 6100 4200 2    50   Output ~ 0
FLIP
Text HLabel 6100 4400 2    50   Output ~ 0
LUTPRO
Text HLabel 6950 4200 0    50   Input ~ 0
LI
Text HLabel 6950 5550 0    50   Input ~ 0
WSTROM-END
Text HLabel 6950 5650 0    50   Input ~ 0
WSTOBJ-END
Text HLabel 6950 5750 0    50   Input ~ 0
WSTLUT-END
Text HLabel 8650 4200 2    50   Output ~ 0
LI-SYNCED
Text HLabel 8650 5550 2    50   Output ~ 0
~WSTROM-RESET
Text HLabel 10100 3600 2    50   Output ~ 0
~BR
$Comp
L A5C:AND02 UAB151
U 1 1 67BB3C10
P 2750 2800
AR Path="/611F0159/67BB3C10" Ref="UAB151"  Part="1" 
AR Path="/60A9F60C/6133A9EC/67BB3C10" Ref="UAB151"  Part="1" 
AR Path="/60A9F60C/67BB3C10" Ref="UAB151"  Part="1" 
AR Path="/60A9F60C/613FECF4/67BB3C10" Ref="UAB151"  Part="1" 
F 0 "UAB151" H 2775 3067 50  0000 C CNN
F 1 "AND02" H 2775 2976 50  0000 C CNN
F 2 "" H 2750 2800 50  0001 C CNN
F 3 "" H 2750 2800 50  0001 C CNN
	1    2750 2800
	1    0    0    -1  
$EndComp
$Comp
L A5C:NBUF02 UAA?
U 1 1 62D31531
P 3350 5750
AR Path="/62D31531" Ref="UAA?"  Part="1" 
AR Path="/60A9F60C/62D31531" Ref="UAA388"  Part="1" 
F 0 "UAA388" H 3350 6067 50  0000 C CNN
F 1 "NBUF02" H 3350 5976 50  0000 C CNN
F 2 "" H 3350 5550 50  0001 C CNN
F 3 "" H 3350 5550 50  0001 C CNN
	1    3350 5750
	1    0    0    -1  
$EndComp
$Comp
L A5C:NBUF02 UBF92
U 1 1 603AD510
P 3350 6300
F 0 "UBF92" H 3350 6617 50  0000 C CNN
F 1 "NBUF02" H 3350 6526 50  0000 C CNN
F 2 "" H 3350 6100 50  0001 C CNN
F 3 "" H 3350 6100 50  0001 C CNN
	1    3350 6300
	1    0    0    -1  
$EndComp
$Comp
L A5C:BUF12 UAB60
U 1 1 681F91A7
P 9800 3600
F 0 "UAB60" H 9800 3917 50  0000 C CNN
F 1 "BUF12" H 9800 3826 50  0000 C CNN
F 2 "" H 9800 3600 50  0001 C CNN
F 3 "" H 9800 3600 50  0001 C CNN
	1    9800 3600
	1    0    0    -1  
$EndComp
$Comp
L A5C:DFFCOO UAA467
U 1 1 635F3B89
P 1900 2850
F 0 "UAA467" H 1900 3215 50  0000 C CNN
F 1 "DFFCOO" H 1900 3124 50  0000 C CNN
F 2 "" H 1900 2850 50  0001 C CNN
F 3 "" H 1900 2850 50  0001 C CNN
	1    1900 2850
	1    0    0    -1  
$EndComp
$Comp
L A5C:DFFCOO UAB55
U 1 1 6784661F
P 9250 3600
AR Path="/60A9F60C/6784661F" Ref="UAB55"  Part="1" 
AR Path="/6784661F" Ref="UAB55"  Part="1" 
AR Path="/60A9F60C/613FECF4/6784661F" Ref="UAB55"  Part="1" 
F 0 "UAB55" H 9250 3965 50  0000 C CNN
F 1 "DFFCOO" H 9250 3874 50  0000 C CNN
F 2 "" H 9250 3600 50  0001 C CNN
F 3 "" H 9250 3600 50  0001 C CNN
	1    9250 3600
	1    0    0    -1  
$EndComp
$Sheet
S 4400 3250 1600 1550
U 61165F22
F0 "bus-request-intentions" 50
F1 "bus-request-intentions.sch" 50
F2 "LINE[0..8]" I L 4400 3400 50 
F3 "ROWSCROLL-INTENT" O R 6000 3400 50 
F4 "SCROLL1-INTENT" O R 6000 3500 50 
F5 "SCROLL3-INTENT" O R 6000 3700 50 
F6 "SCROLL2-INTENT" O R 6000 3600 50 
F7 "WSTOBJ-INTENT" O R 6000 3800 50 
F8 "WSTLUT-INTENT" O R 6000 3900 50 
F9 "FLIP" O R 6000 4200 50 
F10 "WSTROM-INTENT" O R 6000 4000 50 
F11 "LUTPRO" O R 6000 4400 50 
F12 "~PALETTE-BASE" I L 4400 3950 50 
F13 "~WSTROM-COPY" I L 4400 4050 50 
F14 "~RESET" I L 4400 4650 50 
F15 "~CLK4M" I L 4400 4550 50 
F16 "BUS-DATA[0..15]" I L 4400 3600 50 
F17 "~VIDEO-CONTROL" I L 4400 3700 50 
F18 "WSTLUT-END" I L 4400 4350 50 
F19 "WSTROM-END" I L 4400 4250 50 
$EndSheet
$Sheet
S 7050 3050 1500 2950
U 611CA9E7
F0 "bus-request-new-state" 50
F1 "bus-request-new-state.sch" 50
F2 "ROWSCROLL" I L 7050 3400 50 
F3 "SCROLL1" I L 7050 3500 50 
F4 "SCROLL2" I L 7050 3600 50 
F5 "SCROLL3" I L 7050 3700 50 
F6 "WSTLUT" I L 7050 3900 50 
F7 "WSTOBJ" I L 7050 3800 50 
F8 "WSTROM" I L 7050 4000 50 
F9 "LI" I L 7050 4200 50 
F10 "~CLK4M" I L 7050 5000 50 
F11 "BUS-STATE[0..2]" I L 7050 3200 50 
F12 "BR" O R 8550 3500 50 
F13 "~WSTROM-RESET" O R 8550 5550 50 
F14 "NEW-STATE[0..2]" O R 8550 3200 50 
F15 "SCROLL-END" I L 7050 5850 50 
F16 "WSTLUT-END" I L 7050 5750 50 
F17 "WSTOBJ-END" I L 7050 5650 50 
F18 "WSTROM-END" I L 7050 5550 50 
F19 "~LOAD-STATE" O R 8550 3350 50 
F20 "LI-SYNCED" O R 8550 4200 50 
$EndSheet
$Sheet
S 4400 1800 1500 1100
U 613FECF4
F0 "bus-request-state" 50
F1 "bus-request-state.sch" 50
F2 "NEW-STATE[0..2]" I L 4400 1950 50 
F3 "BUS-STATE[0..2]" O R 5900 2750 50 
F4 "~LOAD-STATE" I L 4400 2150 50 
F5 "~RESET" I L 4400 2750 50 
F6 "BUS-READY" I L 4400 2400 50 
F7 "~BUS-WSTROM" O R 5900 1950 50 
F8 "~BUS-WSTOBJ" O R 5900 2050 50 
F9 "~BUS-ROWSCROLL" O R 5900 2150 50 
F10 "~BUS-SCROLL1" O R 5900 2250 50 
F11 "~BUS-SCROLL2" O R 5900 2350 50 
F12 "~BUS-SCROLL3" O R 5900 2450 50 
F13 "~BUS-WSTLUT" O R 5900 2550 50 
F14 "~CLK4M" I L 4400 2600 50 
$EndSheet
$Sheet
S 4400 5150 1550 850 
U 6133A9EC
F0 "scroll-counter" 50
F1 "scroll-counter.sch" 50
F2 "BUS-READY" I L 4400 5400 50 
F3 "~CLEAR" I L 4400 5550 50 
F4 "~RESET" I L 4400 5850 50 
F5 "SCROLL-END" O R 5950 5850 50 
F6 "~CLK4M" I L 4400 5750 50 
F7 "SCROLL-CNT[0..6]" O R 5950 5300 50 
F8 "BUS-STATE[0..2]" I L 4400 5300 50 
$EndSheet
Wire Wire Line
	4400 2600 4100 2600
Wire Wire Line
	4100 2600 4100 3200
Connection ~ 4100 3200
Text Notes 3500 7250 0    50   ~ 0
The implementation is a complex state machine.\nThe state a 3 bit value, each value correspond to a specific bus request.\n\nThe intentions are defined by either a LINE value or a write on some registers.\nThen the state transition will take the 3 bit value and produce a new state\nafter line increment.\n\nReport to the extra documentation to see the state machine in action.
$EndSCHEMATC
