EESchema Schematic File Version 4
EELAYER 30 0
EELAYER END
$Descr A3 16535 11693
encoding utf-8
Sheet 8 83
Title "CPS Reverse Engineering: DL-0311"
Date "2021-09-12"
Rev ""
Comp ""
Comment1 ""
Comment2 ""
Comment3 "Licence: CC-BY"
Comment4 "Author: Loïc *WydD* Petit"
$EndDescr
Connection ~ 3650 3650
Connection ~ 5000 3450
Connection ~ 4900 3850
Connection ~ 4900 4150
Connection ~ 5000 3550
Connection ~ 5100 2650
Connection ~ 5250 8200
Connection ~ 5100 8700
Connection ~ 5000 8500
Connection ~ 5000 8600
Connection ~ 5250 8800
Connection ~ 4900 8900
Connection ~ 5250 9500
Connection ~ 4900 9200
Connection ~ 5000 8300
Connection ~ 5100 8100
Connection ~ 5100 7700
Connection ~ 2900 10150
Connection ~ 3650 10300
Connection ~ 2900 8550
Connection ~ 2900 9350
Connection ~ 5000 9300
Connection ~ 5100 9400
Connection ~ 4800 9900
Connection ~ 4800 9600
Connection ~ 4900 9300
Connection ~ 3650 9500
Connection ~ 3650 8700
Connection ~ 3650 5250
Connection ~ 3650 4450
Connection ~ 2900 4300
Connection ~ 2900 3500
Connection ~ 2900 5100
Connection ~ 4800 4550
Connection ~ 4800 4850
Connection ~ 8400 2350
Connection ~ 8500 2450
Connection ~ 8100 5150
Connection ~ 8100 3550
Connection ~ 8100 2050
Connection ~ 5250 4450
Connection ~ 5250 3750
Connection ~ 5100 3650
Connection ~ 4900 4250
Connection ~ 5100 4350
Connection ~ 5000 4250
Connection ~ 5250 3150
Connection ~ 5000 3250
Connection ~ 5100 3050
Connection ~ 8600 4050
Connection ~ 8850 2750
Connection ~ 8700 4150
Connection ~ 10700 2550
Connection ~ 10300 2150
Connection ~ 10400 2250
Connection ~ 10800 2650
Connection ~ 10600 3950
Connection ~ 10400 3750
Connection ~ 10500 3850
Connection ~ 12550 7750
Connection ~ 12550 7850
Connection ~ 12550 6350
Connection ~ 11050 5950
Connection ~ 10950 5850
Connection ~ 11150 7550
Connection ~ 10950 7350
Connection ~ 10600 7050
Connection ~ 10500 6950
Connection ~ 12550 6250
Connection ~ 12550 4650
Connection ~ 12550 4750
Connection ~ 12550 3150
Connection ~ 12550 3250
Connection ~ 10300 3650
Connection ~ 8950 4350
Connection ~ 9050 2950
Connection ~ 8850 4250
Connection ~ 11150 4450
Connection ~ 11050 2850
Connection ~ 10800 7250
Connection ~ 10700 7150
Connection ~ 8950 7450
Connection ~ 10200 6650
Connection ~ 10400 6850
Connection ~ 10300 6750
Connection ~ 10700 5650
Connection ~ 8500 5550
Connection ~ 8400 5450
Connection ~ 8300 5350
Connection ~ 8700 5750
Connection ~ 9050 6050
Connection ~ 8200 5250
Connection ~ 4650 1250
Connection ~ 1750 10200
Connection ~ 1650 5050
Connection ~ 3650 7900
Connection ~ 8850 10150
Connection ~ 8950 10250
Connection ~ 9050 10350
Connection ~ 6100 6700
NoConn ~ 4250 10200
NoConn ~ 6100 10100
Entry Wire Line
	5250 5650 5350 5550
Entry Wire Line
	5250 5750 5350 5650
Entry Wire Line
	5250 5850 5350 5750
Entry Wire Line
	5250 5950 5350 5850
Entry Wire Line
	5250 6050 5350 5950
Entry Wire Line
	5250 6150 5350 6050
Entry Wire Line
	5250 6250 5350 6150
Entry Wire Line
	8100 10050 8200 10150
Entry Wire Line
	8100 10150 8200 10250
Entry Wire Line
	8100 10250 8200 10350
Wire Wire Line
	1500 5050 1650 5050
Wire Wire Line
	1650 5050 1650 10100
Wire Wire Line
	1650 5050 1850 5050
Wire Wire Line
	1650 10100 1850 10100
Wire Wire Line
	1750 5150 1750 10200
Wire Wire Line
	1750 10200 1500 10200
Wire Wire Line
	1750 10200 1850 10200
Wire Wire Line
	1850 5150 1750 5150
Wire Wire Line
	2400 10150 2900 10150
Wire Wire Line
	2500 1850 2500 5000
Wire Wire Line
	2500 1850 7050 1850
Wire Wire Line
	2500 5000 3000 5000
Wire Wire Line
	2500 6900 2500 10050
Wire Wire Line
	2500 6900 7050 6900
Wire Wire Line
	2500 10050 3000 10050
Wire Wire Line
	2600 1950 2600 4200
Wire Wire Line
	2600 1950 6950 1950
Wire Wire Line
	2600 4200 3000 4200
Wire Wire Line
	2600 7000 2600 9250
Wire Wire Line
	2600 7000 6950 7000
Wire Wire Line
	2600 9250 3000 9250
Wire Wire Line
	2700 2050 2700 3400
Wire Wire Line
	2700 2050 6850 2050
Wire Wire Line
	2700 3400 3000 3400
Wire Wire Line
	2700 7100 2700 8450
Wire Wire Line
	2700 7100 6850 7100
Wire Wire Line
	2700 8450 3000 8450
Wire Wire Line
	2800 2150 6750 2150
Wire Wire Line
	2800 2600 2800 2150
Wire Wire Line
	2800 2600 3000 2600
Wire Wire Line
	2800 7200 6750 7200
Wire Wire Line
	2800 7650 2800 7200
Wire Wire Line
	2800 7650 3000 7650
Wire Wire Line
	2900 2700 2900 3500
Wire Wire Line
	2900 3500 2900 4300
Wire Wire Line
	2900 4300 2900 5100
Wire Wire Line
	2900 5100 2400 5100
Wire Wire Line
	2900 5100 3000 5100
Wire Wire Line
	2900 7750 2900 8550
Wire Wire Line
	2900 8550 2900 9350
Wire Wire Line
	2900 9350 2900 10150
Wire Wire Line
	2900 10150 3000 10150
Wire Wire Line
	3000 2700 2900 2700
Wire Wire Line
	3000 3500 2900 3500
Wire Wire Line
	3000 4300 2900 4300
Wire Wire Line
	3000 7750 2900 7750
Wire Wire Line
	3000 8550 2900 8550
Wire Wire Line
	3000 9350 2900 9350
Wire Wire Line
	3550 2650 3750 2650
Wire Wire Line
	3550 3450 3750 3450
Wire Wire Line
	3550 4250 3750 4250
Wire Wire Line
	3550 5050 3750 5050
Wire Wire Line
	3550 7700 3750 7700
Wire Wire Line
	3550 8500 3750 8500
Wire Wire Line
	3550 9300 3750 9300
Wire Wire Line
	3550 10100 3750 10100
Wire Wire Line
	3650 3650 3650 2850
Wire Wire Line
	3650 4450 3650 3650
Wire Wire Line
	3650 4450 3750 4450
Wire Wire Line
	3650 5250 3650 4450
Wire Wire Line
	3650 5250 3650 7900
Wire Wire Line
	3650 8700 3650 7900
Wire Wire Line
	3650 9500 3650 8700
Wire Wire Line
	3650 9500 3750 9500
Wire Wire Line
	3650 10300 3650 9500
Wire Wire Line
	3650 10300 3650 10450
Wire Wire Line
	3650 10450 3350 10450
Wire Wire Line
	3750 2850 3650 2850
Wire Wire Line
	3750 3650 3650 3650
Wire Wire Line
	3750 5250 3650 5250
Wire Wire Line
	3750 7900 3650 7900
Wire Wire Line
	3750 8700 3650 8700
Wire Wire Line
	3750 10300 3650 10300
Wire Wire Line
	4250 2650 5100 2650
Wire Wire Line
	4250 2750 4650 2750
Wire Wire Line
	4250 3450 5000 3450
Wire Wire Line
	4250 3550 4550 3550
Wire Wire Line
	4250 4250 4900 4250
Wire Wire Line
	4250 5050 4800 5050
Wire Wire Line
	4250 5150 4350 5150
Wire Wire Line
	4250 7700 5100 7700
Wire Wire Line
	4250 7800 4350 7800
Wire Wire Line
	4250 8500 5000 8500
Wire Wire Line
	4250 8600 4450 8600
Wire Wire Line
	4250 9300 4900 9300
Wire Wire Line
	4250 9400 4550 9400
Wire Wire Line
	4250 10100 4800 10100
Wire Wire Line
	4350 5150 4350 5950
Wire Wire Line
	4350 5950 5250 5950
Wire Wire Line
	4350 6050 4350 7800
Wire Wire Line
	4350 6050 5250 6050
Wire Wire Line
	4450 4350 4250 4350
Wire Wire Line
	4450 5850 4450 4350
Wire Wire Line
	4450 5850 5250 5850
Wire Wire Line
	4450 6150 4450 8600
Wire Wire Line
	4450 6150 5250 6150
Wire Wire Line
	4550 3550 4550 5750
Wire Wire Line
	4550 5750 5250 5750
Wire Wire Line
	4550 6250 5250 6250
Wire Wire Line
	4550 9400 4550 6250
Wire Wire Line
	4650 1250 4400 1250
Wire Wire Line
	4650 1250 4650 1650
Wire Wire Line
	4650 5650 4650 2750
Wire Wire Line
	4650 5650 5250 5650
Wire Wire Line
	4800 2400 4800 4550
Wire Wire Line
	4800 4550 4800 4850
Wire Wire Line
	4800 4550 6100 4550
Wire Wire Line
	4800 4850 4800 5050
Wire Wire Line
	4800 7450 4800 9600
Wire Wire Line
	4800 9600 4800 9900
Wire Wire Line
	4800 9600 6100 9600
Wire Wire Line
	4800 9900 4800 10100
Wire Wire Line
	4900 2400 4900 3850
Wire Wire Line
	4900 3850 4900 4150
Wire Wire Line
	4900 3850 6100 3850
Wire Wire Line
	4900 4150 4900 4250
Wire Wire Line
	4900 4250 4900 4950
Wire Wire Line
	4900 7450 4900 8900
Wire Wire Line
	4900 8900 4900 9200
Wire Wire Line
	4900 8900 6100 8900
Wire Wire Line
	4900 9200 4900 9300
Wire Wire Line
	4900 9300 4900 10000
Wire Wire Line
	5000 2400 5000 3250
Wire Wire Line
	5000 3250 5000 3450
Wire Wire Line
	5000 3250 6100 3250
Wire Wire Line
	5000 3450 5000 3550
Wire Wire Line
	5000 3550 5000 4250
Wire Wire Line
	5000 4250 5000 5050
Wire Wire Line
	5000 7450 5000 8300
Wire Wire Line
	5000 8300 5000 8500
Wire Wire Line
	5000 8300 6100 8300
Wire Wire Line
	5000 8500 5000 8600
Wire Wire Line
	5000 8600 5000 9300
Wire Wire Line
	5000 9300 5000 10100
Wire Wire Line
	5100 2400 5100 2650
Wire Wire Line
	5100 2650 5100 3050
Wire Wire Line
	5100 3050 5100 3650
Wire Wire Line
	5100 3650 5100 4350
Wire Wire Line
	5100 4350 5100 5150
Wire Wire Line
	5100 7450 5100 7700
Wire Wire Line
	5100 7700 5100 8100
Wire Wire Line
	5100 8100 5100 8700
Wire Wire Line
	5100 8700 5100 9400
Wire Wire Line
	5100 9400 5100 10200
Wire Wire Line
	5250 1650 5250 3150
Wire Wire Line
	5250 3150 5250 3750
Wire Wire Line
	5250 3150 5350 3150
Wire Wire Line
	5250 3750 5250 4450
Wire Wire Line
	5250 3750 5350 3750
Wire Wire Line
	5250 4450 5250 5250
Wire Wire Line
	5250 4450 5350 4450
Wire Wire Line
	5250 5250 5350 5250
Wire Wire Line
	5250 6700 5250 8200
Wire Wire Line
	5250 8200 5250 8800
Wire Wire Line
	5250 8200 5350 8200
Wire Wire Line
	5250 8800 5250 9500
Wire Wire Line
	5250 8800 5350 8800
Wire Wire Line
	5250 9500 5250 10300
Wire Wire Line
	5250 9500 5350 9500
Wire Wire Line
	5250 10300 5350 10300
Wire Wire Line
	5350 1250 4650 1250
Wire Wire Line
	5350 1250 5350 2550
Wire Wire Line
	5350 2550 6100 2550
Wire Wire Line
	5350 3050 5100 3050
Wire Wire Line
	5350 3550 5000 3550
Wire Wire Line
	5350 3650 5100 3650
Wire Wire Line
	5350 4150 4900 4150
Wire Wire Line
	5350 4250 5000 4250
Wire Wire Line
	5350 4350 5100 4350
Wire Wire Line
	5350 4850 4800 4850
Wire Wire Line
	5350 4950 4900 4950
Wire Wire Line
	5350 5050 5000 5050
Wire Wire Line
	5350 5150 5100 5150
Wire Wire Line
	5350 8100 5100 8100
Wire Wire Line
	5350 8600 5000 8600
Wire Wire Line
	5350 8700 5100 8700
Wire Wire Line
	5350 9200 4900 9200
Wire Wire Line
	5350 9300 5000 9300
Wire Wire Line
	5350 9400 5100 9400
Wire Wire Line
	5350 9900 4800 9900
Wire Wire Line
	5350 10000 4900 10000
Wire Wire Line
	5350 10100 5000 10100
Wire Wire Line
	5350 10200 5100 10200
Wire Wire Line
	5400 6700 5250 6700
Wire Wire Line
	5900 3100 5900 3150
Wire Wire Line
	5900 3150 6100 3150
Wire Wire Line
	5900 8150 5900 8200
Wire Wire Line
	5900 8200 6100 8200
Wire Wire Line
	5950 3750 5950 3650
Wire Wire Line
	5950 4450 5950 4300
Wire Wire Line
	5950 8800 5950 8700
Wire Wire Line
	5950 9500 5950 9350
Wire Wire Line
	6000 6700 6100 6700
Wire Wire Line
	6100 2650 5100 2650
Wire Wire Line
	6100 3750 5950 3750
Wire Wire Line
	6100 4450 5950 4450
Wire Wire Line
	6100 7600 6100 6700
Wire Wire Line
	6100 7700 5100 7700
Wire Wire Line
	6100 8800 5950 8800
Wire Wire Line
	6100 9500 5950 9500
Wire Wire Line
	6300 5050 6100 5050
Wire Wire Line
	6300 5050 6300 6700
Wire Wire Line
	6300 6700 6100 6700
Wire Wire Line
	6650 3200 6850 3200
Wire Wire Line
	6650 3800 6950 3800
Wire Wire Line
	6650 4500 7050 4500
Wire Wire Line
	6650 8250 6850 8250
Wire Wire Line
	6650 8850 6950 8850
Wire Wire Line
	6650 9550 7050 9550
Wire Wire Line
	6750 2150 6750 2600
Wire Wire Line
	6750 2600 6650 2600
Wire Wire Line
	6750 7200 6750 7650
Wire Wire Line
	6750 7650 6650 7650
Wire Wire Line
	6850 3200 6850 2050
Wire Wire Line
	6850 8250 6850 7100
Wire Wire Line
	6950 3800 6950 1950
Wire Wire Line
	6950 8850 6950 7000
Wire Wire Line
	7050 1850 7050 4500
Wire Wire Line
	7050 6900 7050 9550
Wire Wire Line
	8100 1450 8100 2050
Wire Wire Line
	8100 2050 8100 3550
Wire Wire Line
	8100 3550 8100 5150
Wire Wire Line
	8100 5150 8100 8450
Wire Wire Line
	8200 1450 8200 5250
Wire Wire Line
	8200 5250 8200 8550
Wire Wire Line
	8200 8550 9300 8550
Wire Wire Line
	8200 10250 8950 10250
Wire Wire Line
	8300 1450 8300 5350
Wire Wire Line
	8300 5350 8300 8650
Wire Wire Line
	8400 1450 8400 2350
Wire Wire Line
	8400 2350 8400 5450
Wire Wire Line
	8400 5450 8400 9050
Wire Wire Line
	8500 1450 8500 2450
Wire Wire Line
	8500 2450 8500 5550
Wire Wire Line
	8500 5550 8500 9150
Wire Wire Line
	8500 9150 9300 9150
Wire Wire Line
	8600 1450 8600 4050
Wire Wire Line
	8600 4050 8600 9250
Wire Wire Line
	8700 1450 8700 4150
Wire Wire Line
	8700 4150 8700 5750
Wire Wire Line
	8700 4150 12550 4150
Wire Wire Line
	8700 5750 8700 9650
Wire Wire Line
	8850 1450 8850 2750
Wire Wire Line
	8850 2750 8850 4250
Wire Wire Line
	8850 4250 8850 10150
Wire Wire Line
	8850 10150 8200 10150
Wire Wire Line
	8850 10150 9100 10150
Wire Wire Line
	8950 1450 8950 4350
Wire Wire Line
	8950 4350 8950 7450
Wire Wire Line
	8950 7450 8950 10250
Wire Wire Line
	9050 1450 9050 2950
Wire Wire Line
	9050 2950 9050 6050
Wire Wire Line
	9050 6050 9050 10350
Wire Wire Line
	9050 10350 8200 10350
Wire Wire Line
	9050 10350 9500 10350
Wire Wire Line
	9100 8450 8100 8450
Wire Wire Line
	9100 9050 8400 9050
Wire Wire Line
	9100 9650 8700 9650
Wire Wire Line
	9300 10250 8950 10250
Wire Wire Line
	9500 8650 8300 8650
Wire Wire Line
	9500 9250 8600 9250
Wire Wire Line
	9700 8450 10200 8450
Wire Wire Line
	9700 9050 10500 9050
Wire Wire Line
	9700 9650 10800 9650
Wire Wire Line
	9700 10150 10950 10150
Wire Wire Line
	9900 8550 10300 8550
Wire Wire Line
	10100 8650 10400 8650
Wire Wire Line
	10100 9250 10700 9250
Wire Wire Line
	10100 10350 11150 10350
Wire Wire Line
	10200 1450 10200 6650
Wire Wire Line
	10200 6650 10200 8450
Wire Wire Line
	10300 1450 10300 2150
Wire Wire Line
	10300 2150 10300 3650
Wire Wire Line
	10300 3650 10300 6750
Wire Wire Line
	10300 6750 10300 8550
Wire Wire Line
	10400 1450 10400 2250
Wire Wire Line
	10400 2250 10400 3750
Wire Wire Line
	10400 3750 10400 6850
Wire Wire Line
	10400 6850 10400 8650
Wire Wire Line
	10500 1450 10500 3850
Wire Wire Line
	10500 3850 10500 6950
Wire Wire Line
	10500 6950 10500 9050
Wire Wire Line
	10600 1450 10600 3950
Wire Wire Line
	10600 3950 10600 7050
Wire Wire Line
	10600 7050 10600 9150
Wire Wire Line
	10600 9150 9900 9150
Wire Wire Line
	10700 1450 10700 2550
Wire Wire Line
	10700 2550 10700 5650
Wire Wire Line
	10700 5650 10700 7150
Wire Wire Line
	10700 7150 10700 9250
Wire Wire Line
	10800 1450 10800 2650
Wire Wire Line
	10800 2650 10800 7250
Wire Wire Line
	10800 7250 10800 9650
Wire Wire Line
	10950 1450 10950 5850
Wire Wire Line
	10950 5850 10950 7350
Wire Wire Line
	10950 7350 10950 10150
Wire Wire Line
	10950 7350 12550 7350
Wire Wire Line
	11050 1450 11050 2850
Wire Wire Line
	11050 2850 11050 5950
Wire Wire Line
	11050 5950 11050 10250
Wire Wire Line
	11050 10250 9900 10250
Wire Wire Line
	11150 1450 11150 4450
Wire Wire Line
	11150 4450 11150 7550
Wire Wire Line
	11150 7550 11150 10350
Wire Wire Line
	12550 2050 8100 2050
Wire Wire Line
	12550 2150 10300 2150
Wire Wire Line
	12550 2250 10400 2250
Wire Wire Line
	12550 2350 8400 2350
Wire Wire Line
	12550 2450 8500 2450
Wire Wire Line
	12550 2550 10700 2550
Wire Wire Line
	12550 2650 10800 2650
Wire Wire Line
	12550 2750 8850 2750
Wire Wire Line
	12550 2850 11050 2850
Wire Wire Line
	12550 2950 9050 2950
Wire Wire Line
	12550 3050 12550 3150
Wire Wire Line
	12550 3150 12550 3250
Wire Wire Line
	12550 3550 8100 3550
Wire Wire Line
	12550 3650 10300 3650
Wire Wire Line
	12550 3750 10400 3750
Wire Wire Line
	12550 3850 10500 3850
Wire Wire Line
	12550 3950 10600 3950
Wire Wire Line
	12550 4050 8600 4050
Wire Wire Line
	12550 4250 8850 4250
Wire Wire Line
	12550 4350 8950 4350
Wire Wire Line
	12550 4450 11150 4450
Wire Wire Line
	12550 4550 12550 4650
Wire Wire Line
	12550 4650 12550 4750
Wire Wire Line
	12550 5150 8100 5150
Wire Wire Line
	12550 5250 8200 5250
Wire Wire Line
	12550 5350 8300 5350
Wire Wire Line
	12550 5450 8400 5450
Wire Wire Line
	12550 5550 8500 5550
Wire Wire Line
	12550 5650 10700 5650
Wire Wire Line
	12550 5750 8700 5750
Wire Wire Line
	12550 5850 10950 5850
Wire Wire Line
	12550 5950 11050 5950
Wire Wire Line
	12550 6050 9050 6050
Wire Wire Line
	12550 6150 12550 6250
Wire Wire Line
	12550 6250 12550 6350
Wire Wire Line
	12550 6650 10200 6650
Wire Wire Line
	12550 6750 10300 6750
Wire Wire Line
	12550 6850 10400 6850
Wire Wire Line
	12550 6950 10500 6950
Wire Wire Line
	12550 7050 10600 7050
Wire Wire Line
	12550 7150 10700 7150
Wire Wire Line
	12550 7250 10800 7250
Wire Wire Line
	12550 7450 8950 7450
Wire Wire Line
	12550 7550 11150 7550
Wire Wire Line
	12550 7650 12550 7750
Wire Wire Line
	12550 7750 12550 7850
Wire Wire Line
	13150 5750 13200 5750
Wire Wire Line
	13200 4150 13150 4150
Wire Wire Line
	13200 4800 13200 4150
Wire Wire Line
	13200 4900 13400 4900
Wire Wire Line
	13200 5750 13200 4900
Wire Wire Line
	13300 2650 13150 2650
Wire Wire Line
	13300 4700 13300 2650
Wire Wire Line
	13300 5000 13300 7250
Wire Wire Line
	13300 7250 13150 7250
Wire Wire Line
	13400 4700 13300 4700
Wire Wire Line
	13400 4800 13200 4800
Wire Wire Line
	13400 5000 13300 5000
Wire Wire Line
	14450 4850 14000 4850
Wire Bus Line
	5350 5450 5450 5450
Wire Bus Line
	8100 9950 8000 9950
Text Notes 11950 3200 0    50   ~ 0
SCROLL3\n2 & ~1~ & 0
Text Notes 11950 4700 0    50   ~ 0
SCROLL1\n~2~ & 1 & 0
Text Notes 12000 6300 0    50   ~ 0
SCROLL2\n2 & ~1~ & ~0~
Text Notes 12000 7800 0    50   ~ 0
ROWSCROLL\n~2~ & 1 & ~0
Text Notes 12450 2650 0    61   ~ 0
1\n0\n0\n1\n1\n0\n0
Text Notes 12450 4150 0    61   ~ 0
1\n0\n0\n0\n0\n1\n1
Text Notes 12450 5750 0    61   ~ 0
1\n1\n1\n1\n1\n0\n1
Text Notes 13350 2650 0    50   ~ 0
25
Text Notes 13350 4150 0    50   ~ 0
97
Text Notes 13400 5700 0    50   ~ 0
95
Text Notes 13400 7250 0    50   ~ 0
0
Text Label 4700 5650 0    50   ~ 0
SCROLL-CNT0
Text Label 4700 5750 0    50   ~ 0
SCROLL-CNT1
Text Label 4700 5850 0    50   ~ 0
SCROLL-CNT2
Text Label 4700 5950 0    50   ~ 0
SCROLL-CNT3
Text Label 4700 6050 0    50   ~ 0
SCROLL-CNT4
Text Label 4700 6150 0    50   ~ 0
SCROLL-CNT5
Text Label 4700 6250 0    50   ~ 0
SCROLL-CNT6
Text Label 8100 1450 1    50   ~ 0
SCROLL-CNT0
Text Label 8200 1450 1    50   ~ 0
SCROLL-CNT1
Text Label 8200 10150 0    50   ~ 0
BUS-STATE0
Text Label 8200 10250 0    50   ~ 0
BUS-STATE1
Text Label 8200 10350 0    50   ~ 0
BUS-STATE2
Text Label 8300 1450 1    50   ~ 0
SCROLL-CNT2
Text Label 8400 1450 1    50   ~ 0
SCROLL-CNT3
Text Label 8500 1450 1    50   ~ 0
SCROLL-CNT4
Text Label 8600 1450 1    50   ~ 0
SCROLL-CNT5
Text Label 8700 1450 1    50   ~ 0
SCROLL-CNT6
Text Label 14450 4950 2    50   ~ 0
BUS-READY
Text HLabel 1500 5050 0    50   Input ~ 0
~CLEAR
Text HLabel 1500 10200 0    50   Input ~ 0
~RESET
Text HLabel 3350 10450 0    50   Input ~ 0
~CLK4M
Text HLabel 4400 1250 0    50   Input ~ 0
BUS-READY
Text HLabel 5450 5450 2    50   Output ~ 0
SCROLL-CNT[0..6]
Text HLabel 8000 9950 0    50   Input ~ 0
BUS-STATE[0..2]
Text HLabel 15000 4900 2    50   Output ~ 0
SCROLL-END
$Comp
L power:GND #PWR0210
U 1 1 70CBB2E9
P 12550 3250
AR Path="/611F0159/70CBB2E9" Ref="#PWR0210"  Part="1" 
AR Path="/60A9F60C/6133A9EC/70CBB2E9" Ref="#PWR0210"  Part="1" 
F 0 "#PWR0210" H 12550 3000 50  0001 C CNN
F 1 "GND" H 12555 3077 50  0001 C CNN
F 2 "" H 12550 3250 50  0001 C CNN
F 3 "" H 12550 3250 50  0001 C CNN
	1    12550 3250
	1    0    0    -1  
$EndComp
$Comp
L power:GND #PWR0211
U 1 1 70CC9D45
P 12550 4750
AR Path="/611F0159/70CC9D45" Ref="#PWR0211"  Part="1" 
AR Path="/60A9F60C/6133A9EC/70CC9D45" Ref="#PWR0211"  Part="1" 
F 0 "#PWR0211" H 12550 4500 50  0001 C CNN
F 1 "GND" H 12555 4577 50  0001 C CNN
F 2 "" H 12550 4750 50  0001 C CNN
F 3 "" H 12550 4750 50  0001 C CNN
	1    12550 4750
	1    0    0    -1  
$EndComp
$Comp
L power:GND #PWR0212
U 1 1 70CC91F3
P 12550 6350
AR Path="/611F0159/70CC91F3" Ref="#PWR0212"  Part="1" 
AR Path="/60A9F60C/6133A9EC/70CC91F3" Ref="#PWR0212"  Part="1" 
F 0 "#PWR0212" H 12550 6100 50  0001 C CNN
F 1 "GND" H 12555 6177 50  0001 C CNN
F 2 "" H 12550 6350 50  0001 C CNN
F 3 "" H 12550 6350 50  0001 C CNN
	1    12550 6350
	1    0    0    -1  
$EndComp
$Comp
L power:GND #PWR0213
U 1 1 70CC9851
P 12550 7850
AR Path="/611F0159/70CC9851" Ref="#PWR0213"  Part="1" 
AR Path="/60A9F60C/6133A9EC/70CC9851" Ref="#PWR0213"  Part="1" 
F 0 "#PWR0213" H 12550 7600 50  0001 C CNN
F 1 "GND" H 12555 7677 50  0001 C CNN
F 2 "" H 12550 7850 50  0001 C CNN
F 3 "" H 12550 7850 50  0001 C CNN
	1    12550 7850
	1    0    0    -1  
$EndComp
$Comp
L A5C:AND02 UAC424
U 1 1 61EC175B
P 2100 5100
AR Path="/611F0159/61EC175B" Ref="UAC424"  Part="1" 
AR Path="/60A9F60C/6133A9EC/61EC175B" Ref="UAC424"  Part="1" 
F 0 "UAC424" H 2125 5367 50  0000 C CNN
F 1 "AND02" H 2125 5276 50  0000 C CNN
F 2 "" H 2100 5100 50  0001 C CNN
F 3 "" H 2100 5100 50  0001 C CNN
	1    2100 5100
	1    0    0    -1  
$EndComp
$Comp
L A5C:AND02 UBF78
U 1 1 61118EFF
P 2100 10150
AR Path="/611F0159/61118EFF" Ref="UBF78"  Part="1" 
AR Path="/60A9F60C/6133A9EC/61118EFF" Ref="UBF78"  Part="1" 
F 0 "UBF78" H 2125 10417 50  0000 C CNN
F 1 "AND02" H 2125 10326 50  0000 C CNN
F 2 "" H 2100 10150 50  0001 C CNN
F 3 "" H 2100 10150 50  0001 C CNN
	1    2100 10150
	1    0    0    -1  
$EndComp
$Comp
L A5C:NAND02 UAB423
U 1 1 709812BB
P 3250 2650
AR Path="/611F0159/709812BB" Ref="UAB423"  Part="1" 
AR Path="/60A9F60C/6133A9EC/709812BB" Ref="UAB423"  Part="1" 
F 0 "UAB423" H 3275 2917 50  0000 C CNN
F 1 "NAND02" H 3275 2826 50  0000 C CNN
F 2 "" H 3250 2650 50  0001 C CNN
F 3 "" H 3250 2650 50  0001 C CNN
	1    3250 2650
	1    0    0    -1  
$EndComp
$Comp
L A5C:NAND02 UAB388
U 1 1 709812C1
P 3250 3450
AR Path="/611F0159/709812C1" Ref="UAB388"  Part="1" 
AR Path="/60A9F60C/6133A9EC/709812C1" Ref="UAB388"  Part="1" 
F 0 "UAB388" H 3275 3717 50  0000 C CNN
F 1 "NAND02" H 3275 3626 50  0000 C CNN
F 2 "" H 3250 3450 50  0001 C CNN
F 3 "" H 3250 3450 50  0001 C CNN
	1    3250 3450
	1    0    0    -1  
$EndComp
$Comp
L A5C:NAND02 UAC366
U 1 1 709812C7
P 3250 4250
AR Path="/611F0159/709812C7" Ref="UAC366"  Part="1" 
AR Path="/60A9F60C/6133A9EC/709812C7" Ref="UAC366"  Part="1" 
F 0 "UAC366" H 3275 4517 50  0000 C CNN
F 1 "NAND02" H 3275 4426 50  0000 C CNN
F 2 "" H 3250 4250 50  0001 C CNN
F 3 "" H 3250 4250 50  0001 C CNN
	1    3250 4250
	1    0    0    -1  
$EndComp
$Comp
L A5C:NAND02 UAB369
U 1 1 709812CD
P 3250 5050
AR Path="/611F0159/709812CD" Ref="UAB369"  Part="1" 
AR Path="/60A9F60C/6133A9EC/709812CD" Ref="UAB369"  Part="1" 
F 0 "UAB369" H 3275 5317 50  0000 C CNN
F 1 "NAND02" H 3275 5226 50  0000 C CNN
F 2 "" H 3250 5050 50  0001 C CNN
F 3 "" H 3250 5050 50  0001 C CNN
	1    3250 5050
	1    0    0    -1  
$EndComp
$Comp
L A5C:NAND02 UBA51
U 1 1 61118EFE
P 3250 7700
AR Path="/611F0159/61118EFE" Ref="UBA51"  Part="1" 
AR Path="/60A9F60C/6133A9EC/61118EFE" Ref="UBA51"  Part="1" 
F 0 "UBA51" H 3275 7967 50  0000 C CNN
F 1 "NAND02" H 3275 7876 50  0000 C CNN
F 2 "" H 3250 7700 50  0001 C CNN
F 3 "" H 3250 7700 50  0001 C CNN
	1    3250 7700
	1    0    0    -1  
$EndComp
$Comp
L A5C:NAND02 UAC393
U 1 1 61118F01
P 3250 8500
AR Path="/611F0159/61118F01" Ref="UAC393"  Part="1" 
AR Path="/60A9F60C/6133A9EC/61118F01" Ref="UAC393"  Part="1" 
F 0 "UAC393" H 3275 8767 50  0000 C CNN
F 1 "NAND02" H 3275 8676 50  0000 C CNN
F 2 "" H 3250 8500 50  0001 C CNN
F 3 "" H 3250 8500 50  0001 C CNN
	1    3250 8500
	1    0    0    -1  
$EndComp
$Comp
L A5C:NAND02 UBF73
U 1 1 61118F00
P 3250 9300
AR Path="/611F0159/61118F00" Ref="UBF73"  Part="1" 
AR Path="/60A9F60C/6133A9EC/61118F00" Ref="UBF73"  Part="1" 
F 0 "UBF73" H 3275 9567 50  0000 C CNN
F 1 "NAND02" H 3275 9476 50  0000 C CNN
F 2 "" H 3250 9300 50  0001 C CNN
F 3 "" H 3250 9300 50  0001 C CNN
	1    3250 9300
	1    0    0    -1  
$EndComp
$Comp
L A5C:NAND02 UBG43
U 1 1 61118F02
P 3250 10100
AR Path="/611F0159/61118F02" Ref="UBG43"  Part="1" 
AR Path="/60A9F60C/6133A9EC/61118F02" Ref="UBG43"  Part="1" 
F 0 "UBG43" H 3275 10367 50  0000 C CNN
F 1 "NAND02" H 3275 10276 50  0000 C CNN
F 2 "" H 3250 10100 50  0001 C CNN
F 3 "" H 3250 10100 50  0001 C CNN
	1    3250 10100
	1    0    0    -1  
$EndComp
$Comp
L A5C:NOR02 UAB407
U 1 1 709812D3
P 5600 3100
AR Path="/611F0159/709812D3" Ref="UAB407"  Part="1" 
AR Path="/60A9F60C/6133A9EC/709812D3" Ref="UAB407"  Part="1" 
F 0 "UAB407" H 5625 3367 50  0000 C CNN
F 1 "NOR02" H 5625 3276 50  0000 C CNN
F 2 "" H 5600 3100 50  0001 C CNN
F 3 "" H 5600 3100 50  0001 C CNN
	1    5600 3100
	1    0    0    -1  
$EndComp
$Comp
L A5C:NOR02 UAB394
U 1 1 61118F07
P 5600 8150
AR Path="/611F0159/61118F07" Ref="UAB394"  Part="1" 
AR Path="/60A9F60C/6133A9EC/61118F07" Ref="UAB394"  Part="1" 
F 0 "UAB394" H 5625 8417 50  0000 C CNN
F 1 "NOR02" H 5625 8326 50  0000 C CNN
F 2 "" H 5600 8150 50  0001 C CNN
F 3 "" H 5600 8150 50  0001 C CNN
	1    5600 8150
	1    0    0    -1  
$EndComp
$Comp
L A5C:XNOR02 UAB420
U 1 1 709812D9
P 6350 2600
AR Path="/611F0159/709812D9" Ref="UAB420"  Part="1" 
AR Path="/60A9F60C/6133A9EC/709812D9" Ref="UAB420"  Part="1" 
F 0 "UAB420" H 6375 2867 50  0000 C CNN
F 1 "XNOR02" H 6375 2776 50  0000 C CNN
F 2 "" H 6375 2600 50  0001 C CNN
F 3 "" H 6375 2600 50  0001 C CNN
	1    6350 2600
	1    0    0    -1  
$EndComp
$Comp
L A5C:XNOR02 UAB385
U 1 1 709812DF
P 6350 3200
AR Path="/611F0159/709812DF" Ref="UAB385"  Part="1" 
AR Path="/60A9F60C/6133A9EC/709812DF" Ref="UAB385"  Part="1" 
F 0 "UAB385" H 6375 3467 50  0000 C CNN
F 1 "XNOR02" H 6375 3376 50  0000 C CNN
F 2 "" H 6375 3200 50  0001 C CNN
F 3 "" H 6375 3200 50  0001 C CNN
	1    6350 3200
	1    0    0    -1  
$EndComp
$Comp
L A5C:XNOR02 UAB351
U 1 1 709812E5
P 6350 3800
AR Path="/611F0159/709812E5" Ref="UAB351"  Part="1" 
AR Path="/60A9F60C/6133A9EC/709812E5" Ref="UAB351"  Part="1" 
F 0 "UAB351" H 6375 4067 50  0000 C CNN
F 1 "XNOR02" H 6375 3976 50  0000 C CNN
F 2 "" H 6375 3800 50  0001 C CNN
F 3 "" H 6375 3800 50  0001 C CNN
	1    6350 3800
	1    0    0    -1  
$EndComp
$Comp
L A5C:XNOR02 UAB370
U 1 1 709812EB
P 6350 4500
AR Path="/611F0159/709812EB" Ref="UAB370"  Part="1" 
AR Path="/60A9F60C/6133A9EC/709812EB" Ref="UAB370"  Part="1" 
F 0 "UAB370" H 6375 4767 50  0000 C CNN
F 1 "XNOR02" H 6375 4676 50  0000 C CNN
F 2 "" H 6375 4500 50  0001 C CNN
F 3 "" H 6375 4500 50  0001 C CNN
	1    6350 4500
	1    0    0    -1  
$EndComp
$Comp
L A5C:XNOR02 UAB391
U 1 1 61118F0E
P 6350 7650
AR Path="/611F0159/61118F0E" Ref="UAB391"  Part="1" 
AR Path="/60A9F60C/6133A9EC/61118F0E" Ref="UAB391"  Part="1" 
F 0 "UAB391" H 6375 7917 50  0000 C CNN
F 1 "XNOR02" H 6375 7826 50  0000 C CNN
F 2 "" H 6375 7650 50  0001 C CNN
F 3 "" H 6375 7650 50  0001 C CNN
	1    6350 7650
	1    0    0    -1  
$EndComp
$Comp
L A5C:XNOR02 UAC394
U 1 1 61118F0F
P 6350 8250
AR Path="/611F0159/61118F0F" Ref="UAC394"  Part="1" 
AR Path="/60A9F60C/6133A9EC/61118F0F" Ref="UAC394"  Part="1" 
F 0 "UAC394" H 6375 8517 50  0000 C CNN
F 1 "XNOR02" H 6375 8426 50  0000 C CNN
F 2 "" H 6375 8250 50  0001 C CNN
F 3 "" H 6375 8250 50  0001 C CNN
	1    6350 8250
	1    0    0    -1  
$EndComp
$Comp
L A5C:XNOR02 UBF68
U 1 1 61118F0C
P 6350 8850
AR Path="/611F0159/61118F0C" Ref="UBF68"  Part="1" 
AR Path="/60A9F60C/6133A9EC/61118F0C" Ref="UBF68"  Part="1" 
F 0 "UBF68" H 6375 9117 50  0000 C CNN
F 1 "XNOR02" H 6375 9026 50  0000 C CNN
F 2 "" H 6375 8850 50  0001 C CNN
F 3 "" H 6375 8850 50  0001 C CNN
	1    6350 8850
	1    0    0    -1  
$EndComp
$Comp
L A5C:XNOR02 UBE49
U 1 1 61118F0D
P 6350 9550
AR Path="/611F0159/61118F0D" Ref="UBE49"  Part="1" 
AR Path="/60A9F60C/6133A9EC/61118F0D" Ref="UBE49"  Part="1" 
F 0 "UBE49" H 6375 9817 50  0000 C CNN
F 1 "XNOR02" H 6375 9726 50  0000 C CNN
F 2 "" H 6375 9550 50  0001 C CNN
F 3 "" H 6375 9550 50  0001 C CNN
	1    6350 9550
	1    0    0    -1  
$EndComp
$Comp
L A5C:AND02 UBF81
U 1 1 61118F19
P 14700 4900
AR Path="/611F0159/61118F19" Ref="UBF81"  Part="1" 
AR Path="/60A9F60C/6133A9EC/61118F19" Ref="UBF81"  Part="1" 
F 0 "UBF81" H 14725 5167 50  0000 C CNN
F 1 "AND02" H 14725 5076 50  0000 C CNN
F 2 "" H 14700 4900 50  0001 C CNN
F 3 "" H 14700 4900 50  0001 C CNN
	1    14700 4900
	1    0    0    -1  
$EndComp
$Comp
L A5C:INV01 UAB374
U 1 1 709812F1
P 4950 1650
AR Path="/611F0159/709812F1" Ref="UAB374"  Part="1" 
AR Path="/60A9F60C/6133A9EC/709812F1" Ref="UAB374"  Part="1" 
F 0 "UAB374" H 4950 1967 50  0000 C CNN
F 1 "INV01" H 4950 1876 50  0000 C CNN
F 2 "" H 4950 1450 50  0001 C CNN
F 3 "" H 4950 1450 50  0001 C CNN
	1    4950 1650
	1    0    0    -1  
$EndComp
$Comp
L A5C:NOR03 UAB356
U 1 1 709812F7
P 5650 3650
AR Path="/611F0159/709812F7" Ref="UAB356"  Part="1" 
AR Path="/60A9F60C/6133A9EC/709812F7" Ref="UAB356"  Part="1" 
F 0 "UAB356" H 5650 3967 50  0000 C CNN
F 1 "NOR03" H 5650 3876 50  0000 C CNN
F 2 "" H 5650 3650 50  0001 C CNN
F 3 "" H 5650 3650 50  0001 C CNN
	1    5650 3650
	1    0    0    -1  
$EndComp
$Comp
L A5C:NOR03 UBE65
U 1 1 61118F0A
P 5650 8700
AR Path="/611F0159/61118F0A" Ref="UBE65"  Part="1" 
AR Path="/60A9F60C/6133A9EC/61118F0A" Ref="UBE65"  Part="1" 
F 0 "UBE65" H 5650 9017 50  0000 C CNN
F 1 "NOR03" H 5650 8926 50  0000 C CNN
F 2 "" H 5650 8700 50  0001 C CNN
F 3 "" H 5650 8700 50  0001 C CNN
	1    5650 8700
	1    0    0    -1  
$EndComp
$Comp
L A5C:INV01 UAA389
U 1 1 61118F08
P 5700 6700
AR Path="/611F0159/61118F08" Ref="UAA389"  Part="1" 
AR Path="/60A9F60C/6133A9EC/61118F08" Ref="UAA389"  Part="1" 
F 0 "UAA389" H 5700 7017 50  0000 C CNN
F 1 "INV01" H 5700 6926 50  0000 C CNN
F 2 "" H 5700 6500 50  0001 C CNN
F 3 "" H 5700 6500 50  0001 C CNN
	1    5700 6700
	-1   0    0    -1  
$EndComp
$Comp
L A5C:INV01 UEA271
U 1 1 61C74798
P 9400 8450
AR Path="/611F0159/61C74798" Ref="UEA271"  Part="1" 
AR Path="/60A9F60C/6133A9EC/61C74798" Ref="UEA271"  Part="1" 
F 0 "UEA271" H 9400 8767 50  0000 C CNN
F 1 "INV01" H 9400 8676 50  0000 C CNN
F 2 "" H 9400 8250 50  0001 C CNN
F 3 "" H 9400 8250 50  0001 C CNN
	1    9400 8450
	1    0    0    -1  
$EndComp
$Comp
L A5C:INV01 UEB279
U 1 1 61118F13
P 9400 9050
AR Path="/611F0159/61118F13" Ref="UEB279"  Part="1" 
AR Path="/60A9F60C/6133A9EC/61118F13" Ref="UEB279"  Part="1" 
F 0 "UEB279" H 9400 9367 50  0000 C CNN
F 1 "INV01" H 9400 9276 50  0000 C CNN
F 2 "" H 9400 8850 50  0001 C CNN
F 3 "" H 9400 8850 50  0001 C CNN
	1    9400 9050
	1    0    0    -1  
$EndComp
$Comp
L A5C:INV01 UEA254
U 1 1 61118F11
P 9400 9650
AR Path="/611F0159/61118F11" Ref="UEA254"  Part="1" 
AR Path="/60A9F60C/6133A9EC/61118F11" Ref="UEA254"  Part="1" 
F 0 "UEA254" H 9400 9967 50  0000 C CNN
F 1 "INV01" H 9400 9876 50  0000 C CNN
F 2 "" H 9400 9450 50  0001 C CNN
F 3 "" H 9400 9450 50  0001 C CNN
	1    9400 9650
	1    0    0    -1  
$EndComp
$Comp
L A5C:INV01 UBI130
U 1 1 61118F12
P 9400 10150
AR Path="/611F0159/61118F12" Ref="UBI130"  Part="1" 
AR Path="/60A9F60C/6133A9EC/61118F12" Ref="UBI130"  Part="1" 
F 0 "UBI130" H 9400 10467 50  0000 C CNN
F 1 "INV01" H 9400 10376 50  0000 C CNN
F 2 "" H 9400 9950 50  0001 C CNN
F 3 "" H 9400 9950 50  0001 C CNN
	1    9400 10150
	1    0    0    -1  
$EndComp
$Comp
L A5C:INV01 UCB466
U 1 1 7D3898B6
P 9600 8550
AR Path="/611F0159/7D3898B6" Ref="UCB466"  Part="1" 
AR Path="/60A9F60C/6133A9EC/7D3898B6" Ref="UCB466"  Part="1" 
F 0 "UCB466" H 9600 8867 50  0000 C CNN
F 1 "INV01" H 9600 8776 50  0000 C CNN
F 2 "" H 9600 8350 50  0001 C CNN
F 3 "" H 9600 8350 50  0001 C CNN
	1    9600 8550
	1    0    0    -1  
$EndComp
$Comp
L A5C:INV01 UEA270
U 1 1 61118F10
P 9600 9150
AR Path="/611F0159/61118F10" Ref="UEA270"  Part="1" 
AR Path="/60A9F60C/6133A9EC/61118F10" Ref="UEA270"  Part="1" 
F 0 "UEA270" H 9600 9467 50  0000 C CNN
F 1 "INV01" H 9600 9376 50  0000 C CNN
F 2 "" H 9600 8950 50  0001 C CNN
F 3 "" H 9600 8950 50  0001 C CNN
	1    9600 9150
	1    0    0    -1  
$EndComp
$Comp
L A5C:INV01 UBI132
U 1 1 61118F15
P 9600 10250
AR Path="/611F0159/61118F15" Ref="UBI132"  Part="1" 
AR Path="/60A9F60C/6133A9EC/61118F15" Ref="UBI132"  Part="1" 
F 0 "UBI132" H 9600 10567 50  0000 C CNN
F 1 "INV01" H 9600 10476 50  0000 C CNN
F 2 "" H 9600 10050 50  0001 C CNN
F 3 "" H 9600 10050 50  0001 C CNN
	1    9600 10250
	1    0    0    -1  
$EndComp
$Comp
L A5C:INV01 UBH128
U 1 1 61118F17
P 9800 8650
AR Path="/611F0159/61118F17" Ref="UBH128"  Part="1" 
AR Path="/60A9F60C/6133A9EC/61118F17" Ref="UBH128"  Part="1" 
F 0 "UBH128" H 9800 8967 50  0000 C CNN
F 1 "INV01" H 9800 8876 50  0000 C CNN
F 2 "" H 9800 8450 50  0001 C CNN
F 3 "" H 9800 8450 50  0001 C CNN
	1    9800 8650
	1    0    0    -1  
$EndComp
$Comp
L A5C:INV01 UEA255
U 1 1 61118F14
P 9800 9250
AR Path="/611F0159/61118F14" Ref="UEA255"  Part="1" 
AR Path="/60A9F60C/6133A9EC/61118F14" Ref="UEA255"  Part="1" 
F 0 "UEA255" H 9800 9567 50  0000 C CNN
F 1 "INV01" H 9800 9476 50  0000 C CNN
F 2 "" H 9800 9050 50  0001 C CNN
F 3 "" H 9800 9050 50  0001 C CNN
	1    9800 9250
	1    0    0    -1  
$EndComp
$Comp
L A5C:INV01 UBJ129
U 1 1 61118F16
P 9800 10350
AR Path="/611F0159/61118F16" Ref="UBJ129"  Part="1" 
AR Path="/60A9F60C/6133A9EC/61118F16" Ref="UBJ129"  Part="1" 
F 0 "UBJ129" H 9800 10667 50  0000 C CNN
F 1 "INV01" H 9800 10576 50  0000 C CNN
F 2 "" H 9800 10150 50  0001 C CNN
F 3 "" H 9800 10150 50  0001 C CNN
	1    9800 10350
	1    0    0    -1  
$EndComp
$Comp
L A5C:DFFCOO UAB427
U 1 1 709812FD
P 4000 2750
AR Path="/611F0159/709812FD" Ref="UAB427"  Part="1" 
AR Path="/60A9F60C/6133A9EC/709812FD" Ref="UAB427"  Part="1" 
F 0 "UAB427" H 4000 3115 50  0000 C CNN
F 1 "DFFCOO" H 4000 3024 50  0000 C CNN
F 2 "" H 4000 2750 50  0001 C CNN
F 3 "" H 4000 2750 50  0001 C CNN
	1    4000 2750
	1    0    0    -1  
$EndComp
$Comp
L A5C:DFFCOO UAB398
U 1 1 70981303
P 4000 3550
AR Path="/611F0159/70981303" Ref="UAB398"  Part="1" 
AR Path="/60A9F60C/6133A9EC/70981303" Ref="UAB398"  Part="1" 
F 0 "UAB398" H 4000 3915 50  0000 C CNN
F 1 "DFFCOO" H 4000 3824 50  0000 C CNN
F 2 "" H 4000 3550 50  0001 C CNN
F 3 "" H 4000 3550 50  0001 C CNN
	1    4000 3550
	1    0    0    -1  
$EndComp
$Comp
L A5C:DFFCOO UAC369
U 1 1 70981309
P 4000 4350
AR Path="/611F0159/70981309" Ref="UAC369"  Part="1" 
AR Path="/60A9F60C/6133A9EC/70981309" Ref="UAC369"  Part="1" 
F 0 "UAC369" H 4000 4715 50  0000 C CNN
F 1 "DFFCOO" H 4000 4624 50  0000 C CNN
F 2 "" H 4000 4350 50  0001 C CNN
F 3 "" H 4000 4350 50  0001 C CNN
	1    4000 4350
	1    0    0    -1  
$EndComp
$Comp
L A5C:DFFCOO UAB364
U 1 1 7098130F
P 4000 5150
AR Path="/611F0159/7098130F" Ref="UAB364"  Part="1" 
AR Path="/60A9F60C/6133A9EC/7098130F" Ref="UAB364"  Part="1" 
F 0 "UAB364" H 4000 5515 50  0000 C CNN
F 1 "DFFCOO" H 4000 5424 50  0000 C CNN
F 2 "" H 4000 5150 50  0001 C CNN
F 3 "" H 4000 5150 50  0001 C CNN
	1    4000 5150
	1    0    0    -1  
$EndComp
$Comp
L A5C:DFFCOO UBE61
U 1 1 61118F06
P 4000 7800
AR Path="/611F0159/61118F06" Ref="UBE61"  Part="1" 
AR Path="/60A9F60C/6133A9EC/61118F06" Ref="UBE61"  Part="1" 
F 0 "UBE61" H 4000 8165 50  0000 C CNN
F 1 "DFFCOO" H 4000 8074 50  0000 C CNN
F 2 "" H 4000 7800 50  0001 C CNN
F 3 "" H 4000 7800 50  0001 C CNN
	1    4000 7800
	1    0    0    -1  
$EndComp
$Comp
L A5C:DFFCOO UAD404
U 1 1 61118F03
P 4000 8600
AR Path="/611F0159/61118F03" Ref="UAD404"  Part="1" 
AR Path="/60A9F60C/6133A9EC/61118F03" Ref="UAD404"  Part="1" 
F 0 "UAD404" H 4000 8965 50  0000 C CNN
F 1 "DFFCOO" H 4000 8874 50  0000 C CNN
F 2 "" H 4000 8600 50  0001 C CNN
F 3 "" H 4000 8600 50  0001 C CNN
	1    4000 8600
	1    0    0    -1  
$EndComp
$Comp
L A5C:DFFCOO UBE79
U 1 1 61118F05
P 4000 9400
AR Path="/611F0159/61118F05" Ref="UBE79"  Part="1" 
AR Path="/60A9F60C/6133A9EC/61118F05" Ref="UBE79"  Part="1" 
F 0 "UBE79" H 4000 9765 50  0000 C CNN
F 1 "DFFCOO" H 4000 9674 50  0000 C CNN
F 2 "" H 4000 9400 50  0001 C CNN
F 3 "" H 4000 9400 50  0001 C CNN
	1    4000 9400
	1    0    0    -1  
$EndComp
$Comp
L A5C:DFFCOO UBH48
U 1 1 61118F04
P 4000 10200
AR Path="/611F0159/61118F04" Ref="UBH48"  Part="1" 
AR Path="/60A9F60C/6133A9EC/61118F04" Ref="UBH48"  Part="1" 
F 0 "UBH48" H 4000 10565 50  0000 C CNN
F 1 "DFFCOO" H 4000 10474 50  0000 C CNN
F 2 "" H 4000 10200 50  0001 C CNN
F 3 "" H 4000 10200 50  0001 C CNN
	1    4000 10200
	1    0    0    -1  
$EndComp
$Comp
L A5C:NOR04 UAB361
U 1 1 70981315
P 5650 4300
AR Path="/611F0159/70981315" Ref="UAB361"  Part="1" 
AR Path="/60A9F60C/6133A9EC/70981315" Ref="UAB361"  Part="1" 
F 0 "UAB361" H 5650 4642 50  0000 C CNN
F 1 "NOR04" H 5650 4551 50  0000 C CNN
F 2 "" H 5650 4300 50  0001 C CNN
F 3 "" H 5650 4300 50  0001 C CNN
	1    5650 4300
	1    0    0    -1  
$EndComp
$Comp
L A5C:NOR04 UBE52
U 1 1 61118F0B
P 5650 9350
AR Path="/611F0159/61118F0B" Ref="UBE52"  Part="1" 
AR Path="/60A9F60C/6133A9EC/61118F0B" Ref="UBE52"  Part="1" 
F 0 "UBE52" H 5650 9692 50  0000 C CNN
F 1 "NOR04" H 5650 9601 50  0000 C CNN
F 2 "" H 5650 9350 50  0001 C CNN
F 3 "" H 5650 9350 50  0001 C CNN
	1    5650 9350
	1    0    0    -1  
$EndComp
$Comp
L A5C:NAND04 UCC477
U 1 1 61118F18
P 13700 4850
AR Path="/611F0159/61118F18" Ref="UCC477"  Part="1" 
AR Path="/60A9F60C/6133A9EC/61118F18" Ref="UCC477"  Part="1" 
F 0 "UCC477" H 13700 5192 50  0000 C CNN
F 1 "NAND04" H 13700 5101 50  0000 C CNN
F 2 "" H 13700 4600 50  0001 C CNN
F 3 "" H 13700 4600 50  0001 C CNN
	1    13700 4850
	1    0    0    -1  
$EndComp
$Comp
L A5C:NOR05 UAB380
U 1 1 7098131B
P 5650 5050
AR Path="/611F0159/7098131B" Ref="UAB380"  Part="1" 
AR Path="/60A9F60C/6133A9EC/7098131B" Ref="UAB380"  Part="1" 
F 0 "UAB380" H 5725 5465 50  0000 C CNN
F 1 "NOR05" H 5725 5374 50  0000 C CNN
F 2 "" H 5650 5100 50  0001 C CNN
F 3 "" H 5650 5100 50  0001 C CNN
	1    5650 5050
	1    0    0    -1  
$EndComp
$Comp
L A5C:NOR05 UBE56
U 1 1 61118F09
P 5650 10100
AR Path="/611F0159/61118F09" Ref="UBE56"  Part="1" 
AR Path="/60A9F60C/6133A9EC/61118F09" Ref="UBE56"  Part="1" 
F 0 "UBE56" H 5725 10515 50  0000 C CNN
F 1 "NOR05" H 5725 10424 50  0000 C CNN
F 2 "" H 5650 10150 50  0001 C CNN
F 3 "" H 5650 10150 50  0001 C CNN
	1    5650 10100
	1    0    0    -1  
$EndComp
$Comp
L A5C:NAND13 UCC469
U 1 1 68541653
P 12850 2650
AR Path="/611F0159/68541653" Ref="UCC469"  Part="1" 
AR Path="/60A9F60C/6133A9EC/68541653" Ref="UCC469"  Part="1" 
F 0 "UCC469" H 12850 3440 50  0000 C CNN
F 1 "NAND13" H 12850 3349 50  0000 C CNN
F 2 "" H 12800 3100 50  0001 C CNN
F 3 "" H 12800 3100 50  0001 C CNN
	1    12850 2650
	1    0    0    -1  
$EndComp
$Comp
L A5C:NAND13 UEA280
U 1 1 6853E4D1
P 12850 4150
AR Path="/611F0159/6853E4D1" Ref="UEA280"  Part="1" 
AR Path="/60A9F60C/6133A9EC/6853E4D1" Ref="UEA280"  Part="1" 
F 0 "UEA280" H 12850 4940 50  0000 C CNN
F 1 "NAND13" H 12850 4849 50  0000 C CNN
F 2 "" H 12800 4600 50  0001 C CNN
F 3 "" H 12800 4600 50  0001 C CNN
	1    12850 4150
	1    0    0    -1  
$EndComp
$Comp
L A5C:NAND13 UCB458
U 1 1 680BFFCE
P 12850 5750
AR Path="/611F0159/680BFFCE" Ref="UCB458"  Part="1" 
AR Path="/60A9F60C/6133A9EC/680BFFCE" Ref="UCB458"  Part="1" 
F 0 "UCB458" H 12850 6540 50  0000 C CNN
F 1 "NAND13" H 12850 6449 50  0000 C CNN
F 2 "" H 12800 6200 50  0001 C CNN
F 3 "" H 12800 6200 50  0001 C CNN
	1    12850 5750
	1    0    0    -1  
$EndComp
$Comp
L A5C:NAND13 UEA272
U 1 1 680BFFD4
P 12850 7250
AR Path="/611F0159/680BFFD4" Ref="UEA272"  Part="1" 
AR Path="/60A9F60C/6133A9EC/680BFFD4" Ref="UEA272"  Part="1" 
F 0 "UEA272" H 12850 8040 50  0000 C CNN
F 1 "NAND13" H 12850 7949 50  0000 C CNN
F 2 "" H 12800 7700 50  0001 C CNN
F 3 "" H 12800 7700 50  0001 C CNN
	1    12850 7250
	1    0    0    -1  
$EndComp
Wire Bus Line
	8100 9950 8100 10250
Wire Bus Line
	5350 5450 5350 6150
$EndSCHEMATC
