EESchema Schematic File Version 4
EELAYER 30 0
EELAYER END
$Descr A4 11693 8268
encoding utf-8
Sheet 40 83
Title "CPS Reverse Engineering: DL-0311"
Date "2021-09-12"
Rev ""
Comp ""
Comment1 ""
Comment2 ""
Comment3 "Licence: CC-BY"
Comment4 "Author: Loïc *WydD* Petit"
$EndDescr
Connection ~ 6250 3500
Connection ~ 6350 2700
Connection ~ 4150 2750
Connection ~ 4150 3550
Connection ~ 4150 4350
Connection ~ 6250 3600
Connection ~ 6150 3900
Connection ~ 6150 4200
Connection ~ 6150 4300
Connection ~ 6250 3300
Connection ~ 6500 4500
Connection ~ 6350 4400
Connection ~ 6350 3700
Connection ~ 6500 3800
Connection ~ 6050 4900
Connection ~ 6250 4300
Connection ~ 6050 4600
Connection ~ 4900 5300
Connection ~ 4900 3700
Connection ~ 4900 4500
Connection ~ 6350 3100
Connection ~ 6500 3200
Connection ~ 5900 1000
NoConn ~ 7350 5100
Entry Wire Line
	6450 5700 6550 5600
Entry Wire Line
	6450 5800 6550 5700
Entry Wire Line
	6450 5900 6550 5800
Entry Wire Line
	6450 6000 6550 5900
Wire Wire Line
	3750 1900 3750 5050
Wire Wire Line
	3750 1900 8300 1900
Wire Wire Line
	3750 5050 4250 5050
Wire Wire Line
	3850 2000 3850 4250
Wire Wire Line
	3850 2000 8200 2000
Wire Wire Line
	3850 4250 4250 4250
Wire Wire Line
	3950 2100 3950 3450
Wire Wire Line
	3950 2100 8100 2100
Wire Wire Line
	3950 3450 4250 3450
Wire Wire Line
	4050 2200 8000 2200
Wire Wire Line
	4050 2650 4050 2200
Wire Wire Line
	4050 2650 4250 2650
Wire Wire Line
	4150 2750 3650 2750
Wire Wire Line
	4150 2750 4150 3550
Wire Wire Line
	4150 3550 4150 4350
Wire Wire Line
	4150 4350 4150 5150
Wire Wire Line
	4150 5150 4250 5150
Wire Wire Line
	4250 2750 4150 2750
Wire Wire Line
	4250 3550 4150 3550
Wire Wire Line
	4250 4350 4150 4350
Wire Wire Line
	4800 1000 5900 1000
Wire Wire Line
	4800 2700 5000 2700
Wire Wire Line
	4800 3500 5000 3500
Wire Wire Line
	4800 4300 5000 4300
Wire Wire Line
	4800 5100 5000 5100
Wire Wire Line
	4900 3700 4900 2900
Wire Wire Line
	4900 4500 4900 3700
Wire Wire Line
	4900 4500 5000 4500
Wire Wire Line
	4900 5300 4900 4500
Wire Wire Line
	4900 5300 4900 5450
Wire Wire Line
	4900 5450 4750 5450
Wire Wire Line
	5000 2900 4900 2900
Wire Wire Line
	5000 3700 4900 3700
Wire Wire Line
	5000 5300 4900 5300
Wire Wire Line
	5500 2700 6350 2700
Wire Wire Line
	5500 2800 5900 2800
Wire Wire Line
	5500 3500 6250 3500
Wire Wire Line
	5500 3600 5800 3600
Wire Wire Line
	5500 4300 6150 4300
Wire Wire Line
	5500 5100 6050 5100
Wire Wire Line
	5500 5200 5600 5200
Wire Wire Line
	5600 5200 5600 6000
Wire Wire Line
	5600 6000 6450 6000
Wire Wire Line
	5700 4400 5500 4400
Wire Wire Line
	5700 5900 5700 4400
Wire Wire Line
	5800 3600 5800 5800
Wire Wire Line
	5800 5800 6450 5800
Wire Wire Line
	5900 1000 5900 1400
Wire Wire Line
	5900 1000 6600 1000
Wire Wire Line
	5900 2800 5900 5700
Wire Wire Line
	5900 5700 6450 5700
Wire Wire Line
	6050 2450 6050 4600
Wire Wire Line
	6050 4600 6050 4900
Wire Wire Line
	6050 4600 7350 4600
Wire Wire Line
	6050 4900 6050 5100
Wire Wire Line
	6150 2450 6150 3900
Wire Wire Line
	6150 3900 6150 4200
Wire Wire Line
	6150 3900 7350 3900
Wire Wire Line
	6150 4200 6150 4300
Wire Wire Line
	6150 4300 6150 5000
Wire Wire Line
	6250 2450 6250 3300
Wire Wire Line
	6250 3300 6250 3500
Wire Wire Line
	6250 3300 7350 3300
Wire Wire Line
	6250 3500 6250 3600
Wire Wire Line
	6250 3600 6250 4300
Wire Wire Line
	6250 4300 6250 5100
Wire Wire Line
	6350 2450 6350 2700
Wire Wire Line
	6350 2700 6350 3100
Wire Wire Line
	6350 3100 6350 3700
Wire Wire Line
	6350 3700 6350 4400
Wire Wire Line
	6350 4400 6350 5200
Wire Wire Line
	6450 5900 5700 5900
Wire Wire Line
	6500 1400 6500 3200
Wire Wire Line
	6500 3200 6500 3800
Wire Wire Line
	6500 3200 6600 3200
Wire Wire Line
	6500 3800 6500 4500
Wire Wire Line
	6500 3800 6600 3800
Wire Wire Line
	6500 4500 6500 5300
Wire Wire Line
	6500 4500 6600 4500
Wire Wire Line
	6500 5300 6600 5300
Wire Wire Line
	6600 1000 6600 2600
Wire Wire Line
	6600 2600 7350 2600
Wire Wire Line
	6600 3100 6350 3100
Wire Wire Line
	6600 3600 6250 3600
Wire Wire Line
	6600 3700 6350 3700
Wire Wire Line
	6600 4200 6150 4200
Wire Wire Line
	6600 4300 6250 4300
Wire Wire Line
	6600 4400 6350 4400
Wire Wire Line
	6600 4900 6050 4900
Wire Wire Line
	6600 5000 6150 5000
Wire Wire Line
	6600 5100 6250 5100
Wire Wire Line
	6600 5200 6350 5200
Wire Wire Line
	7150 3150 7150 3200
Wire Wire Line
	7150 3200 7350 3200
Wire Wire Line
	7200 3800 7200 3700
Wire Wire Line
	7200 4500 7200 4350
Wire Wire Line
	7350 2700 6350 2700
Wire Wire Line
	7350 3800 7200 3800
Wire Wire Line
	7350 4500 7200 4500
Wire Wire Line
	7900 3250 8100 3250
Wire Wire Line
	7900 3850 8200 3850
Wire Wire Line
	7900 4550 8300 4550
Wire Wire Line
	8000 2200 8000 2650
Wire Wire Line
	8000 2650 7900 2650
Wire Wire Line
	8100 3250 8100 2100
Wire Wire Line
	8200 3850 8200 2000
Wire Wire Line
	8300 1900 8300 4550
Wire Bus Line
	6550 5500 6700 5500
Text Notes 3100 3600 0    50   ~ 0
RESET:\nLI + RESET\n\nINC:\nX = 14-15
Text Label 6450 5700 2    50   ~ 0
WY-C0
Text Label 6450 5800 2    50   ~ 0
WY-C1
Text Label 6450 5900 2    50   ~ 0
WY-C2
Text Label 6450 6000 2    50   ~ 0
WY-C3
Text HLabel 3100 2700 0    50   Input ~ 0
~ZERO
Text HLabel 3100 2800 0    50   Input ~ 0
~RESET
Text HLabel 4750 5450 0    50   Input ~ 0
~CLK8M4M
Text HLabel 4800 1000 0    50   Input ~ 0
INC
Text HLabel 6700 5500 2    50   Output ~ 0
WY-C[0..3]
$Comp
L A5C:AND02 UDB137
U 1 1 61118E88
P 3350 2750
F 0 "UDB137" H 3375 3017 50  0000 C CNN
F 1 "AND02" H 3375 2926 50  0000 C CNN
F 2 "" H 3350 2750 50  0001 C CNN
F 3 "" H 3350 2750 50  0001 C CNN
	1    3350 2750
	1    0    0    -1  
$EndComp
$Comp
L A5C:NAND02 UAD?
U 1 1 61118E91
P 4500 2700
AR Path="/61118E91" Ref="UAD?"  Part="1" 
AR Path="/613100A2/61118E91" Ref="UDD83"  Part="1" 
AR Path="/613100A2/612E8443/61118E91" Ref="UDD83"  Part="1" 
F 0 "UDD83" H 4525 2967 50  0000 C CNN
F 1 "NAND02" H 4525 2876 50  0000 C CNN
F 2 "" H 4500 2700 50  0001 C CNN
F 3 "" H 4500 2700 50  0001 C CNN
	1    4500 2700
	1    0    0    -1  
$EndComp
$Comp
L A5C:NAND02 UAB?
U 1 1 61118E90
P 4500 3500
AR Path="/611F0159/61118E90" Ref="UAB?"  Part="1" 
AR Path="/61118E90" Ref="UAB?"  Part="1" 
AR Path="/613100A2/61118E90" Ref="UDH142"  Part="1" 
AR Path="/613100A2/612E8443/61118E90" Ref="UDH142"  Part="1" 
F 0 "UDH142" H 4525 3767 50  0000 C CNN
F 1 "NAND02" H 4525 3676 50  0000 C CNN
F 2 "" H 4500 3500 50  0001 C CNN
F 3 "" H 4500 3500 50  0001 C CNN
	1    4500 3500
	1    0    0    -1  
$EndComp
$Comp
L A5C:NAND02 UAC?
U 1 1 61118EB1
P 4500 4300
AR Path="/611F0159/61118EB1" Ref="UAC?"  Part="1" 
AR Path="/61118EB1" Ref="UAC?"  Part="1" 
AR Path="/613100A2/61118EB1" Ref="UDE138"  Part="1" 
AR Path="/613100A2/612E8443/61118EB1" Ref="UDE138"  Part="1" 
F 0 "UDE138" H 4525 4567 50  0000 C CNN
F 1 "NAND02" H 4525 4476 50  0000 C CNN
F 2 "" H 4500 4300 50  0001 C CNN
F 3 "" H 4500 4300 50  0001 C CNN
	1    4500 4300
	1    0    0    -1  
$EndComp
$Comp
L A5C:NAND02 UAB?
U 1 1 61118E8B
P 4500 5100
AR Path="/611F0159/61118E8B" Ref="UAB?"  Part="1" 
AR Path="/61118E8B" Ref="UAB?"  Part="1" 
AR Path="/613100A2/61118E8B" Ref="UDD126"  Part="1" 
AR Path="/613100A2/612E8443/61118E8B" Ref="UDD126"  Part="1" 
F 0 "UDD126" H 4525 5367 50  0000 C CNN
F 1 "NAND02" H 4525 5276 50  0000 C CNN
F 2 "" H 4500 5100 50  0001 C CNN
F 3 "" H 4500 5100 50  0001 C CNN
	1    4500 5100
	1    0    0    -1  
$EndComp
$Comp
L A5C:NOR02 UAB?
U 1 1 61118E92
P 6850 3150
AR Path="/611F0159/61118E92" Ref="UAB?"  Part="1" 
AR Path="/61118E92" Ref="UAB?"  Part="1" 
AR Path="/613100A2/61118E92" Ref="UDE129"  Part="1" 
AR Path="/613100A2/612E8443/61118E92" Ref="UDE129"  Part="1" 
F 0 "UDE129" H 6875 3417 50  0000 C CNN
F 1 "NOR02" H 6875 3326 50  0000 C CNN
F 2 "" H 6850 3150 50  0001 C CNN
F 3 "" H 6850 3150 50  0001 C CNN
	1    6850 3150
	1    0    0    -1  
$EndComp
$Comp
L A5C:XNOR02 UAD?
U 1 1 61118E8D
P 7600 2650
AR Path="/61118E8D" Ref="UAD?"  Part="1" 
AR Path="/613100A2/61118E8D" Ref="UDD85"  Part="1" 
AR Path="/613100A2/612E8443/61118E8D" Ref="UDD85"  Part="1" 
F 0 "UDD85" H 7625 2917 50  0000 C CNN
F 1 "XNOR02" H 7625 2826 50  0000 C CNN
F 2 "" H 7625 2650 50  0001 C CNN
F 3 "" H 7625 2650 50  0001 C CNN
	1    7600 2650
	1    0    0    -1  
$EndComp
$Comp
L A5C:XNOR02 UAB?
U 1 1 61118EAD
P 7600 3250
AR Path="/611F0159/61118EAD" Ref="UAB?"  Part="1" 
AR Path="/61118EAD" Ref="UAB?"  Part="1" 
AR Path="/613100A2/61118EAD" Ref="UDL137"  Part="1" 
AR Path="/613100A2/612E8443/61118EAD" Ref="UDL137"  Part="1" 
F 0 "UDL137" H 7625 3517 50  0000 C CNN
F 1 "XNOR02" H 7625 3426 50  0000 C CNN
F 2 "" H 7625 3250 50  0001 C CNN
F 3 "" H 7625 3250 50  0001 C CNN
	1    7600 3250
	1    0    0    -1  
$EndComp
$Comp
L A5C:XNOR02 UAB?
U 1 1 61118EAE
P 7600 3850
AR Path="/611F0159/61118EAE" Ref="UAB?"  Part="1" 
AR Path="/61118EAE" Ref="UAB?"  Part="1" 
AR Path="/613100A2/61118EAE" Ref="UDE132"  Part="1" 
AR Path="/613100A2/612E8443/61118EAE" Ref="UDE132"  Part="1" 
F 0 "UDE132" H 7625 4117 50  0000 C CNN
F 1 "XNOR02" H 7625 4026 50  0000 C CNN
F 2 "" H 7625 3850 50  0001 C CNN
F 3 "" H 7625 3850 50  0001 C CNN
	1    7600 3850
	1    0    0    -1  
$EndComp
$Comp
L A5C:XNOR02 UAB?
U 1 1 61118EB2
P 7600 4550
AR Path="/611F0159/61118EB2" Ref="UAB?"  Part="1" 
AR Path="/61118EB2" Ref="UAB?"  Part="1" 
AR Path="/613100A2/61118EB2" Ref="UDD124"  Part="1" 
AR Path="/613100A2/612E8443/61118EB2" Ref="UDD124"  Part="1" 
F 0 "UDD124" H 7625 4817 50  0000 C CNN
F 1 "XNOR02" H 7625 4726 50  0000 C CNN
F 2 "" H 7625 4550 50  0001 C CNN
F 3 "" H 7625 4550 50  0001 C CNN
	1    7600 4550
	1    0    0    -1  
$EndComp
$Comp
L A5C:INV01 UAB?
U 1 1 61118E8C
P 6200 1400
AR Path="/611F0159/61118E8C" Ref="UAB?"  Part="1" 
AR Path="/61118E8C" Ref="UAB?"  Part="1" 
AR Path="/613100A2/61118E8C" Ref="UDD108"  Part="1" 
AR Path="/613100A2/612E8443/61118E8C" Ref="UDD108"  Part="1" 
F 0 "UDD108" H 6200 1717 50  0000 C CNN
F 1 "INV01" H 6200 1626 50  0000 C CNN
F 2 "" H 6200 1200 50  0001 C CNN
F 3 "" H 6200 1200 50  0001 C CNN
	1    6200 1400
	1    0    0    -1  
$EndComp
$Comp
L A5C:NOR03 UAB?
U 1 1 61118EAB
P 6900 3700
AR Path="/611F0159/61118EAB" Ref="UAB?"  Part="1" 
AR Path="/61118EAB" Ref="UAB?"  Part="1" 
AR Path="/613100A2/61118EAB" Ref="UDE126"  Part="1" 
AR Path="/613100A2/612E8443/61118EAB" Ref="UDE126"  Part="1" 
F 0 "UDE126" H 6900 4017 50  0000 C CNN
F 1 "NOR03" H 6900 3926 50  0000 C CNN
F 2 "" H 6900 3700 50  0001 C CNN
F 3 "" H 6900 3700 50  0001 C CNN
	1    6900 3700
	1    0    0    -1  
$EndComp
$Comp
L A5C:DFFCOO UAD?
U 1 1 61118E8E
P 5250 2800
AR Path="/61118E8E" Ref="UAD?"  Part="1" 
AR Path="/613100A2/61118E8E" Ref="UDD109"  Part="1" 
AR Path="/613100A2/612E8443/61118E8E" Ref="UDD109"  Part="1" 
F 0 "UDD109" H 5250 3165 50  0000 C CNN
F 1 "DFFCOO" H 5250 3074 50  0000 C CNN
F 2 "" H 5250 2800 50  0001 C CNN
F 3 "" H 5250 2800 50  0001 C CNN
	1    5250 2800
	1    0    0    -1  
$EndComp
$Comp
L A5C:DFFCOO UAB?
U 1 1 61118E8F
P 5250 3600
AR Path="/611F0159/61118E8F" Ref="UAB?"  Part="1" 
AR Path="/61118E8F" Ref="UAB?"  Part="1" 
AR Path="/613100A2/61118E8F" Ref="UDI137"  Part="1" 
AR Path="/613100A2/612E8443/61118E8F" Ref="UDI137"  Part="1" 
F 0 "UDI137" H 5250 3965 50  0000 C CNN
F 1 "DFFCOO" H 5250 3874 50  0000 C CNN
F 2 "" H 5250 3600 50  0001 C CNN
F 3 "" H 5250 3600 50  0001 C CNN
	1    5250 3600
	1    0    0    -1  
$EndComp
$Comp
L A5C:DFFCOO UBC?
U 1 1 61118EAF
P 5250 4400
AR Path="/61118EAF" Ref="UBC?"  Part="1" 
AR Path="/613100A2/61118EAF" Ref="UDE134"  Part="1" 
AR Path="/613100A2/612E8443/61118EAF" Ref="UDE134"  Part="1" 
F 0 "UDE134" H 5250 4765 50  0000 C CNN
F 1 "DFFCOO" H 5250 4674 50  0000 C CNN
F 2 "" H 5250 4400 50  0001 C CNN
F 3 "" H 5250 4400 50  0001 C CNN
	1    5250 4400
	1    0    0    -1  
$EndComp
$Comp
L A5C:DFFCOO UAB?
U 1 1 61118EB0
P 5250 5200
AR Path="/611F0159/61118EB0" Ref="UAB?"  Part="1" 
AR Path="/61118EB0" Ref="UAB?"  Part="1" 
AR Path="/613100A2/61118EB0" Ref="UDD113"  Part="1" 
AR Path="/613100A2/612E8443/61118EB0" Ref="UDD113"  Part="1" 
F 0 "UDD113" H 5250 5565 50  0000 C CNN
F 1 "DFFCOO" H 5250 5474 50  0000 C CNN
F 2 "" H 5250 5200 50  0001 C CNN
F 3 "" H 5250 5200 50  0001 C CNN
	1    5250 5200
	1    0    0    -1  
$EndComp
$Comp
L A5C:NOR04 UAB?
U 1 1 61118EAC
P 6900 4350
AR Path="/611F0159/61118EAC" Ref="UAB?"  Part="1" 
AR Path="/61118EAC" Ref="UAB?"  Part="1" 
AR Path="/613100A2/61118EAC" Ref="UDD120"  Part="1" 
AR Path="/613100A2/612E8443/61118EAC" Ref="UDD120"  Part="1" 
F 0 "UDD120" H 6900 4692 50  0000 C CNN
F 1 "NOR04" H 6900 4601 50  0000 C CNN
F 2 "" H 6900 4350 50  0001 C CNN
F 3 "" H 6900 4350 50  0001 C CNN
	1    6900 4350
	1    0    0    -1  
$EndComp
$Comp
L A5C:NOR05 UAB?
U 1 1 61118EAA
P 6900 5100
AR Path="/611F0159/61118EAA" Ref="UAB?"  Part="1" 
AR Path="/61118EAA" Ref="UAB?"  Part="1" 
AR Path="/613100A2/61118EAA" Ref="UDD117"  Part="1" 
AR Path="/613100A2/612E8443/61118EAA" Ref="UDD117"  Part="1" 
F 0 "UDD117" H 6975 5515 50  0000 C CNN
F 1 "NOR05" H 6975 5424 50  0000 C CNN
F 2 "" H 6900 5150 50  0001 C CNN
F 3 "" H 6900 5150 50  0001 C CNN
	1    6900 5100
	1    0    0    -1  
$EndComp
Wire Bus Line
	6550 5500 6550 5900
$EndSCHEMATC
