EESchema Schematic File Version 4
EELAYER 30 0
EELAYER END
$Descr A4 11693 8268
encoding utf-8
Sheet 26 69
Title ""
Date "2020-11-26"
Rev ""
Comp ""
Comment1 "Licence: CC-BY"
Comment2 "Author: Loïc *WydD* Petit"
Comment3 ""
Comment4 ""
$EndDescr
Connection ~ 4150 5550
Connection ~ 4150 6200
Connection ~ 4150 4250
Connection ~ 4150 4900
Connection ~ 4150 2950
Connection ~ 4150 3600
Connection ~ 4150 2300
Connection ~ 4150 6850
NoConn ~ 4750 1450
NoConn ~ 4750 2100
NoConn ~ 4750 2750
NoConn ~ 4750 3400
NoConn ~ 4750 4050
NoConn ~ 4750 4800
NoConn ~ 4750 5450
NoConn ~ 4750 6100
NoConn ~ 4750 6750
Entry Wire Line
	3100 1350 3200 1450
Entry Wire Line
	3100 2000 3200 2100
Entry Wire Line
	3100 2650 3200 2750
Entry Wire Line
	3100 3300 3200 3400
Entry Wire Line
	3100 3950 3200 4050
Entry Wire Line
	3100 4600 3200 4700
Entry Wire Line
	3100 5250 3200 5350
Entry Wire Line
	3100 5900 3200 6000
Entry Wire Line
	3100 6550 3200 6650
Entry Wire Line
	5800 1550 5900 1450
Entry Wire Line
	5800 2200 5900 2100
Entry Wire Line
	5800 2850 5900 2750
Entry Wire Line
	5800 3500 5900 3400
Entry Wire Line
	5800 4150 5900 4050
Entry Wire Line
	5800 4700 5900 4800
Entry Wire Line
	5800 5350 5900 5450
Entry Wire Line
	5800 6000 5900 6100
Entry Wire Line
	5800 6650 5900 6750
Wire Wire Line
	3850 7150 4150 7150
Wire Wire Line
	4150 1650 4150 2300
Wire Wire Line
	4150 1650 4250 1650
Wire Wire Line
	4150 2300 4150 2950
Wire Wire Line
	4150 2950 4150 3600
Wire Wire Line
	4150 3600 4150 4250
Wire Wire Line
	4150 4250 4250 4250
Wire Wire Line
	4150 4900 4150 4250
Wire Wire Line
	4150 4900 4150 5550
Wire Wire Line
	4150 5550 4150 6200
Wire Wire Line
	4150 6200 4150 6850
Wire Wire Line
	4150 6850 4250 6850
Wire Wire Line
	4150 7150 4150 6850
Wire Wire Line
	4250 1450 3200 1450
Wire Wire Line
	4250 2100 3200 2100
Wire Wire Line
	4250 2300 4150 2300
Wire Wire Line
	4250 2750 3200 2750
Wire Wire Line
	4250 2950 4150 2950
Wire Wire Line
	4250 3400 3200 3400
Wire Wire Line
	4250 3600 4150 3600
Wire Wire Line
	4250 4050 3200 4050
Wire Wire Line
	4250 4700 3200 4700
Wire Wire Line
	4250 4900 4150 4900
Wire Wire Line
	4250 5350 3200 5350
Wire Wire Line
	4250 5550 4150 5550
Wire Wire Line
	4250 6000 3200 6000
Wire Wire Line
	4250 6200 4150 6200
Wire Wire Line
	4250 6650 3200 6650
Wire Wire Line
	4750 1550 5800 1550
Wire Wire Line
	4750 2200 5800 2200
Wire Wire Line
	4750 2850 5800 2850
Wire Wire Line
	4750 3500 5800 3500
Wire Wire Line
	4750 4150 5800 4150
Wire Wire Line
	4750 4700 5800 4700
Wire Wire Line
	4750 5350 5800 5350
Wire Wire Line
	4750 6000 5800 6000
Wire Wire Line
	4750 6650 5800 6650
Wire Bus Line
	3100 1250 3000 1250
Wire Bus Line
	3100 1250 3100 6550
Wire Bus Line
	5900 1350 5900 4050
Wire Bus Line
	5900 1350 6000 1350
Wire Bus Line
	5900 4800 5900 6850
Wire Bus Line
	5900 6850 6000 6850
Text Label 2900 7100 2    50   ~ 0
UBN260-Q
Text Label 2900 7200 2    50   ~ 0
CLK8M
Text Label 3350 1450 0    50   ~ 0
PD0
Text Label 3350 2100 0    50   ~ 0
PD1
Text Label 3350 2750 0    50   ~ 0
PD2
Text Label 3350 3400 0    50   ~ 0
PD3
Text Label 3350 4050 0    50   ~ 0
PD4
Text Label 3350 4700 0    50   ~ 0
PD5
Text Label 3350 5350 0    50   ~ 0
PD6
Text Label 3350 6000 0    50   ~ 0
PD7
Text Label 3350 6650 0    50   ~ 0
PD8
Text Label 4850 1550 0    50   ~ 0
~PD-OUT0
Text Label 4850 2200 0    50   ~ 0
~PD-OUT1
Text Label 4850 2850 0    50   ~ 0
~PD-OUT2
Text Label 4850 3500 0    50   ~ 0
~PD-OUT3
Text Label 4850 4150 0    50   ~ 0
~PD-OUT4
Text Label 4850 4700 0    50   ~ 0
PD-OUT5
Text Label 4850 5350 0    50   ~ 0
PD-OUT6
Text Label 4850 6000 0    50   ~ 0
PD-OUT7
Text Label 4850 6650 0    50   ~ 0
PD-OUT8
Text HLabel 3000 1250 0    50   Input ~ 0
PD[0..8]
Text HLabel 3300 7100 0    50   Input ~ 0
~LOAD
Text HLabel 3300 7200 0    50   Input ~ 0
CLK8M
Text HLabel 6000 1350 2    50   Output ~ 0
~PD-OUT[0..4]
Text HLabel 6000 6850 2    50   Output ~ 0
PD-OUT[5..8]
$Comp
L A5C:NAND02 UBN258
U 1 1 621DAA50
P 3550 7150
AR Path="/5FAAFB48/621DAA50" Ref="UBN258"  Part="1" 
AR Path="/5FBCE4A9/5FBD0B14/621DAA50" Ref="UBN258"  Part="1" 
F 0 "UBN258" H 3575 7417 50  0000 C CNN
F 1 "NAND02" H 3575 7326 50  0000 C CNN
F 2 "" H 3550 7150 50  0001 C CNN
F 3 "" H 3550 7150 50  0001 C CNN
	1    3550 7150
	1    0    0    -1  
$EndComp
$Comp
L A5C:DFFCOO UBR240
U 1 1 6247259E
P 4500 1550
AR Path="/5FAAFB48/6247259E" Ref="UBR240"  Part="1" 
AR Path="/5FBCE4A9/5FBD0B14/6247259E" Ref="UBR240"  Part="1" 
F 0 "UBR240" H 4500 1915 50  0000 C CNN
F 1 "DFFCOO" H 4500 1824 50  0000 C CNN
F 2 "" H 4500 1550 50  0001 C CNN
F 3 "" H 4500 1550 50  0001 C CNN
	1    4500 1550
	1    0    0    -1  
$EndComp
$Comp
L A5C:DFFCOO UBR244
U 1 1 6246F601
P 4500 2200
AR Path="/5FAAFB48/6246F601" Ref="UBR244"  Part="1" 
AR Path="/5FBCE4A9/5FBD0B14/6246F601" Ref="UBR244"  Part="1" 
F 0 "UBR244" H 4500 2565 50  0000 C CNN
F 1 "FFCOO" H 4500 2474 50  0000 C CNN
F 2 "" H 4500 2200 50  0001 C CNN
F 3 "" H 4500 2200 50  0001 C CNN
F 4 "UBR237" H 4500 2200 50  0001 C CNN "MiscRef"
	1    4500 2200
	1    0    0    -1  
$EndComp
$Comp
L A5C:DFFCOO UBR248
U 1 1 6246F607
P 4500 2850
AR Path="/5FAAFB48/6246F607" Ref="UBR248"  Part="1" 
AR Path="/5FBCE4A9/5FBD0B14/6246F607" Ref="UBR248"  Part="1" 
F 0 "UBR248" H 4500 3215 50  0000 C CNN
F 1 "DFFCOO" H 4500 3124 50  0000 C CNN
F 2 "" H 4500 2850 50  0001 C CNN
F 3 "" H 4500 2850 50  0001 C CNN
	1    4500 2850
	1    0    0    -1  
$EndComp
$Comp
L A5C:DFFCOO UBR252
U 1 1 6246F60D
P 4500 3500
AR Path="/5FAAFB48/6246F60D" Ref="UBR252"  Part="1" 
AR Path="/5FBCE4A9/5FBD0B14/6246F60D" Ref="UBR252"  Part="1" 
F 0 "UBR252" H 4500 3865 50  0000 C CNN
F 1 "DFFCOO" H 4500 3774 50  0000 C CNN
F 2 "" H 4500 3500 50  0001 C CNN
F 3 "" H 4500 3500 50  0001 C CNN
	1    4500 3500
	1    0    0    -1  
$EndComp
$Comp
L A5C:DFFCOO UBR255
U 1 1 6246F613
P 4500 4150
AR Path="/5FAAFB48/6246F613" Ref="UBR255"  Part="1" 
AR Path="/5FBCE4A9/5FBD0B14/6246F613" Ref="UBR255"  Part="1" 
F 0 "UBR255" H 4500 4515 50  0000 C CNN
F 1 "DFFCOO" H 4500 4424 50  0000 C CNN
F 2 "" H 4500 4150 50  0001 C CNN
F 3 "" H 4500 4150 50  0001 C CNN
	1    4500 4150
	1    0    0    -1  
$EndComp
$Comp
L A5C:DFFCOO UBH227
U 1 1 621CF45C
P 4500 4800
AR Path="/5FAAFB48/621CF45C" Ref="UBH227"  Part="1" 
AR Path="/5FBCE4A9/5FBD0B14/621CF45C" Ref="UBH227"  Part="1" 
F 0 "UBH227" H 4500 5165 50  0000 C CNN
F 1 "DFFCOO" H 4500 5074 50  0000 C CNN
F 2 "" H 4500 4800 50  0001 C CNN
F 3 "" H 4500 4800 50  0001 C CNN
F 4 "UBH226" H 4500 4800 50  0001 C CNN "MiscRef"
	1    4500 4800
	1    0    0    -1  
$EndComp
$Comp
L A5C:DFFCOO UBH231
U 1 1 621CF559
P 4500 5450
AR Path="/5FAAFB48/621CF559" Ref="UBH231"  Part="1" 
AR Path="/5FBCE4A9/5FBD0B14/621CF559" Ref="UBH231"  Part="1" 
F 0 "UBH231" H 4500 5815 50  0000 C CNN
F 1 "DFFCOO" H 4500 5724 50  0000 C CNN
F 2 "" H 4500 5450 50  0001 C CNN
F 3 "" H 4500 5450 50  0001 C CNN
	1    4500 5450
	1    0    0    -1  
$EndComp
$Comp
L A5C:DFFCOO UBH235
U 1 1 621CF735
P 4500 6100
AR Path="/5FAAFB48/621CF735" Ref="UBH235"  Part="1" 
AR Path="/5FBCE4A9/5FBD0B14/621CF735" Ref="UBH235"  Part="1" 
F 0 "UBH235" H 4500 6465 50  0000 C CNN
F 1 "DFFCOO" H 4500 6374 50  0000 C CNN
F 2 "" H 4500 6100 50  0001 C CNN
F 3 "" H 4500 6100 50  0001 C CNN
	1    4500 6100
	1    0    0    -1  
$EndComp
$Comp
L A5C:DFFCOO UBH239
U 1 1 621CF812
P 4500 6750
AR Path="/5FAAFB48/621CF812" Ref="UBH239"  Part="1" 
AR Path="/5FBCE4A9/5FBD0B14/621CF812" Ref="UBH239"  Part="1" 
F 0 "UBH239" H 4500 7115 50  0000 C CNN
F 1 "DFFCOO" H 4500 7024 50  0000 C CNN
F 2 "" H 4500 6750 50  0001 C CNN
F 3 "" H 4500 6750 50  0001 C CNN
	1    4500 6750
	1    0    0    -1  
$EndComp
$EndSCHEMATC
