EESchema Schematic File Version 4
EELAYER 30 0
EELAYER END
$Descr A4 11693 8268
encoding utf-8
Sheet 45 69
Title ""
Date "2020-11-26"
Rev ""
Comp ""
Comment1 "Licence: CC-BY"
Comment2 "Author: Loïc *WydD* Petit"
Comment3 ""
Comment4 ""
$EndDescr
Text Notes 2700 2950 0    50   ~ 0
0x3E
Text Label 2750 3500 2    50   ~ 0
~DEBUG11
$Sheet
S 3550 2550 1300 1350
U 5FC17149
F0 "video-counter" 50
F1 "video-counter.sch" 50
F2 "BUS-DATA[0..15]" I L 3550 2750 50 
F3 "FI" I L 3550 3250 50 
F4 "LI" I L 3550 3350 50 
F5 "~RESETI" I L 3550 3750 50 
F6 "~WR" I L 3550 3000 50 
F7 "~E" I L 3550 2900 50 
F8 "~CLK4M" I L 3550 3100 50 
F9 "~COUNTER-SET" I L 3550 3600 50 
F10 "COUNTER-INC" I L 3550 3500 50 
F11 "LINE[0..8]" O R 4850 2900 50 
F12 "COL[1..8]" O R 4850 2750 50 
$EndSheet
$Sheet
S 5350 2550 1200 2700
U 5FC17148
F0 "video-signal-generator" 50
F1 "video-signal-generator.sch" 50
F2 "FI" I L 5350 3250 50 
F3 "LI" I L 5350 3350 50 
F4 "~CLK4M" I L 5350 3550 50 
F5 "FLIP" I L 5350 3650 50 
F6 "~VBLANK" O R 6550 2800 50 
F7 "VSYNC" O R 6550 3150 50 
F8 "~HBLANK" O R 6550 2700 50 
F9 "HSYNC" O R 6550 3050 50 
F10 "BLANK" O R 6550 3300 50 
F11 "GFX-CHNL" O R 6550 4000 50 
F12 "SERIAL-CHNL" O R 6550 4300 50 
F13 "LOAD-XPD2" O R 6550 4500 50 
F14 "LOAD-XPD1" O R 6550 4400 50 
F15 "LOAD-XPD4" O R 6550 4700 50 
F16 "LOAD-XPD3" O R 6550 4600 50 
F17 "STARS2-LOAD" O R 6550 4950 50 
F18 "STARS1-LOAD" O R 6550 4850 50 
F19 "SERIAL-LOAD-XPD4" O R 6550 5050 50 
F20 "SERIAL-LOAD" O R 6550 4200 50 
F21 "STARS-SERIAL" O R 6550 5150 50 
F22 "GFX-OUT-LMSB" O R 6550 4100 50 
F23 "~DEBUG-LO" I L 5350 4150 50 
F24 "~DEBUG-HI" I L 5350 4550 50 
F25 "TD[0..11]" T L 5350 4850 50 
F26 "COL[1..8]" I L 5350 2750 50 
F27 "LINE[0..8]" I L 5350 2900 50 
$EndSheet
$Sheet
S 7250 2550 1200 1200
U 5FC17155
F0 "video-signal-registries" 50
F1 "video-signal-registries.sch" 50
F2 "~HBLANK-OUT" O R 8450 2700 50 
F3 "~VBLANK-OUT" O R 8450 2800 50 
F4 "HSYNC-OUT" O R 8450 3050 50 
F5 "VSYNC-OUT" O R 8450 3150 50 
F6 "~HBLANK-IN" I L 7250 2700 50 
F7 "~VBLANK-IN" I L 7250 2800 50 
F8 "HSYNC-IN" I L 7250 3050 50 
F9 "VSYNC-IN" I L 7250 3150 50 
F10 "~RESET" I L 7250 3600 50 
F11 "BLANK-OUT" O R 8450 3300 50 
F12 "BLANK" I L 7250 3300 50 
F13 "CLK8M" I L 7250 3500 50 
$EndSheet
Text Label 2750 4450 2    50   ~ 0
~DEBUG11
$Comp
L A5C:AND03 UBN?
U 1 1 607B0BCF
P 3000 4550
AR Path="/5FC16B93/5FC17148/607B0BCF" Ref="UBN?"  Part="1" 
AR Path="/5FC16B93/607B0BCF" Ref="UBN385"  Part="1" 
F 0 "UBN385" H 3025 4842 50  0000 C CNN
F 1 "AND03" H 3025 4751 50  0000 C CNN
F 2 "" H 3000 4550 50  0001 C CNN
F 3 "" H 3000 4550 50  0001 C CNN
	1    3000 4550
	1    0    0    -1  
$EndComp
Text Label 2750 4550 2    50   ~ 0
~DEBUG12
Text Label 2750 4650 2    50   ~ 0
~DEBUG1
Wire Wire Line
	2300 4650 2750 4650
Wire Wire Line
	2750 4550 2300 4550
Wire Wire Line
	2300 4450 2750 4450
Entry Wire Line
	2300 4650 2200 4550
Entry Wire Line
	2300 4550 2200 4450
Entry Wire Line
	2300 4450 2200 4350
Text Label 2750 4150 2    50   ~ 0
~DEBUG0
Entry Wire Line
	2300 4150 2200 4050
Text Label 2750 3600 2    50   ~ 0
~DEBUG12
Entry Wire Line
	2300 3600 2200 3500
Entry Wire Line
	2300 3500 2200 3400
Wire Wire Line
	2300 3600 3550 3600
Wire Wire Line
	2300 3500 3550 3500
Wire Bus Line
	2200 3250 2100 3250
Wire Bus Line
	5350 4850 5100 4850
Text HLabel 5100 4850 0    50   3State ~ 0
TD[0..11]
Text HLabel 2100 3250 0    50   Input ~ 0
~DEBUG[0..12]
Text HLabel 3400 3250 0    50   Input ~ 0
FI
Text HLabel 3400 3350 0    50   Input ~ 0
LI
Wire Wire Line
	3400 3250 3550 3250
Wire Wire Line
	3550 3350 3400 3350
Text HLabel 5200 3650 0    50   Input ~ 0
FLIP
Wire Wire Line
	5350 3650 5200 3650
Text HLabel 5200 3250 0    50   Input ~ 0
FI
Text HLabel 5200 3350 0    50   Input ~ 0
LI
Wire Wire Line
	5200 3250 5350 3250
Wire Wire Line
	5350 3350 5200 3350
Text HLabel 3400 3100 0    50   Input ~ 0
~CLK4M
Wire Wire Line
	3400 3100 3550 3100
Text HLabel 5200 3550 0    50   Input ~ 0
~CLK4M
Wire Wire Line
	5200 3550 5350 3550
Wire Wire Line
	2300 4150 5350 4150
Wire Bus Line
	4850 2750 5350 2750
Wire Wire Line
	3300 4550 5350 4550
Text HLabel 7100 3500 0    50   Input ~ 0
~CLK4M
Wire Wire Line
	7100 3500 7250 3500
Wire Wire Line
	6550 2700 7250 2700
Wire Wire Line
	6550 2800 7250 2800
Wire Wire Line
	6550 3050 7250 3050
Wire Wire Line
	6550 3150 7250 3150
Wire Wire Line
	6550 3300 7250 3300
Text HLabel 3400 3750 0    50   Input ~ 0
~RESET
Wire Wire Line
	3400 3750 3550 3750
Text HLabel 7100 3600 0    50   Input ~ 0
~RESET
Wire Wire Line
	7100 3600 7250 3600
Text HLabel 2100 2750 0    50   Input ~ 0
BUS-DATA[0..15]
Wire Bus Line
	2100 2750 3550 2750
Text HLabel 3400 2900 0    50   Input ~ 0
~SCANLINE
Wire Wire Line
	3400 2900 3550 2900
Text HLabel 3400 3000 0    50   Input ~ 0
~BUS-WR
Wire Wire Line
	3400 3000 3550 3000
Text HLabel 6750 4400 2    50   Output ~ 0
LOAD-XPD1
Text HLabel 6750 4500 2    50   Output ~ 0
LOAD-XPD2
Text HLabel 6750 4600 2    50   Output ~ 0
LOAD-XPD3
Text HLabel 6750 4700 2    50   Output ~ 0
LOAD-XPD4
Text HLabel 6750 4000 2    50   Output ~ 0
GFX-CHNL
Text HLabel 6750 4100 2    50   Output ~ 0
GFX-OUT-LMSB
Text HLabel 6750 4200 2    50   Output ~ 0
SERIAL-LOAD
Text HLabel 6750 4300 2    50   Output ~ 0
SERIAL-CHNL
Text HLabel 6750 4950 2    50   Output ~ 0
STARS2-LOAD
Text HLabel 6750 4850 2    50   Output ~ 0
STARS1-LOAD
Text HLabel 6750 5050 2    50   Output ~ 0
SERIAL-LOAD-XPD4
Text HLabel 6750 5150 2    50   Output ~ 0
STARS-SERIAL
Wire Wire Line
	6550 4000 6750 4000
Wire Wire Line
	6550 4100 6750 4100
Wire Wire Line
	6550 4200 6750 4200
Wire Wire Line
	6550 4300 6750 4300
Wire Wire Line
	6550 4400 6750 4400
Wire Wire Line
	6550 4500 6750 4500
Wire Wire Line
	6550 4600 6750 4600
Wire Wire Line
	6550 4700 6750 4700
Wire Wire Line
	6550 4950 6750 4950
Wire Wire Line
	6550 4850 6750 4850
Wire Wire Line
	6550 5050 6750 5050
Wire Wire Line
	6550 5150 6750 5150
Text HLabel 8650 2700 2    50   Output ~ 0
~HBLANK
Text HLabel 8650 2800 2    50   Output ~ 0
~VBLANK
Text HLabel 8650 3050 2    50   Output ~ 0
HSYNC
Text HLabel 8650 3150 2    50   Output ~ 0
VSYNC
Text HLabel 8650 3300 2    50   Output ~ 0
BLANK
Wire Wire Line
	8450 2700 8650 2700
Wire Wire Line
	8450 2800 8650 2800
Wire Wire Line
	8450 3050 8650 3050
Wire Wire Line
	8450 3150 8650 3150
Wire Wire Line
	8650 3300 8450 3300
Wire Bus Line
	5350 2900 4850 2900
Wire Bus Line
	2200 3250 2200 4550
$EndSCHEMATC
