EESchema Schematic File Version 4
EELAYER 30 0
EELAYER END
$Descr A3 16535 11693
encoding utf-8
Sheet 34 83
Title "CPS Reverse Engineering: DL-0311"
Date "2021-09-12"
Rev ""
Comp ""
Comment1 ""
Comment2 ""
Comment3 "Licence: CC-BY"
Comment4 "Author: Loïc *WydD* Petit"
$EndDescr
Connection ~ 7350 3100
Connection ~ 7350 3000
Connection ~ 7350 2800
Connection ~ 7450 3200
Connection ~ 7600 3300
Connection ~ 7250 3700
Connection ~ 7250 3800
Connection ~ 7450 2600
Connection ~ 7600 2700
Connection ~ 7450 2200
Connection ~ 7550 2100
Connection ~ 6900 800 
Connection ~ 3800 4200
Connection ~ 3800 4100
Connection ~ 3800 4000
Connection ~ 5700 4650
Connection ~ 7150 4400
Connection ~ 7150 4100
Connection ~ 6450 4800
Connection ~ 7600 6150
Connection ~ 7450 6250
Connection ~ 6450 5200
Connection ~ 6450 4000
Connection ~ 5700 3850
Connection ~ 5700 3050
Connection ~ 6450 3200
Connection ~ 7600 7350
Connection ~ 7350 7050
Connection ~ 7350 7150
Connection ~ 7450 7250
Connection ~ 7250 7450
Connection ~ 7600 6750
Connection ~ 7250 3400
Connection ~ 7600 4000
Connection ~ 7350 3800
Connection ~ 7450 3900
Connection ~ 6450 6450
Connection ~ 7350 6850
Connection ~ 7450 6650
Connection ~ 7250 7750
Connection ~ 7250 7850
Connection ~ 7450 7950
Connection ~ 7350 7850
Connection ~ 5700 7900
Connection ~ 5700 8700
Connection ~ 6450 8050
Connection ~ 7150 8650
Connection ~ 7150 8150
Connection ~ 6450 7250
Connection ~ 5700 7100
Connection ~ 14100 4300
Connection ~ 11950 8000
Connection ~ 4550 8750
Connection ~ 2350 3850
Connection ~ 4650 4600
Connection ~ 4550 9050
Connection ~ 13350 8950
Connection ~ 12050 7150
Connection ~ 12050 8200
NoConn ~ 7050 2300
NoConn ~ 7050 4700
NoConn ~ 7050 3900
NoConn ~ 7050 3100
NoConn ~ 7050 6350
NoConn ~ 7050 7150
NoConn ~ 7050 8750
NoConn ~ 7050 7950
NoConn ~ 12950 5000
NoConn ~ 12950 4900
NoConn ~ 12950 4600
NoConn ~ 12950 4400
NoConn ~ 12800 7800
Entry Wire Line
	2350 4300 2450 4400
Entry Wire Line
	2350 4800 2450 4900
Entry Wire Line
	2350 5300 2450 5400
Entry Wire Line
	3450 4400 3550 4500
Entry Wire Line
	3450 4500 3550 4600
Entry Wire Line
	3450 4600 3550 4700
Entry Wire Line
	3450 4700 3550 4800
Entry Wire Line
	3450 4900 3550 5000
Entry Wire Line
	3450 5000 3550 5100
Entry Wire Line
	7950 8350 8050 8450
Entry Wire Line
	7950 8450 8050 8550
Entry Wire Line
	7950 8550 8050 8650
Entry Wire Line
	7950 8650 8050 8750
Entry Wire Line
	10950 7800 11050 7900
Entry Wire Line
	11600 6450 11700 6550
Entry Wire Line
	11600 6550 11700 6650
Entry Wire Line
	11600 6650 11700 6750
Entry Wire Line
	11600 6750 11700 6850
Entry Wire Line
	11600 7700 11700 7800
Entry Wire Line
	13250 6550 13350 6650
Entry Wire Line
	13250 6650 13350 6750
Entry Wire Line
	13250 6750 13350 6850
Entry Wire Line
	13250 6850 13350 6950
Entry Wire Line
	13250 7900 13350 8000
Wire Wire Line
	2450 5400 2700 5400
Wire Wire Line
	2700 4400 2450 4400
Wire Wire Line
	2700 4900 2450 4900
Wire Wire Line
	3300 4350 3650 4350
Wire Wire Line
	3300 4400 3300 4350
Wire Wire Line
	3300 4850 3650 4850
Wire Wire Line
	3300 4900 3300 4850
Wire Wire Line
	3300 5400 3700 5400
Wire Wire Line
	3650 4350 3650 4400
Wire Wire Line
	3650 4400 3800 4400
Wire Wire Line
	3650 4850 3650 4900
Wire Wire Line
	3650 4900 3800 4900
Wire Wire Line
	3700 5200 3800 5200
Wire Wire Line
	3700 5400 3700 5200
Wire Wire Line
	3800 4100 3800 4000
Wire Wire Line
	3800 4200 3800 4100
Wire Wire Line
	3800 4300 3800 4200
Wire Wire Line
	3800 4500 3550 4500
Wire Wire Line
	3800 4600 3550 4600
Wire Wire Line
	3800 4700 3550 4700
Wire Wire Line
	3800 4800 3550 4800
Wire Wire Line
	3800 5000 3550 5000
Wire Wire Line
	3800 5100 3550 5100
Wire Wire Line
	4400 4600 4650 4600
Wire Wire Line
	4550 4700 4750 4700
Wire Wire Line
	4550 8750 4550 4700
Wire Wire Line
	4550 8750 4550 9050
Wire Wire Line
	4550 9050 3950 9050
Wire Wire Line
	4550 9050 12050 9050
Wire Wire Line
	4650 4600 4650 8650
Wire Wire Line
	4650 8650 4750 8650
Wire Wire Line
	4750 4600 4650 4600
Wire Wire Line
	4750 8750 4550 8750
Wire Wire Line
	5300 1400 5300 4550
Wire Wire Line
	5300 1400 9400 1400
Wire Wire Line
	5300 4550 5800 4550
Wire Wire Line
	5300 4650 5700 4650
Wire Wire Line
	5300 5450 5300 8600
Wire Wire Line
	5300 5450 9400 5450
Wire Wire Line
	5300 8600 5800 8600
Wire Wire Line
	5300 8700 5700 8700
Wire Wire Line
	5400 1500 5400 3750
Wire Wire Line
	5400 1500 9300 1500
Wire Wire Line
	5400 3750 5800 3750
Wire Wire Line
	5400 5550 5400 7800
Wire Wire Line
	5400 5550 9300 5550
Wire Wire Line
	5400 7800 5800 7800
Wire Wire Line
	5500 1600 5500 2950
Wire Wire Line
	5500 1600 9200 1600
Wire Wire Line
	5500 2950 5800 2950
Wire Wire Line
	5500 5650 5500 7000
Wire Wire Line
	5500 5650 9200 5650
Wire Wire Line
	5500 7000 5800 7000
Wire Wire Line
	5600 1700 9100 1700
Wire Wire Line
	5600 2150 5600 1700
Wire Wire Line
	5600 2150 5800 2150
Wire Wire Line
	5600 5750 9100 5750
Wire Wire Line
	5600 6200 5600 5750
Wire Wire Line
	5600 6200 5800 6200
Wire Wire Line
	5700 2250 5700 3050
Wire Wire Line
	5700 3050 5700 3850
Wire Wire Line
	5700 3850 5700 4650
Wire Wire Line
	5700 4650 5800 4650
Wire Wire Line
	5700 6300 5700 7100
Wire Wire Line
	5700 7100 5700 7900
Wire Wire Line
	5700 7900 5700 8700
Wire Wire Line
	5700 8700 5800 8700
Wire Wire Line
	5800 2250 5700 2250
Wire Wire Line
	5800 3050 5700 3050
Wire Wire Line
	5800 3850 5700 3850
Wire Wire Line
	5800 6300 5700 6300
Wire Wire Line
	5800 7100 5700 7100
Wire Wire Line
	5800 7900 5700 7900
Wire Wire Line
	6100 800  6900 800 
Wire Wire Line
	6350 2200 6550 2200
Wire Wire Line
	6350 3000 6550 3000
Wire Wire Line
	6350 3800 6550 3800
Wire Wire Line
	6350 4600 6550 4600
Wire Wire Line
	6350 6250 6550 6250
Wire Wire Line
	6350 7050 6550 7050
Wire Wire Line
	6350 7850 6550 7850
Wire Wire Line
	6350 8650 6550 8650
Wire Wire Line
	6450 3200 6450 2400
Wire Wire Line
	6450 4000 6450 3200
Wire Wire Line
	6450 4000 6550 4000
Wire Wire Line
	6450 4800 6450 4000
Wire Wire Line
	6450 5200 6450 4800
Wire Wire Line
	6450 6450 6450 5200
Wire Wire Line
	6450 7250 6450 6450
Wire Wire Line
	6450 8050 6450 7250
Wire Wire Line
	6450 8050 6550 8050
Wire Wire Line
	6450 8850 6450 8050
Wire Wire Line
	6550 2400 6450 2400
Wire Wire Line
	6550 3200 6450 3200
Wire Wire Line
	6550 4800 6450 4800
Wire Wire Line
	6550 6450 6450 6450
Wire Wire Line
	6550 7250 6450 7250
Wire Wire Line
	6550 8850 6450 8850
Wire Wire Line
	6900 800  6900 1200
Wire Wire Line
	7050 2200 7450 2200
Wire Wire Line
	7050 3000 7350 3000
Wire Wire Line
	7050 3800 7250 3800
Wire Wire Line
	7050 4600 7150 4600
Wire Wire Line
	7050 6250 7450 6250
Wire Wire Line
	7050 7050 7350 7050
Wire Wire Line
	7050 7850 7250 7850
Wire Wire Line
	7050 8650 7150 8650
Wire Wire Line
	7150 1950 7150 4100
Wire Wire Line
	7150 4100 7150 4400
Wire Wire Line
	7150 4100 8450 4100
Wire Wire Line
	7150 4400 7150 4600
Wire Wire Line
	7150 6000 7150 8150
Wire Wire Line
	7150 8150 7150 8650
Wire Wire Line
	7150 8150 8450 8150
Wire Wire Line
	7150 8650 7950 8650
Wire Wire Line
	7250 1950 7250 3400
Wire Wire Line
	7250 3400 7250 3700
Wire Wire Line
	7250 3400 8450 3400
Wire Wire Line
	7250 3700 7250 3800
Wire Wire Line
	7250 3800 7250 4500
Wire Wire Line
	7250 6000 7250 7450
Wire Wire Line
	7250 7450 7250 7750
Wire Wire Line
	7250 7450 8450 7450
Wire Wire Line
	7250 7750 7250 7850
Wire Wire Line
	7250 7850 7250 8550
Wire Wire Line
	7250 8550 7950 8550
Wire Wire Line
	7350 1950 7350 2800
Wire Wire Line
	7350 2800 7350 3000
Wire Wire Line
	7350 2800 8450 2800
Wire Wire Line
	7350 3000 7350 3100
Wire Wire Line
	7350 3100 7350 3800
Wire Wire Line
	7350 3800 7350 4600
Wire Wire Line
	7350 6000 7350 6850
Wire Wire Line
	7350 6850 7350 7050
Wire Wire Line
	7350 6850 8450 6850
Wire Wire Line
	7350 7050 7350 7150
Wire Wire Line
	7350 7150 7350 7850
Wire Wire Line
	7350 7850 7350 8450
Wire Wire Line
	7350 8450 7950 8450
Wire Wire Line
	7450 1950 7450 2200
Wire Wire Line
	7450 2200 7450 2600
Wire Wire Line
	7450 2600 7450 3200
Wire Wire Line
	7450 3200 7450 3900
Wire Wire Line
	7450 3900 7450 4700
Wire Wire Line
	7450 6000 7450 6250
Wire Wire Line
	7450 6250 7450 6650
Wire Wire Line
	7450 6650 7450 7250
Wire Wire Line
	7450 7250 7450 7950
Wire Wire Line
	7450 7950 7450 8350
Wire Wire Line
	7450 8350 7950 8350
Wire Wire Line
	7500 1200 7600 1200
Wire Wire Line
	7550 800  6900 800 
Wire Wire Line
	7550 800  7550 2100
Wire Wire Line
	7550 2100 7550 4900
Wire Wire Line
	7550 2100 8450 2100
Wire Wire Line
	7550 4900 8450 4900
Wire Wire Line
	7600 1200 7600 2700
Wire Wire Line
	7600 2700 7600 3300
Wire Wire Line
	7600 2700 7700 2700
Wire Wire Line
	7600 3300 7600 4000
Wire Wire Line
	7600 3300 7700 3300
Wire Wire Line
	7600 4000 7600 4800
Wire Wire Line
	7600 4000 7700 4000
Wire Wire Line
	7600 4800 7700 4800
Wire Wire Line
	7600 5100 7600 6150
Wire Wire Line
	7600 5100 9000 5100
Wire Wire Line
	7600 6150 8450 6150
Wire Wire Line
	7600 6750 7600 6150
Wire Wire Line
	7600 6750 7600 7350
Wire Wire Line
	7600 6750 7700 6750
Wire Wire Line
	7600 7350 7600 8050
Wire Wire Line
	7600 7350 7700 7350
Wire Wire Line
	7600 8050 7700 8050
Wire Wire Line
	7700 2600 7450 2600
Wire Wire Line
	7700 3100 7350 3100
Wire Wire Line
	7700 3200 7450 3200
Wire Wire Line
	7700 3700 7250 3700
Wire Wire Line
	7700 3800 7350 3800
Wire Wire Line
	7700 3900 7450 3900
Wire Wire Line
	7700 4400 7150 4400
Wire Wire Line
	7700 4500 7250 4500
Wire Wire Line
	7700 4600 7350 4600
Wire Wire Line
	7700 4700 7450 4700
Wire Wire Line
	7700 6650 7450 6650
Wire Wire Line
	7700 7150 7350 7150
Wire Wire Line
	7700 7250 7450 7250
Wire Wire Line
	7700 7750 7250 7750
Wire Wire Line
	7700 7850 7350 7850
Wire Wire Line
	7700 7950 7450 7950
Wire Wire Line
	8250 2650 8250 2700
Wire Wire Line
	8250 2700 8450 2700
Wire Wire Line
	8250 6700 8250 6750
Wire Wire Line
	8250 6750 8450 6750
Wire Wire Line
	8300 3300 8300 3200
Wire Wire Line
	8300 4000 8300 3850
Wire Wire Line
	8300 7350 8300 7250
Wire Wire Line
	8300 8050 8300 7900
Wire Wire Line
	8450 2200 7450 2200
Wire Wire Line
	8450 3300 8300 3300
Wire Wire Line
	8450 4000 8300 4000
Wire Wire Line
	8450 4800 8450 4600
Wire Wire Line
	8450 6250 7450 6250
Wire Wire Line
	8450 7350 8300 7350
Wire Wire Line
	8450 8050 8300 8050
Wire Wire Line
	9000 2750 9200 2750
Wire Wire Line
	9000 3350 9300 3350
Wire Wire Line
	9000 4050 9400 4050
Wire Wire Line
	9000 5100 9000 4850
Wire Wire Line
	9000 6800 9200 6800
Wire Wire Line
	9000 7400 9300 7400
Wire Wire Line
	9000 8100 9400 8100
Wire Wire Line
	9100 1700 9100 2150
Wire Wire Line
	9100 2150 9000 2150
Wire Wire Line
	9100 5750 9100 6200
Wire Wire Line
	9100 6200 9000 6200
Wire Wire Line
	9200 2750 9200 1600
Wire Wire Line
	9200 6800 9200 5650
Wire Wire Line
	9300 3350 9300 1500
Wire Wire Line
	9300 7400 9300 5550
Wire Wire Line
	9400 1400 9400 4050
Wire Wire Line
	9400 5450 9400 8100
Wire Wire Line
	10900 8100 11400 8100
Wire Wire Line
	11050 7900 11400 7900
Wire Wire Line
	11300 3700 11300 4450
Wire Wire Line
	11300 3700 13250 3700
Wire Wire Line
	11300 4900 12150 4900
Wire Wire Line
	11850 3800 11850 4400
Wire Wire Line
	11850 3800 13150 3800
Wire Wire Line
	11850 4400 12150 4400
Wire Wire Line
	11850 4500 12150 4500
Wire Wire Line
	11950 3900 11950 4300
Wire Wire Line
	11950 3900 13050 3900
Wire Wire Line
	11950 4300 12150 4300
Wire Wire Line
	11950 7050 11950 8000
Wire Wire Line
	11950 7050 12150 7050
Wire Wire Line
	11950 8000 12300 8000
Wire Wire Line
	12050 5000 12050 7150
Wire Wire Line
	12050 5000 12150 5000
Wire Wire Line
	12050 7150 12050 8200
Wire Wire Line
	12050 8200 12550 8200
Wire Wire Line
	12050 9050 12050 8200
Wire Wire Line
	12150 6550 11700 6550
Wire Wire Line
	12150 6650 11700 6650
Wire Wire Line
	12150 6750 11700 6750
Wire Wire Line
	12150 6850 11700 6850
Wire Wire Line
	12150 7150 12050 7150
Wire Wire Line
	12300 7800 11700 7800
Wire Wire Line
	12800 7900 13250 7900
Wire Wire Line
	12950 4300 13500 4300
Wire Wire Line
	12950 4500 13050 4500
Wire Wire Line
	12950 4700 13150 4700
Wire Wire Line
	12950 4800 13250 4800
Wire Wire Line
	12950 6550 13250 6550
Wire Wire Line
	12950 6650 13250 6650
Wire Wire Line
	12950 6750 13250 6750
Wire Wire Line
	12950 6850 13250 6850
Wire Wire Line
	13050 4500 13050 3900
Wire Wire Line
	13150 4700 13150 3800
Wire Wire Line
	13250 4800 13250 3700
Wire Wire Line
	14100 4800 14100 4300
Wire Wire Line
	14700 4300 14100 4300
Wire Bus Line
	2350 3850 2250 3850
Wire Bus Line
	2350 3850 3450 3850
Wire Bus Line
	8050 8950 13350 8950
Wire Bus Line
	10850 7800 10950 7800
Wire Bus Line
	11600 6300 11450 6300
Wire Bus Line
	13350 8950 13500 8950
Text Notes 3900 5500 0    50   ~ 0
0b011110110\nLINE = 246
Text Notes 8450 8550 0    50   ~ 0
IGNORED
Text Label 2700 4400 2    50   ~ 0
LINE8
Text Label 2700 4900 2    50   ~ 0
LINE3
Text Label 2700 5400 2    50   ~ 0
LINE0
Text Label 3800 4500 2    50   ~ 0
LINE7
Text Label 3800 4600 2    50   ~ 0
LINE6
Text Label 3800 4700 2    50   ~ 0
LINE5
Text Label 3800 4800 2    50   ~ 0
LINE4
Text Label 3800 5000 2    50   ~ 0
LINE2
Text Label 3800 5100 2    50   ~ 0
LINE1
Text Label 7900 8350 2    50   ~ 0
~D9
Text Label 7900 8450 2    50   ~ 0
~D10
Text Label 7900 8550 2    50   ~ 0
~D11
Text Label 7900 8650 2    50   ~ 0
~D12
Text Label 11100 7900 0    50   ~ 0
COL1
Text Label 11700 6550 0    50   ~ 0
_CB3
Text Label 11700 6650 0    50   ~ 0
_CB2
Text Label 11700 6750 0    50   ~ 0
_CB1
Text Label 11700 6850 0    50   ~ 0
_CB0
Text Label 11700 7800 0    50   ~ 0
_CB4
Text Label 13200 6550 2    50   ~ 0
~D7
Text Label 13200 6650 2    50   ~ 0
~D6
Text Label 13200 6750 2    50   ~ 0
~D5
Text Label 13200 6850 2    50   ~ 0
~D4
Text Label 13200 7900 2    50   ~ 0
~D8
Text HLabel 2250 3850 0    50   Input ~ 0
LINE[0..8]
Text HLabel 3350 9050 0    50   Input ~ 0
MAIN-RESET
Text HLabel 5850 5200 0    50   Input ~ 0
CLK4M
Text HLabel 6100 800  0    50   Input ~ 0
OBJUP
Text HLabel 10300 8100 0    50   Input ~ 0
~SPRITE-T
Text HLabel 10850 7800 0    50   Input ~ 0
COL[1..1]
Text HLabel 11300 4550 0    50   Input ~ 0
SCAN-243
Text HLabel 11300 4900 0    50   Input ~ 0
~CLK8M
Text HLabel 11400 8000 0    50   Input ~ 0
CLK4M
Text HLabel 11450 6300 0    50   Input ~ 0
_CB[0..4]
Text HLabel 13500 8950 2    50   Output ~ 0
~D[4..12]
Text HLabel 14700 4300 2    50   Output ~ 0
FRAME
Text HLabel 14700 4800 2    50   Output ~ 0
~FRAME
$Comp
L power:VCC #PWR0235
U 1 1 629ED4DF
P 3800 4000
F 0 "#PWR0235" H 3800 3850 50  0001 C CNN
F 1 "VCC" H 3815 4173 50  0000 C CNN
F 2 "" H 3800 4000 50  0001 C CNN
F 3 "" H 3800 4000 50  0001 C CNN
	1    3800 4000
	1    0    0    -1  
$EndComp
$Comp
L power:GND #PWR0246
U 1 1 61118E62
P 12150 4600
F 0 "#PWR0246" H 12150 4350 50  0001 C CNN
F 1 "GND" H 12155 4427 50  0001 C CNN
F 2 "" H 12150 4600 50  0001 C CNN
F 3 "" H 12150 4600 50  0001 C CNN
	1    12150 4600
	1    0    0    -1  
$EndComp
$Comp
L A5C:AND02 UDD78
U 1 1 62475C68
P 5000 4650
F 0 "UDD78" H 5025 4917 50  0000 C CNN
F 1 "AND02" H 5025 4826 50  0000 C CNN
F 2 "" H 5000 4650 50  0001 C CNN
F 3 "" H 5000 4650 50  0001 C CNN
	1    5000 4650
	1    0    0    -1  
$EndComp
$Comp
L A5C:AND02 UDD76
U 1 1 623F3462
P 5000 8700
F 0 "UDD76" H 5025 8967 50  0000 C CNN
F 1 "AND02" H 5025 8876 50  0000 C CNN
F 2 "" H 5000 8700 50  0001 C CNN
F 3 "" H 5000 8700 50  0001 C CNN
	1    5000 8700
	1    0    0    -1  
$EndComp
$Comp
L A5C:NAND02 UBB?
U 1 1 61CDE8F5
P 6050 2200
AR Path="/60F602ED/61CDE8F5" Ref="UBB?"  Part="1" 
AR Path="/613100A2/61CDE8F5" Ref="UDB56"  Part="1" 
AR Path="/613100A2/6125387A/61CDE8F5" Ref="UDB56"  Part="1" 
F 0 "UDB56" H 6075 2467 50  0000 C CNN
F 1 "NAND02" H 6075 2376 50  0000 C CNN
F 2 "" H 6050 2200 50  0001 C CNN
F 3 "" H 6050 2200 50  0001 C CNN
	1    6050 2200
	1    0    0    -1  
$EndComp
$Comp
L A5C:NAND02 UBB?
U 1 1 61CDE8FB
P 6050 3000
AR Path="/60F602ED/61CDE8FB" Ref="UBB?"  Part="1" 
AR Path="/613100A2/61CDE8FB" Ref="UDB18"  Part="1" 
AR Path="/613100A2/6125387A/61CDE8FB" Ref="UDB18"  Part="1" 
F 0 "UDB18" H 6075 3267 50  0000 C CNN
F 1 "NAND02" H 6075 3176 50  0000 C CNN
F 2 "" H 6050 3000 50  0001 C CNN
F 3 "" H 6050 3000 50  0001 C CNN
	1    6050 3000
	1    0    0    -1  
$EndComp
$Comp
L A5C:NAND02 UBB?
U 1 1 61CDE901
P 6050 3800
AR Path="/60F602ED/61CDE901" Ref="UBB?"  Part="1" 
AR Path="/613100A2/61CDE901" Ref="UDB32"  Part="1" 
AR Path="/613100A2/6125387A/61CDE901" Ref="UDB32"  Part="1" 
F 0 "UDB32" H 6075 4067 50  0000 C CNN
F 1 "NAND02" H 6075 3976 50  0000 C CNN
F 2 "" H 6050 3800 50  0001 C CNN
F 3 "" H 6050 3800 50  0001 C CNN
	1    6050 3800
	1    0    0    -1  
$EndComp
$Comp
L A5C:NAND02 UBB?
U 1 1 61CDE907
P 6050 4600
AR Path="/60F602ED/61CDE907" Ref="UBB?"  Part="1" 
AR Path="/613100A2/61CDE907" Ref="UDC72"  Part="1" 
AR Path="/613100A2/6125387A/61CDE907" Ref="UDC72"  Part="1" 
F 0 "UDC72" H 6075 4867 50  0000 C CNN
F 1 "NAND02" H 6075 4776 50  0000 C CNN
F 2 "" H 6050 4600 50  0001 C CNN
F 3 "" H 6050 4600 50  0001 C CNN
	1    6050 4600
	1    0    0    -1  
$EndComp
$Comp
L A5C:NAND02 UDB?
U 1 1 61F65DC5
P 6050 6250
AR Path="/60F602ED/61F65DC5" Ref="UDB?"  Part="1" 
AR Path="/613100A2/61F65DC5" Ref="UDE74"  Part="1" 
AR Path="/613100A2/6125387A/61F65DC5" Ref="UDE74"  Part="1" 
F 0 "UDE74" H 6075 6517 50  0000 C CNN
F 1 "NAND02" H 6075 6426 50  0000 C CNN
F 2 "" H 6050 6250 50  0001 C CNN
F 3 "" H 6050 6250 50  0001 C CNN
	1    6050 6250
	1    0    0    -1  
$EndComp
$Comp
L A5C:NAND02 UDB?
U 1 1 61F65DCB
P 6050 7050
AR Path="/60F602ED/61F65DCB" Ref="UDB?"  Part="1" 
AR Path="/613100A2/61F65DCB" Ref="UDC34"  Part="1" 
AR Path="/613100A2/6125387A/61F65DCB" Ref="UDC34"  Part="1" 
F 0 "UDC34" H 6075 7317 50  0000 C CNN
F 1 "NAND02" H 6075 7226 50  0000 C CNN
F 2 "" H 6050 7050 50  0001 C CNN
F 3 "" H 6050 7050 50  0001 C CNN
	1    6050 7050
	1    0    0    -1  
$EndComp
$Comp
L A5C:NAND02 UDB?
U 1 1 61F65DD1
P 6050 7850
AR Path="/60F602ED/61F65DD1" Ref="UDB?"  Part="1" 
AR Path="/613100A2/61F65DD1" Ref="UDD67"  Part="1" 
AR Path="/613100A2/6125387A/61F65DD1" Ref="UDD67"  Part="1" 
F 0 "UDD67" H 6075 8117 50  0000 C CNN
F 1 "NAND02" H 6075 8026 50  0000 C CNN
F 2 "" H 6050 7850 50  0001 C CNN
F 3 "" H 6050 7850 50  0001 C CNN
	1    6050 7850
	1    0    0    -1  
$EndComp
$Comp
L A5C:NAND02 UDC?
U 1 1 61F65DD7
P 6050 8650
AR Path="/60F602ED/61F65DD7" Ref="UDC?"  Part="1" 
AR Path="/613100A2/61F65DD7" Ref="UDD26"  Part="1" 
AR Path="/613100A2/6125387A/61F65DD7" Ref="UDD26"  Part="1" 
F 0 "UDD26" H 6075 8917 50  0000 C CNN
F 1 "NAND02" H 6075 8826 50  0000 C CNN
F 2 "" H 6050 8650 50  0001 C CNN
F 3 "" H 6050 8650 50  0001 C CNN
	1    6050 8650
	1    0    0    -1  
$EndComp
$Comp
L A5C:NOR02 UBB?
U 1 1 61CDE90D
P 7950 2650
AR Path="/60F602ED/61CDE90D" Ref="UBB?"  Part="1" 
AR Path="/613100A2/61CDE90D" Ref="UDB30"  Part="1" 
AR Path="/613100A2/6125387A/61CDE90D" Ref="UDB30"  Part="1" 
F 0 "UDB30" H 7975 2917 50  0000 C CNN
F 1 "NOR02" H 7975 2826 50  0000 C CNN
F 2 "" H 7950 2650 50  0001 C CNN
F 3 "" H 7950 2650 50  0001 C CNN
	1    7950 2650
	1    0    0    -1  
$EndComp
$Comp
L A5C:NOR02 UDB?
U 1 1 61F65DDD
P 7950 6700
AR Path="/60F602ED/61F65DDD" Ref="UDB?"  Part="1" 
AR Path="/613100A2/61F65DDD" Ref="UDD28"  Part="1" 
AR Path="/613100A2/6125387A/61F65DDD" Ref="UDD28"  Part="1" 
F 0 "UDD28" H 7975 6967 50  0000 C CNN
F 1 "NOR02" H 7975 6876 50  0000 C CNN
F 2 "" H 7950 6700 50  0001 C CNN
F 3 "" H 7950 6700 50  0001 C CNN
	1    7950 6700
	1    0    0    -1  
$EndComp
$Comp
L A5C:XNOR02 UBB?
U 1 1 61CDE913
P 8700 2150
AR Path="/60F602ED/61CDE913" Ref="UBB?"  Part="1" 
AR Path="/613100A2/61CDE913" Ref="UDB53"  Part="1" 
AR Path="/613100A2/6125387A/61CDE913" Ref="UDB53"  Part="1" 
F 0 "UDB53" H 8725 2417 50  0000 C CNN
F 1 "XNOR02" H 8725 2326 50  0000 C CNN
F 2 "" H 8725 2150 50  0001 C CNN
F 3 "" H 8725 2150 50  0001 C CNN
	1    8700 2150
	1    0    0    -1  
$EndComp
$Comp
L A5C:XNOR02 UBB?
U 1 1 61CDE919
P 8700 2750
AR Path="/60F602ED/61CDE919" Ref="UBB?"  Part="1" 
AR Path="/613100A2/61CDE919" Ref="UDB23"  Part="1" 
AR Path="/613100A2/6125387A/61CDE919" Ref="UDB23"  Part="1" 
F 0 "UDB23" H 8725 3017 50  0000 C CNN
F 1 "XNOR02" H 8725 2926 50  0000 C CNN
F 2 "" H 8725 2750 50  0001 C CNN
F 3 "" H 8725 2750 50  0001 C CNN
	1    8700 2750
	1    0    0    -1  
$EndComp
$Comp
L A5C:XNOR02 UBB?
U 1 1 61CDE91F
P 8700 3350
AR Path="/60F602ED/61CDE91F" Ref="UBB?"  Part="1" 
AR Path="/613100A2/61CDE91F" Ref="UDA33"  Part="1" 
AR Path="/613100A2/6125387A/61CDE91F" Ref="UDA33"  Part="1" 
F 0 "UDA33" H 8725 3617 50  0000 C CNN
F 1 "XNOR02" H 8725 3526 50  0000 C CNN
F 2 "" H 8725 3350 50  0001 C CNN
F 3 "" H 8725 3350 50  0001 C CNN
	1    8700 3350
	1    0    0    -1  
$EndComp
$Comp
L A5C:XNOR02 UBB?
U 1 1 61CDE925
P 8700 4050
AR Path="/60F602ED/61CDE925" Ref="UBB?"  Part="1" 
AR Path="/613100A2/61CDE925" Ref="UDC39"  Part="1" 
AR Path="/613100A2/6125387A/61CDE925" Ref="UDC39"  Part="1" 
F 0 "UDC39" H 8725 4317 50  0000 C CNN
F 1 "XNOR02" H 8725 4226 50  0000 C CNN
F 2 "" H 8725 4050 50  0001 C CNN
F 3 "" H 8725 4050 50  0001 C CNN
	1    8700 4050
	1    0    0    -1  
$EndComp
$Comp
L A5C:NAND02 UBB?
U 1 1 61E0AE20
P 8700 4850
AR Path="/60F602ED/61E0AE20" Ref="UBB?"  Part="1" 
AR Path="/613100A2/61E0AE20" Ref="UDB41"  Part="1" 
AR Path="/613100A2/6125387A/61E0AE20" Ref="UDB41"  Part="1" 
F 0 "UDB41" H 8725 5117 50  0000 C CNN
F 1 "NAND02" H 8725 5026 50  0000 C CNN
F 2 "" H 8700 4850 50  0001 C CNN
F 3 "" H 8700 4850 50  0001 C CNN
	1    8700 4850
	1    0    0    -1  
$EndComp
$Comp
L A5C:XOR02 UDE71
U 1 1 620F728C
P 8700 6200
F 0 "UDE71" H 8725 6467 50  0000 C CNN
F 1 "XOR02" H 8725 6376 50  0000 C CNN
F 2 "" H 8700 6200 50  0001 C CNN
F 3 "" H 8700 6200 50  0001 C CNN
	1    8700 6200
	1    0    0    -1  
$EndComp
$Comp
L A5C:XNOR02 UDB?
U 1 1 61F65DE9
P 8700 6800
AR Path="/60F602ED/61F65DE9" Ref="UDB?"  Part="1" 
AR Path="/613100A2/61F65DE9" Ref="UDC36"  Part="1" 
AR Path="/613100A2/6125387A/61F65DE9" Ref="UDC36"  Part="1" 
F 0 "UDC36" H 8725 7067 50  0000 C CNN
F 1 "XNOR02" H 8725 6976 50  0000 C CNN
F 2 "" H 8725 6800 50  0001 C CNN
F 3 "" H 8725 6800 50  0001 C CNN
	1    8700 6800
	1    0    0    -1  
$EndComp
$Comp
L A5C:XNOR02 UDA?
U 1 1 61F65DEF
P 8700 7400
AR Path="/60F602ED/61F65DEF" Ref="UDA?"  Part="1" 
AR Path="/613100A2/61F65DEF" Ref="UDD64"  Part="1" 
AR Path="/613100A2/6125387A/61F65DEF" Ref="UDD64"  Part="1" 
F 0 "UDD64" H 8725 7667 50  0000 C CNN
F 1 "XNOR02" H 8725 7576 50  0000 C CNN
F 2 "" H 8725 7400 50  0001 C CNN
F 3 "" H 8725 7400 50  0001 C CNN
	1    8700 7400
	1    0    0    -1  
$EndComp
$Comp
L A5C:XNOR02 UDC?
U 1 1 61F65DF5
P 8700 8100
AR Path="/60F602ED/61F65DF5" Ref="UDC?"  Part="1" 
AR Path="/613100A2/61F65DF5" Ref="UDD6"  Part="1" 
AR Path="/613100A2/6125387A/61F65DF5" Ref="UDD6"  Part="1" 
F 0 "UDD6" H 8725 8367 50  0000 C CNN
F 1 "XNOR02" H 8725 8276 50  0000 C CNN
F 2 "" H 8725 8100 50  0001 C CNN
F 3 "" H 8725 8100 50  0001 C CNN
	1    8700 8100
	1    0    0    -1  
$EndComp
$Comp
L A5C:XNOR02 UDE?
U 1 1 61118E63
P 11550 4500
AR Path="/61118E63" Ref="UDE?"  Part="1" 
AR Path="/613100A2/61118E63" Ref="UDD128"  Part="1" 
AR Path="/613100A2/6125387A/61118E63" Ref="UDD128"  Part="1" 
F 0 "UDD128" H 11575 4767 50  0000 C CNN
F 1 "XNOR02" H 11575 4676 50  0000 C CNN
F 2 "" H 11575 4500 50  0001 C CNN
F 3 "" H 11575 4500 50  0001 C CNN
	1    11550 4500
	1    0    0    -1  
$EndComp
$Comp
L A5C:NAND03 UDL123
U 1 1 61E219C7
P 11650 8000
F 0 "UDL123" H 11675 8292 50  0000 C CNN
F 1 "NAND03" H 11675 8201 50  0000 C CNN
F 2 "" H 11650 8000 50  0001 C CNN
F 3 "" H 11650 8000 50  0001 C CNN
	1    11650 8000
	1    0    0    1   
$EndComp
$Comp
L A5C:INV01 UDJ102
U 1 1 629EE6BF
P 3000 4400
F 0 "UDJ102" H 3000 4717 50  0000 C CNN
F 1 "INV01" H 3000 4626 50  0000 C CNN
F 2 "" H 3000 4200 50  0001 C CNN
F 3 "" H 3000 4200 50  0001 C CNN
	1    3000 4400
	1    0    0    -1  
$EndComp
$Comp
L A5C:INV01 UDI130
U 1 1 62C9AA50
P 3000 4900
F 0 "UDI130" H 3000 5217 50  0000 C CNN
F 1 "INV01" H 3000 5126 50  0000 C CNN
F 2 "" H 3000 4700 50  0001 C CNN
F 3 "" H 3000 4700 50  0001 C CNN
	1    3000 4900
	1    0    0    -1  
$EndComp
$Comp
L A5C:INV01 UDJ64
U 1 1 62D56C3D
P 3000 5400
F 0 "UDJ64" H 3000 5717 50  0000 C CNN
F 1 "INV01" H 3000 5626 50  0000 C CNN
F 2 "" H 3000 5200 50  0001 C CNN
F 3 "" H 3000 5200 50  0001 C CNN
	1    3000 5400
	1    0    0    -1  
$EndComp
$Comp
L A5C:INV01 UDA?
U 1 1 78774953
P 3650 9050
AR Path="/78774953" Ref="UDA?"  Part="1" 
AR Path="/613100A2/78774953" Ref="UDA79"  Part="1" 
AR Path="/613100A2/6125387A/78774953" Ref="UDA79"  Part="1" 
F 0 "UDA79" H 3650 9367 50  0000 C CNN
F 1 "INV01" H 3650 9276 50  0000 C CNN
F 2 "" H 3650 8850 50  0001 C CNN
F 3 "" H 3650 8850 50  0001 C CNN
	1    3650 9050
	1    0    0    -1  
$EndComp
$Comp
L A5C:NBUF02 UDA78
U 1 1 61118E5F
P 6150 5200
F 0 "UDA78" H 6150 5517 50  0000 C CNN
F 1 "NBUF02" H 6150 5426 50  0000 C CNN
F 2 "" H 6150 5000 50  0001 C CNN
F 3 "" H 6150 5000 50  0001 C CNN
	1    6150 5200
	1    0    0    -1  
$EndComp
$Comp
L A5C:INV01 UBD?
U 1 1 61CDE92B
P 7200 1200
AR Path="/60F602ED/61CDE92B" Ref="UBD?"  Part="1" 
AR Path="/613100A2/61CDE92B" Ref="UDB33"  Part="1" 
AR Path="/613100A2/6125387A/61CDE92B" Ref="UDB33"  Part="1" 
F 0 "UDB33" H 7200 1517 50  0000 C CNN
F 1 "INV01" H 7200 1426 50  0000 C CNN
F 2 "" H 7200 1000 50  0001 C CNN
F 3 "" H 7200 1000 50  0001 C CNN
	1    7200 1200
	1    0    0    -1  
$EndComp
$Comp
L A5C:NOR03 UBB?
U 1 1 61CDE931
P 8000 3200
AR Path="/60F602ED/61CDE931" Ref="UBB?"  Part="1" 
AR Path="/613100A2/61CDE931" Ref="UDA31"  Part="1" 
AR Path="/613100A2/6125387A/61CDE931" Ref="UDA31"  Part="1" 
F 0 "UDA31" H 8000 3517 50  0000 C CNN
F 1 "NOR03" H 8000 3426 50  0000 C CNN
F 2 "" H 8000 3200 50  0001 C CNN
F 3 "" H 8000 3200 50  0001 C CNN
	1    8000 3200
	1    0    0    -1  
$EndComp
$Comp
L A5C:NOR03 UDA?
U 1 1 61F65E01
P 8000 7250
AR Path="/60F602ED/61F65E01" Ref="UDA?"  Part="1" 
AR Path="/613100A2/61F65E01" Ref="UDD30"  Part="1" 
AR Path="/613100A2/6125387A/61F65E01" Ref="UDD30"  Part="1" 
F 0 "UDD30" H 8000 7567 50  0000 C CNN
F 1 "NOR03" H 8000 7476 50  0000 C CNN
F 2 "" H 8000 7250 50  0001 C CNN
F 3 "" H 8000 7250 50  0001 C CNN
	1    8000 7250
	1    0    0    -1  
$EndComp
$Comp
L A5C:INV01 UDL125
U 1 1 61E5785D
P 10600 8100
F 0 "UDL125" H 10600 8417 50  0000 C CNN
F 1 "INV01" H 10600 8326 50  0000 C CNN
F 2 "" H 10600 7900 50  0001 C CNN
F 3 "" H 10600 7900 50  0001 C CNN
	1    10600 8100
	1    0    0    1   
$EndComp
$Comp
L A5C:BUF12 UDG?
U 1 1 7480BCC1
P 13800 4300
AR Path="/7480BCC1" Ref="UDG?"  Part="1" 
AR Path="/613100A2/7480BCC1" Ref="UDG102"  Part="1" 
AR Path="/613100A2/6125387A/7480BCC1" Ref="UDG102"  Part="1" 
F 0 "UDG102" H 13800 4617 50  0000 C CNN
F 1 "BUF12" H 13800 4526 50  0000 C CNN
F 2 "" H 13800 4300 50  0001 C CNN
F 3 "" H 13800 4300 50  0001 C CNN
	1    13800 4300
	1    0    0    -1  
$EndComp
$Comp
L A5C:INV01 UDK76
U 1 1 6C963E96
P 14400 4800
F 0 "UDK76" H 14400 5117 50  0000 C CNN
F 1 "INV01" H 14400 5026 50  0000 C CNN
F 2 "" H 14400 4600 50  0001 C CNN
F 3 "" H 14400 4600 50  0001 C CNN
	1    14400 4800
	1    0    0    -1  
$EndComp
$Comp
L A5C:DFFCOO UBE?
U 1 1 61CDE937
P 6800 2300
AR Path="/60F602ED/61CDE937" Ref="UBE?"  Part="1" 
AR Path="/613100A2/61CDE937" Ref="UDB58"  Part="1" 
AR Path="/613100A2/6125387A/61CDE937" Ref="UDB58"  Part="1" 
F 0 "UDB58" H 6800 2665 50  0000 C CNN
F 1 "DFFCOO" H 6800 2574 50  0000 C CNN
F 2 "" H 6800 2300 50  0001 C CNN
F 3 "" H 6800 2300 50  0001 C CNN
	1    6800 2300
	1    0    0    -1  
$EndComp
$Comp
L A5C:DFFCOO UBE?
U 1 1 61CDE93D
P 6800 3100
AR Path="/60F602ED/61CDE93D" Ref="UBE?"  Part="1" 
AR Path="/613100A2/61CDE93D" Ref="UDA6"  Part="1" 
AR Path="/613100A2/6125387A/61CDE93D" Ref="UDA6"  Part="1" 
F 0 "UDA6" H 6800 3465 50  0000 C CNN
F 1 "DFFCOO" H 6800 3374 50  0000 C CNN
F 2 "" H 6800 3100 50  0001 C CNN
F 3 "" H 6800 3100 50  0001 C CNN
	1    6800 3100
	1    0    0    -1  
$EndComp
$Comp
L A5C:DFFCOO UBC?
U 1 1 61CDE943
P 6800 3900
AR Path="/60F602ED/61CDE943" Ref="UBC?"  Part="1" 
AR Path="/613100A2/61CDE943" Ref="UDB25"  Part="1" 
AR Path="/613100A2/6125387A/61CDE943" Ref="UDB25"  Part="1" 
F 0 "UDB25" H 6800 4265 50  0000 C CNN
F 1 "DFFCOO" H 6800 4174 50  0000 C CNN
F 2 "" H 6800 3900 50  0001 C CNN
F 3 "" H 6800 3900 50  0001 C CNN
	1    6800 3900
	1    0    0    -1  
$EndComp
$Comp
L A5C:DFFCOO UBD?
U 1 1 61CDE949
P 6800 4700
AR Path="/60F602ED/61CDE949" Ref="UBD?"  Part="1" 
AR Path="/613100A2/61CDE949" Ref="UDC73"  Part="1" 
AR Path="/613100A2/6125387A/61CDE949" Ref="UDC73"  Part="1" 
F 0 "UDC73" H 6800 5065 50  0000 C CNN
F 1 "DFFCOO" H 6800 4974 50  0000 C CNN
F 2 "" H 6800 4700 50  0001 C CNN
F 3 "" H 6800 4700 50  0001 C CNN
	1    6800 4700
	1    0    0    -1  
$EndComp
$Comp
L A5C:DFFCOO UDB?
U 1 1 61F65E07
P 6800 6350
AR Path="/60F602ED/61F65E07" Ref="UDB?"  Part="1" 
AR Path="/613100A2/61F65E07" Ref="UDC65"  Part="1" 
AR Path="/613100A2/6125387A/61F65E07" Ref="UDC65"  Part="1" 
F 0 "UDC65" H 6800 6715 50  0000 C CNN
F 1 "DFFCOO" H 6800 6624 50  0000 C CNN
F 2 "" H 6800 6350 50  0001 C CNN
F 3 "" H 6800 6350 50  0001 C CNN
	1    6800 6350
	1    0    0    -1  
$EndComp
$Comp
L A5C:DFFCOO UDA?
U 1 1 61F65E0D
P 6800 7150
AR Path="/60F602ED/61F65E0D" Ref="UDA?"  Part="1" 
AR Path="/613100A2/61F65E0D" Ref="UDC30"  Part="1" 
AR Path="/613100A2/6125387A/61F65E0D" Ref="UDC30"  Part="1" 
F 0 "UDC30" H 6800 7515 50  0000 C CNN
F 1 "DFFCOO" H 6800 7424 50  0000 C CNN
F 2 "" H 6800 7150 50  0001 C CNN
F 3 "" H 6800 7150 50  0001 C CNN
	1    6800 7150
	1    0    0    -1  
$EndComp
$Comp
L A5C:DFFCOO UDB?
U 1 1 61F65E13
P 6800 7950
AR Path="/60F602ED/61F65E13" Ref="UDB?"  Part="1" 
AR Path="/613100A2/61F65E13" Ref="UDD71"  Part="1" 
AR Path="/613100A2/6125387A/61F65E13" Ref="UDD71"  Part="1" 
F 0 "UDD71" H 6800 8315 50  0000 C CNN
F 1 "DFFCOO" H 6800 8224 50  0000 C CNN
F 2 "" H 6800 7950 50  0001 C CNN
F 3 "" H 6800 7950 50  0001 C CNN
	1    6800 7950
	1    0    0    -1  
$EndComp
$Comp
L A5C:DFFCOO UDC?
U 1 1 61F65E19
P 6800 8750
AR Path="/60F602ED/61F65E19" Ref="UDC?"  Part="1" 
AR Path="/613100A2/61F65E19" Ref="UDD33"  Part="1" 
AR Path="/613100A2/6125387A/61F65E19" Ref="UDD33"  Part="1" 
F 0 "UDD33" H 6800 9115 50  0000 C CNN
F 1 "DFFCOO" H 6800 9024 50  0000 C CNN
F 2 "" H 6800 8750 50  0001 C CNN
F 3 "" H 6800 8750 50  0001 C CNN
	1    6800 8750
	1    0    0    -1  
$EndComp
$Comp
L A5C:NOR04 UBB?
U 1 1 61CDE94F
P 8000 3850
AR Path="/60F602ED/61CDE94F" Ref="UBB?"  Part="1" 
AR Path="/613100A2/61CDE94F" Ref="UDB34"  Part="1" 
AR Path="/613100A2/6125387A/61CDE94F" Ref="UDB34"  Part="1" 
F 0 "UDB34" H 8000 4192 50  0000 C CNN
F 1 "NOR04" H 8000 4101 50  0000 C CNN
F 2 "" H 8000 3850 50  0001 C CNN
F 3 "" H 8000 3850 50  0001 C CNN
	1    8000 3850
	1    0    0    -1  
$EndComp
$Comp
L A5C:NOR04 UDB?
U 1 1 61F65E1F
P 8000 7900
AR Path="/60F602ED/61F65E1F" Ref="UDB?"  Part="1" 
AR Path="/613100A2/61F65E1F" Ref="UDD23"  Part="1" 
AR Path="/613100A2/6125387A/61F65E1F" Ref="UDD23"  Part="1" 
F 0 "UDD23" H 8000 8242 50  0000 C CNN
F 1 "NOR04" H 8000 8151 50  0000 C CNN
F 2 "" H 8000 7900 50  0001 C CNN
F 3 "" H 8000 7900 50  0001 C CNN
	1    8000 7900
	1    0    0    -1  
$EndComp
$Comp
L A5C:DFFCOR UDA81
U 1 1 61737EBF
P 12550 7900
F 0 "UDA81" H 12550 8265 50  0000 C CNN
F 1 "DFFCOR" H 12550 8174 50  0000 C CNN
F 2 "" H 12550 7900 50  0001 C CNN
F 3 "" H 12550 7900 50  0001 C CNN
	1    12550 7900
	1    0    0    -1  
$EndComp
$Comp
L A5C:NOR05 UBD?
U 1 1 61CDE955
P 8000 4600
AR Path="/60F602ED/61CDE955" Ref="UBD?"  Part="1" 
AR Path="/613100A2/61CDE955" Ref="UDB38"  Part="1" 
AR Path="/613100A2/6125387A/61CDE955" Ref="UDB38"  Part="1" 
F 0 "UDB38" H 8075 5015 50  0000 C CNN
F 1 "NOR05" H 8075 4924 50  0000 C CNN
F 2 "" H 8000 4650 50  0001 C CNN
F 3 "" H 8000 4650 50  0001 C CNN
	1    8000 4600
	1    0    0    -1  
$EndComp
$Comp
L A5C:M175CL UDC78
U 1 1 61118E60
P 12550 6850
F 0 "UDC78" H 12550 7415 50  0000 C CNN
F 1 "M175CL" H 12550 7324 50  0000 C CNN
F 2 "" H 12550 6650 50  0001 C CNN
F 3 "" H 12550 6650 50  0001 C CNN
	1    12550 6850
	1    0    0    -1  
$EndComp
$Comp
L A5C:M175CLH UDD88
U 1 1 61118E61
P 12550 4600
F 0 "UDD88" H 12550 5165 50  0000 C CNN
F 1 "M175CLH" H 12550 5074 50  0000 C CNN
F 2 "" H 12550 4400 50  0001 C CNN
F 3 "" H 12550 4400 50  0001 C CNN
	1    12550 4600
	1    0    0    -1  
$EndComp
$Comp
L A5C:NAND13 UDI100
U 1 1 62991160
P 4100 4600
F 0 "UDI100" H 4100 5390 50  0000 C CNN
F 1 "NAND13" H 4100 5299 50  0000 C CNN
F 2 "" H 4050 5050 50  0001 C CNN
F 3 "" H 4050 5050 50  0001 C CNN
	1    4100 4600
	1    0    0    -1  
$EndComp
Wire Bus Line
	2350 3850 2350 5300
Wire Bus Line
	8050 8450 8050 8950
Wire Bus Line
	11600 6300 11600 7700
Wire Bus Line
	13350 6650 13350 8950
Wire Bus Line
	3450 3850 3450 5000
$EndSCHEMATC
