EESchema Schematic File Version 4
EELAYER 30 0
EELAYER END
$Descr A4 11693 8268
encoding utf-8
Sheet 6 8
Title ""
Date "2020-05-05"
Rev ""
Comp ""
Comment1 ""
Comment2 "Licence: CC-BY"
Comment3 "Author: Loic *WydD* Petit"
Comment4 "Project: CPS2 Reverse Engineering: DL-1927"
$EndDescr
Connection ~ 5000 1800
Connection ~ 5000 5700
Connection ~ 5000 4750
Connection ~ 5000 3800
Connection ~ 5000 2850
Connection ~ 5000 6650
Connection ~ 4550 3950
Connection ~ 6250 3950
NoConn ~ 5800 1100
NoConn ~ 5800 1750
Entry Wire Line
	4550 4150 4650 4250
Entry Wire Line
	4550 4250 4650 4350
Entry Wire Line
	4550 4350 4650 4450
Entry Wire Line
	4550 4450 4650 4550
Entry Wire Line
	4550 5100 4650 5200
Entry Wire Line
	4550 5200 4650 5300
Entry Wire Line
	4550 5300 4650 5400
Entry Wire Line
	4550 5400 4650 5500
Entry Wire Line
	4550 6050 4650 6150
Entry Wire Line
	4550 6150 4650 6250
Entry Wire Line
	4550 6250 4650 6350
Entry Wire Line
	4550 6350 4650 6450
Entry Wire Line
	4650 950  4550 1050
Entry Wire Line
	4650 1600 4550 1700
Entry Wire Line
	4650 2350 4550 2450
Entry Wire Line
	4650 2450 4550 2550
Entry Wire Line
	4650 2550 4550 2650
Entry Wire Line
	4650 2650 4550 2750
Entry Wire Line
	4650 3300 4550 3400
Entry Wire Line
	4650 3400 4550 3500
Entry Wire Line
	4650 3500 4550 3600
Entry Wire Line
	4650 3600 4550 3700
Entry Wire Line
	6150 950  6250 1050
Entry Wire Line
	6150 1600 6250 1700
Entry Wire Line
	6150 2350 6250 2450
Entry Wire Line
	6150 2450 6250 2550
Entry Wire Line
	6150 2550 6250 2650
Entry Wire Line
	6150 2650 6250 2750
Entry Wire Line
	6150 3300 6250 3400
Entry Wire Line
	6150 3400 6250 3500
Entry Wire Line
	6150 3500 6250 3600
Entry Wire Line
	6150 3600 6250 3700
Entry Wire Line
	6250 4150 6150 4250
Entry Wire Line
	6250 4250 6150 4350
Entry Wire Line
	6250 4350 6150 4450
Entry Wire Line
	6250 4450 6150 4550
Entry Wire Line
	6250 5100 6150 5200
Entry Wire Line
	6250 5200 6150 5300
Entry Wire Line
	6250 5300 6150 5400
Entry Wire Line
	6250 5400 6150 5500
Entry Wire Line
	6250 6050 6150 6150
Entry Wire Line
	6250 6150 6150 6250
Entry Wire Line
	6250 6250 6150 6350
Entry Wire Line
	6250 6350 6150 6450
Wire Wire Line
	4650 950  5300 950 
Wire Wire Line
	4650 1600 5300 1600
Wire Wire Line
	4650 2350 5100 2350
Wire Wire Line
	4650 2450 5100 2450
Wire Wire Line
	4650 2550 5100 2550
Wire Wire Line
	4650 2650 5100 2650
Wire Wire Line
	4650 3300 5100 3300
Wire Wire Line
	4650 3400 5100 3400
Wire Wire Line
	4650 3500 5100 3500
Wire Wire Line
	4650 3600 5100 3600
Wire Wire Line
	4650 4250 5100 4250
Wire Wire Line
	4650 4350 5100 4350
Wire Wire Line
	4650 4450 5100 4450
Wire Wire Line
	4650 4550 5100 4550
Wire Wire Line
	4650 5200 5100 5200
Wire Wire Line
	4650 5300 5100 5300
Wire Wire Line
	4650 5400 5100 5400
Wire Wire Line
	4650 5500 5100 5500
Wire Wire Line
	4650 6150 5100 6150
Wire Wire Line
	4650 6250 5100 6250
Wire Wire Line
	4650 6350 5100 6350
Wire Wire Line
	4650 6450 5100 6450
Wire Wire Line
	5000 1150 5000 1800
Wire Wire Line
	5000 1150 5300 1150
Wire Wire Line
	5000 1800 5000 2850
Wire Wire Line
	5000 1800 5300 1800
Wire Wire Line
	5000 2850 5000 3800
Wire Wire Line
	5000 2850 5100 2850
Wire Wire Line
	5000 3800 5000 4750
Wire Wire Line
	5000 3800 5100 3800
Wire Wire Line
	5000 4750 5000 5700
Wire Wire Line
	5000 4750 5100 4750
Wire Wire Line
	5000 5700 5000 6650
Wire Wire Line
	5000 5700 5100 5700
Wire Wire Line
	5000 6650 4500 6650
Wire Wire Line
	5000 6650 5100 6650
Wire Wire Line
	5800 950  6150 950 
Wire Wire Line
	5800 1600 6150 1600
Wire Wire Line
	5800 2350 6150 2350
Wire Wire Line
	5800 2450 6150 2450
Wire Wire Line
	5800 2550 6150 2550
Wire Wire Line
	5800 2650 6150 2650
Wire Wire Line
	5800 3300 6150 3300
Wire Wire Line
	5800 3400 6150 3400
Wire Wire Line
	5800 3500 6150 3500
Wire Wire Line
	5800 3600 6150 3600
Wire Wire Line
	5800 4250 6150 4250
Wire Wire Line
	5800 4350 6150 4350
Wire Wire Line
	5800 4450 6150 4450
Wire Wire Line
	5800 4550 6150 4550
Wire Wire Line
	5800 5200 6150 5200
Wire Wire Line
	5800 5300 6150 5300
Wire Wire Line
	5800 5400 6150 5400
Wire Wire Line
	5800 5500 6150 5500
Wire Wire Line
	5800 6150 6150 6150
Wire Wire Line
	5800 6250 6150 6250
Wire Wire Line
	5800 6350 6150 6350
Wire Wire Line
	5800 6450 6150 6450
Wire Bus Line
	4300 3950 4550 3950
Wire Bus Line
	6500 3950 6250 3950
Text Label 4750 950  0    50   ~ 0
D2
Text Label 4750 1600 0    50   ~ 0
D3
Text Label 4750 2350 0    50   ~ 0
D4
Text Label 4750 2450 0    50   ~ 0
D5
Text Label 4750 2550 0    50   ~ 0
D6
Text Label 4750 2650 0    50   ~ 0
D7
Text Label 4750 3300 0    50   ~ 0
D8
Text Label 4750 3400 0    50   ~ 0
D9
Text Label 4750 3500 0    50   ~ 0
D10
Text Label 4750 3600 0    50   ~ 0
D11
Text Label 4750 4250 0    50   ~ 0
D12
Text Label 4750 4350 0    50   ~ 0
D13
Text Label 4750 4450 0    50   ~ 0
D14
Text Label 4750 4550 0    50   ~ 0
D15
Text Label 4750 5200 0    50   ~ 0
D16
Text Label 4750 5300 0    50   ~ 0
D17
Text Label 4750 5400 0    50   ~ 0
D18
Text Label 4750 5500 0    50   ~ 0
D19
Text Label 4750 6150 0    50   ~ 0
D20
Text Label 4750 6250 0    50   ~ 0
D21
Text Label 4750 6350 0    50   ~ 0
D22
Text Label 4750 6450 0    50   ~ 0
D23
Text Label 6050 950  2    50   ~ 0
Q2
Text Label 6050 1600 2    50   ~ 0
Q3
Text Label 6050 2350 2    50   ~ 0
Q4
Text Label 6050 2450 2    50   ~ 0
Q5
Text Label 6050 2550 2    50   ~ 0
Q6
Text Label 6050 2650 2    50   ~ 0
Q7
Text Label 6050 3300 2    50   ~ 0
Q8
Text Label 6050 3400 2    50   ~ 0
Q9
Text Label 6050 3500 2    50   ~ 0
Q10
Text Label 6050 3600 2    50   ~ 0
Q11
Text Label 6050 4250 2    50   ~ 0
Q12
Text Label 6050 4350 2    50   ~ 0
Q13
Text Label 6050 4450 2    50   ~ 0
Q14
Text Label 6050 4550 2    50   ~ 0
Q15
Text Label 6050 5200 2    50   ~ 0
Q16
Text Label 6050 5300 2    50   ~ 0
Q17
Text Label 6050 5400 2    50   ~ 0
Q18
Text Label 6050 5500 2    50   ~ 0
Q19
Text Label 6050 6150 2    50   ~ 0
Q20
Text Label 6050 6250 2    50   ~ 0
Q21
Text Label 6050 6350 2    50   ~ 0
Q22
Text Label 6050 6450 2    50   ~ 0
Q23
Text HLabel 4300 3950 0    50   Input ~ 0
D[2..23]
Text HLabel 4500 6650 0    50   Input ~ 0
CLK
Text HLabel 6500 3950 2    50   Output ~ 0
Q[2..23]
$Comp
L CG24-cells:FDM U30R103
U 1 1 5EB7E9B6
P 5550 1050
F 0 "U30R103" H 5550 1415 50  0000 C CNN
F 1 "FDM" H 5550 1324 50  0000 C CNN
F 2 "" H 5550 1050 50  0001 C CNN
F 3 "" H 5550 1050 50  0001 C CNN
	1    5550 1050
	1    0    0    -1  
$EndComp
$Comp
L CG24-cells:FDM U16R122
U 1 1 5EB67901
P 5550 1700
F 0 "U16R122" H 5550 2065 50  0000 C CNN
F 1 "FDM" H 5550 1974 50  0000 C CNN
F 2 "" H 5550 1700 50  0001 C CNN
F 3 "" H 5550 1700 50  0001 C CNN
	1    5550 1700
	1    0    0    -1  
$EndComp
$Comp
L CG24-cells:FDS U30R115
U 1 1 5EBB6010
P 5450 2550
F 0 "U30R115" H 5450 3015 50  0000 C CNN
F 1 "FDS" H 5450 2924 50  0000 C CNN
F 2 "" H 5350 2650 50  0001 C CNN
F 3 "" H 5350 2650 50  0001 C CNN
	1    5450 2550
	1    0    0    -1  
$EndComp
$Comp
L CG24-cells:FDS U8R115
U 1 1 5ED62521
P 5450 3500
F 0 "U8R115" H 5450 3965 50  0000 C CNN
F 1 "FDS" H 5450 3874 50  0000 C CNN
F 2 "" H 5350 3600 50  0001 C CNN
F 3 "" H 5350 3600 50  0001 C CNN
	1    5450 3500
	1    0    0    -1  
$EndComp
$Comp
L CG24-cells:FDS U4R96
U 1 1 5EDC78C2
P 5450 4450
F 0 "U4R96" H 5450 4915 50  0000 C CNN
F 1 "FDS" H 5450 4824 50  0000 C CNN
F 2 "" H 5350 4550 50  0001 C CNN
F 3 "" H 5350 4550 50  0001 C CNN
	1    5450 4450
	1    0    0    -1  
$EndComp
$Comp
L CG24-cells:FDS U8R58
U 1 1 5EE67E82
P 5450 5400
F 0 "U8R58" H 5450 5865 50  0000 C CNN
F 1 "FDS" H 5450 5774 50  0000 C CNN
F 2 "" H 5350 5500 50  0001 C CNN
F 3 "" H 5350 5500 50  0001 C CNN
	1    5450 5400
	1    0    0    -1  
$EndComp
$Comp
L CG24-cells:FDS U4R58
U 1 1 5F2C1548
P 5450 6350
F 0 "U4R58" H 5450 6815 50  0000 C CNN
F 1 "FDS" H 5450 6724 50  0000 C CNN
F 2 "" H 5350 6450 50  0001 C CNN
F 3 "" H 5350 6450 50  0001 C CNN
	1    5450 6350
	1    0    0    -1  
$EndComp
Wire Bus Line
	4550 1050 4550 3950
Wire Bus Line
	4550 3950 4550 6350
Wire Bus Line
	6250 1050 6250 3950
Wire Bus Line
	6250 3950 6250 6350
$EndSCHEMATC
