EESchema Schematic File Version 4
EELAYER 30 0
EELAYER END
$Descr A3 16535 11693
encoding utf-8
Sheet 17 69
Title ""
Date "2020-11-26"
Rev ""
Comp ""
Comment1 "Licence: CC-BY"
Comment2 "Author: Loïc *WydD* Petit"
Comment3 ""
Comment4 ""
$EndDescr
Connection ~ 7500 9800
Connection ~ 8500 9400
Connection ~ 8300 9600
Connection ~ 8400 9500
Connection ~ 7500 9000
Connection ~ 8500 8700
Connection ~ 8400 8800
Connection ~ 8500 3500
Connection ~ 8600 3400
Connection ~ 8600 2700
Connection ~ 8500 2800
Connection ~ 8600 2000
Connection ~ 7500 8200
Connection ~ 8800 7100
Connection ~ 8600 7200
Connection ~ 8600 7900
Connection ~ 8800 7800
Connection ~ 7500 7400
Connection ~ 8500 8000
Connection ~ 8600 9300
Connection ~ 8800 8500
Connection ~ 8600 8600
Connection ~ 8800 9200
Connection ~ 5650 8200
Connection ~ 5650 8300
Connection ~ 4600 9150
Connection ~ 6050 5600
Connection ~ 7500 4600
Connection ~ 8600 4100
Connection ~ 8500 4200
Connection ~ 8400 3600
Connection ~ 7500 3000
Connection ~ 7500 3800
Connection ~ 8300 4400
Connection ~ 8400 4300
NoConn ~ 8200 9700
NoConn ~ 8200 8900
NoConn ~ 8200 2100
NoConn ~ 8200 8100
NoConn ~ 8200 7300
NoConn ~ 8200 3700
NoConn ~ 8200 2900
NoConn ~ 8200 4500
Entry Wire Line
	4200 2700 4300 2800
Entry Wire Line
	4200 2800 4300 2900
Entry Wire Line
	4200 2900 4300 3000
Entry Wire Line
	4200 3000 4300 3100
Entry Wire Line
	4200 3100 4300 3200
Wire Wire Line
	4300 3100 6150 3100
Wire Wire Line
	4500 9150 4600 9150
Wire Wire Line
	4600 3950 4900 3950
Wire Wire Line
	4600 9150 4600 3950
Wire Wire Line
	4600 9150 4900 9150
Wire Wire Line
	5400 6100 5400 9000
Wire Wire Line
	5400 6100 6050 6100
Wire Wire Line
	5500 3950 6150 3950
Wire Wire Line
	5500 8300 5650 8300
Wire Wire Line
	5500 9150 6150 9150
Wire Wire Line
	5650 3200 4300 3200
Wire Wire Line
	5650 3200 5650 4200
Wire Wire Line
	5650 4200 6150 4200
Wire Wire Line
	5650 8100 5650 8200
Wire Wire Line
	5650 8100 6150 8100
Wire Wire Line
	5650 8200 5650 8300
Wire Wire Line
	5650 8200 6150 8200
Wire Wire Line
	5650 8300 6150 8300
Wire Wire Line
	5750 1100 10650 1100
Wire Wire Line
	5750 3600 5750 1100
Wire Wire Line
	5750 6300 10850 6300
Wire Wire Line
	5750 8800 5750 6300
Wire Wire Line
	5850 1200 5850 3500
Wire Wire Line
	5850 1200 10550 1200
Wire Wire Line
	5850 3500 6150 3500
Wire Wire Line
	5850 6400 5850 8700
Wire Wire Line
	5850 6400 10750 6400
Wire Wire Line
	5850 8700 6150 8700
Wire Wire Line
	5950 1300 10450 1300
Wire Wire Line
	5950 3400 5950 1300
Wire Wire Line
	5950 5600 6050 5600
Wire Wire Line
	5950 6500 10650 6500
Wire Wire Line
	5950 8600 5950 6500
Wire Wire Line
	6050 1400 10350 1400
Wire Wire Line
	6050 3300 6050 1400
Wire Wire Line
	6050 3800 6050 5600
Wire Wire Line
	6050 3800 6150 3800
Wire Wire Line
	6050 5600 6050 6100
Wire Wire Line
	6050 6600 10550 6600
Wire Wire Line
	6050 8500 6050 6600
Wire Wire Line
	6150 2800 4300 2800
Wire Wire Line
	6150 2900 4300 2900
Wire Wire Line
	6150 3000 4300 3000
Wire Wire Line
	6150 3300 6050 3300
Wire Wire Line
	6150 3400 5950 3400
Wire Wire Line
	6150 3600 5750 3600
Wire Wire Line
	6150 4200 6150 8000
Wire Wire Line
	6150 8500 6050 8500
Wire Wire Line
	6150 8600 5950 8600
Wire Wire Line
	6150 8800 5750 8800
Wire Wire Line
	6150 9000 5400 9000
Wire Wire Line
	7150 3050 7250 3050
Wire Wire Line
	7150 3150 7350 3150
Wire Wire Line
	7150 3250 7350 3250
Wire Wire Line
	7150 3350 7250 3350
Wire Wire Line
	7150 8250 7250 8250
Wire Wire Line
	7150 8350 7350 8350
Wire Wire Line
	7150 8450 7350 8450
Wire Wire Line
	7150 8550 7250 8550
Wire Wire Line
	7150 9800 7500 9800
Wire Wire Line
	7250 2000 7700 2000
Wire Wire Line
	7250 3050 7250 2000
Wire Wire Line
	7250 3350 7250 4400
Wire Wire Line
	7250 4400 7700 4400
Wire Wire Line
	7250 7200 7700 7200
Wire Wire Line
	7250 8250 7250 7200
Wire Wire Line
	7250 8550 7250 9600
Wire Wire Line
	7250 9600 7700 9600
Wire Wire Line
	7350 2800 7700 2800
Wire Wire Line
	7350 3150 7350 2800
Wire Wire Line
	7350 3250 7350 3600
Wire Wire Line
	7350 3600 7700 3600
Wire Wire Line
	7350 8000 7700 8000
Wire Wire Line
	7350 8350 7350 8000
Wire Wire Line
	7350 8450 7350 8800
Wire Wire Line
	7350 8800 7700 8800
Wire Wire Line
	7500 2200 7700 2200
Wire Wire Line
	7500 3000 7500 2200
Wire Wire Line
	7500 3000 7700 3000
Wire Wire Line
	7500 3800 7500 3000
Wire Wire Line
	7500 4600 7500 3800
Wire Wire Line
	7500 4600 7500 7400
Wire Wire Line
	7500 4600 7700 4600
Wire Wire Line
	7500 7400 7700 7400
Wire Wire Line
	7500 8200 7500 7400
Wire Wire Line
	7500 8200 7700 8200
Wire Wire Line
	7500 9000 7500 8200
Wire Wire Line
	7500 9800 7500 9000
Wire Wire Line
	7500 9800 7700 9800
Wire Wire Line
	7700 3800 7500 3800
Wire Wire Line
	7700 9000 7500 9000
Wire Wire Line
	8200 2000 8600 2000
Wire Wire Line
	8200 2800 8500 2800
Wire Wire Line
	8200 3600 8400 3600
Wire Wire Line
	8200 4400 8300 4400
Wire Wire Line
	8200 7200 8600 7200
Wire Wire Line
	8200 8000 8500 8000
Wire Wire Line
	8200 8800 8400 8800
Wire Wire Line
	8200 9600 8300 9600
Wire Wire Line
	8300 1600 8300 4400
Wire Wire Line
	8300 4400 8300 5100
Wire Wire Line
	8300 6800 8300 9600
Wire Wire Line
	8300 9600 8300 10400
Wire Wire Line
	8400 3600 8400 1600
Wire Wire Line
	8400 3600 8400 4300
Wire Wire Line
	8400 4300 8400 5000
Wire Wire Line
	8400 8800 8400 6800
Wire Wire Line
	8400 8800 8400 9500
Wire Wire Line
	8400 9500 8400 10300
Wire Wire Line
	8500 2800 8500 1600
Wire Wire Line
	8500 2800 8500 3500
Wire Wire Line
	8500 3500 8500 4200
Wire Wire Line
	8500 4200 8500 4900
Wire Wire Line
	8500 4200 9200 4200
Wire Wire Line
	8500 8000 8500 6800
Wire Wire Line
	8500 8000 8500 8700
Wire Wire Line
	8500 8700 8500 9400
Wire Wire Line
	8500 9400 8500 10200
Wire Wire Line
	8600 1600 8600 2000
Wire Wire Line
	8600 2000 8600 2700
Wire Wire Line
	8600 2000 10350 2000
Wire Wire Line
	8600 2700 8600 3400
Wire Wire Line
	8600 2700 9800 2700
Wire Wire Line
	8600 3400 8600 4100
Wire Wire Line
	8600 3400 9250 3400
Wire Wire Line
	8600 4100 8600 4800
Wire Wire Line
	8600 4100 9200 4100
Wire Wire Line
	8600 4800 9200 4800
Wire Wire Line
	8600 6800 8600 7200
Wire Wire Line
	8600 7200 8600 7900
Wire Wire Line
	8600 7900 8600 8600
Wire Wire Line
	8600 8600 8600 9300
Wire Wire Line
	8600 8600 9300 8600
Wire Wire Line
	8600 9300 8600 10100
Wire Wire Line
	8800 6100 10650 6100
Wire Wire Line
	8800 7100 8800 6100
Wire Wire Line
	8800 7100 8800 7800
Wire Wire Line
	8800 7800 8800 8500
Wire Wire Line
	8800 8500 8800 9200
Wire Wire Line
	8800 9200 8800 10000
Wire Wire Line
	9200 4300 8400 4300
Wire Wire Line
	9200 4900 8500 4900
Wire Wire Line
	9200 5000 8400 5000
Wire Wire Line
	9200 5100 8300 5100
Wire Wire Line
	9200 10000 8800 10000
Wire Wire Line
	9200 10100 8600 10100
Wire Wire Line
	9200 10200 8500 10200
Wire Wire Line
	9200 10300 8400 10300
Wire Wire Line
	9200 10400 8300 10400
Wire Wire Line
	9250 3500 8500 3500
Wire Wire Line
	9300 8500 8800 8500
Wire Wire Line
	9300 8700 8500 8700
Wire Wire Line
	9300 9200 8800 9200
Wire Wire Line
	9300 9300 8600 9300
Wire Wire Line
	9300 9400 8500 9400
Wire Wire Line
	9300 9500 8400 9500
Wire Wire Line
	9350 7800 8800 7800
Wire Wire Line
	9350 7900 8600 7900
Wire Wire Line
	9800 2800 8500 2800
Wire Wire Line
	9800 3500 9800 3450
Wire Wire Line
	9800 3600 8400 3600
Wire Wire Line
	9800 4300 9800 4200
Wire Wire Line
	9800 4400 8300 4400
Wire Wire Line
	9900 7100 8800 7100
Wire Wire Line
	9900 7200 8600 7200
Wire Wire Line
	9900 7900 9900 7850
Wire Wire Line
	9900 8000 8500 8000
Wire Wire Line
	9900 8700 9900 8600
Wire Wire Line
	9900 8800 8400 8800
Wire Wire Line
	9900 9350 9900 9500
Wire Wire Line
	9900 9600 8300 9600
Wire Wire Line
	10350 2000 10350 1400
Wire Wire Line
	10350 2750 10450 2750
Wire Wire Line
	10350 4350 10650 4350
Wire Wire Line
	10450 1300 10450 2750
Wire Wire Line
	10450 7150 10550 7150
Wire Wire Line
	10450 8750 10750 8750
Wire Wire Line
	10450 9550 10850 9550
Wire Wire Line
	10550 1200 10550 3550
Wire Wire Line
	10550 3550 10350 3550
Wire Wire Line
	10550 7150 10550 6600
Wire Wire Line
	10650 1100 10650 4350
Wire Wire Line
	10650 4950 10400 4950
Wire Wire Line
	10650 6100 10650 4950
Wire Wire Line
	10650 6500 10650 7950
Wire Wire Line
	10650 7950 10450 7950
Wire Wire Line
	10750 8750 10750 6400
Wire Wire Line
	10850 9550 10850 6300
Wire Bus Line
	4200 2600 4100 2600
Wire Bus Line
	4200 2600 4200 3100
Text Label 4400 2800 0    50   ~ 0
XS0
Text Label 4400 2900 0    50   ~ 0
XS1
Text Label 4400 3000 0    50   ~ 0
XS2
Text Label 4400 3100 0    50   ~ 0
XS3
Text Label 4400 3200 0    50   ~ 0
XS4
Text HLabel 4100 2600 0    50   Input ~ 0
XS[0..4]
Text HLabel 4500 9150 0    50   Input ~ 0
~RESETI
Text HLabel 5350 5600 0    50   Input ~ 0
LOAD
Text HLabel 7150 9800 0    50   Input ~ 0
~CLK8M
Text HLabel 9950 10200 2    50   Output ~ 0
ZERO
$Comp
L power:VCC #PWR?
U 1 1 5FA2C9EA
P 5500 8300
AR Path="/5FD56F21/5FA2C9EA" Ref="#PWR?"  Part="1" 
AR Path="/5FBCE4A9/5FBD0B25/5FA2C9EA" Ref="#PWR0109"  Part="1" 
F 0 "#PWR0109" H 5500 8150 50  0001 C CNN
F 1 "VCC" H 5515 8473 50  0000 C CNN
F 2 "" H 5500 8300 50  0001 C CNN
F 3 "" H 5500 8300 50  0001 C CNN
	1    5500 8300
	1    0    0    -1  
$EndComp
$Comp
L A5C:NOR02 UCC87
U 1 1 601E0A46
P 9500 3450
AR Path="/5FD56F21/601E0A46" Ref="UCC87"  Part="1" 
AR Path="/5FBCE4A9/5FBD0B25/601E0A46" Ref="UCC87"  Part="1" 
F 0 "UCC87" H 9525 3716 50  0000 C CNN
F 1 "NOR02" H 9525 3625 50  0000 C CNN
F 2 "" H 9500 3450 50  0001 C CNN
F 3 "" H 9500 3450 50  0001 C CNN
	1    9500 3450
	1    0    0    -1  
$EndComp
$Comp
L A5C:NOR02 UBR37
U 1 1 5FC726F3
P 9600 7850
AR Path="/5FD56F21/5FC726F3" Ref="UBR37"  Part="1" 
AR Path="/5FBCE4A9/5FBD0B25/5FC726F3" Ref="UBR37"  Part="1" 
F 0 "UBR37" H 9625 8116 50  0000 C CNN
F 1 "NOR02" H 9625 8025 50  0000 C CNN
F 2 "" H 9600 7850 50  0001 C CNN
F 3 "" H 9600 7850 50  0001 C CNN
	1    9600 7850
	1    0    0    -1  
$EndComp
$Comp
L A5C:XOR02 UCC89
U 1 1 601E0A43
P 10050 2750
AR Path="/5FD56F21/601E0A43" Ref="UCC89"  Part="1" 
AR Path="/5FBCE4A9/5FBD0B25/601E0A43" Ref="UCC89"  Part="1" 
F 0 "UCC89" H 10075 3017 50  0000 C CNN
F 1 "XOR02" H 10075 2926 50  0000 C CNN
F 2 "" H 10050 2750 50  0001 C CNN
F 3 "" H 10050 2750 50  0001 C CNN
	1    10050 2750
	1    0    0    -1  
$EndComp
$Comp
L A5C:XNOR02 UCC76
U 1 1 5F6919B7
P 10050 3550
AR Path="/5FD56F21/5F6919B7" Ref="UCC76"  Part="1" 
AR Path="/5FBCE4A9/5FBD0B25/5F6919B7" Ref="UCC76"  Part="1" 
F 0 "UCC76" H 10050 3867 50  0000 C CNN
F 1 "XNOR02" H 10050 3776 50  0000 C CNN
F 2 "" H 10050 3550 50  0001 C CNN
F 3 "" H 10050 3550 50  0001 C CNN
	1    10050 3550
	1    0    0    -1  
$EndComp
$Comp
L A5C:XNOR02 UCC73
U 1 1 601E0A40
P 10050 4350
AR Path="/5FD56F21/601E0A40" Ref="UCC73"  Part="1" 
AR Path="/5FBCE4A9/5FBD0B25/601E0A40" Ref="UCC73"  Part="1" 
F 0 "UCC73" H 10050 4667 50  0000 C CNN
F 1 "XNOR02" H 10050 4576 50  0000 C CNN
F 2 "" H 10050 4350 50  0001 C CNN
F 3 "" H 10050 4350 50  0001 C CNN
	1    10050 4350
	1    0    0    -1  
$EndComp
$Comp
L A5C:XOR02 UBU10
U 1 1 601E0A5B
P 10150 7150
AR Path="/5FD56F21/601E0A5B" Ref="UBU10"  Part="1" 
AR Path="/5FBCE4A9/5FBD0B25/601E0A5B" Ref="UBU10"  Part="1" 
F 0 "UBU10" H 10175 7417 50  0000 C CNN
F 1 "XOR02" H 10175 7326 50  0000 C CNN
F 2 "" H 10150 7150 50  0001 C CNN
F 3 "" H 10150 7150 50  0001 C CNN
	1    10150 7150
	1    0    0    -1  
$EndComp
$Comp
L A5C:XNOR02 UBR39
U 1 1 5FC726E1
P 10150 7950
AR Path="/5FD56F21/5FC726E1" Ref="UBR39"  Part="1" 
AR Path="/5FBCE4A9/5FBD0B25/5FC726E1" Ref="UBR39"  Part="1" 
F 0 "UBR39" H 10150 8267 50  0000 C CNN
F 1 "XNOR02" H 10150 8176 50  0000 C CNN
F 2 "" H 10150 7950 50  0001 C CNN
F 3 "" H 10150 7950 50  0001 C CNN
	1    10150 7950
	1    0    0    -1  
$EndComp
$Comp
L A5C:XNOR02 UBU48
U 1 1 601E0A60
P 10150 8750
AR Path="/5FD56F21/601E0A60" Ref="UBU48"  Part="1" 
AR Path="/5FBCE4A9/5FBD0B25/601E0A60" Ref="UBU48"  Part="1" 
F 0 "UBU48" H 10150 9067 50  0000 C CNN
F 1 "XNOR02" H 10150 8976 50  0000 C CNN
F 2 "" H 10150 8750 50  0001 C CNN
F 3 "" H 10150 8750 50  0001 C CNN
	1    10150 8750
	1    0    0    -1  
$EndComp
$Comp
L A5C:XNOR02 UBU14
U 1 1 601E0A61
P 10150 9550
AR Path="/5FD56F21/601E0A61" Ref="UBU14"  Part="1" 
AR Path="/5FBCE4A9/5FBD0B25/601E0A61" Ref="UBU14"  Part="1" 
F 0 "UBU14" H 10150 9867 50  0000 C CNN
F 1 "XNOR02" H 10150 9776 50  0000 C CNN
F 2 "" H 10150 9550 50  0001 C CNN
F 3 "" H 10150 9550 50  0001 C CNN
	1    10150 9550
	1    0    0    -1  
$EndComp
$Comp
L A5C:INV01 UBZ62
U 1 1 678C912E
P 5200 3950
AR Path="/5FD56F21/678C912E" Ref="UBZ62"  Part="1" 
AR Path="/5FBCE4A9/5FBD0B25/678C912E" Ref="UBZ62"  Part="1" 
F 0 "UBZ62" H 5200 4267 50  0000 C CNN
F 1 "INV01" H 5200 4176 50  0000 C CNN
F 2 "" H 5200 3750 50  0001 C CNN
F 3 "" H 5200 3750 50  0001 C CNN
	1    5200 3950
	1    0    0    -1  
$EndComp
$Comp
L A5C:INV01 UBR42
U 1 1 6907440F
P 5200 9150
AR Path="/5FD56F21/6907440F" Ref="UBR42"  Part="1" 
AR Path="/5FBCE4A9/5FBD0B25/6907440F" Ref="UBR42"  Part="1" 
F 0 "UBR42" H 5200 9467 50  0000 C CNN
F 1 "INV01" H 5200 9376 50  0000 C CNN
F 2 "" H 5200 8950 50  0001 C CNN
F 3 "" H 5200 8950 50  0001 C CNN
	1    5200 9150
	1    0    0    -1  
$EndComp
$Comp
L A5C:INV01 UBZ86
U 1 1 601E0A64
P 5650 5600
AR Path="/5FD56F21/601E0A64" Ref="UBZ86"  Part="1" 
AR Path="/5FBCE4A9/5FBD0B25/601E0A64" Ref="UBZ86"  Part="1" 
F 0 "UBZ86" H 5650 5916 50  0000 C CNN
F 1 "INV01" H 5650 5825 50  0000 C CNN
F 2 "" H 5650 5400 50  0001 C CNN
F 3 "" H 5650 5400 50  0001 C CNN
	1    5650 5600
	1    0    0    -1  
$EndComp
$Comp
L A5C:NOR03 UCC79
U 1 1 5F7481D6
P 9500 4200
AR Path="/5FD56F21/5F7481D6" Ref="UCC79"  Part="1" 
AR Path="/5FBCE4A9/5FBD0B25/5F7481D6" Ref="UCC79"  Part="1" 
F 0 "UCC79" H 9500 4516 50  0000 C CNN
F 1 "NOR03" H 9500 4425 50  0000 C CNN
F 2 "" H 9500 4200 50  0001 C CNN
F 3 "" H 9500 4200 50  0001 C CNN
	1    9500 4200
	1    0    0    -1  
$EndComp
$Comp
L A5C:NOR03 UBU27
U 1 1 601E0A5E
P 9600 8600
AR Path="/5FD56F21/601E0A5E" Ref="UBU27"  Part="1" 
AR Path="/5FBCE4A9/5FBD0B25/601E0A5E" Ref="UBU27"  Part="1" 
F 0 "UBU27" H 9600 8916 50  0000 C CNN
F 1 "NOR03" H 9600 8825 50  0000 C CNN
F 2 "" H 9600 8600 50  0001 C CNN
F 3 "" H 9600 8600 50  0001 C CNN
	1    9600 8600
	1    0    0    -1  
$EndComp
$Comp
L A5C:INV01 UBU23
U 1 1 5FCF0BE2
P 10100 4950
AR Path="/5FD56F21/5FCF0BE2" Ref="UBU23"  Part="1" 
AR Path="/5FBCE4A9/5FBD0B25/5FCF0BE2" Ref="UBU23"  Part="1" 
F 0 "UBU23" H 10100 5266 50  0000 C CNN
F 1 "INV01" H 10100 5175 50  0000 C CNN
F 2 "" H 10100 4750 50  0001 C CNN
F 3 "" H 10100 4750 50  0001 C CNN
	1    10100 4950
	1    0    0    -1  
$EndComp
$Comp
L A5C:DFFCOO UCC53
U 1 1 601E0A4D
P 7950 2100
AR Path="/5FD56F21/601E0A4D" Ref="UCC53"  Part="1" 
AR Path="/5FBCE4A9/5FBD0B25/601E0A4D" Ref="UCC53"  Part="1" 
F 0 "UCC53" H 7950 2461 50  0000 C CNN
F 1 "DFFCOO" H 7950 2370 50  0000 C CNN
F 2 "" H 7950 2100 50  0001 C CNN
F 3 "" H 7950 2100 50  0001 C CNN
F 4 "UCC52" H 7950 2100 50  0001 C CNN "MiscRef"
	1    7950 2100
	1    0    0    -1  
$EndComp
$Comp
L A5C:DFFCOO UCC57
U 1 1 5F9C67D5
P 7950 2900
AR Path="/5FD56F21/5F9C67D5" Ref="UCC57"  Part="1" 
AR Path="/5FBCE4A9/5FBD0B25/5F9C67D5" Ref="UCC57"  Part="1" 
F 0 "UCC57" H 7950 3261 50  0000 C CNN
F 1 "DFFCOO" H 7950 3170 50  0000 C CNN
F 2 "" H 7950 2900 50  0001 C CNN
F 3 "" H 7950 2900 50  0001 C CNN
	1    7950 2900
	1    0    0    -1  
$EndComp
$Comp
L A5C:DFFCOO UCC61
U 1 1 5F9C798E
P 7950 3700
AR Path="/5FD56F21/5F9C798E" Ref="UCC61"  Part="1" 
AR Path="/5FBCE4A9/5FBD0B25/5F9C798E" Ref="UCC61"  Part="1" 
F 0 "UCC61" H 7950 4061 50  0000 C CNN
F 1 "DFFCOO" H 7950 3970 50  0000 C CNN
F 2 "" H 7950 3700 50  0001 C CNN
F 3 "" H 7950 3700 50  0001 C CNN
	1    7950 3700
	1    0    0    -1  
$EndComp
$Comp
L A5C:DFFCOO UCC65
U 1 1 5F9C87FB
P 7950 4500
AR Path="/5FD56F21/5F9C87FB" Ref="UCC65"  Part="1" 
AR Path="/5FBCE4A9/5FBD0B25/5F9C87FB" Ref="UCC65"  Part="1" 
F 0 "UCC65" H 7950 4861 50  0000 C CNN
F 1 "DFFCOO" H 7950 4770 50  0000 C CNN
F 2 "" H 7950 4500 50  0001 C CNN
F 3 "" H 7950 4500 50  0001 C CNN
	1    7950 4500
	1    0    0    -1  
$EndComp
$Comp
L A5C:DFFCOO UBR18
U 1 1 601E0A5D
P 7950 7300
AR Path="/5FD56F21/601E0A5D" Ref="UBR18"  Part="1" 
AR Path="/5FBCE4A9/5FBD0B25/601E0A5D" Ref="UBR18"  Part="1" 
F 0 "UBR18" H 7950 7661 50  0000 C CNN
F 1 "DFFCOO" H 7950 7570 50  0000 C CNN
F 2 "" H 7950 7300 50  0001 C CNN
F 3 "" H 7950 7300 50  0001 C CNN
F 4 "UBR16" H 7950 7300 50  0001 C CNN "MiscRef"
	1    7950 7300
	1    0    0    -1  
$EndComp
$Comp
L A5C:DFFCOO UBR22
U 1 1 5FC72722
P 7950 8100
AR Path="/5FD56F21/5FC72722" Ref="UBR22"  Part="1" 
AR Path="/5FBCE4A9/5FBD0B25/5FC72722" Ref="UBR22"  Part="1" 
F 0 "UBR22" H 7950 8461 50  0000 C CNN
F 1 "DFFCOO" H 7950 8370 50  0000 C CNN
F 2 "" H 7950 8100 50  0001 C CNN
F 3 "" H 7950 8100 50  0001 C CNN
	1    7950 8100
	1    0    0    -1  
$EndComp
$Comp
L A5C:DFFCOO UBR25
U 1 1 601E0A59
P 7950 8900
AR Path="/5FD56F21/601E0A59" Ref="UBR25"  Part="1" 
AR Path="/5FBCE4A9/5FBD0B25/601E0A59" Ref="UBR25"  Part="1" 
F 0 "UBR25" H 7950 9261 50  0000 C CNN
F 1 "DFFCOO" H 7950 9170 50  0000 C CNN
F 2 "" H 7950 8900 50  0001 C CNN
F 3 "" H 7950 8900 50  0001 C CNN
	1    7950 8900
	1    0    0    -1  
$EndComp
$Comp
L A5C:DFFCOO UBR29
U 1 1 601E0A5C
P 7950 9700
AR Path="/5FD56F21/601E0A5C" Ref="UBR29"  Part="1" 
AR Path="/5FBCE4A9/5FBD0B25/601E0A5C" Ref="UBR29"  Part="1" 
F 0 "UBR29" H 7950 10061 50  0000 C CNN
F 1 "DFFCOO" H 7950 9970 50  0000 C CNN
F 2 "" H 7950 9700 50  0001 C CNN
F 3 "" H 7950 9700 50  0001 C CNN
	1    7950 9700
	1    0    0    -1  
$EndComp
$Comp
L A5C:NOR04 UCC69
U 1 1 5F74F151
P 9500 4950
AR Path="/5FD56F21/5F74F151" Ref="UCC69"  Part="1" 
AR Path="/5FBCE4A9/5FBD0B25/5F74F151" Ref="UCC69"  Part="1" 
F 0 "UCC69" H 9500 5291 50  0000 C CNN
F 1 "NOR04" H 9500 5200 50  0000 C CNN
F 2 "" H 9500 4950 50  0001 C CNN
F 3 "" H 9500 4950 50  0001 C CNN
	1    9500 4950
	1    0    0    -1  
$EndComp
$Comp
L A5C:NOR04 UBU17
U 1 1 5FC7289A
P 9600 9350
AR Path="/5FD56F21/5FC7289A" Ref="UBU17"  Part="1" 
AR Path="/5FBCE4A9/5FBD0B25/5FC7289A" Ref="UBU17"  Part="1" 
F 0 "UBU17" H 9600 9691 50  0000 C CNN
F 1 "NOR04" H 9600 9600 50  0000 C CNN
F 2 "" H 9600 9350 50  0001 C CNN
F 3 "" H 9600 9350 50  0001 C CNN
	1    9600 9350
	1    0    0    -1  
$EndComp
$Comp
L A5C:NOR05 UBR33
U 1 1 601E0A5F
P 9500 10200
AR Path="/5FD56F21/601E0A5F" Ref="UBR33"  Part="1" 
AR Path="/5FBCE4A9/5FBD0B25/601E0A5F" Ref="UBR33"  Part="1" 
F 0 "UBR33" H 9575 10611 50  0000 C CNN
F 1 "NOR05" H 9575 10520 50  0000 C CNN
F 2 "" H 9500 10250 50  0001 C CNN
F 3 "" H 9500 10250 50  0001 C CNN
	1    9500 10200
	1    0    0    -1  
$EndComp
$Comp
L A5C:M258C UBZ66
U 1 1 601E0A56
P 6650 3400
AR Path="/5FD56F21/601E0A56" Ref="UBZ66"  Part="1" 
AR Path="/5FBCE4A9/5FBD0B25/601E0A56" Ref="UBZ66"  Part="1" 
F 0 "UBZ66" H 6650 4261 50  0000 C CNN
F 1 "M258C" H 6650 4170 50  0000 C CNN
F 2 "" H 6650 3400 50  0001 C CNN
F 3 "" H 6650 3400 50  0001 C CNN
	1    6650 3400
	1    0    0    -1  
$EndComp
$Comp
L A5C:M258C UBU31
U 1 1 5FA1FADE
P 6650 8600
AR Path="/5FD56F21/5FA1FADE" Ref="UBU31"  Part="1" 
AR Path="/5FBCE4A9/5FBD0B25/5FA1FADE" Ref="UBU31"  Part="1" 
F 0 "UBU31" H 6650 9461 50  0000 C CNN
F 1 "M258C" H 6650 9370 50  0000 C CNN
F 2 "" H 6650 8600 50  0001 C CNN
F 3 "" H 6650 8600 50  0001 C CNN
	1    6650 8600
	1    0    0    -1  
$EndComp
$EndSCHEMATC
