EESchema Schematic File Version 4
EELAYER 30 0
EELAYER END
$Descr A4 11693 8268
encoding utf-8
Sheet 12 17
Title ""
Date "2019-10-17"
Rev ""
Comp ""
Comment1 ""
Comment2 "Licence: CC-BY"
Comment3 "Author: Loic *WydD* Petit"
Comment4 "Project: CPS2 Reverse Engineering: 93646B"
$EndDescr
Connection ~ 9950 4350
Connection ~ 10450 4050
Connection ~ 10900 5450
NoConn ~ 1350 5100
NoConn ~ 1250 5100
NoConn ~ 1150 5100
NoConn ~ 1050 5100
NoConn ~ 950  5100
Entry Wire Line
	1350 7300 1250 7400
Entry Wire Line
	1350 7200 1250 7300
Entry Wire Line
	1350 7100 1250 7200
Entry Wire Line
	1350 7000 1250 7100
Entry Wire Line
	1350 6900 1250 7000
Entry Wire Line
	1350 6800 1250 6900
Entry Wire Line
	1350 6700 1250 6800
Entry Wire Line
	1350 6600 1250 6700
Entry Wire Line
	1350 6500 1250 6600
Entry Wire Line
	1350 6400 1250 6500
Entry Wire Line
	1350 6300 1250 6400
Entry Wire Line
	1350 6200 1250 6300
Entry Wire Line
	1350 6100 1250 6200
Entry Wire Line
	1350 6000 1250 6100
Entry Wire Line
	1350 5900 1250 6000
Entry Wire Line
	1350 5800 1250 5900
Entry Wire Line
	2500 1000 2600 1100
Entry Wire Line
	2500 1100 2600 1200
Entry Wire Line
	2500 1200 2600 1300
Entry Wire Line
	2500 1300 2600 1400
Entry Wire Line
	2500 1400 2600 1500
Entry Wire Line
	2500 1500 2600 1600
Entry Wire Line
	2500 1600 2600 1700
Entry Wire Line
	2500 1700 2600 1800
Entry Wire Line
	2500 1800 2600 1900
Entry Wire Line
	2500 1900 2600 2000
Entry Wire Line
	2500 2000 2600 2100
Entry Wire Line
	2500 2100 2600 2200
Entry Wire Line
	2500 2200 2600 2300
Entry Wire Line
	2500 2300 2600 2400
Entry Wire Line
	2500 2400 2600 2500
Entry Wire Line
	2500 2500 2600 2600
Entry Wire Line
	2500 2600 2600 2700
Entry Wire Line
	2500 2700 2600 2800
Entry Wire Line
	2500 2800 2600 2900
Entry Wire Line
	2500 2900 2600 3000
Entry Wire Line
	2500 3000 2600 3100
Entry Wire Line
	2500 3100 2600 3200
Entry Wire Line
	2500 3200 2600 3300
Entry Wire Line
	5050 1200 4950 1100
Entry Wire Line
	5050 1300 4950 1200
Entry Wire Line
	5050 1400 4950 1300
Entry Wire Line
	5050 1500 4950 1400
Entry Wire Line
	5050 1600 4950 1500
Entry Wire Line
	5050 1700 4950 1600
Entry Wire Line
	5050 1800 4950 1700
Entry Wire Line
	5050 1900 4950 1800
Entry Wire Line
	5050 2000 4950 1900
Entry Wire Line
	5050 2100 4950 2000
Entry Wire Line
	5050 2200 4950 2100
Entry Wire Line
	5050 2300 4950 2200
Entry Wire Line
	5050 2400 4950 2300
Entry Wire Line
	5050 2500 4950 2400
Entry Wire Line
	5050 2600 4950 2500
Entry Wire Line
	5050 2700 4950 2600
Entry Wire Line
	8000 6250 7900 6150
Entry Wire Line
	8000 6150 7900 6050
Entry Wire Line
	8000 6050 7900 5950
Entry Wire Line
	8000 5950 7900 5850
Entry Wire Line
	8300 2350 8200 2450
Entry Wire Line
	8300 2250 8200 2350
Entry Wire Line
	8300 2150 8200 2250
Entry Wire Line
	8300 2050 8200 2150
Entry Wire Line
	8300 1950 8200 2050
Entry Wire Line
	8300 1850 8200 1950
Entry Wire Line
	8300 1750 8200 1850
Entry Wire Line
	8300 1650 8200 1750
Entry Wire Line
	8300 1550 8200 1650
Entry Wire Line
	8300 1450 8200 1550
Entry Wire Line
	8300 1350 8200 1450
Entry Wire Line
	8300 1250 8200 1350
Entry Wire Line
	8300 1150 8200 1250
Entry Wire Line
	8300 1050 8200 1150
Entry Wire Line
	8300 950  8200 1050
Entry Wire Line
	8300 850  8200 950 
Entry Wire Line
	5500 850  5600 950 
Entry Wire Line
	5500 950  5600 1050
Entry Wire Line
	5500 1050 5600 1150
Entry Wire Line
	5500 1150 5600 1250
Entry Wire Line
	5500 1250 5600 1350
Entry Wire Line
	5500 1350 5600 1450
Entry Wire Line
	5500 1450 5600 1550
Entry Wire Line
	5500 1550 5600 1650
Entry Wire Line
	5500 1650 5600 1750
Entry Wire Line
	5500 1750 5600 1850
Entry Wire Line
	5500 1850 5600 1950
Entry Wire Line
	5500 1950 5600 2050
Entry Wire Line
	5500 2050 5600 2150
Entry Wire Line
	5500 2150 5600 2250
Entry Wire Line
	5500 2250 5600 2350
Entry Wire Line
	5500 2350 5600 2450
Entry Wire Line
	5500 2450 5600 2550
Entry Wire Line
	5500 2550 5600 2650
Entry Wire Line
	5500 2650 5600 2750
Entry Wire Line
	5500 2750 5600 2850
Entry Wire Line
	5500 2850 5600 2950
Entry Wire Line
	5500 2950 5600 3050
Entry Wire Line
	5500 3050 5600 3150
Entry Wire Line
	5500 3150 5600 3250
Entry Wire Line
	5500 3250 5600 3350
Entry Wire Line
	5500 3350 5600 3450
Entry Wire Line
	5500 3450 5600 3550
Entry Wire Line
	5500 3550 5600 3650
Entry Wire Line
	5500 3650 5600 3750
Entry Wire Line
	5500 3750 5600 3850
Entry Wire Line
	5500 3850 5600 3950
Entry Wire Line
	5500 3950 5600 4050
Entry Wire Line
	8700 900  8800 1000
Entry Wire Line
	8700 1000 8800 1100
Entry Wire Line
	8700 1100 8800 1200
Entry Wire Line
	8700 1200 8800 1300
Entry Wire Line
	8700 1300 8800 1400
Entry Wire Line
	8700 1400 8800 1500
Entry Wire Line
	8700 1500 8800 1600
Entry Wire Line
	8700 1600 8800 1700
Entry Wire Line
	8700 2950 8800 3050
Entry Wire Line
	8700 3050 8800 3150
Entry Wire Line
	8700 3150 8800 3250
Entry Wire Line
	8700 3250 8800 3350
Entry Wire Line
	8700 3350 8800 3450
Entry Wire Line
	8700 3450 8800 3550
Entry Wire Line
	8700 3550 8800 3650
Entry Wire Line
	8700 3650 8800 3750
Entry Wire Line
	11000 1000 11100 1100
Entry Wire Line
	11000 1100 11100 1200
Entry Wire Line
	11000 1200 11100 1300
Entry Wire Line
	11000 1300 11100 1400
Entry Wire Line
	11000 1400 11100 1500
Entry Wire Line
	11000 1500 11100 1600
Entry Wire Line
	11000 1600 11100 1700
Entry Wire Line
	11000 1700 11100 1800
Entry Wire Line
	11000 3050 11100 3150
Entry Wire Line
	11000 3150 11100 3250
Entry Wire Line
	11000 3250 11100 3350
Entry Wire Line
	11000 3350 11100 3450
Entry Wire Line
	11000 3450 11100 3550
Entry Wire Line
	11000 3550 11100 3650
Entry Wire Line
	11000 3650 11100 3750
Entry Wire Line
	11000 3750 11100 3850
Wire Wire Line
	2600 1100 3200 1100
Wire Wire Line
	2600 1200 3200 1200
Wire Wire Line
	2600 1300 3200 1300
Wire Wire Line
	2600 1400 3200 1400
Wire Wire Line
	2600 1500 3200 1500
Wire Wire Line
	2600 1600 3200 1600
Wire Wire Line
	2600 1700 3200 1700
Wire Wire Line
	2600 1800 3200 1800
Wire Wire Line
	2600 1900 3200 1900
Wire Wire Line
	2600 2000 3200 2000
Wire Wire Line
	2600 2100 3200 2100
Wire Wire Line
	2600 2200 3200 2200
Wire Wire Line
	2600 2300 3200 2300
Wire Wire Line
	2600 2400 3200 2400
Wire Wire Line
	2600 2500 3200 2500
Wire Wire Line
	2600 2600 3200 2600
Wire Wire Line
	2600 2700 3200 2700
Wire Wire Line
	2600 2800 3200 2800
Wire Wire Line
	2600 2900 3200 2900
Wire Wire Line
	2600 3000 3200 3000
Wire Wire Line
	2600 3100 3200 3100
Wire Wire Line
	2600 3200 3200 3200
Wire Wire Line
	2600 3300 3200 3300
Wire Wire Line
	4950 1100 4350 1100
Wire Wire Line
	4950 1200 4350 1200
Wire Wire Line
	4950 1300 4350 1300
Wire Wire Line
	4950 1400 4350 1400
Wire Wire Line
	4950 1500 4350 1500
Wire Wire Line
	4950 1600 4350 1600
Wire Wire Line
	4950 1700 4350 1700
Wire Wire Line
	4950 1800 4350 1800
Wire Wire Line
	4950 1900 4350 1900
Wire Wire Line
	4950 2000 4350 2000
Wire Wire Line
	4950 2100 4350 2100
Wire Wire Line
	4950 2200 4350 2200
Wire Wire Line
	4950 2300 4350 2300
Wire Wire Line
	4950 2400 4350 2400
Wire Wire Line
	4950 2500 4350 2500
Wire Wire Line
	4950 2600 4350 2600
Wire Wire Line
	3550 3700 3000 3700
Wire Wire Line
	3550 3800 3000 3800
Wire Wire Line
	3550 3900 3000 3900
Wire Wire Line
	3550 4000 3000 4000
Wire Wire Line
	3550 4100 3000 4100
Wire Wire Line
	3550 4200 3000 4200
Wire Wire Line
	3550 4300 3000 4300
Wire Wire Line
	3550 4400 3000 4400
Wire Wire Line
	3550 4500 3000 4500
Wire Wire Line
	3550 4600 3000 4600
Wire Wire Line
	3550 4700 3000 4700
Wire Wire Line
	3550 4800 3000 4800
Wire Wire Line
	3550 4900 3000 4900
Wire Wire Line
	3550 5000 3000 5000
Wire Wire Line
	3550 5100 3000 5100
Wire Wire Line
	3550 5200 3000 5200
Wire Wire Line
	7450 6150 7900 6150
Wire Wire Line
	7450 6050 7900 6050
Wire Wire Line
	5000 3700 4450 3700
Wire Wire Line
	5000 3800 4450 3800
Wire Wire Line
	5000 3900 4450 3900
Wire Wire Line
	5000 4000 4450 4000
Wire Wire Line
	5000 4100 4450 4100
Wire Wire Line
	5000 4200 4450 4200
Wire Wire Line
	5000 4300 4450 4300
Wire Wire Line
	5000 4400 4450 4400
Wire Wire Line
	5000 4500 4450 4500
Wire Wire Line
	5000 4600 4450 4600
Wire Wire Line
	5000 4700 4450 4700
Wire Wire Line
	5000 4800 4450 4800
Wire Wire Line
	5000 4900 4450 4900
Wire Wire Line
	5000 5000 4450 5000
Wire Wire Line
	5000 5100 4450 5100
Wire Wire Line
	5000 5200 4450 5200
Wire Wire Line
	7450 5950 7900 5950
Wire Wire Line
	7450 5850 7900 5850
Wire Wire Line
	8200 950  7650 950 
Wire Wire Line
	8200 1050 7650 1050
Wire Wire Line
	8200 1150 7650 1150
Wire Wire Line
	8200 1250 7650 1250
Wire Wire Line
	8200 1350 7650 1350
Wire Wire Line
	8200 1450 7650 1450
Wire Wire Line
	8200 1550 7650 1550
Wire Wire Line
	8200 1650 7650 1650
Wire Wire Line
	8200 1750 7650 1750
Wire Wire Line
	8200 1850 7650 1850
Wire Wire Line
	8200 1950 7650 1950
Wire Wire Line
	8200 2050 7650 2050
Wire Wire Line
	8200 2150 7650 2150
Wire Wire Line
	8200 2250 7650 2250
Wire Wire Line
	8200 2350 7650 2350
Wire Wire Line
	8200 2450 7650 2450
Wire Wire Line
	1000 4500 1100 4500
Wire Wire Line
	1100 4600 1000 4600
Wire Wire Line
	750  4700 750  5100
Wire Wire Line
	650  4700 650  5100
Wire Wire Line
	6150 950  5600 950 
Wire Wire Line
	6150 1050 5600 1050
Wire Wire Line
	6150 1150 5600 1150
Wire Wire Line
	6150 1250 5600 1250
Wire Wire Line
	6150 1350 5600 1350
Wire Wire Line
	6150 1450 5600 1450
Wire Wire Line
	6150 1550 5600 1550
Wire Wire Line
	6150 1650 5600 1650
Wire Wire Line
	6150 1750 5600 1750
Wire Wire Line
	6150 1850 5600 1850
Wire Wire Line
	6150 1950 5600 1950
Wire Wire Line
	6150 2050 5600 2050
Wire Wire Line
	6150 2150 5600 2150
Wire Wire Line
	6150 2250 5600 2250
Wire Wire Line
	6150 2350 5600 2350
Wire Wire Line
	6150 2450 5600 2450
Wire Wire Line
	6150 2550 5600 2550
Wire Wire Line
	6150 2650 5600 2650
Wire Wire Line
	6150 2750 5600 2750
Wire Wire Line
	6150 2850 5600 2850
Wire Wire Line
	6150 2950 5600 2950
Wire Wire Line
	6150 3050 5600 3050
Wire Wire Line
	6150 3150 5600 3150
Wire Wire Line
	6150 3250 5600 3250
Wire Wire Line
	6150 3350 5600 3350
Wire Wire Line
	6150 3450 5600 3450
Wire Wire Line
	6150 3550 5600 3550
Wire Wire Line
	6150 3650 5600 3650
Wire Wire Line
	6150 3750 5600 3750
Wire Wire Line
	6150 3850 5600 3850
Wire Wire Line
	6150 3950 5600 3950
Wire Wire Line
	6150 4050 5600 4050
Wire Wire Line
	7650 3850 7800 3850
Wire Wire Line
	7650 4050 7800 4050
Wire Wire Line
	8800 1300 9450 1300
Wire Wire Line
	8800 1400 9450 1400
Wire Wire Line
	8800 1500 9450 1500
Wire Wire Line
	8800 1600 9450 1600
Wire Wire Line
	8800 1700 9450 1700
Wire Wire Line
	8800 3050 9450 3050
Wire Wire Line
	8800 3150 9450 3150
Wire Wire Line
	8800 3250 9450 3250
Wire Wire Line
	8800 3350 9450 3350
Wire Wire Line
	8800 3450 9450 3450
Wire Wire Line
	8800 3550 9450 3550
Wire Wire Line
	8800 3650 9450 3650
Wire Wire Line
	8800 3750 9450 3750
Wire Wire Line
	9600 2750 9950 2750
Wire Wire Line
	10100 6300 10500 6300
Wire Wire Line
	9950 4350 10450 4350
Wire Wire Line
	10450 3050 11000 3050
Wire Wire Line
	10450 3150 11000 3150
Wire Wire Line
	10450 3250 11000 3250
Wire Wire Line
	10450 3350 11000 3350
Wire Wire Line
	10450 3450 11000 3450
Wire Wire Line
	10450 3550 11000 3550
Wire Wire Line
	10450 3650 11000 3650
Wire Wire Line
	10450 3750 11000 3750
Wire Wire Line
	10450 4050 10450 3950
Wire Wire Line
	10450 4350 10450 4050
Wire Wire Line
	10800 5450 10900 5450
Wire Wire Line
	10900 5450 10900 5600
Wire Wire Line
	1250 750  1250 950 
Wire Wire Line
	1250 750  1350 750 
Wire Wire Line
	1400 950  1250 950 
Wire Wire Line
	1600 950  1800 950 
Wire Wire Line
	1650 750  1800 750 
Wire Wire Line
	1800 750  1800 950 
Wire Wire Line
	2000 850  2000 950 
Wire Bus Line
	2550 900  2500 900 
Wire Bus Line
	8000 6350 7850 6350
Wire Bus Line
	5500 750  5300 750 
Wire Bus Line
	11100 4500 10950 4500
Text Label 2650 1100 0    50   ~ 0
CPU-ADDR1
Text Label 2650 1200 0    50   ~ 0
CPU-ADDR2
Text Label 2650 1300 0    50   ~ 0
CPU-ADDR3
Text Label 2650 1400 0    50   ~ 0
CPU-ADDR4
Text Label 2650 1500 0    50   ~ 0
CPU-ADDR5
Text Label 2650 1600 0    50   ~ 0
CPU-ADDR6
Text Label 2650 1700 0    50   ~ 0
CPU-ADDR7
Text Label 2650 1800 0    50   ~ 0
CPU-ADDR8
Text Label 2650 1900 0    50   ~ 0
CPU-ADDR9
Text Label 2650 2000 0    50   ~ 0
CPU-ADDR10
Text Label 2650 2100 0    50   ~ 0
CPU-ADDR11
Text Label 2650 2200 0    50   ~ 0
CPU-ADDR12
Text Label 2650 2300 0    50   ~ 0
CPU-ADDR13
Text Label 2650 2400 0    50   ~ 0
CPU-ADDR14
Text Label 2650 2500 0    50   ~ 0
CPU-ADDR15
Text Label 2650 2600 0    50   ~ 0
CPU-ADDR16
Text Label 2650 2700 0    50   ~ 0
CPU-ADDR17
Text Label 2650 2800 0    50   ~ 0
CPU-ADDR18
Text Label 2650 2900 0    50   ~ 0
CPU-ADDR19
Text Label 2650 3000 0    50   ~ 0
CPU-ADDR20
Text Label 2650 3100 0    50   ~ 0
CPU-ADDR21
Text Label 2650 3200 0    50   ~ 0
CPU-ADDR22
Text Label 2650 3300 0    50   ~ 0
CPU-ADDR23
Text Label 4900 1100 2    50   ~ 0
CPU-DATA0
Text Label 4900 1200 2    50   ~ 0
CPU-DATA1
Text Label 4900 1300 2    50   ~ 0
CPU-DATA2
Text Label 4900 1400 2    50   ~ 0
CPU-DATA3
Text Label 4900 1500 2    50   ~ 0
CPU-DATA4
Text Label 4900 1600 2    50   ~ 0
CPU-DATA5
Text Label 4900 1700 2    50   ~ 0
CPU-DATA6
Text Label 4900 1800 2    50   ~ 0
CPU-DATA7
Text Label 4900 1900 2    50   ~ 0
CPU-DATA8
Text Label 4900 2000 2    50   ~ 0
CPU-DATA9
Text Label 4900 2100 2    50   ~ 0
CPU-DATA10
Text Label 4900 2200 2    50   ~ 0
CPU-DATA11
Text Label 4900 2300 2    50   ~ 0
CPU-DATA12
Text Label 4900 2400 2    50   ~ 0
CPU-DATA13
Text Label 4900 2500 2    50   ~ 0
CPU-DATA14
Text Label 4900 2600 2    50   ~ 0
CPU-DATA15
Text Label 3500 3700 2    50   ~ 0
GFX-BUS0
Text Label 3500 3800 2    50   ~ 0
GFX-BUS1
Text Label 3500 3900 2    50   ~ 0
GFX-BUS2
Text Label 3500 4000 2    50   ~ 0
GFX-BUS3
Text Label 3500 4100 2    50   ~ 0
GFX-BUS4
Text Label 3500 4200 2    50   ~ 0
GFX-BUS5
Text Label 3500 4300 2    50   ~ 0
GFX-BUS6
Text Label 3500 4400 2    50   ~ 0
GFX-BUS7
Text Label 3500 4500 2    50   ~ 0
GFX-BUS8
Text Label 3500 4600 2    50   ~ 0
GFX-BUS9
Text Label 3500 4700 2    50   ~ 0
GFX-BUS10
Text Label 3500 4800 2    50   ~ 0
GFX-BUS11
Text Label 3500 4900 2    50   ~ 0
GFX-BUS12
Text Label 3500 5000 2    50   ~ 0
GFX-BUS13
Text Label 3500 5100 2    50   ~ 0
GFX-BUS14
Text Label 3500 5200 2    50   ~ 0
GFX-BUS15
Text Label 7850 6150 2    50   ~ 0
SECURITY2
Text Label 7850 6050 2    50   ~ 0
SECURITY3
Text Label 4950 3700 2    50   ~ 0
GFX-BUS16
Text Label 4950 3800 2    50   ~ 0
GFX-BUS17
Text Label 4950 3900 2    50   ~ 0
GFX-BUS18
Text Label 4950 4000 2    50   ~ 0
GFX-BUS19
Text Label 4950 4100 2    50   ~ 0
GFX-BUS20
Text Label 4950 4200 2    50   ~ 0
GFX-BUS21
Text Label 4950 4300 2    50   ~ 0
GFX-BUS22
Text Label 4950 4400 2    50   ~ 0
GFX-BUS23
Text Label 4950 4500 2    50   ~ 0
GFX-BUS24
Text Label 4950 4600 2    50   ~ 0
GFX-BUS25
Text Label 4950 4700 2    50   ~ 0
GFX-BUS26
Text Label 4950 4800 2    50   ~ 0
GFX-BUS27
Text Label 4950 4900 2    50   ~ 0
GFX-BUS28
Text Label 4950 5000 2    50   ~ 0
GFX-BUS29
Text Label 4950 5100 2    50   ~ 0
GFX-BUS30
Text Label 4950 5200 2    50   ~ 0
GFX-BUS31
Text Label 7850 5950 2    50   ~ 0
SECURITY4
Text Label 7850 5850 2    50   ~ 0
SECURITY5
Text Label 8200 950  2    50   ~ 0
GFX-OUT-A0
Text Label 8200 1050 2    50   ~ 0
GFX-OUT-A1
Text Label 8200 1150 2    50   ~ 0
GFX-OUT-A2
Text Label 8200 1250 2    50   ~ 0
GFX-OUT-A3
Text Label 8200 1350 2    50   ~ 0
GFX-OUT-A4
Text Label 8200 1450 2    50   ~ 0
GFX-OUT-A5
Text Label 8200 1550 2    50   ~ 0
GFX-OUT-A6
Text Label 8200 1650 2    50   ~ 0
GFX-OUT-A7
Text Label 8200 1750 2    50   ~ 0
GFX-OUT-A8
Text Label 8200 1850 2    50   ~ 0
GFX-OUT-A9
Text Label 8200 1950 2    50   ~ 0
GFX-OUT-A10
Text Label 8200 2050 2    50   ~ 0
GFX-OUT-A11
Text Label 8200 2150 2    50   ~ 0
GFX-OUT-A12
Text Label 8200 2250 2    50   ~ 0
GFX-OUT-A13
Text Label 8200 2350 2    50   ~ 0
GFX-OUT-A14
Text Label 8200 2450 2    50   ~ 0
GFX-OUT-A15
Text Label 750  4700 3    50   ~ 0
SECURITY5
Text Label 6100 950  2    50   ~ 0
GFX-BUS31
Text Label 6100 1050 2    50   ~ 0
GFX-BUS30
Text Label 6100 1150 2    50   ~ 0
GFX-BUS29
Text Label 6100 1250 2    50   ~ 0
GFX-BUS28
Text Label 6100 1350 2    50   ~ 0
GFX-BUS27
Text Label 6100 1450 2    50   ~ 0
GFX-BUS26
Text Label 6100 1550 2    50   ~ 0
GFX-BUS25
Text Label 6100 1650 2    50   ~ 0
GFX-BUS24
Text Label 6100 1750 2    50   ~ 0
GFX-BUS23
Text Label 6100 1850 2    50   ~ 0
GFX-BUS22
Text Label 6100 1950 2    50   ~ 0
GFX-BUS21
Text Label 6100 2050 2    50   ~ 0
GFX-BUS20
Text Label 6100 2150 2    50   ~ 0
GFX-BUS19
Text Label 6100 2250 2    50   ~ 0
GFX-BUS18
Text Label 6100 2350 2    50   ~ 0
GFX-BUS17
Text Label 6100 2450 2    50   ~ 0
GFX-BUS16
Text Label 6100 2550 2    50   ~ 0
GFX-BUS15
Text Label 6100 2650 2    50   ~ 0
GFX-BUS14
Text Label 6100 2750 2    50   ~ 0
GFX-BUS13
Text Label 6100 2850 2    50   ~ 0
GFX-BUS12
Text Label 6100 2950 2    50   ~ 0
GFX-BUS11
Text Label 6100 3050 2    50   ~ 0
GFX-BUS10
Text Label 6100 3150 2    50   ~ 0
GFX-BUS9
Text Label 6100 3250 2    50   ~ 0
GFX-BUS8
Text Label 6100 3350 2    50   ~ 0
GFX-BUS7
Text Label 6100 3450 2    50   ~ 0
GFX-BUS6
Text Label 6100 3550 2    50   ~ 0
GFX-BUS5
Text Label 6100 3650 2    50   ~ 0
GFX-BUS4
Text Label 6100 3750 2    50   ~ 0
GFX-BUS3
Text Label 6100 3850 2    50   ~ 0
GFX-BUS2
Text Label 6100 3950 2    50   ~ 0
GFX-BUS1
Text Label 6100 4050 2    50   ~ 0
GFX-BUS0
Text Label 8850 1400 0    50   ~ 0
GFX-OUT-A1
Text Label 8850 1500 0    50   ~ 0
GFX-OUT-A3
Text Label 8850 1600 0    50   ~ 0
GFX-OUT-A5
Text Label 8850 1700 0    50   ~ 0
GFX-OUT-A7
Text Label 8850 3050 0    50   ~ 0
GFX-OUT-A8
Text Label 8850 3150 0    50   ~ 0
GFX-OUT-A9
Text Label 8850 3250 0    50   ~ 0
GFX-OUT-A10
Text Label 8850 3350 0    50   ~ 0
GFX-OUT-A11
Text Label 8850 3450 0    50   ~ 0
GFX-OUT-A12
Text Label 8850 3550 0    50   ~ 0
GFX-OUT-A13
Text Label 8850 3650 0    50   ~ 0
GFX-OUT-A14
Text Label 8850 3750 0    50   ~ 0
GFX-OUT-A15
Text Label 10150 6300 0    50   ~ 0
SPA102
Text Label 10500 1000 0    50   ~ 0
GFX-OUT0
Text Label 10500 1100 0    50   ~ 0
GFX-OUT2
Text Label 10500 1200 0    50   ~ 0
GFX-OUT4
Text Label 10500 1300 0    50   ~ 0
GFX-OUT6
Text Label 10500 1400 0    50   ~ 0
GFX-OUT1
Text Label 10500 1500 0    50   ~ 0
GFX-OUT3
Text Label 10500 1600 0    50   ~ 0
GFX-OUT5
Text Label 10500 1700 0    50   ~ 0
GFX-OUT7
Text Label 10500 3050 0    50   ~ 0
GFX-OUT8
Text Label 10500 3150 0    50   ~ 0
GFX-OUT9
Text Label 10500 3250 0    50   ~ 0
GFX-OUT10
Text Label 10500 3350 0    50   ~ 0
GFX-OUT11
Text Label 10500 3450 0    50   ~ 0
GFX-OUT12
Text Label 10500 3550 0    50   ~ 0
GFX-OUT13
Text Label 10500 3650 0    50   ~ 0
GFX-OUT14
Text Label 10500 3750 0    50   ~ 0
GFX-OUT15
Text HLabel 1400 7700 2    50   BiDi ~ 0
OBJRAM-D[0..15]
Text HLabel 4900 2850 0    50   Input ~ 0
CPU-DATA[0..15]
Text HLabel 2550 900  2    50   Output ~ 0
CPU-ADDR[1..23]
Text HLabel 7850 6350 0    50   Input ~ 0
SECURITY[2..5]
Text HLabel 7800 3850 2    50   Output ~ 0
GFX-DATA-E
Text HLabel 7800 4050 2    50   Output ~ 0
GFX-ADDR-W
Text HLabel 6350 6150 0    50   Input ~ 0
CLK
Text HLabel 6350 6050 0    50   Input ~ 0
ENABLE
Text HLabel 5300 750  0    50   BiDi ~ 0
GFX-BUS[0..31]
Text HLabel 10950 4500 0    50   Output ~ 0
GFX-OUT[0..15]
$Comp
L power:VDD #PWR?
U 1 1 5E594D07
P 2600 3700
AR Path="/5DC1E7F0/5E594D07" Ref="#PWR?"  Part="1" 
AR Path="/5D9F70E5/5E594D07" Ref="#PWR0292"  Part="1" 
F 0 "#PWR0292" H 2600 3550 50  0001 C CNN
F 1 "VDD" H 2700 3700 50  0000 C BNN
F 2 "" H 2600 3700 50  0001 C CNN
F 3 "" H 2600 3700 50  0001 C CNN
	1    2600 3700
	-1   0    0    -1  
$EndComp
$Comp
L power:VDD #PWR?
U 1 1 5E504A5F
P 2600 4500
AR Path="/5DC1E7F0/5E504A5F" Ref="#PWR?"  Part="1" 
AR Path="/5D9F70E5/5E504A5F" Ref="#PWR0291"  Part="1" 
F 0 "#PWR0291" H 2600 4350 50  0001 C CNN
F 1 "VDD" H 2500 4500 50  0000 C BNN
F 2 "" H 2600 4500 50  0001 C CNN
F 3 "" H 2600 4500 50  0001 C CNN
	1    2600 4500
	1    0    0    -1  
$EndComp
$Comp
L power:VDD #PWR?
U 1 1 5E5BE12E
P 4050 3700
AR Path="/5DC1E7F0/5E5BE12E" Ref="#PWR?"  Part="1" 
AR Path="/5D9F70E5/5E5BE12E" Ref="#PWR0294"  Part="1" 
F 0 "#PWR0294" H 4050 3550 50  0001 C CNN
F 1 "VDD" H 4150 3700 50  0000 C BNN
F 2 "" H 4050 3700 50  0001 C CNN
F 3 "" H 4050 3700 50  0001 C CNN
	1    4050 3700
	-1   0    0    -1  
$EndComp
$Comp
L power:VDD #PWR?
U 1 1 5E5BE128
P 4050 4500
AR Path="/5DC1E7F0/5E5BE128" Ref="#PWR?"  Part="1" 
AR Path="/5D9F70E5/5E5BE128" Ref="#PWR0293"  Part="1" 
F 0 "#PWR0293" H 4050 4350 50  0001 C CNN
F 1 "VDD" H 4150 4500 50  0000 C BNN
F 2 "" H 4050 4500 50  0001 C CNN
F 3 "" H 4050 4500 50  0001 C CNN
	1    4050 4500
	-1   0    0    -1  
$EndComp
$Comp
L power:VCC #PWR0295
U 1 1 5E6D2C48
P 1350 5500
F 0 "#PWR0295" H 1350 5350 50  0001 C CNN
F 1 "VCC" H 1367 5673 50  0000 C CNN
F 2 "" H 1350 5500 50  0001 C CNN
F 3 "" H 1350 5500 50  0001 C CNN
	1    1350 5500
	0    1    -1   0   
$EndComp
$Comp
L power:VCC #PWR0290
U 1 1 5E3DDAC2
P 9700 4850
F 0 "#PWR0290" H 9700 4700 50  0001 C CNN
F 1 "VCC" H 9717 5023 50  0000 C CNN
F 2 "" H 9700 4850 50  0001 C CNN
F 3 "" H 9700 4850 50  0001 C CNN
	1    9700 4850
	-1   0    0    -1  
$EndComp
$Comp
L power:VCC #PWR0289
U 1 1 5E3AF7AE
P 9700 5650
F 0 "#PWR0289" H 9700 5500 50  0001 C CNN
F 1 "VCC" H 9600 5700 50  0000 C CNN
F 2 "" H 9700 5650 50  0001 C CNN
F 3 "" H 9700 5650 50  0001 C CNN
	1    9700 5650
	-1   0    0    -1  
$EndComp
$Comp
L power:VCC #PWR?
U 1 1 5DB67C94
P 9600 2750
AR Path="/635BEEB0/5DB67C94" Ref="#PWR?"  Part="1" 
AR Path="/5DB67C94" Ref="#PWR?"  Part="1" 
AR Path="/5DC1E7F0/5DB67C94" Ref="#PWR?"  Part="1" 
AR Path="/5D9F70E5/5DB67C94" Ref="#PWR0286"  Part="1" 
F 0 "#PWR0286" H 9600 2600 50  0001 C CNN
F 1 "VCC" V 9618 2878 50  0000 L CNN
F 2 "" H 9600 2750 50  0001 C CNN
F 3 "" H 9600 2750 50  0001 C CNN
	1    9600 2750
	0    -1   -1   0   
$EndComp
$Comp
L power:VCC #PWR0296
U 1 1 5E7228FA
P 10900 5450
F 0 "#PWR0296" H 10900 5300 50  0001 C CNN
F 1 "VCC" H 10917 5623 50  0000 C CNN
F 2 "" H 10900 5450 50  0001 C CNN
F 3 "" H 10900 5450 50  0001 C CNN
	1    10900 5450
	1    0    0    -1  
$EndComp
$Comp
L power:VDD #PWR?
U 1 1 5D9FF3D7
P 1100 850
AR Path="/5DC1E7F0/5D9FF3D7" Ref="#PWR?"  Part="1" 
AR Path="/5D9F70E5/5D9FF3D7" Ref="#PWR0279"  Part="1" 
F 0 "#PWR0279" H 1100 700 50  0001 C CNN
F 1 "VDD" H 1117 1023 50  0000 C CNN
F 2 "" H 1100 850 50  0001 C CNN
F 3 "" H 1100 850 50  0001 C CNN
	1    1100 850 
	-1   0    0    -1  
$EndComp
$Comp
L power:VCC #PWR0281
U 1 1 5DA06ACB
P 2000 4600
F 0 "#PWR0281" H 2000 4450 50  0001 C CNN
F 1 "VCC" H 2017 4773 50  0000 C CNN
F 2 "" H 2000 4600 50  0001 C CNN
F 3 "" H 2000 4600 50  0001 C CNN
	1    2000 4600
	1    0    0    -1  
$EndComp
$Comp
L power:GND #PWR?
U 1 1 5DAFC380
P 9950 2300
AR Path="/635BEEB0/5DAFC380" Ref="#PWR?"  Part="1" 
AR Path="/5DAFC380" Ref="#PWR?"  Part="1" 
AR Path="/5DC1E7F0/5DAFC380" Ref="#PWR?"  Part="1" 
AR Path="/5D9F70E5/5DAFC380" Ref="#PWR0282"  Part="1" 
F 0 "#PWR0282" H 9950 2050 50  0001 C CNN
F 1 "GND" H 9955 2127 50  0001 C CNN
F 2 "" H 9950 2300 50  0001 C CNN
F 3 "" H 9950 2300 50  0001 C CNN
	1    9950 2300
	-1   0    0    -1  
$EndComp
$Comp
L power:GND #PWR?
U 1 1 5DB67C8E
P 9950 4350
AR Path="/635BEEB0/5DB67C8E" Ref="#PWR?"  Part="1" 
AR Path="/5DB67C8E" Ref="#PWR?"  Part="1" 
AR Path="/5DC1E7F0/5DB67C8E" Ref="#PWR?"  Part="1" 
AR Path="/5D9F70E5/5DB67C8E" Ref="#PWR0285"  Part="1" 
F 0 "#PWR0285" H 9950 4100 50  0001 C CNN
F 1 "GND" H 9955 4177 50  0001 C CNN
F 2 "" H 9950 4350 50  0001 C CNN
F 3 "" H 9950 4350 50  0001 C CNN
	1    9950 4350
	-1   0    0    -1  
$EndComp
$Comp
L power:GND #PWR?
U 1 1 5DAFC39F
P 10450 700
AR Path="/635BEEB0/5DAFC39F" Ref="#PWR?"  Part="1" 
AR Path="/5DAFC39F" Ref="#PWR?"  Part="1" 
AR Path="/5DC1E7F0/5DAFC39F" Ref="#PWR?"  Part="1" 
AR Path="/5D9F70E5/5DAFC39F" Ref="#PWR0284"  Part="1" 
F 0 "#PWR0284" H 10450 450 50  0001 C CNN
F 1 "GND" H 10455 527 50  0001 C CNN
F 2 "" H 10450 700 50  0001 C CNN
F 3 "" H 10450 700 50  0001 C CNN
	1    10450 700 
	-1   0    0    -1  
$EndComp
$Comp
L power:GND #PWR0280
U 1 1 5DA02B27
P 2000 850
F 0 "#PWR0280" H 2000 600 50  0001 C CNN
F 1 "GND" H 2005 677 50  0000 C CNN
F 2 "" H 2000 850 50  0001 C CNN
F 3 "" H 2000 850 50  0001 C CNN
	1    2000 850 
	-1   0    0    1   
$EndComp
$Comp
L Device:R_Small R10
U 1 1 5E1EC55E
P 900 4500
F 0 "R10" H 959 4546 50  0000 L CNN
F 1 "4.7k" H 959 4455 50  0000 L CNN
F 2 "" H 900 4500 50  0001 C CNN
F 3 "~" H 900 4500 50  0001 C CNN
	1    900  4500
	0    1    1    0   
$EndComp
$Comp
L Device:R_Small R9
U 1 1 5E96397E
P 10700 5450
F 0 "R9" V 10500 5450 50  0000 C CNN
F 1 "4.7k" V 10600 5450 50  0000 C CNN
F 2 "" H 10700 5450 50  0001 C CNN
F 3 "~" H 10700 5450 50  0001 C CNN
	1    10700 5450
	0    1    1    0   
$EndComp
$Comp
L Device:C_Small C?
U 1 1 5DAFC399
P 10350 700
AR Path="/635BEEB0/5DAFC399" Ref="C?"  Part="1" 
AR Path="/5DAFC399" Ref="C?"  Part="1" 
AR Path="/5DC1E7F0/5DAFC399" Ref="C?"  Part="1" 
AR Path="/5D9F70E5/5DAFC399" Ref="CX36"  Part="1" 
F 0 "CX36" V 10121 700 50  0001 C CNN
F 1 "0.1u" V 10213 700 50  0000 C TNN
F 2 "" H 10350 700 50  0001 C CNN
F 3 "~" H 10350 700 50  0001 C CNN
	1    10350 700 
	0    -1   1    0   
$EndComp
$Comp
L Device:C_Small CX?
U 1 1 5DE8AD63
P 1500 950
AR Path="/5E35B989/5DE8AD63" Ref="CX?"  Part="1" 
AR Path="/5DC1E7F0/5DE8AD63" Ref="CX?"  Part="1" 
AR Path="/5D9F70E5/5DE8AD63" Ref="CX35"  Part="1" 
F 0 "CX35" H 1592 996 50  0001 L CNN
F 1 "0.1u" V 1450 750 50  0000 L CNN
F 2 "" H 1500 950 50  0001 C CNN
F 3 "~" H 1500 950 50  0001 C CNN
	1    1500 950 
	0    1    -1   0   
$EndComp
$Comp
L Device:C EXC?
U 1 1 5DE8AD69
P 1500 750
AR Path="/5E35B989/5DE8AD69" Ref="EXC?"  Part="1" 
AR Path="/5DC1E7F0/5DE8AD69" Ref="EXC?"  Part="1" 
AR Path="/5D9F70E5/5DE8AD69" Ref="EXC2"  Part="1" 
F 0 "EXC2" V 1550 800 50  0000 L CNN
F 1 "1u" V 1550 600 50  0000 L CNN
F 2 "" H 1538 600 50  0001 C CNN
F 3 "~" H 1500 750 50  0001 C CNN
	1    1500 750 
	0    1    1    0   
$EndComp
$Comp
L Device:R_Network08 RA30
U 1 1 5E43CD69
P 2800 4100
F 0 "RA30" H 2950 4300 50  0000 R CNN
F 1 "4.7k" H 2650 4300 50  0000 R CNN
F 2 "Resistor_THT:R_Array_SIP9" V 3275 4100 50  0001 C CNN
F 3 "http://www.vishay.com/docs/31509/csc.pdf" H 2800 4100 50  0001 C CNN
	1    2800 4100
	0    -1   1    0   
$EndComp
$Comp
L Device:R_Network08 RA31
U 1 1 5E43CD5C
P 2800 4900
F 0 "RA31" H 3100 5100 50  0000 R CNN
F 1 "4.7k" H 2850 5100 50  0000 R CNN
F 2 "Resistor_THT:R_Array_SIP9" V 3275 4900 50  0001 C CNN
F 3 "http://www.vishay.com/docs/31509/csc.pdf" H 2800 4900 50  0001 C CNN
	1    2800 4900
	0    -1   1    0   
$EndComp
$Comp
L Device:R_Network08 RA32
U 1 1 5E5BE101
P 4250 4100
F 0 "RA32" H 4400 4300 50  0000 R CNN
F 1 "4.7k" H 4100 4300 50  0000 R CNN
F 2 "Resistor_THT:R_Array_SIP9" V 4725 4100 50  0001 C CNN
F 3 "http://www.vishay.com/docs/31509/csc.pdf" H 4250 4100 50  0001 C CNN
	1    4250 4100
	0    -1   1    0   
$EndComp
$Comp
L Device:R_Network08 RA33
U 1 1 5E5BE0FA
P 4250 4900
F 0 "RA33" H 4550 5100 50  0000 R CNN
F 1 "4.7k" H 4300 5100 50  0000 R CNN
F 2 "Resistor_THT:R_Array_SIP9" V 4725 4900 50  0001 C CNN
F 3 "http://www.vishay.com/docs/31509/csc.pdf" H 4250 4900 50  0001 C CNN
	1    4250 4900
	0    -1   1    0   
$EndComp
$Comp
L Device:R_Network08 RA13
U 1 1 5E1837FF
P 900 3200
F 0 "RA13" H 1200 3400 50  0000 R CNN
F 1 "4.7k" H 950 3400 50  0000 R CNN
F 2 "Resistor_THT:R_Array_SIP9" V 1375 3200 50  0001 C CNN
F 3 "http://www.vishay.com/docs/31509/csc.pdf" H 900 3200 50  0001 C CNN
	1    900  3200
	0    -1   -1   0   
$EndComp
$Comp
L Device:R_Network08 RA14
U 1 1 5E1838BD
P 900 4000
F 0 "RA14" H 1200 4200 50  0000 R CNN
F 1 "4.7k" H 900 4200 50  0000 R CNN
F 2 "Resistor_THT:R_Array_SIP9" V 1375 4000 50  0001 C CNN
F 3 "http://www.vishay.com/docs/31509/csc.pdf" H 900 4000 50  0001 C CNN
	1    900  4000
	0    -1   -1   0   
$EndComp
$Comp
L Device:R_Network08 RA6
U 1 1 5E6D2C41
P 950 5300
F 0 "RA6" H 1250 5500 50  0000 R CNN
F 1 "4.7k" H 1000 5500 50  0000 R CNN
F 2 "Resistor_THT:R_Array_SIP9" V 1425 5300 50  0001 C CNN
F 3 "http://www.vishay.com/docs/31509/csc.pdf" H 950 5300 50  0001 C CNN
	1    950  5300
	-1   0    0    1   
$EndComp
$Comp
L Device:R_Network08 RA8
U 1 1 5E3DDABB
P 9500 5250
F 0 "RA8" H 9650 5450 50  0000 R CNN
F 1 "4.7k" H 9350 5450 50  0000 R CNN
F 2 "Resistor_THT:R_Array_SIP9" V 9975 5250 50  0001 C CNN
F 3 "http://www.vishay.com/docs/31509/csc.pdf" H 9500 5250 50  0001 C CNN
	1    9500 5250
	0    1    1    0   
$EndComp
$Comp
L Device:R_Network08 RA11
U 1 1 5E3AF7A7
P 9500 6050
F 0 "RA11" H 9800 6250 50  0000 R CNN
F 1 "4.7k" H 9550 6250 50  0000 R CNN
F 2 "Resistor_THT:R_Array_SIP9" V 9975 6050 50  0001 C CNN
F 3 "http://www.vishay.com/docs/31509/csc.pdf" H 9500 6050 50  0001 C CNN
	1    9500 6050
	0    1    1    0   
$EndComp
$Comp
L Device:R_Network08 RA7
U 1 1 5E7228F3
P 10700 6000
F 0 "RA7" H 11000 6200 50  0000 R CNN
F 1 "4.7k" H 10750 6200 50  0000 R CNN
F 2 "Resistor_THT:R_Array_SIP9" V 11175 6000 50  0001 C CNN
F 3 "http://www.vishay.com/docs/31509/csc.pdf" H 10700 6000 50  0001 C CNN
	1    10700 6000
	0    1    1    0   
$EndComp
$Comp
L 74xx:74LS245 U10L?
U 1 1 5DB67CAC
P 9950 3550
AR Path="/635BEEB0/5DB67CAC" Ref="U10L?"  Part="1" 
AR Path="/5DB67CAC" Ref="U10L?"  Part="1" 
AR Path="/5DC1E7F0/5DB67CAC" Ref="U10L?"  Part="1" 
AR Path="/5D9F70E5/5DB67CAC" Ref="UM10"  Part="1" 
F 0 "UM10" H 9950 4528 50  0000 C CNN
F 1 "74LS245" H 9950 4437 50  0000 C CNN
F 2 "" H 9950 3550 50  0001 C CNN
F 3 "http://www.ti.com/lit/gpn/sn74LS245" H 9950 3550 50  0001 C CNN
	1    9950 3550
	-1   0    0    -1  
$EndComp
Wire Wire Line
	10450 1700 11000 1700
Wire Wire Line
	10450 1600 11000 1600
Wire Wire Line
	10450 1500 11000 1500
Wire Wire Line
	10450 1400 11000 1400
Wire Wire Line
	10450 1300 11000 1300
Wire Wire Line
	10450 1200 11000 1200
Wire Wire Line
	10450 1100 11000 1100
Wire Wire Line
	10450 1000 11000 1000
Wire Wire Line
	9950 2300 10450 2300
$Comp
L power:VCC #PWR?
U 1 1 5DAFC386
P 9600 700
AR Path="/635BEEB0/5DAFC386" Ref="#PWR?"  Part="1" 
AR Path="/5DAFC386" Ref="#PWR?"  Part="1" 
AR Path="/5DC1E7F0/5DAFC386" Ref="#PWR?"  Part="1" 
AR Path="/5D9F70E5/5DAFC386" Ref="#PWR0283"  Part="1" 
F 0 "#PWR0283" H 9600 550 50  0001 C CNN
F 1 "VCC" V 9618 828 50  0000 L CNN
F 2 "" H 9600 700 50  0001 C CNN
F 3 "" H 9600 700 50  0001 C CNN
	1    9600 700 
	0    -1   -1   0   
$EndComp
Text Label 8850 1300 0    50   ~ 0
GFX-OUT-A6
Text Label 8850 1200 0    50   ~ 0
GFX-OUT-A4
Text Label 8850 1100 0    50   ~ 0
GFX-OUT-A2
Text Label 8850 1000 0    50   ~ 0
GFX-OUT-A0
Wire Wire Line
	8800 1200 9450 1200
Wire Wire Line
	8800 1100 9450 1100
Wire Wire Line
	8800 1000 9450 1000
Wire Wire Line
	9600 700  9950 700 
Wire Wire Line
	10250 700  9950 700 
Connection ~ 9950 700 
Connection ~ 9950 2300
Connection ~ 10450 2000
Wire Wire Line
	10450 2000 10450 1900
Wire Wire Line
	10450 2300 10450 2000
$Comp
L 74xx:74LS245 U10F?
U 1 1 5DAFC3B3
P 9950 1500
AR Path="/635BEEB0/5DAFC3B3" Ref="U10F?"  Part="1" 
AR Path="/5DAFC3B3" Ref="U10F?"  Part="1" 
AR Path="/5DC1E7F0/5DAFC3B3" Ref="U10F?"  Part="1" 
AR Path="/5D9F70E5/5DAFC3B3" Ref="UL10"  Part="1" 
F 0 "UL10" H 9950 2478 50  0000 C CNN
F 1 "74LS245" H 9950 2387 50  0000 C CNN
F 2 "" H 9950 1500 50  0001 C CNN
F 3 "http://www.ti.com/lit/gpn/sn74LS245" H 9950 1500 50  0001 C CNN
	1    9950 1500
	-1   0    0    -1  
$EndComp
$Comp
L CPS2-Custom:DL-1525 UE4
U 1 1 5EA6F926
P 6900 5350
F 0 "UE4" H 6900 6377 100 0000 C CNN
F 1 "DL-1525" H 6900 6211 100 0000 C CNN
F 2 "" H 6725 6900 50  0001 C CNN
F 3 "" H 6725 6900 50  0001 C CNN
	1    6900 5350
	1    0    0    -1  
$EndComp
$Comp
L CPS2-Custom:DL-1525 UE4
U 2 1 5EA7459C
P 2800 6650
F 0 "UE4" H 2750 7877 100 0000 C CNN
F 1 "DL-1525" H 2750 7711 100 0000 C CNN
F 2 "" H 2625 8200 50  0001 C CNN
F 3 "" H 2625 8200 50  0001 C CNN
	2    2800 6650
	1    0    0    -1  
$EndComp
$Comp
L CPS2-Custom:DL-1525 UE4
U 3 1 5EA74B3E
P 6900 2250
F 0 "UE4" H 6900 3927 100 0000 C CNN
F 1 "DL-1525" H 6900 3761 100 0000 C CNN
F 2 "" H 6725 3800 50  0001 C CNN
F 3 "" H 6725 3800 50  0001 C CNN
	3    6900 2250
	1    0    0    -1  
$EndComp
$Comp
L CPS2-Custom:DL-1525 UE4
U 4 1 5EA78CE3
P 3800 2300
F 0 "UE4" H 3775 3877 100 0000 C CNN
F 1 "DL-1525" H 3775 3711 100 0000 C CNN
F 2 "" H 3625 3850 50  0001 C CNN
F 3 "" H 3625 3850 50  0001 C CNN
	4    3800 2300
	1    0    0    -1  
$EndComp
$Comp
L CPS2-Custom:DL-1525 UE4
U 5 1 5EA7C42E
P 1550 3300
F 0 "UE4" H 1550 5377 100 0000 C CNN
F 1 "DL-1525" H 1550 5211 100 0000 C CNN
F 2 "" H 1375 4850 50  0001 C CNN
F 3 "" H 1375 4850 50  0001 C CNN
	5    1550 3300
	1    0    0    -1  
$EndComp
Wire Wire Line
	1800 950  2000 950 
Wire Wire Line
	2000 950  2000 1600
Connection ~ 1800 950 
Wire Wire Line
	1250 950  1100 950 
Connection ~ 1250 950 
Wire Wire Line
	1100 950  1100 1600
Connection ~ 2000 950 
Wire Wire Line
	1100 850  1100 950 
Connection ~ 1100 950 
Wire Wire Line
	1100 1600 1100 1700
Connection ~ 1100 1600
Connection ~ 1100 1700
Wire Wire Line
	1100 1700 1100 1800
Connection ~ 1100 1800
Wire Wire Line
	1100 1800 1100 1900
Connection ~ 1100 1900
Wire Wire Line
	1100 1900 1100 2000
Connection ~ 1100 2000
Wire Wire Line
	1100 2000 1100 2100
Connection ~ 1100 2100
Wire Wire Line
	1100 2100 1100 2200
Connection ~ 1100 2200
Wire Wire Line
	1100 2200 1100 2300
Connection ~ 1100 2300
Wire Wire Line
	1100 2300 1100 2400
Connection ~ 1100 2400
Wire Wire Line
	1100 2400 1100 2500
Connection ~ 1100 2500
Wire Wire Line
	1100 2500 1100 2600
Connection ~ 1100 2600
Wire Wire Line
	1100 2600 1100 2700
Wire Wire Line
	2000 1600 2000 1700
Connection ~ 2000 1600
Connection ~ 2000 1700
Wire Wire Line
	2000 1700 2000 1800
Connection ~ 2000 1800
Wire Wire Line
	2000 1800 2000 1900
Connection ~ 2000 1900
Wire Wire Line
	2000 1900 2000 2000
Connection ~ 2000 2000
Wire Wire Line
	2000 2000 2000 2100
Connection ~ 2000 2100
Wire Wire Line
	2000 2100 2000 2200
Connection ~ 2000 2200
Wire Wire Line
	2000 2200 2000 2300
Connection ~ 2000 2300
Wire Wire Line
	2000 2300 2000 2400
Connection ~ 2000 2400
Wire Wire Line
	2000 2400 2000 2500
Connection ~ 2000 2500
Wire Wire Line
	2000 2500 2000 2600
Connection ~ 2000 2600
Wire Wire Line
	2000 2600 2000 2700
Connection ~ 2000 2700
Wire Wire Line
	2000 2700 2000 2800
Connection ~ 2000 2800
Wire Wire Line
	2000 2800 2000 2900
Connection ~ 2000 2900
Wire Wire Line
	2000 2900 2000 3000
Connection ~ 2000 3000
Wire Wire Line
	2000 3000 2000 3100
Connection ~ 2000 3100
Wire Wire Line
	2000 3100 2000 3200
Connection ~ 2000 3200
Wire Wire Line
	2000 3200 2000 3300
Connection ~ 2000 3300
Wire Wire Line
	2000 3300 2000 3400
Connection ~ 2000 3400
Wire Wire Line
	2000 3400 2000 3500
Connection ~ 2000 3500
Wire Wire Line
	2000 3500 2000 3600
Connection ~ 2000 3600
Wire Wire Line
	2000 3600 2000 3700
Connection ~ 2000 3700
Wire Wire Line
	2000 3700 2000 3800
Wire Wire Line
	2000 4600 2000 4700
Connection ~ 2000 4600
Wire Bus Line
	4900 2850 5050 2850
Wire Bus Line
	8300 700  8700 700 
Text Label 1350 4950 0    50   ~ 0
SPA102
Wire Wire Line
	1100 4950 1100 4700
Wire Wire Line
	1100 4950 1700 4950
Wire Wire Line
	1000 4600 1000 4950
Wire Wire Line
	1000 4950 850  4950
Wire Wire Line
	850  4950 850  5100
Wire Wire Line
	600  3600 700  3600
Wire Wire Line
	600  4500 600  4400
Wire Wire Line
	700  4400 600  4400
Connection ~ 600  4400
Wire Wire Line
	600  4400 600  3600
Wire Wire Line
	600  4500 800  4500
Wire Bus Line
	1250 7700 1400 7700
Text Label 3600 7000 0    50   ~ 0
OBJRAM-A0
Text Label 3600 6900 0    50   ~ 0
OBJRAM-A1
Text Label 3600 6800 0    50   ~ 0
OBJRAM-A2
Text Label 3600 6700 0    50   ~ 0
OBJRAM-A3
Text Label 3600 6600 0    50   ~ 0
OBJRAM-A4
Text Label 3600 6500 0    50   ~ 0
OBJRAM-A5
Text Label 3600 6400 0    50   ~ 0
OBJRAM-A6
Text Label 3600 6300 0    50   ~ 0
OBJRAM-A7
Text Label 3600 6200 0    50   ~ 0
OBJRAM-A8
Text Label 3600 6100 0    50   ~ 0
OBJRAM-A9
Text Label 3600 6000 0    50   ~ 0
OBJRAM-A10
Text Label 3600 5900 0    50   ~ 0
OBJRAM-A11
Text Label 3600 5800 0    50   ~ 0
OBJRAM-A12
Wire Wire Line
	3550 5800 4150 5800
Wire Wire Line
	3550 5900 4150 5900
Wire Wire Line
	3550 6000 4150 6000
Wire Wire Line
	3550 6100 4150 6100
Wire Wire Line
	3550 6200 4150 6200
Wire Wire Line
	3550 6300 4150 6300
Wire Wire Line
	3550 6400 4150 6400
Wire Wire Line
	3550 6500 4150 6500
Wire Wire Line
	3550 6600 4150 6600
Wire Wire Line
	3550 6700 4150 6700
Wire Wire Line
	3550 6800 4150 6800
Wire Wire Line
	3550 6900 4150 6900
Wire Wire Line
	3550 7000 4150 7000
Entry Wire Line
	4150 7000 4250 6900
Entry Wire Line
	4150 6900 4250 6800
Entry Wire Line
	4150 6800 4250 6700
Entry Wire Line
	4150 6700 4250 6600
Entry Wire Line
	4150 6600 4250 6500
Entry Wire Line
	4150 6500 4250 6400
Entry Wire Line
	4150 6400 4250 6300
Entry Wire Line
	4150 6300 4250 6200
Entry Wire Line
	4150 6200 4250 6100
Entry Wire Line
	4150 6100 4250 6000
Entry Wire Line
	4150 6000 4250 5900
Entry Wire Line
	4150 5900 4250 5800
Entry Wire Line
	4150 5800 4250 5700
Wire Bus Line
	4250 5550 4150 5550
Text HLabel 4150 5550 0    50   Output ~ 0
OBJRAM-A[0..12]
Text HLabel 7800 3650 2    50   Input ~ 0
~VBLANK
Text Label 3600 7200 0    50   ~ 0
OBJRAM-C0
Text Label 3600 7300 0    50   ~ 0
OBJRAM-C1
Text Label 3600 7400 0    50   ~ 0
OBJRAM-C2
Text Label 3600 7500 0    50   ~ 0
OBJRAM-C3
Wire Wire Line
	3550 7200 4150 7200
Wire Wire Line
	3550 7300 4150 7300
Wire Wire Line
	3550 7400 4150 7400
Wire Wire Line
	3550 7500 4150 7500
Entry Wire Line
	4150 7200 4250 7300
Entry Wire Line
	4150 7300 4250 7400
Entry Wire Line
	4150 7400 4250 7500
Entry Wire Line
	4150 7500 4250 7600
Wire Bus Line
	4250 7700 4400 7700
Text HLabel 4400 7700 2    50   Output ~ 0
OBJRAM-C[0..3]
Wire Wire Line
	7800 3650 7650 3650
Text HLabel 8400 4450 2    50   Output ~ 0
CONTROL-O[0..7]
Entry Wire Line
	8250 5350 8150 5450
Entry Wire Line
	8250 5250 8150 5350
Entry Wire Line
	8250 5150 8150 5250
Entry Wire Line
	8250 5000 8150 5100
Entry Wire Line
	8250 4900 8150 5000
Entry Wire Line
	8250 4800 8150 4900
Entry Wire Line
	8250 4700 8150 4800
Entry Wire Line
	8250 4600 8150 4700
Wire Wire Line
	7450 5450 8150 5450
Wire Wire Line
	7450 5350 8150 5350
Wire Wire Line
	7450 5250 8150 5250
Wire Wire Line
	7450 5100 8150 5100
Wire Wire Line
	7450 5000 8150 5000
Wire Wire Line
	7450 4900 8150 4900
Wire Wire Line
	7450 4800 8150 4800
Wire Wire Line
	7450 4700 8150 4700
Text Label 8050 5450 2    50   ~ 0
CONTROL-O7
Text Label 8050 5350 2    50   ~ 0
CONTROL-O6
Text Label 8050 5250 2    50   ~ 0
CONTROL-O5
Text Label 8050 5100 2    50   ~ 0
CONTROL-O4
Text Label 8050 5000 2    50   ~ 0
CONTROL-O3
Text Label 8050 4900 2    50   ~ 0
CONTROL-O2
Text Label 8050 4800 2    50   ~ 0
CONTROL-O1
Text Label 8050 4700 2    50   ~ 0
CONTROL-O0
Wire Bus Line
	5700 6150 5550 6150
Entry Wire Line
	5800 5850 5700 5950
Entry Wire Line
	5800 5600 5700 5700
Entry Wire Line
	5800 5450 5700 5550
Entry Wire Line
	5800 5250 5700 5350
Entry Wire Line
	5800 5150 5700 5250
Entry Wire Line
	5800 5050 5700 5150
Entry Wire Line
	5800 4900 5700 5000
Entry Wire Line
	5800 4800 5700 4900
Text Label 5850 5600 0    50   ~ 0
CONTROL-I7
Text Label 5850 5450 0    50   ~ 0
CONTROL-I6
Text Label 5850 5250 0    50   ~ 0
CONTROL-I5
Text Label 5850 5150 0    50   ~ 0
CONTROL-I4
Text Label 5850 5050 0    50   ~ 0
CONTROL-I3
Text Label 5850 4900 0    50   ~ 0
CONTROL-I2
Text Label 5850 4800 0    50   ~ 0
CONTROL-I1
Text Label 5850 4700 0    50   ~ 0
CONTROL-I0
Entry Wire Line
	5800 4700 5700 4800
Text HLabel 5550 6150 0    50   Input ~ 0
CONTROL-I[0..8]
Text Label 5850 5850 0    50   ~ 0
CONTROL-I8
Wire Bus Line
	8250 4450 8400 4450
Wire Wire Line
	5800 4700 6350 4700
Wire Wire Line
	5800 4800 6350 4800
Wire Wire Line
	5800 4900 6350 4900
Wire Wire Line
	5800 5050 6350 5050
Wire Wire Line
	5800 5150 6350 5150
Wire Wire Line
	5800 5250 6350 5250
Wire Wire Line
	5800 5450 6350 5450
Wire Wire Line
	6350 5600 5800 5600
Wire Wire Line
	5800 5850 6350 5850
Wire Wire Line
	1350 7300 1950 7300
Wire Wire Line
	1350 7200 1950 7200
Wire Wire Line
	1350 7100 1950 7100
Wire Wire Line
	1350 7000 1950 7000
Wire Wire Line
	1350 6900 1950 6900
Wire Wire Line
	1350 6800 1950 6800
Wire Wire Line
	1350 6700 1950 6700
Wire Wire Line
	1350 6600 1950 6600
Wire Wire Line
	1350 6500 1950 6500
Wire Wire Line
	1350 6400 1950 6400
Wire Wire Line
	1350 6300 1950 6300
Wire Wire Line
	1350 6200 1950 6200
Wire Wire Line
	1350 6100 1950 6100
Wire Wire Line
	1350 6000 1950 6000
Wire Wire Line
	1350 5900 1950 5900
Wire Wire Line
	1350 5800 1950 5800
Text Label 1400 5800 0    50   ~ 0
OBJRAM-D15
Text Label 1400 5900 0    50   ~ 0
OBJRAM-D14
Text Label 1400 6000 0    50   ~ 0
OBJRAM-D13
Text Label 1400 6100 0    50   ~ 0
OBJRAM-D12
Text Label 1400 6200 0    50   ~ 0
OBJRAM-D11
Text Label 1400 6300 0    50   ~ 0
OBJRAM-D10
Text Label 1400 6400 0    50   ~ 0
OBJRAM-D9
Text Label 1400 6500 0    50   ~ 0
OBJRAM-D8
Text Label 1400 6600 0    50   ~ 0
OBJRAM-D7
Text Label 1400 6700 0    50   ~ 0
OBJRAM-D6
Text Label 1400 6800 0    50   ~ 0
OBJRAM-D5
Text Label 1400 6900 0    50   ~ 0
OBJRAM-D4
Text Label 1400 7000 0    50   ~ 0
OBJRAM-D3
Text Label 1400 7100 0    50   ~ 0
OBJRAM-D2
Text Label 1400 7200 0    50   ~ 0
OBJRAM-D1
Text Label 1400 7300 0    50   ~ 0
OBJRAM-D0
Wire Wire Line
	8700 6350 9300 6350
Wire Wire Line
	8700 6250 9300 6250
Wire Wire Line
	8700 6150 9300 6150
Wire Wire Line
	8700 6050 9300 6050
Wire Wire Line
	8700 5950 9300 5950
Wire Wire Line
	8700 5850 9300 5850
Wire Wire Line
	8700 5750 9300 5750
Wire Wire Line
	8700 5650 9300 5650
Wire Wire Line
	8700 5550 9300 5550
Wire Wire Line
	8700 5450 9300 5450
Wire Wire Line
	8700 5350 9300 5350
Wire Wire Line
	8700 5250 9300 5250
Wire Wire Line
	8700 5150 9300 5150
Wire Wire Line
	8700 5050 9300 5050
Wire Wire Line
	8700 4950 9300 4950
Wire Wire Line
	8700 4850 9300 4850
Text Label 8750 4850 0    50   ~ 0
OBJRAM-D15
Text Label 8750 4950 0    50   ~ 0
OBJRAM-D14
Text Label 8750 5050 0    50   ~ 0
OBJRAM-D13
Text Label 8750 5150 0    50   ~ 0
OBJRAM-D12
Text Label 8750 5250 0    50   ~ 0
OBJRAM-D11
Text Label 8750 5350 0    50   ~ 0
OBJRAM-D10
Text Label 8750 5450 0    50   ~ 0
OBJRAM-D9
Text Label 8750 5550 0    50   ~ 0
OBJRAM-D8
Text Label 8750 5650 0    50   ~ 0
OBJRAM-D7
Text Label 8750 5750 0    50   ~ 0
OBJRAM-D6
Text Label 8750 5850 0    50   ~ 0
OBJRAM-D5
Text Label 8750 5950 0    50   ~ 0
OBJRAM-D4
Text Label 8750 6050 0    50   ~ 0
OBJRAM-D3
Text Label 8750 6150 0    50   ~ 0
OBJRAM-D2
Text Label 8750 6250 0    50   ~ 0
OBJRAM-D1
Text Label 8750 6350 0    50   ~ 0
OBJRAM-D0
Text Label 650  5100 1    50   ~ 0
CONTROL-I8
Text Label 10500 6200 2    50   ~ 0
CONTROL-O7
Text Label 10500 6100 2    50   ~ 0
CONTROL-O6
Text Label 10500 6000 2    50   ~ 0
CONTROL-O5
Text Label 10500 5450 2    50   ~ 0
CONTROL-O4
Text Label 10500 5900 2    50   ~ 0
CONTROL-O3
Text Label 10500 5800 2    50   ~ 0
CONTROL-O2
Text Label 10500 5700 2    50   ~ 0
CONTROL-O1
Text Label 10500 5600 2    50   ~ 0
CONTROL-O0
Wire Wire Line
	10600 5450 10000 5450
Wire Wire Line
	10000 5700 10500 5700
Wire Wire Line
	10000 5800 10500 5800
Wire Wire Line
	10000 5900 10500 5900
Wire Wire Line
	10000 5600 10500 5600
Wire Wire Line
	10000 6000 10500 6000
Wire Wire Line
	10000 6100 10500 6100
Wire Wire Line
	10000 6200 10500 6200
$Comp
L power:GND #PWR?
U 1 1 5F988238
P 600 3600
F 0 "#PWR?" H 600 3350 50  0001 C CNN
F 1 "GND" H 605 3427 50  0000 C CNN
F 2 "" H 600 3600 50  0001 C CNN
F 3 "" H 600 3600 50  0001 C CNN
	1    600  3600
	-1   0    0    1   
$EndComp
Connection ~ 600  3600
Text HLabel 7800 3500 2    50   Input ~ 0
~RESETI
Wire Wire Line
	7800 3500 7650 3500
Text HLabel 7800 3250 2    50   Input ~ 0
CLK2M
Wire Wire Line
	7800 3250 7650 3250
Text HLabel 7800 3350 2    50   Input ~ 0
CLK16M
Wire Wire Line
	7800 3350 7650 3350
Wire Bus Line
	4250 7300 4250 7700
Wire Bus Line
	8000 5950 8000 6350
Wire Bus Line
	8250 4450 8250 5350
Wire Bus Line
	4250 5550 4250 6900
Wire Bus Line
	5700 4800 5700 6150
Wire Bus Line
	11100 1100 11100 4500
Wire Bus Line
	8700 700  8700 3650
Wire Bus Line
	8300 700  8300 2350
Wire Bus Line
	5050 1200 5050 2850
Wire Bus Line
	2500 900  2500 3200
Wire Bus Line
	1250 5900 1250 7700
Wire Bus Line
	5500 750  5500 3950
$EndSCHEMATC
