EESchema Schematic File Version 4
EELAYER 30 0
EELAYER END
$Descr A4 11693 8268
encoding utf-8
Sheet 16 83
Title "CPS Reverse Engineering: DL-0311"
Date "2021-09-12"
Rev ""
Comp ""
Comment1 ""
Comment2 ""
Comment3 "Licence: CC-BY"
Comment4 "Author: Loïc *WydD* Petit"
$EndDescr
Connection ~ 2900 4100
Connection ~ 5850 4900
Connection ~ 5750 4800
Connection ~ 5550 3550
Connection ~ 5850 4150
Connection ~ 5650 4150
Connection ~ 6950 4150
Connection ~ 6950 4900
Connection ~ 7050 2850
Connection ~ 5950 1700
Connection ~ 7050 4050
Connection ~ 6950 3850
Connection ~ 2900 4650
Connection ~ 2900 5150
NoConn ~ 7950 4900
NoConn ~ 6850 4900
NoConn ~ 7950 3850
NoConn ~ 6850 1600
NoConn ~ 7950 2450
NoConn ~ 7950 2350
NoConn ~ 7950 2650
NoConn ~ 7950 2850
NoConn ~ 7950 1500
Entry Wire Line
	3550 3550 3650 3650
Entry Wire Line
	3550 4150 3650 4250
Entry Wire Line
	3550 4750 3650 4850
Entry Wire Line
	6300 2150 6400 2250
Entry Wire Line
	6300 2250 6400 2350
Entry Wire Line
	6300 2350 6400 2450
Entry Wire Line
	8400 3550 8500 3650
Entry Wire Line
	8400 3650 8500 3750
Entry Wire Line
	8400 3750 8500 3850
Entry Wire Line
	8400 4600 8500 4700
Entry Wire Line
	8400 4700 8500 4800
Entry Wire Line
	8400 4800 8500 4900
Wire Wire Line
	2800 5150 2900 5150
Wire Wire Line
	2900 3500 2900 4100
Wire Wire Line
	2900 3500 4600 3500
Wire Wire Line
	2900 4100 4600 4100
Wire Wire Line
	2900 4650 2800 4650
Wire Wire Line
	2900 4650 2900 4100
Wire Wire Line
	2900 4750 2900 5150
Wire Wire Line
	2900 5150 4050 5150
Wire Wire Line
	3450 4700 4050 4700
Wire Wire Line
	3650 3650 4600 3650
Wire Wire Line
	3650 4250 4600 4250
Wire Wire Line
	4050 4800 4050 4850
Wire Wire Line
	4050 4850 3650 4850
Wire Wire Line
	4600 3650 4600 3600
Wire Wire Line
	4600 4250 4600 4200
Wire Wire Line
	4600 5200 4600 4850
Wire Wire Line
	5150 3550 5550 3550
Wire Wire Line
	5150 4150 5650 4150
Wire Wire Line
	5550 3550 5550 4600
Wire Wire Line
	5550 3550 7150 3550
Wire Wire Line
	5550 4600 6050 4600
Wire Wire Line
	5650 3650 5650 4150
Wire Wire Line
	5650 3650 7150 3650
Wire Wire Line
	5650 4150 5650 4700
Wire Wire Line
	5650 4700 6050 4700
Wire Wire Line
	5750 3750 7150 3750
Wire Wire Line
	5750 4800 5150 4800
Wire Wire Line
	5750 4800 5750 3750
Wire Wire Line
	5750 4800 6050 4800
Wire Wire Line
	5850 1700 5950 1700
Wire Wire Line
	5850 4150 6950 4150
Wire Wire Line
	5850 4900 5850 4150
Wire Wire Line
	5850 4900 5850 5200
Wire Wire Line
	5850 5200 6050 5200
Wire Wire Line
	5950 1700 5950 5100
Wire Wire Line
	5950 1700 6350 1700
Wire Wire Line
	5950 5100 6050 5100
Wire Wire Line
	6050 4900 5850 4900
Wire Wire Line
	6350 1500 5850 1500
Wire Wire Line
	6400 2250 7150 2250
Wire Wire Line
	6400 2350 7150 2350
Wire Wire Line
	6400 2450 7150 2450
Wire Wire Line
	6400 2550 7150 2550
Wire Wire Line
	6850 1500 7450 1500
Wire Wire Line
	6850 4600 7150 4600
Wire Wire Line
	6850 4700 7150 4700
Wire Wire Line
	6850 4800 7150 4800
Wire Wire Line
	6950 3850 6950 2950
Wire Wire Line
	6950 3850 6950 4150
Wire Wire Line
	6950 4150 6950 4900
Wire Wire Line
	6950 4900 6950 5200
Wire Wire Line
	6950 5200 7150 5200
Wire Wire Line
	7050 1700 7050 2850
Wire Wire Line
	7050 2850 6850 2850
Wire Wire Line
	7050 2850 7150 2850
Wire Wire Line
	7050 4050 7050 2850
Wire Wire Line
	7050 4050 7050 5100
Wire Wire Line
	7050 4050 7150 4050
Wire Wire Line
	7150 2950 6950 2950
Wire Wire Line
	7150 3850 6950 3850
Wire Wire Line
	7150 4150 6950 4150
Wire Wire Line
	7150 4900 6950 4900
Wire Wire Line
	7150 5100 7050 5100
Wire Wire Line
	7450 1700 7050 1700
Wire Wire Line
	7950 1600 8050 1600
Wire Wire Line
	7950 2950 8050 2950
Wire Wire Line
	7950 3550 8400 3550
Wire Wire Line
	7950 3650 8400 3650
Wire Wire Line
	7950 3750 8400 3750
Wire Wire Line
	7950 4600 8400 4600
Wire Wire Line
	7950 4700 8400 4700
Wire Wire Line
	7950 4800 8400 4800
Wire Wire Line
	8050 2250 7950 2250
Wire Wire Line
	8050 2550 7950 2550
Wire Wire Line
	8050 2750 7950 2750
Wire Bus Line
	3550 3350 3400 3350
Wire Bus Line
	5850 2050 6300 2050
Wire Bus Line
	8500 3950 8600 3950
Wire Bus Line
	8500 5000 8600 5000
Text Notes 2000 4500 0    50   ~ 0
~YFLIP\nFor SCROLL+SPRITES\n1 for others
Text Notes 3700 4450 0    50   ~ 0
~YFLIP~ + SCROLL3\nFor SCROLL+SPRITES
Text Notes 4750 5800 0    50   ~ 0
If SCROLL3 = 0\n~YFLIP~ xnor ADDR0 for SCROLL+SPRITES\nADDR0 for others\nIf SCROLL3 = 1\nADDR0 xnor ~XFLIP
Text Label 3650 3650 0    50   ~ 0
ROMA-Y2
Text Label 3650 4250 0    50   ~ 0
ROMA-Y1
Text Label 3650 4850 0    50   ~ 0
ROMA-Y0
Text Label 5950 1500 0    50   ~ 0
_CDEN
Text Label 6400 2250 0    50   ~ 0
GFX-ADDR22
Text Label 6400 2350 0    50   ~ 0
GFX-ADDR21
Text Label 6400 2450 0    50   ~ 0
GFX-ADDR20
Text Label 6400 2550 0    50   ~ 0
_CDEN
Text Label 8350 3550 2    50   ~ 0
A-ROMA2
Text Label 8350 3650 2    50   ~ 0
A-ROMA1
Text Label 8350 3750 2    50   ~ 0
A-ROMA0
Text Label 8350 4600 2    50   ~ 0
B-ROMA2
Text Label 8350 4700 2    50   ~ 0
B-ROMA1
Text Label 8350 4800 2    50   ~ 0
B-ROMA0
Text HLabel 2800 4650 0    50   Input ~ 0
~YFLIP
Text HLabel 2800 5150 0    50   Input ~ 0
SCROLL3-T
Text HLabel 3400 3350 0    50   Input ~ 0
ROMA-Y[0..2]
Text HLabel 4050 5250 0    50   Input ~ 0
_XFLIP
Text HLabel 5850 1500 0    50   Input ~ 0
_CDEN
Text HLabel 5850 1700 0    50   Input ~ 0
CLK-~CHNL
Text HLabel 5850 2050 0    50   Input ~ 0
GFX-ADDR[20..22]
Text HLabel 6850 2850 0    50   Input ~ 0
CLK-CHNL
Text HLabel 8050 1600 2    50   Output ~ 0
~A-CDEN
Text HLabel 8050 2250 2    50   Output ~ 0
ROMA22
Text HLabel 8050 2550 2    50   Output ~ 0
~ROMA21
Text HLabel 8050 2750 2    50   Output ~ 0
~ROMA20
Text HLabel 8050 2950 2    50   Output ~ 0
~B-CDEN
Text HLabel 8600 3950 2    50   Output ~ 0
A-ROMA[0..2]
Text HLabel 8600 5000 2    50   Output ~ 0
B-ROMA[0..2]
$Comp
L power:VCC #PWR0183
U 1 1 62ABAC4B
P 5850 4150
F 0 "#PWR0183" H 5850 4000 50  0001 C CNN
F 1 "VCC" H 5865 4323 50  0000 C CNN
F 2 "" H 5850 4150 50  0001 C CNN
F 3 "" H 5850 4150 50  0001 C CNN
	1    5850 4150
	1    0    0    -1  
$EndComp
$Comp
L A5C:OR02 UEF95
U 1 1 6E4A8961
P 3150 4700
F 0 "UEF95" H 3175 4967 50  0000 C CNN
F 1 "OR02" H 3175 4876 50  0000 C CNN
F 2 "" H 3200 4700 50  0001 C CNN
F 3 "" H 3200 4700 50  0001 C CNN
	1    3150 4700
	1    0    0    -1  
$EndComp
$Comp
L A5C:XNOR02 UEF98
U 1 1 622C4F0C
P 4300 4750
F 0 "UEF98" H 4325 5017 50  0000 C CNN
F 1 "XNOR02" H 4325 4926 50  0000 C CNN
F 2 "" H 4325 4750 50  0001 C CNN
F 3 "" H 4325 4750 50  0001 C CNN
	1    4300 4750
	1    0    0    -1  
$EndComp
$Comp
L A5C:NAND02 UED136
U 1 1 706B0FBA
P 4300 5200
F 0 "UED136" H 4325 5467 50  0000 C CNN
F 1 "NAND02" H 4325 5376 50  0000 C CNN
F 2 "" H 4300 5200 50  0001 C CNN
F 3 "" H 4300 5200 50  0001 C CNN
	1    4300 5200
	1    0    0    -1  
$EndComp
$Comp
L A5C:XNOR02 UED19
U 1 1 6FDC8C7B
P 4850 3550
F 0 "UED19" H 4875 3817 50  0000 C CNN
F 1 "XNOR02" H 4875 3726 50  0000 C CNN
F 2 "" H 4875 3550 50  0001 C CNN
F 3 "" H 4875 3550 50  0001 C CNN
	1    4850 3550
	1    0    0    -1  
$EndComp
$Comp
L A5C:XNOR02 UEH2
U 1 1 7014082D
P 4850 4150
F 0 "UEH2" H 4875 4417 50  0000 C CNN
F 1 "XNOR02" H 4875 4326 50  0000 C CNN
F 2 "" H 4875 4150 50  0001 C CNN
F 3 "" H 4875 4150 50  0001 C CNN
	1    4850 4150
	1    0    0    -1  
$EndComp
$Comp
L A5C:XNOR02 UEE87
U 1 1 705E4FF7
P 4850 4800
F 0 "UEE87" H 4875 5067 50  0000 C CNN
F 1 "XNOR02" H 4875 4976 50  0000 C CNN
F 2 "" H 4875 4800 50  0001 C CNN
F 3 "" H 4875 4800 50  0001 C CNN
	1    4850 4800
	1    0    0    -1  
$EndComp
$Comp
L A5C:DFFCOO UEF21
U 1 1 61118E3D
P 6600 1600
F 0 "UEF21" H 6600 1965 50  0000 C CNN
F 1 "DFFCOO" H 6600 1874 50  0000 C CNN
F 2 "" H 6600 1600 50  0001 C CNN
F 3 "" H 6600 1600 50  0001 C CNN
	1    6600 1600
	1    0    0    -1  
$EndComp
$Comp
L A5C:DFFCOO UEF26
U 1 1 6ADCD8F1
P 7700 1600
F 0 "UEF26" H 7700 1965 50  0000 C CNN
F 1 "DFFCOO" H 7700 1874 50  0000 C CNN
F 2 "" H 7700 1600 50  0001 C CNN
F 3 "" H 7700 1600 50  0001 C CNN
	1    7700 1600
	1    0    0    -1  
$EndComp
$Comp
L A5C:M175C UEE34
U 1 1 616121E4
P 6450 4900
F 0 "UEE34" H 6450 5465 50  0000 C CNN
F 1 "M175C" H 6450 5374 50  0000 C CNN
F 2 "" H 6450 4700 50  0001 C CNN
F 3 "" H 6450 4700 50  0001 C CNN
	1    6450 4900
	1    0    0    -1  
$EndComp
$Comp
L A5C:M175C UEG11
U 1 1 6942F62A
P 7550 3850
F 0 "UEG11" H 7550 4415 50  0000 C CNN
F 1 "M175C" H 7550 4324 50  0000 C CNN
F 2 "" H 7550 3650 50  0001 C CNN
F 3 "" H 7550 3650 50  0001 C CNN
	1    7550 3850
	1    0    0    -1  
$EndComp
$Comp
L A5C:M175C UEE10
U 1 1 6B2FE945
P 7550 4900
F 0 "UEE10" H 7550 5465 50  0000 C CNN
F 1 "M175C" H 7550 5374 50  0000 C CNN
F 2 "" H 7550 4700 50  0001 C CNN
F 3 "" H 7550 4700 50  0001 C CNN
	1    7550 4900
	1    0    0    -1  
$EndComp
$Comp
L A5C:M175CLH UEF195
U 1 1 6D978629
P 7550 2550
F 0 "UEF195" H 7550 3115 50  0000 C CNN
F 1 "M175CLH" H 7550 3024 50  0000 C CNN
F 2 "" H 7550 2350 50  0001 C CNN
F 3 "" H 7550 2350 50  0001 C CNN
	1    7550 2550
	1    0    0    -1  
$EndComp
Wire Bus Line
	3550 3350 3550 4750
Wire Bus Line
	6300 2050 6300 2350
Wire Bus Line
	8500 3650 8500 3950
Wire Bus Line
	8500 4700 8500 5000
$EndSCHEMATC
