EESchema Schematic File Version 4
EELAYER 30 0
EELAYER END
$Descr A4 11693 8268
encoding utf-8
Sheet 35 69
Title ""
Date "2020-11-26"
Rev ""
Comp ""
Comment1 "Licence: CC-BY"
Comment2 "Author: Loïc *WydD* Petit"
Comment3 ""
Comment4 ""
$EndDescr
Connection ~ 4250 2450
Connection ~ 4250 3350
Connection ~ 4250 2900
Connection ~ 3450 2200
Connection ~ 3350 2100
Connection ~ 3250 2000
Connection ~ 3150 1900
Connection ~ 4200 4100
Connection ~ 4300 4200
Connection ~ 4400 4300
Connection ~ 4500 4400
Connection ~ 4600 4500
Connection ~ 4700 4600
Connection ~ 4800 4700
Connection ~ 4900 4800
Entry Wire Line
	1550 4500 1650 4600
Entry Wire Line
	1550 4600 1650 4700
Entry Wire Line
	1800 4000 1900 4100
Entry Wire Line
	1800 4100 1900 4200
Entry Wire Line
	1800 4200 1900 4300
Entry Wire Line
	1800 4300 1900 4400
Entry Wire Line
	1800 4400 1900 4500
Entry Wire Line
	5400 900  5500 1000
Entry Wire Line
	5400 1000 5500 1100
Entry Wire Line
	5400 1100 5500 1200
Entry Wire Line
	5400 1200 5500 1300
Entry Wire Line
	5450 1950 5550 2050
Entry Wire Line
	5450 2400 5550 2500
Entry Wire Line
	5450 2850 5550 2950
Entry Wire Line
	5450 3300 5550 3400
Entry Wire Line
	5450 4100 5550 4200
Entry Wire Line
	5450 4200 5550 4300
Entry Wire Line
	5450 4300 5550 4400
Entry Wire Line
	5450 4400 5550 4500
Entry Wire Line
	5450 4500 5550 4600
Entry Wire Line
	5450 4600 5550 4700
Entry Wire Line
	5450 4700 5550 4800
Entry Wire Line
	5450 4800 5550 4900
Entry Wire Line
	6400 5750 6500 5650
Entry Wire Line
	6400 5850 6500 5750
Entry Wire Line
	6400 5950 6500 5850
Entry Wire Line
	6400 6050 6500 5950
Entry Wire Line
	6400 6150 6500 6050
Entry Wire Line
	6400 6250 6500 6150
Entry Wire Line
	6400 6350 6500 6250
Entry Wire Line
	6400 6450 6500 6350
Wire Wire Line
	1650 4600 3050 4600
Wire Wire Line
	1650 4700 3050 4700
Wire Wire Line
	1900 4100 3050 4100
Wire Wire Line
	1900 4200 3050 4200
Wire Wire Line
	1900 4300 3050 4300
Wire Wire Line
	1900 4400 3050 4400
Wire Wire Line
	1900 4500 3050 4500
Wire Wire Line
	2650 1900 3150 1900
Wire Wire Line
	2650 2000 3250 2000
Wire Wire Line
	2650 2100 3350 2100
Wire Wire Line
	2650 2200 3450 2200
Wire Wire Line
	2950 5150 2950 5000
Wire Wire Line
	3050 4800 1900 4800
Wire Wire Line
	3050 5000 2950 5000
Wire Wire Line
	3050 5100 3050 5450
Wire Wire Line
	3050 5450 2900 5450
Wire Wire Line
	3150 900  3150 1900
Wire Wire Line
	3150 1900 4350 1900
Wire Wire Line
	3250 2000 3250 1000
Wire Wire Line
	3250 2000 4150 2000
Wire Wire Line
	3350 1100 3350 2100
Wire Wire Line
	3350 2100 4050 2100
Wire Wire Line
	3450 1200 3450 2200
Wire Wire Line
	3450 2200 3950 2200
Wire Wire Line
	3950 3250 3950 2200
Wire Wire Line
	4050 2100 4050 2800
Wire Wire Line
	4050 2800 4350 2800
Wire Wire Line
	4050 4100 4200 4100
Wire Wire Line
	4050 4200 4300 4200
Wire Wire Line
	4050 4300 4400 4300
Wire Wire Line
	4050 4400 4500 4400
Wire Wire Line
	4050 4500 4600 4500
Wire Wire Line
	4050 4600 4700 4600
Wire Wire Line
	4050 4700 4800 4700
Wire Wire Line
	4050 4800 4900 4800
Wire Wire Line
	4100 900  3150 900 
Wire Wire Line
	4100 1000 3250 1000
Wire Wire Line
	4100 1100 3350 1100
Wire Wire Line
	4100 1200 3450 1200
Wire Wire Line
	4150 2350 4150 2000
Wire Wire Line
	4200 4100 5450 4100
Wire Wire Line
	4200 5750 4200 4100
Wire Wire Line
	4200 5750 5100 5750
Wire Wire Line
	4250 2000 4250 2450
Wire Wire Line
	4250 2450 4250 2900
Wire Wire Line
	4250 2900 4250 3350
Wire Wire Line
	4250 3350 4150 3350
Wire Wire Line
	4250 3350 4350 3350
Wire Wire Line
	4300 4200 5450 4200
Wire Wire Line
	4300 5850 4300 4200
Wire Wire Line
	4300 5850 5100 5850
Wire Wire Line
	4350 2000 4250 2000
Wire Wire Line
	4350 2350 4150 2350
Wire Wire Line
	4350 2450 4250 2450
Wire Wire Line
	4350 2900 4250 2900
Wire Wire Line
	4350 3250 3950 3250
Wire Wire Line
	4400 4300 4400 5950
Wire Wire Line
	4400 4300 5450 4300
Wire Wire Line
	4400 5950 5100 5950
Wire Wire Line
	4500 4400 5450 4400
Wire Wire Line
	4500 6050 4500 4400
Wire Wire Line
	4500 6050 5100 6050
Wire Wire Line
	4600 4500 4600 6150
Wire Wire Line
	4600 4500 5450 4500
Wire Wire Line
	4600 6150 5100 6150
Wire Wire Line
	4700 4600 5450 4600
Wire Wire Line
	4700 6250 4700 4600
Wire Wire Line
	4700 6250 5100 6250
Wire Wire Line
	4800 4700 4800 6350
Wire Wire Line
	4800 4700 5450 4700
Wire Wire Line
	4800 6350 5100 6350
Wire Wire Line
	4900 1950 5450 1950
Wire Wire Line
	4900 2400 5450 2400
Wire Wire Line
	4900 2850 5450 2850
Wire Wire Line
	4900 3300 5450 3300
Wire Wire Line
	4900 4800 5450 4800
Wire Wire Line
	4900 6450 4900 4800
Wire Wire Line
	4900 6450 5100 6450
Wire Wire Line
	5100 900  5400 900 
Wire Wire Line
	5100 1000 5400 1000
Wire Wire Line
	5100 1100 5400 1100
Wire Wire Line
	5100 1200 5400 1200
Wire Wire Line
	6100 5750 6400 5750
Wire Wire Line
	6100 5850 6400 5850
Wire Wire Line
	6100 5950 6400 5950
Wire Wire Line
	6100 6050 6400 6050
Wire Wire Line
	6100 6150 6400 6150
Wire Wire Line
	6100 6250 6400 6250
Wire Wire Line
	6100 6350 6400 6350
Wire Wire Line
	6100 6450 6400 6450
Wire Bus Line
	1550 4400 1400 4400
Wire Bus Line
	1800 3850 1700 3850
Wire Bus Line
	5500 1400 5600 1400
Wire Bus Line
	5550 5000 5700 5000
Wire Bus Line
	6500 800  5500 800 
Text Label 2250 4100 2    50   ~ 0
CB0
Text Label 2250 4200 2    50   ~ 0
CB1
Text Label 2250 4300 2    50   ~ 0
CB2
Text Label 2250 4400 2    50   ~ 0
CB3
Text Label 2250 4500 2    50   ~ 0
CB4
Text Label 2250 4600 2    50   ~ 0
CPC0
Text Label 2250 4700 2    50   ~ 0
CPC1
Text Label 2250 4800 2    50   ~ 0
CDEN
Text Label 4950 1950 0    50   ~ 0
COL4-D0
Text Label 4950 2400 0    50   ~ 0
COL4-D1
Text Label 4950 2850 0    50   ~ 0
COL4-D2
Text Label 4950 3300 0    50   ~ 0
COL4-D3
Text Label 4950 4100 0    50   ~ 0
COL4-D4
Text Label 4950 4200 0    50   ~ 0
COL4-D5
Text Label 4950 4300 0    50   ~ 0
COL4-D6
Text Label 4950 4400 0    50   ~ 0
COL4-D7
Text Label 4950 4500 0    50   ~ 0
COL4-D8
Text Label 4950 4600 0    50   ~ 0
COL4-D9
Text Label 4950 4700 0    50   ~ 0
COL4-D10
Text Label 4950 4800 0    50   ~ 0
COL4-D11
Text Label 5150 900  0    50   ~ 0
TD8
Text Label 5150 1000 0    50   ~ 0
TD9
Text Label 5150 1100 0    50   ~ 0
TD10
Text Label 5150 1200 0    50   ~ 0
TD11
Text Label 6150 5750 0    50   ~ 0
TD0
Text Label 6150 5850 0    50   ~ 0
TD1
Text Label 6150 5950 0    50   ~ 0
TD2
Text Label 6150 6050 0    50   ~ 0
TD3
Text Label 6150 6150 0    50   ~ 0
TD4
Text Label 6150 6250 0    50   ~ 0
TD5
Text Label 6150 6350 0    50   ~ 0
TD6
Text Label 6150 6450 0    50   ~ 0
TD7
Text HLabel 1400 4400 0    50   Input ~ 0
CPC[0..1]
Text HLabel 1700 3850 0    50   Input ~ 0
CB[0..4]
Text HLabel 1900 4800 0    50   Input ~ 0
CDEN
Text HLabel 2400 5100 0    50   Input ~ 0
SERIAL-END
Text HLabel 2400 5200 0    50   Input ~ 0
CLK8M
Text HLabel 2650 1900 0    50   Input ~ 0
GFX-A
Text HLabel 2650 2000 0    50   Input ~ 0
GFX-B
Text HLabel 2650 2100 0    50   Input ~ 0
GFX-C
Text HLabel 2650 2200 0    50   Input ~ 0
GFX-D
Text HLabel 4150 3350 0    50   Input ~ 0
~COL4-E
Text HLabel 5600 1400 2    50   Output ~ 0
TD[0..11]
Text HLabel 5700 5000 2    50   Output ~ 0
COL4-D[0..11]
$Comp
L power:VCC #PWR?
U 1 1 63628D69
P 2900 5450
AR Path="/5F9B692F/63628D69" Ref="#PWR?"  Part="1" 
AR Path="/622689A9/63628D69" Ref="#PWR?"  Part="1" 
AR Path="/601B6105/63628D69" Ref="#PWR?"  Part="1" 
AR Path="/5FBBD4DB/5FBBDC09/63628D69" Ref="#PWR0127"  Part="1" 
F 0 "#PWR0127" H 2900 5300 50  0001 C CNN
F 1 "VCC" H 2915 5623 50  0000 C CNN
F 2 "" H 2900 5450 50  0001 C CNN
F 3 "" H 2900 5450 50  0001 C CNN
	1    2900 5450
	1    0    0    -1  
$EndComp
$Comp
L A5C:NAND02 UAU?
U 1 1 6364004E
P 2650 5150
AR Path="/61243538/6364004E" Ref="UAU?"  Part="1" 
AR Path="/601B6105/6364004E" Ref="UAU327"  Part="1" 
AR Path="/5FBBD4DB/5FBBDC09/6364004E" Ref="UAU327"  Part="1" 
F 0 "UAU327" H 2675 5417 50  0000 C CNN
F 1 "NAND02" H 2675 5326 50  0000 C CNN
F 2 "" H 2650 5150 50  0001 C CNN
F 3 "" H 2650 5150 50  0001 C CNN
	1    2650 5150
	1    0    0    -1  
$EndComp
$Comp
L A5C:OR02 UBH?
U 1 1 601BC77A
P 4600 1950
AR Path="/5F9B692F/601BC77A" Ref="UBH?"  Part="1" 
AR Path="/622689A9/601BC77A" Ref="UBH?"  Part="1" 
AR Path="/601B6105/601BC77A" Ref="UBH62"  Part="1" 
AR Path="/5FBBD4DB/5FBBDC09/601BC77A" Ref="UBH62"  Part="1" 
F 0 "UBH62" H 4625 2217 50  0000 C CNN
F 1 "OR02" H 4625 2126 50  0000 C CNN
F 2 "" H 4650 1950 50  0001 C CNN
F 3 "" H 4650 1950 50  0001 C CNN
	1    4600 1950
	1    0    0    -1  
$EndComp
$Comp
L A5C:OR02 UBH?
U 1 1 601BC780
P 4600 2400
AR Path="/5F9B692F/601BC780" Ref="UBH?"  Part="1" 
AR Path="/622689A9/601BC780" Ref="UBH?"  Part="1" 
AR Path="/601B6105/601BC780" Ref="UBH64"  Part="1" 
AR Path="/5FBBD4DB/5FBBDC09/601BC780" Ref="UBH64"  Part="1" 
F 0 "UBH64" H 4625 2667 50  0000 C CNN
F 1 "OR02" H 4625 2576 50  0000 C CNN
F 2 "" H 4650 2400 50  0001 C CNN
F 3 "" H 4650 2400 50  0001 C CNN
	1    4600 2400
	1    0    0    -1  
$EndComp
$Comp
L A5C:OR02 UBH?
U 1 1 601BC786
P 4600 2850
AR Path="/5F9B692F/601BC786" Ref="UBH?"  Part="1" 
AR Path="/622689A9/601BC786" Ref="UBH?"  Part="1" 
AR Path="/601B6105/601BC786" Ref="UBH66"  Part="1" 
AR Path="/5FBBD4DB/5FBBDC09/601BC786" Ref="UBH66"  Part="1" 
F 0 "UBH66" H 4625 3117 50  0000 C CNN
F 1 "OR02" H 4625 3026 50  0000 C CNN
F 2 "" H 4650 2850 50  0001 C CNN
F 3 "" H 4650 2850 50  0001 C CNN
	1    4600 2850
	1    0    0    -1  
$EndComp
$Comp
L A5C:OR02 UBH?
U 1 1 601BC78C
P 4600 3300
AR Path="/5F9B692F/601BC78C" Ref="UBH?"  Part="1" 
AR Path="/622689A9/601BC78C" Ref="UBH?"  Part="1" 
AR Path="/601B6105/601BC78C" Ref="UBH68"  Part="1" 
AR Path="/5FBBD4DB/5FBBDC09/601BC78C" Ref="UBH68"  Part="1" 
F 0 "UBH68" H 4625 3567 50  0000 C CNN
F 1 "OR02" H 4625 3476 50  0000 C CNN
F 2 "" H 4650 3300 50  0001 C CNN
F 3 "" H 4650 3300 50  0001 C CNN
	1    4600 3300
	1    0    0    -1  
$EndComp
$Comp
L A5C:M367C UAV?
U 1 1 601BC793
P 4600 1150
AR Path="/5F9B692F/601BC793" Ref="UAV?"  Part="1" 
AR Path="/622689A9/601BC793" Ref="UAV?"  Part="1" 
AR Path="/601B6105/601BC793" Ref="UAT290"  Part="1" 
AR Path="/5FBBD4DB/5FBBDC09/601BC793" Ref="UAT290"  Part="1" 
F 0 "UAT290" H 4600 1665 50  0000 C CNN
F 1 "M367C" H 4600 1574 50  0000 C CNN
F 2 "" H 4900 950 50  0001 C CNN
F 3 "" H 4900 950 50  0001 C CNN
F 4 "UAT287;UAT292;UAT294;UAT296" H 4600 1150 50  0001 C CNN "MiscRef"
	1    4600 1150
	1    0    0    -1  
$EndComp
$Comp
L A5C:M541C UAK?
U 1 1 601BC7B6
P 5600 6200
AR Path="/5F9AA26B/601BC7B6" Ref="UAK?"  Part="1" 
AR Path="/622689A9/601BC7B6" Ref="UAK?"  Part="1" 
AR Path="/601B6105/601BC7B6" Ref="UAT299"  Part="1" 
AR Path="/5FBBD4DB/5FBBDC09/601BC7B6" Ref="UAT299"  Part="1" 
F 0 "UAT299" H 5600 6915 50  0000 C CNN
F 1 "M541C" H 5600 6824 50  0000 C CNN
F 2 "" H 5900 6200 50  0001 C CNN
F 3 "" H 5900 6200 50  0001 C CNN
F 4 "UAT301;UAT303;UAT305;UAT310;UAT314;UAT319;UAT323" H 5600 6200 50  0001 C CNN "MiscRef"
	1    5600 6200
	1    0    0    -1  
$EndComp
$Comp
L A5C:M273C UAS?
U 1 1 636156E3
P 3550 4600
AR Path="/61243538/636156E3" Ref="UAS?"  Part="1" 
AR Path="/601B6105/636156E3" Ref="UAS287"  Part="1" 
AR Path="/5FBBD4DB/5FBBDC09/636156E3" Ref="UAS287"  Part="1" 
F 0 "UAS287" H 3550 3833 50  0000 C CNN
F 1 "M273C" H 3550 3924 50  0000 C CNN
F 2 "" H 3550 4600 50  0001 C CNN
F 3 "" H 3550 4600 50  0001 C CNN
	1    3550 4600
	1    0    0    -1  
$EndComp
Text HLabel 4100 1350 0    50   Input ~ 0
~DEBUG
Text HLabel 5100 6650 0    50   Input ~ 0
~DEBUG
Wire Bus Line
	1550 4400 1550 4600
Wire Bus Line
	1800 3850 1800 4400
Wire Bus Line
	5500 800  5500 1400
Wire Bus Line
	6500 800  6500 6350
Wire Bus Line
	5550 2050 5550 5000
$EndSCHEMATC
