EESchema Schematic File Version 4
EELAYER 30 0
EELAYER END
$Descr A4 11693 8268
encoding utf-8
Sheet 49 69
Title ""
Date "2020-11-26"
Rev ""
Comp ""
Comment1 "Licence: CC-BY"
Comment2 "Author: Loïc *WydD* Petit"
Comment3 ""
Comment4 ""
$EndDescr
Connection ~ 5850 1900
Connection ~ 5850 1000
Connection ~ 5850 1450
Connection ~ 5850 5500
Connection ~ 5850 5950
Connection ~ 5850 4600
Connection ~ 5850 6850
Connection ~ 5850 6400
Connection ~ 5850 5050
Connection ~ 5850 3700
Connection ~ 5850 3250
Connection ~ 5850 2800
Connection ~ 5850 2350
Connection ~ 5850 4150
Connection ~ 4350 4050
Connection ~ 5850 7300
Connection ~ 2150 1900
Connection ~ 2150 1000
Connection ~ 2150 1450
Connection ~ 2150 5500
Connection ~ 2150 5950
Connection ~ 2150 4600
Connection ~ 2150 6850
Connection ~ 2150 6400
Connection ~ 2150 5050
Connection ~ 2150 3700
Connection ~ 2150 3250
Connection ~ 2150 2800
Connection ~ 2150 2350
Connection ~ 2150 4150
Connection ~ 3650 4050
Connection ~ 2150 7300
Connection ~ 8200 1550
Connection ~ 8800 1550
Connection ~ 5850 550 
Connection ~ 8200 1050
Connection ~ 8800 1050
Connection ~ 8200 2050
Connection ~ 3650 3650
Entry Wire Line
	1450 650  1350 750 
Entry Wire Line
	1450 1100 1350 1200
Entry Wire Line
	1450 1550 1350 1650
Entry Wire Line
	1450 2000 1350 2100
Entry Wire Line
	1450 2450 1350 2550
Entry Wire Line
	1450 2900 1350 3000
Entry Wire Line
	1450 3350 1350 3450
Entry Wire Line
	1450 3800 1350 3900
Entry Wire Line
	1450 4250 1350 4150
Entry Wire Line
	1450 4700 1350 4600
Entry Wire Line
	1450 5150 1350 5050
Entry Wire Line
	1450 5600 1350 5500
Entry Wire Line
	1450 6050 1350 5950
Entry Wire Line
	1450 6500 1350 6400
Entry Wire Line
	1450 6950 1350 6850
Entry Wire Line
	1450 7400 1350 7300
Entry Wire Line
	3550 650  3650 750 
Entry Wire Line
	3550 1100 3650 1200
Entry Wire Line
	3550 1550 3650 1650
Entry Wire Line
	3550 2000 3650 2100
Entry Wire Line
	3550 2450 3650 2550
Entry Wire Line
	3550 2900 3650 3000
Entry Wire Line
	3550 3350 3650 3450
Entry Wire Line
	3550 3800 3650 3900
Entry Wire Line
	3550 4250 3650 4150
Entry Wire Line
	3550 4700 3650 4600
Entry Wire Line
	3550 5150 3650 5050
Entry Wire Line
	3550 5600 3650 5500
Entry Wire Line
	3550 6050 3650 5950
Entry Wire Line
	3550 6500 3650 6400
Entry Wire Line
	3550 6950 3650 6850
Entry Wire Line
	3550 7400 3650 7300
Entry Wire Line
	4450 650  4350 750 
Entry Wire Line
	4450 1100 4350 1200
Entry Wire Line
	4450 1550 4350 1650
Entry Wire Line
	4450 2000 4350 2100
Entry Wire Line
	4450 2450 4350 2550
Entry Wire Line
	4450 2900 4350 3000
Entry Wire Line
	4450 3350 4350 3450
Entry Wire Line
	4450 3800 4350 3900
Entry Wire Line
	4450 4250 4350 4150
Entry Wire Line
	4450 4700 4350 4600
Entry Wire Line
	4450 5150 4350 5050
Entry Wire Line
	4450 5600 4350 5500
Entry Wire Line
	4450 6050 4350 5950
Entry Wire Line
	4450 6500 4350 6400
Entry Wire Line
	4450 6950 4350 6850
Entry Wire Line
	4450 7400 4350 7300
Entry Wire Line
	6550 650  6650 750 
Entry Wire Line
	6550 1100 6650 1200
Entry Wire Line
	6550 1550 6650 1650
Entry Wire Line
	6550 2000 6650 2100
Entry Wire Line
	6550 2450 6650 2550
Entry Wire Line
	6550 2900 6650 3000
Entry Wire Line
	6550 3350 6650 3450
Entry Wire Line
	6550 3800 6650 3900
Entry Wire Line
	6550 4250 6650 4150
Entry Wire Line
	6550 4700 6650 4600
Entry Wire Line
	6550 5150 6650 5050
Entry Wire Line
	6550 5600 6650 5500
Entry Wire Line
	6550 6050 6650 5950
Entry Wire Line
	6550 6500 6650 6400
Entry Wire Line
	6550 6950 6650 6850
Entry Wire Line
	6550 7400 6650 7300
Wire Wire Line
	2150 1000 2150 550 
Wire Wire Line
	2150 1000 2450 1000
Wire Wire Line
	2150 1450 2150 1000
Wire Wire Line
	2150 1450 2450 1450
Wire Wire Line
	2150 1900 2150 1450
Wire Wire Line
	2150 1900 2450 1900
Wire Wire Line
	2150 2350 2150 1900
Wire Wire Line
	2150 2350 2450 2350
Wire Wire Line
	2150 2800 2150 2350
Wire Wire Line
	2150 2800 2450 2800
Wire Wire Line
	2150 3250 2150 2800
Wire Wire Line
	2150 3250 2450 3250
Wire Wire Line
	2150 3700 2150 3250
Wire Wire Line
	2150 3700 2450 3700
Wire Wire Line
	2150 4150 2150 3700
Wire Wire Line
	2150 4150 2450 4150
Wire Wire Line
	2150 4600 2150 4150
Wire Wire Line
	2150 4600 2450 4600
Wire Wire Line
	2150 5050 2150 4600
Wire Wire Line
	2150 5050 2450 5050
Wire Wire Line
	2150 5500 2150 5050
Wire Wire Line
	2150 5500 2450 5500
Wire Wire Line
	2150 5950 2150 5500
Wire Wire Line
	2150 6400 2150 5950
Wire Wire Line
	2150 6400 2450 6400
Wire Wire Line
	2150 6850 2150 6400
Wire Wire Line
	2150 6850 2450 6850
Wire Wire Line
	2150 7300 2150 6850
Wire Wire Line
	2150 7300 2150 7750
Wire Wire Line
	2150 7300 2450 7300
Wire Wire Line
	2150 7750 5850 7750
Wire Wire Line
	2350 650  1450 650 
Wire Wire Line
	2350 1100 1450 1100
Wire Wire Line
	2350 1550 1450 1550
Wire Wire Line
	2350 2000 1450 2000
Wire Wire Line
	2350 2450 1450 2450
Wire Wire Line
	2350 2900 1450 2900
Wire Wire Line
	2350 3350 1450 3350
Wire Wire Line
	2350 3800 1450 3800
Wire Wire Line
	2350 4250 1450 4250
Wire Wire Line
	2350 4700 1450 4700
Wire Wire Line
	2350 5150 1450 5150
Wire Wire Line
	2350 5600 1450 5600
Wire Wire Line
	2350 6050 1450 6050
Wire Wire Line
	2350 6500 1450 6500
Wire Wire Line
	2350 6950 1450 6950
Wire Wire Line
	2350 7400 1450 7400
Wire Wire Line
	2450 550  2150 550 
Wire Wire Line
	2450 5950 2150 5950
Wire Wire Line
	3550 650  2750 650 
Wire Wire Line
	3550 1100 2750 1100
Wire Wire Line
	3550 1550 2750 1550
Wire Wire Line
	3550 2000 2750 2000
Wire Wire Line
	3550 2450 2750 2450
Wire Wire Line
	3550 2900 2750 2900
Wire Wire Line
	3550 3350 2750 3350
Wire Wire Line
	3550 3800 2750 3800
Wire Wire Line
	3550 4250 2750 4250
Wire Wire Line
	3550 4700 2750 4700
Wire Wire Line
	3550 5150 2750 5150
Wire Wire Line
	3550 5600 2750 5600
Wire Wire Line
	3550 6050 2750 6050
Wire Wire Line
	3550 6500 2750 6500
Wire Wire Line
	3550 6950 2750 6950
Wire Wire Line
	3550 7400 2750 7400
Wire Wire Line
	4450 650  5250 650 
Wire Wire Line
	4450 1100 5250 1100
Wire Wire Line
	4450 1550 5250 1550
Wire Wire Line
	4450 2000 5250 2000
Wire Wire Line
	4450 2450 5250 2450
Wire Wire Line
	4450 2900 5250 2900
Wire Wire Line
	4450 3350 5250 3350
Wire Wire Line
	4450 3800 5250 3800
Wire Wire Line
	4450 4250 5250 4250
Wire Wire Line
	4450 4700 5250 4700
Wire Wire Line
	4450 5150 5250 5150
Wire Wire Line
	4450 5600 5250 5600
Wire Wire Line
	4450 6050 5250 6050
Wire Wire Line
	4450 6500 5250 6500
Wire Wire Line
	4450 6950 5250 6950
Wire Wire Line
	4450 7400 5250 7400
Wire Wire Line
	5550 550  5850 550 
Wire Wire Line
	5550 5950 5850 5950
Wire Wire Line
	5650 650  6550 650 
Wire Wire Line
	5650 1100 6550 1100
Wire Wire Line
	5650 1550 6550 1550
Wire Wire Line
	5650 2000 6550 2000
Wire Wire Line
	5650 2450 6550 2450
Wire Wire Line
	5650 2900 6550 2900
Wire Wire Line
	5650 3350 6550 3350
Wire Wire Line
	5650 3800 6550 3800
Wire Wire Line
	5650 4250 6550 4250
Wire Wire Line
	5650 4700 6550 4700
Wire Wire Line
	5650 5150 6550 5150
Wire Wire Line
	5650 5600 6550 5600
Wire Wire Line
	5650 6050 6550 6050
Wire Wire Line
	5650 6500 6550 6500
Wire Wire Line
	5650 6950 6550 6950
Wire Wire Line
	5650 7400 6550 7400
Wire Wire Line
	5850 550  7650 550 
Wire Wire Line
	5850 1000 5550 1000
Wire Wire Line
	5850 1000 5850 550 
Wire Wire Line
	5850 1450 5550 1450
Wire Wire Line
	5850 1450 5850 1000
Wire Wire Line
	5850 1900 5550 1900
Wire Wire Line
	5850 1900 5850 1450
Wire Wire Line
	5850 2350 5550 2350
Wire Wire Line
	5850 2350 5850 1900
Wire Wire Line
	5850 2800 5550 2800
Wire Wire Line
	5850 2800 5850 2350
Wire Wire Line
	5850 3250 5550 3250
Wire Wire Line
	5850 3250 5850 2800
Wire Wire Line
	5850 3700 5550 3700
Wire Wire Line
	5850 3700 5850 3250
Wire Wire Line
	5850 4150 5550 4150
Wire Wire Line
	5850 4150 5850 3700
Wire Wire Line
	5850 4600 5550 4600
Wire Wire Line
	5850 4600 5850 4150
Wire Wire Line
	5850 5050 5550 5050
Wire Wire Line
	5850 5050 5850 4600
Wire Wire Line
	5850 5500 5550 5500
Wire Wire Line
	5850 5500 5850 5050
Wire Wire Line
	5850 5950 5850 5500
Wire Wire Line
	5850 6400 5550 6400
Wire Wire Line
	5850 6400 5850 5950
Wire Wire Line
	5850 6850 5550 6850
Wire Wire Line
	5850 6850 5850 6400
Wire Wire Line
	5850 7300 5550 7300
Wire Wire Line
	5850 7300 5850 6850
Wire Wire Line
	5850 7300 5850 7750
Wire Wire Line
	7650 550  7650 1050
Wire Wire Line
	7650 1050 8200 1050
Wire Wire Line
	8200 1550 8200 1050
Wire Wire Line
	8200 2050 8200 1550
Wire Wire Line
	8200 2600 8200 2050
Wire Wire Line
	8800 1050 8800 1550
Wire Wire Line
	8800 1050 9450 1050
Wire Wire Line
	8800 1550 8800 2050
Wire Wire Line
	9500 2600 8800 2600
Wire Bus Line
	1350 3900 1100 3900
Wire Bus Line
	1350 4150 1100 4150
Wire Bus Line
	3650 4050 4350 4050
Wire Bus Line
	3850 3650 3650 3650
Wire Bus Line
	6650 3900 6900 3900
Wire Bus Line
	6650 4150 6900 4150
Text Label 2050 650  2    50   ~ 0
APD0
Text Label 2050 1100 2    50   ~ 0
APD1
Text Label 2050 1550 2    50   ~ 0
APD2
Text Label 2050 2000 2    50   ~ 0
APD3
Text Label 2050 2450 2    50   ~ 0
APD4
Text Label 2050 2900 2    50   ~ 0
APD5
Text Label 2050 3350 2    50   ~ 0
APD6
Text Label 2050 3800 2    50   ~ 0
APD7
Text Label 2050 4250 2    50   ~ 0
BPD0
Text Label 2050 4700 2    50   ~ 0
BPD1
Text Label 2050 5150 2    50   ~ 0
BPD2
Text Label 2050 5600 2    50   ~ 0
BPD3
Text Label 2050 6050 2    50   ~ 0
BPD4
Text Label 2050 6500 2    50   ~ 0
BPD5
Text Label 2050 6950 2    50   ~ 0
BPD6
Text Label 2050 7400 2    50   ~ 0
BPD7
Text Label 5950 650  0    50   ~ 0
CPD0
Text Label 5950 1100 0    50   ~ 0
CPD1
Text Label 5950 1550 0    50   ~ 0
CPD2
Text Label 5950 2000 0    50   ~ 0
CPD3
Text Label 5950 2450 0    50   ~ 0
CPD4
Text Label 5950 2900 0    50   ~ 0
CPD5
Text Label 5950 3350 0    50   ~ 0
CPD6
Text Label 5950 3800 0    50   ~ 0
CPD7
Text Label 5950 4250 0    50   ~ 0
DPD0
Text Label 5950 4700 0    50   ~ 0
DPD1
Text Label 5950 5150 0    50   ~ 0
DPD2
Text Label 5950 5600 0    50   ~ 0
DPD3
Text Label 5950 6050 0    50   ~ 0
DPD4
Text Label 5950 6500 0    50   ~ 0
DPD5
Text Label 5950 6950 0    50   ~ 0
DPD6
Text Label 5950 7400 0    50   ~ 0
DPD7
Text HLabel 1100 3900 0    50   3State ~ 0
APD[0..7]
Text HLabel 1100 4150 0    50   3State ~ 0
BPD[0..7]
Text HLabel 3850 3650 2    50   Input ~ 0
OUT[0..7]
Text HLabel 6900 3900 2    50   3State ~ 0
CPD[0..7]
Text HLabel 6900 4150 2    50   3State ~ 0
DPD[0..7]
Text HLabel 9450 1050 2    50   Input ~ 0
~OE
Text HLabel 9500 2600 2    50   Output ~ 0
~ROMOE
$Comp
L A5C:OUTTRI UCT?
U 1 1 62E7481C
P 2550 650
AR Path="/5FB062CA/62E7481C" Ref="UCT?"  Part="1" 
AR Path="/62E6B083/62E7481C" Ref="UAA494"  Part="1" 
F 0 "UAA494" H 2550 900 50  0000 C CNN
F 1 "OUTTRI" H 2550 800 50  0000 C CNN
F 2 "" H 2600 650 50  0001 C CNN
F 3 "" H 2600 650 50  0001 C CNN
	1    2550 650 
	-1   0    0    1   
$EndComp
$Comp
L A5C:OUTTRI UCT?
U 1 1 62E74822
P 2550 1100
AR Path="/5FB062CA/62E74822" Ref="UCT?"  Part="1" 
AR Path="/62E6B083/62E74822" Ref="UAA463"  Part="1" 
F 0 "UAA463" H 2550 1350 50  0000 C CNN
F 1 "OUTTRI" H 2550 1250 50  0000 C CNN
F 2 "" H 2600 1100 50  0001 C CNN
F 3 "" H 2600 1100 50  0001 C CNN
	1    2550 1100
	-1   0    0    1   
$EndComp
$Comp
L A5C:OUTTRI UCT?
U 1 1 62E74828
P 2550 1550
AR Path="/5FB062CA/62E74828" Ref="UCT?"  Part="1" 
AR Path="/62E6B083/62E74828" Ref="UAA412"  Part="1" 
F 0 "UAA412" H 2550 1800 50  0000 C CNN
F 1 "OUTTRI" H 2550 1700 50  0000 C CNN
F 2 "" H 2600 1550 50  0001 C CNN
F 3 "" H 2600 1550 50  0001 C CNN
	1    2550 1550
	-1   0    0    1   
$EndComp
$Comp
L A5C:OUTTRI UCT?
U 1 1 62E7482E
P 2550 2000
AR Path="/5FB062CA/62E7482E" Ref="UCT?"  Part="1" 
AR Path="/62E6B083/62E7482E" Ref="UAA488"  Part="1" 
F 0 "UAA488" H 2550 2250 50  0000 C CNN
F 1 "OUTTRI" H 2550 2150 50  0000 C CNN
F 2 "" H 2600 2000 50  0001 C CNN
F 3 "" H 2600 2000 50  0001 C CNN
	1    2550 2000
	-1   0    0    1   
$EndComp
$Comp
L A5C:OUTTRI UCT?
U 1 1 62E74834
P 2550 2450
AR Path="/5FB062CA/62E74834" Ref="UCT?"  Part="1" 
AR Path="/62E6B083/62E74834" Ref="UAA416"  Part="1" 
F 0 "UAA416" H 2550 2700 50  0000 C CNN
F 1 "OUTTRI" H 2550 2600 50  0000 C CNN
F 2 "" H 2600 2450 50  0001 C CNN
F 3 "" H 2600 2450 50  0001 C CNN
	1    2550 2450
	-1   0    0    1   
$EndComp
$Comp
L A5C:OUTTRI UCT?
U 1 1 62E7483A
P 2550 2900
AR Path="/5FB062CA/62E7483A" Ref="UCT?"  Part="1" 
AR Path="/62E6B083/62E7483A" Ref="UAA396"  Part="1" 
F 0 "UAA396" H 2550 3150 50  0000 C CNN
F 1 "OUTTRI" H 2550 3050 50  0000 C CNN
F 2 "" H 2600 2900 50  0001 C CNN
F 3 "" H 2600 2900 50  0001 C CNN
	1    2550 2900
	-1   0    0    1   
$EndComp
$Comp
L A5C:OUTTRI UCT?
U 1 1 62E74840
P 2550 3350
AR Path="/5FB062CA/62E74840" Ref="UCT?"  Part="1" 
AR Path="/62E6B083/62E74840" Ref="UBD444"  Part="1" 
F 0 "UBD444" H 2550 3600 50  0000 C CNN
F 1 "OUTTRI" H 2550 3500 50  0000 C CNN
F 2 "" H 2600 3350 50  0001 C CNN
F 3 "" H 2600 3350 50  0001 C CNN
	1    2550 3350
	-1   0    0    1   
$EndComp
$Comp
L A5C:OUTTRI UCT?
U 1 1 62E74846
P 2550 3800
AR Path="/5FB062CA/62E74846" Ref="UCT?"  Part="1" 
AR Path="/62E6B083/62E74846" Ref="UAA383"  Part="1" 
F 0 "UAA383" H 2550 4050 50  0000 C CNN
F 1 "OUTTRI" H 2550 3950 50  0000 C CNN
F 2 "" H 2600 3800 50  0001 C CNN
F 3 "" H 2600 3800 50  0001 C CNN
	1    2550 3800
	-1   0    0    1   
$EndComp
$Comp
L A5C:OUTTRI UCT?
U 1 1 62E7484C
P 2550 4250
AR Path="/5FB062CA/62E7484C" Ref="UCT?"  Part="1" 
AR Path="/62E6B083/62E7484C" Ref="UAA407"  Part="1" 
F 0 "UAA407" H 2550 4500 50  0000 C CNN
F 1 "OUTTRI" H 2550 4400 50  0000 C CNN
F 2 "" H 2600 4250 50  0001 C CNN
F 3 "" H 2600 4250 50  0001 C CNN
	1    2550 4250
	-1   0    0    1   
$EndComp
$Comp
L A5C:OUTTRI UCT?
U 1 1 62E74852
P 2550 4700
AR Path="/5FB062CA/62E74852" Ref="UCT?"  Part="1" 
AR Path="/62E6B083/62E74852" Ref="UAA401"  Part="1" 
F 0 "UAA401" H 2550 4950 50  0000 C CNN
F 1 "OUTTRI" H 2550 4850 50  0000 C CNN
F 2 "" H 2600 4700 50  0001 C CNN
F 3 "" H 2600 4700 50  0001 C CNN
	1    2550 4700
	-1   0    0    1   
$EndComp
$Comp
L A5C:OUTTRI UCT?
U 1 1 62E74858
P 2550 5150
AR Path="/5FB062CA/62E74858" Ref="UCT?"  Part="1" 
AR Path="/62E6B083/62E74858" Ref="UAA387"  Part="1" 
F 0 "UAA387" H 2550 5400 50  0000 C CNN
F 1 "OUTTRI" H 2550 5300 50  0000 C CNN
F 2 "" H 2600 5150 50  0001 C CNN
F 3 "" H 2600 5150 50  0001 C CNN
	1    2550 5150
	-1   0    0    1   
$EndComp
$Comp
L A5C:OUTTRI UCT?
U 1 1 62E7485E
P 2550 5600
AR Path="/5FB062CA/62E7485E" Ref="UCT?"  Part="1" 
AR Path="/62E6B083/62E7485E" Ref="UAA351"  Part="1" 
F 0 "UAA351" H 2550 5850 50  0000 C CNN
F 1 "OUTTRI" H 2550 5750 50  0000 C CNN
F 2 "" H 2600 5600 50  0001 C CNN
F 3 "" H 2600 5600 50  0001 C CNN
	1    2550 5600
	-1   0    0    1   
$EndComp
$Comp
L A5C:OUTTRI UCR?
U 1 1 62E74864
P 2550 6050
AR Path="/5FB062CA/62E74864" Ref="UCR?"  Part="1" 
AR Path="/62E6B083/62E74864" Ref="UAA337"  Part="1" 
F 0 "UAA337" H 2550 6300 50  0000 C CNN
F 1 "OUTTRI" H 2550 6200 50  0000 C CNN
F 2 "" H 2600 6050 50  0001 C CNN
F 3 "" H 2600 6050 50  0001 C CNN
	1    2550 6050
	-1   0    0    1   
$EndComp
$Comp
L A5C:OUTTRI UCR?
U 1 1 62E7486A
P 2550 6500
AR Path="/5FB062CA/62E7486A" Ref="UCR?"  Part="1" 
AR Path="/62E6B083/62E7486A" Ref="UAA356"  Part="1" 
F 0 "UAA356" H 2550 6750 50  0000 C CNN
F 1 "OUTTRI" H 2550 6650 50  0000 C CNN
F 2 "" H 2600 6500 50  0001 C CNN
F 3 "" H 2600 6500 50  0001 C CNN
	1    2550 6500
	-1   0    0    1   
$EndComp
$Comp
L A5C:OUTTRI UCT?
U 1 1 62E74870
P 2550 6950
AR Path="/5FB062CA/62E74870" Ref="UCT?"  Part="1" 
AR Path="/62E6B083/62E74870" Ref="UAA328"  Part="1" 
F 0 "UAA328" H 2550 7200 50  0000 C CNN
F 1 "OUTTRI" H 2550 7100 50  0000 C CNN
F 2 "" H 2600 6950 50  0001 C CNN
F 3 "" H 2600 6950 50  0001 C CNN
	1    2550 6950
	-1   0    0    1   
$EndComp
$Comp
L A5C:OUTTRI UCT?
U 1 1 62E74876
P 2550 7400
AR Path="/5FB062CA/62E74876" Ref="UCT?"  Part="1" 
AR Path="/62E6B083/62E74876" Ref="UAA346"  Part="1" 
F 0 "UAA346" H 2550 7650 50  0000 C CNN
F 1 "OUTTRI" H 2550 7550 50  0000 C CNN
F 2 "" H 2600 7400 50  0001 C CNN
F 3 "" H 2600 7400 50  0001 C CNN
	1    2550 7400
	-1   0    0    1   
$EndComp
$Comp
L A5C:OUTTRI UCT?
U 1 1 62E6E4D3
P 5450 650
AR Path="/5FB062CA/62E6E4D3" Ref="UCT?"  Part="1" 
AR Path="/62E6B083/62E6E4D3" Ref="UAA300"  Part="1" 
F 0 "UAA300" H 5450 900 50  0000 C CNN
F 1 "OUTTRI" H 5450 800 50  0000 C CNN
F 2 "" H 5500 650 50  0001 C CNN
F 3 "" H 5500 650 50  0001 C CNN
	1    5450 650 
	1    0    0    1   
$EndComp
$Comp
L A5C:OUTTRI UCT?
U 1 1 62E6E4D9
P 5450 1100
AR Path="/5FB062CA/62E6E4D9" Ref="UCT?"  Part="1" 
AR Path="/62E6B083/62E6E4D9" Ref="UAA295"  Part="1" 
F 0 "UAA295" H 5450 1350 50  0000 C CNN
F 1 "OUTTRI" H 5450 1250 50  0000 C CNN
F 2 "" H 5500 1100 50  0001 C CNN
F 3 "" H 5500 1100 50  0001 C CNN
	1    5450 1100
	1    0    0    1   
$EndComp
$Comp
L A5C:OUTTRI UCT?
U 1 1 62E6E4DF
P 5450 1550
AR Path="/5FB062CA/62E6E4DF" Ref="UCT?"  Part="1" 
AR Path="/62E6B083/62E6E4DF" Ref="UAA291"  Part="1" 
F 0 "UAA291" H 5450 1800 50  0000 C CNN
F 1 "OUTTRI" H 5450 1700 50  0000 C CNN
F 2 "" H 5500 1550 50  0001 C CNN
F 3 "" H 5500 1550 50  0001 C CNN
	1    5450 1550
	1    0    0    1   
$EndComp
$Comp
L A5C:OUTTRI UCT?
U 1 1 62E6E4E5
P 5450 2000
AR Path="/5FB062CA/62E6E4E5" Ref="UCT?"  Part="1" 
AR Path="/62E6B083/62E6E4E5" Ref="UAA269"  Part="1" 
F 0 "UAA269" H 5450 2250 50  0000 C CNN
F 1 "OUTTRI" H 5450 2150 50  0000 C CNN
F 2 "" H 5500 2000 50  0001 C CNN
F 3 "" H 5500 2000 50  0001 C CNN
	1    5450 2000
	1    0    0    1   
$EndComp
$Comp
L A5C:OUTTRI UCT?
U 1 1 62E6E4EB
P 5450 2450
AR Path="/5FB062CA/62E6E4EB" Ref="UCT?"  Part="1" 
AR Path="/62E6B083/62E6E4EB" Ref="UAA256"  Part="1" 
F 0 "UAA256" H 5450 2700 50  0000 C CNN
F 1 "OUTTRI" H 5450 2600 50  0000 C CNN
F 2 "" H 5500 2450 50  0001 C CNN
F 3 "" H 5500 2450 50  0001 C CNN
	1    5450 2450
	1    0    0    1   
$EndComp
$Comp
L A5C:OUTTRI UCT?
U 1 1 62E6E4F1
P 5450 2900
AR Path="/5FB062CA/62E6E4F1" Ref="UCT?"  Part="1" 
AR Path="/62E6B083/62E6E4F1" Ref="UAA241"  Part="1" 
F 0 "UAA241" H 5450 3150 50  0000 C CNN
F 1 "OUTTRI" H 5450 3050 50  0000 C CNN
F 2 "" H 5500 2900 50  0001 C CNN
F 3 "" H 5500 2900 50  0001 C CNN
	1    5450 2900
	1    0    0    1   
$EndComp
$Comp
L A5C:OUTTRI UCT?
U 1 1 62E6E4F7
P 5450 3350
AR Path="/5FB062CA/62E6E4F7" Ref="UCT?"  Part="1" 
AR Path="/62E6B083/62E6E4F7" Ref="UAA227"  Part="1" 
F 0 "UAA227" H 5450 3600 50  0000 C CNN
F 1 "OUTTRI" H 5450 3500 50  0000 C CNN
F 2 "" H 5500 3350 50  0001 C CNN
F 3 "" H 5500 3350 50  0001 C CNN
	1    5450 3350
	1    0    0    1   
$EndComp
$Comp
L A5C:OUTTRI UCT?
U 1 1 62E6E4FD
P 5450 3800
AR Path="/5FB062CA/62E6E4FD" Ref="UCT?"  Part="1" 
AR Path="/62E6B083/62E6E4FD" Ref="UAA216"  Part="1" 
F 0 "UAA216" H 5450 4050 50  0000 C CNN
F 1 "OUTTRI" H 5450 3950 50  0000 C CNN
F 2 "" H 5500 3800 50  0001 C CNN
F 3 "" H 5500 3800 50  0001 C CNN
	1    5450 3800
	1    0    0    1   
$EndComp
$Comp
L A5C:OUTTRI UCT?
U 1 1 62E6E503
P 5450 4250
AR Path="/5FB062CA/62E6E503" Ref="UCT?"  Part="1" 
AR Path="/62E6B083/62E6E503" Ref="UAA245"  Part="1" 
F 0 "UAA245" H 5450 4500 50  0000 C CNN
F 1 "OUTTRI" H 5450 4400 50  0000 C CNN
F 2 "" H 5500 4250 50  0001 C CNN
F 3 "" H 5500 4250 50  0001 C CNN
	1    5450 4250
	1    0    0    1   
$EndComp
$Comp
L A5C:OUTTRI UCT?
U 1 1 62E6E509
P 5450 4700
AR Path="/5FB062CA/62E6E509" Ref="UCT?"  Part="1" 
AR Path="/62E6B083/62E6E509" Ref="UAA201"  Part="1" 
F 0 "UAA201" H 5450 4950 50  0000 C CNN
F 1 "OUTTRI" H 5450 4850 50  0000 C CNN
F 2 "" H 5500 4700 50  0001 C CNN
F 3 "" H 5500 4700 50  0001 C CNN
	1    5450 4700
	1    0    0    1   
$EndComp
$Comp
L A5C:OUTTRI UCT?
U 1 1 62E6E50F
P 5450 5150
AR Path="/5FB062CA/62E6E50F" Ref="UCT?"  Part="1" 
AR Path="/62E6B083/62E6E50F" Ref="UAA231"  Part="1" 
F 0 "UAA231" H 5450 5400 50  0000 C CNN
F 1 "OUTTRI" H 5450 5300 50  0000 C CNN
F 2 "" H 5500 5150 50  0001 C CNN
F 3 "" H 5500 5150 50  0001 C CNN
	1    5450 5150
	1    0    0    1   
$EndComp
$Comp
L A5C:OUTTRI UCT?
U 1 1 62E6E515
P 5450 5600
AR Path="/5FB062CA/62E6E515" Ref="UCT?"  Part="1" 
AR Path="/62E6B083/62E6E515" Ref="UAA182"  Part="1" 
F 0 "UAA182" H 5450 5850 50  0000 C CNN
F 1 "OUTTRI" H 5450 5750 50  0000 C CNN
F 2 "" H 5500 5600 50  0001 C CNN
F 3 "" H 5500 5600 50  0001 C CNN
	1    5450 5600
	1    0    0    1   
$EndComp
$Comp
L A5C:OUTTRI UCR?
U 1 1 62E6E51B
P 5450 6050
AR Path="/5FB062CA/62E6E51B" Ref="UCR?"  Part="1" 
AR Path="/62E6B083/62E6E51B" Ref="UAA168"  Part="1" 
F 0 "UAA168" H 5450 6300 50  0000 C CNN
F 1 "OUTTRI" H 5450 6200 50  0000 C CNN
F 2 "" H 5500 6050 50  0001 C CNN
F 3 "" H 5500 6050 50  0001 C CNN
	1    5450 6050
	1    0    0    1   
$EndComp
$Comp
L A5C:OUTTRI UCR?
U 1 1 62E6E521
P 5450 6500
AR Path="/5FB062CA/62E6E521" Ref="UCR?"  Part="1" 
AR Path="/62E6B083/62E6E521" Ref="UAA186"  Part="1" 
F 0 "UAA186" H 5450 6750 50  0000 C CNN
F 1 "OUTTRI" H 5450 6650 50  0000 C CNN
F 2 "" H 5500 6500 50  0001 C CNN
F 3 "" H 5500 6500 50  0001 C CNN
	1    5450 6500
	1    0    0    1   
$EndComp
$Comp
L A5C:OUTTRI UCT?
U 1 1 62E6E527
P 5450 6950
AR Path="/5FB062CA/62E6E527" Ref="UCT?"  Part="1" 
AR Path="/62E6B083/62E6E527" Ref="UAA164"  Part="1" 
F 0 "UAA164" H 5450 7200 50  0000 C CNN
F 1 "OUTTRI" H 5450 7100 50  0000 C CNN
F 2 "" H 5500 6950 50  0001 C CNN
F 3 "" H 5500 6950 50  0001 C CNN
	1    5450 6950
	1    0    0    1   
$EndComp
$Comp
L A5C:OUTTRI UCT?
U 1 1 62E6E52D
P 5450 7400
AR Path="/5FB062CA/62E6E52D" Ref="UCT?"  Part="1" 
AR Path="/62E6B083/62E6E52D" Ref="UAA191"  Part="1" 
F 0 "UAA191" H 5450 7650 50  0000 C CNN
F 1 "OUTTRI" H 5450 7550 50  0000 C CNN
F 2 "" H 5500 7400 50  0001 C CNN
F 3 "" H 5500 7400 50  0001 C CNN
	1    5450 7400
	1    0    0    1   
$EndComp
$Comp
L A5C:BUF12 UAA?
U 1 1 630F233B
P 8500 1050
AR Path="/630F233B" Ref="UAA?"  Part="1" 
AR Path="/62E6B083/630F233B" Ref="UAA467"  Part="1" 
F 0 "UAA467" H 8500 1367 50  0000 C CNN
F 1 "BUF12" H 8500 1276 50  0000 C CNN
F 2 "" H 8500 1050 50  0001 C CNN
F 3 "" H 8500 1050 50  0001 C CNN
	1    8500 1050
	-1   0    0    -1  
$EndComp
$Comp
L A5C:BUF12 UAA?
U 1 1 630F2341
P 8500 1550
AR Path="/630F2341" Ref="UAA?"  Part="1" 
AR Path="/62E6B083/630F2341" Ref="UAA392"  Part="1" 
F 0 "UAA392" H 8500 1867 50  0000 C CNN
F 1 "BUF12" H 8500 1776 50  0000 C CNN
F 2 "" H 8500 1550 50  0001 C CNN
F 3 "" H 8500 1550 50  0001 C CNN
	1    8500 1550
	-1   0    0    -1  
$EndComp
$Comp
L A5C:BUF12 UAA?
U 1 1 630F2347
P 8500 2050
AR Path="/630F2347" Ref="UAA?"  Part="1" 
AR Path="/62E6B083/630F2347" Ref="UAA394"  Part="1" 
F 0 "UAA394" H 8500 2367 50  0000 C CNN
F 1 "BUF12" H 8500 2276 50  0000 C CNN
F 2 "" H 8500 2050 50  0001 C CNN
F 3 "" H 8500 2050 50  0001 C CNN
	1    8500 2050
	-1   0    0    -1  
$EndComp
$Comp
L A5C:NBUF03 UAA162
U 1 1 63229E3F
P 8500 2600
F 0 "UAA162" H 8500 2917 50  0000 C CNN
F 1 "NBUF03" H 8500 2826 50  0000 C CNN
F 2 "" H 8500 2400 50  0001 C CNN
F 3 "" H 8500 2400 50  0001 C CNN
	1    8500 2600
	1    0    0    -1  
$EndComp
Text Label 4550 650  0    50   ~ 0
OUT0
Text Label 4550 1100 0    50   ~ 0
OUT1
Text Label 4550 1550 0    50   ~ 0
OUT2
Text Label 4550 2000 0    50   ~ 0
OUT3
Text Label 4550 2450 0    50   ~ 0
OUT4
Text Label 4550 2900 0    50   ~ 0
OUT5
Text Label 4550 3350 0    50   ~ 0
OUT6
Text Label 4550 3800 0    50   ~ 0
OUT7
Text Label 3450 650  2    50   ~ 0
OUT0
Text Label 3450 1100 2    50   ~ 0
OUT1
Text Label 3450 1550 2    50   ~ 0
OUT2
Text Label 3450 2000 2    50   ~ 0
OUT3
Text Label 3450 2450 2    50   ~ 0
OUT4
Text Label 3450 2900 2    50   ~ 0
OUT5
Text Label 3450 3350 2    50   ~ 0
OUT6
Text Label 3450 3800 2    50   ~ 0
OUT7
Text Label 3450 4250 2    50   ~ 0
OUT0
Text Label 3450 4700 2    50   ~ 0
OUT1
Text Label 3450 5150 2    50   ~ 0
OUT2
Text Label 3450 5600 2    50   ~ 0
OUT3
Text Label 3450 6050 2    50   ~ 0
OUT4
Text Label 3450 6500 2    50   ~ 0
OUT5
Text Label 3450 6950 2    50   ~ 0
OUT6
Text Label 3450 7400 2    50   ~ 0
OUT7
Text Label 4550 4250 0    50   ~ 0
OUT0
Text Label 4550 4700 0    50   ~ 0
OUT1
Text Label 4550 5150 0    50   ~ 0
OUT2
Text Label 4550 5600 0    50   ~ 0
OUT3
Text Label 4550 6050 0    50   ~ 0
OUT4
Text Label 4550 6500 0    50   ~ 0
OUT5
Text Label 4550 6950 0    50   ~ 0
OUT6
Text Label 4550 7400 0    50   ~ 0
OUT7
Wire Bus Line
	3650 3650 3650 4050
Wire Bus Line
	1350 750  1350 3900
Wire Bus Line
	1350 4150 1350 7300
Wire Bus Line
	3650 750  3650 3650
Wire Bus Line
	6650 750  6650 3900
Wire Bus Line
	6650 4150 6650 7300
Wire Bus Line
	3650 4050 3650 7300
Wire Bus Line
	4350 750  4350 4050
Wire Bus Line
	4350 4050 4350 7300
$EndSCHEMATC
