EESchema Schematic File Version 4
EELAYER 30 0
EELAYER END
$Descr A4 11693 8268
encoding utf-8
Sheet 14 22
Title ""
Date "2020-12-13"
Rev ""
Comp ""
Comment1 ""
Comment2 "Licence: CC-BY"
Comment3 "Author: Loïc *WydD* Petit"
Comment4 "Project: CPS2 Reverse Engineering: 93646A"
$EndDescr
Connection ~ 2750 5050
Connection ~ 6500 2750
Connection ~ 6500 5350
Connection ~ 5600 2950
Connection ~ 3750 2950
Connection ~ 7350 2850
Connection ~ 10400 2850
Connection ~ 6750 3100
Connection ~ 2750 7350
Connection ~ 2750 2750
Entry Wire Line
	1650 1150 1750 1250
Entry Wire Line
	1650 1450 1750 1550
Entry Wire Line
	1650 1750 1750 1850
Entry Wire Line
	1650 2050 1750 2150
Entry Wire Line
	1650 3450 1750 3550
Entry Wire Line
	1650 3750 1750 3850
Entry Wire Line
	1650 4050 1750 4150
Entry Wire Line
	1650 4350 1750 4450
Entry Wire Line
	1650 5750 1750 5850
Entry Wire Line
	1650 6050 1750 6150
Entry Wire Line
	1650 6350 1750 6450
Entry Wire Line
	1650 6650 1750 6750
Entry Wire Line
	1850 1050 1950 1150
Entry Wire Line
	1850 1350 1950 1450
Entry Wire Line
	1850 1650 1950 1750
Entry Wire Line
	1850 1950 1950 2050
Entry Wire Line
	1850 3350 1950 3450
Entry Wire Line
	1850 3650 1950 3750
Entry Wire Line
	1850 3950 1950 4050
Entry Wire Line
	1850 4250 1950 4350
Entry Wire Line
	1850 5650 1950 5750
Entry Wire Line
	1850 5950 1950 6050
Entry Wire Line
	1850 6250 1950 6350
Entry Wire Line
	1850 6550 1950 6650
Entry Wire Line
	3750 1250 3650 1150
Entry Wire Line
	3750 1550 3650 1450
Entry Wire Line
	3750 1850 3650 1750
Entry Wire Line
	3750 2150 3650 2050
Entry Wire Line
	3750 3350 3650 3450
Entry Wire Line
	3750 3650 3650 3750
Entry Wire Line
	3750 3950 3650 4050
Entry Wire Line
	3750 4250 3650 4350
Entry Wire Line
	3750 5650 3650 5750
Entry Wire Line
	3750 5950 3650 6050
Entry Wire Line
	3750 6250 3650 6350
Entry Wire Line
	3750 6550 3650 6650
Entry Wire Line
	5600 1250 5700 1150
Entry Wire Line
	5600 1350 5700 1250
Entry Wire Line
	5600 1450 5700 1350
Entry Wire Line
	5600 1550 5700 1450
Entry Wire Line
	5600 1650 5700 1550
Entry Wire Line
	5600 1750 5700 1650
Entry Wire Line
	5600 1850 5700 1750
Entry Wire Line
	5600 1950 5700 1850
Entry Wire Line
	5600 2050 5700 1950
Entry Wire Line
	5600 2150 5700 2050
Entry Wire Line
	5600 2250 5700 2150
Entry Wire Line
	5600 2350 5700 2250
Entry Wire Line
	5600 3650 5700 3750
Entry Wire Line
	5600 3750 5700 3850
Entry Wire Line
	5600 3850 5700 3950
Entry Wire Line
	5600 3950 5700 4050
Entry Wire Line
	5600 4050 5700 4150
Entry Wire Line
	5600 4150 5700 4250
Entry Wire Line
	5600 4250 5700 4350
Entry Wire Line
	5600 4350 5700 4450
Entry Wire Line
	5600 4450 5700 4550
Entry Wire Line
	5600 4550 5700 4650
Entry Wire Line
	5600 4650 5700 4750
Entry Wire Line
	5600 4750 5700 4850
Entry Wire Line
	7250 1050 7150 1150
Entry Wire Line
	7250 1150 7150 1250
Entry Wire Line
	7250 1250 7150 1350
Entry Wire Line
	7250 1350 7150 1450
Entry Wire Line
	7250 1650 7150 1550
Entry Wire Line
	7250 1750 7150 1650
Entry Wire Line
	7250 1850 7150 1750
Entry Wire Line
	7250 1950 7150 1850
Entry Wire Line
	7250 3650 7150 3750
Entry Wire Line
	7250 3750 7150 3850
Entry Wire Line
	7250 3850 7150 3950
Entry Wire Line
	7250 3950 7150 4050
Entry Wire Line
	7250 4250 7150 4150
Entry Wire Line
	7250 4350 7150 4250
Entry Wire Line
	7250 4450 7150 4350
Entry Wire Line
	7250 4550 7150 4450
Entry Wire Line
	10300 1150 10400 1250
Entry Wire Line
	10300 1250 10400 1350
Entry Wire Line
	10300 1350 10400 1450
Entry Wire Line
	10300 1450 10400 1550
Entry Wire Line
	10300 1550 10400 1650
Entry Wire Line
	10300 1650 10400 1750
Entry Wire Line
	10300 1750 10400 1850
Entry Wire Line
	10300 1850 10400 1950
Entry Wire Line
	10300 3750 10400 3650
Entry Wire Line
	10300 3850 10400 3750
Entry Wire Line
	10300 3950 10400 3850
Entry Wire Line
	10300 4050 10400 3950
Entry Wire Line
	10300 4150 10400 4050
Entry Wire Line
	10300 4250 10400 4150
Entry Wire Line
	10300 4350 10400 4250
Entry Wire Line
	10300 4450 10400 4350
Wire Wire Line
	1750 1250 2250 1250
Wire Wire Line
	1750 1550 2250 1550
Wire Wire Line
	1750 1850 2250 1850
Wire Wire Line
	1750 2150 2250 2150
Wire Wire Line
	1750 3550 2250 3550
Wire Wire Line
	1750 3850 2250 3850
Wire Wire Line
	1750 4150 2250 4150
Wire Wire Line
	1750 4450 2250 4450
Wire Wire Line
	1750 5850 2250 5850
Wire Wire Line
	1750 6150 2250 6150
Wire Wire Line
	1750 6450 2250 6450
Wire Wire Line
	1750 6750 2250 6750
Wire Wire Line
	2250 1150 1950 1150
Wire Wire Line
	2250 1450 1950 1450
Wire Wire Line
	2250 1750 1950 1750
Wire Wire Line
	2250 2050 1950 2050
Wire Wire Line
	2250 2350 1950 2350
Wire Wire Line
	2250 2450 2250 2750
Wire Wire Line
	2250 2750 2750 2750
Wire Wire Line
	2250 3450 1950 3450
Wire Wire Line
	2250 3750 1950 3750
Wire Wire Line
	2250 4050 1950 4050
Wire Wire Line
	2250 4350 1950 4350
Wire Wire Line
	2250 4650 1950 4650
Wire Wire Line
	2250 4750 2250 5050
Wire Wire Line
	2250 5050 2750 5050
Wire Wire Line
	2250 5750 1950 5750
Wire Wire Line
	2250 6050 1950 6050
Wire Wire Line
	2250 6350 1950 6350
Wire Wire Line
	2250 6650 1950 6650
Wire Wire Line
	2250 6950 1950 6950
Wire Wire Line
	2250 7050 2250 7350
Wire Wire Line
	2250 7350 2750 7350
Wire Wire Line
	3650 1150 3250 1150
Wire Wire Line
	3650 1450 3250 1450
Wire Wire Line
	3650 1750 3250 1750
Wire Wire Line
	3650 2050 3250 2050
Wire Wire Line
	3650 3450 3250 3450
Wire Wire Line
	3650 3750 3250 3750
Wire Wire Line
	3650 4050 3250 4050
Wire Wire Line
	3650 4350 3250 4350
Wire Wire Line
	3650 5750 3250 5750
Wire Wire Line
	3650 6050 3250 6050
Wire Wire Line
	3650 6350 3250 6350
Wire Wire Line
	3650 6650 3250 6650
Wire Wire Line
	5700 1150 6100 1150
Wire Wire Line
	5700 1250 6100 1250
Wire Wire Line
	5700 1350 6100 1350
Wire Wire Line
	5700 1450 6100 1450
Wire Wire Line
	5700 1550 6100 1550
Wire Wire Line
	5700 1650 6100 1650
Wire Wire Line
	5700 1750 6100 1750
Wire Wire Line
	5700 1850 6100 1850
Wire Wire Line
	5700 1950 6100 1950
Wire Wire Line
	5700 2050 6100 2050
Wire Wire Line
	5700 2150 6100 2150
Wire Wire Line
	5700 2250 6100 2250
Wire Wire Line
	5700 3750 6100 3750
Wire Wire Line
	5700 3850 6100 3850
Wire Wire Line
	5700 3950 6100 3950
Wire Wire Line
	5700 4050 6100 4050
Wire Wire Line
	5700 4150 6100 4150
Wire Wire Line
	5700 4250 6100 4250
Wire Wire Line
	5700 4350 6100 4350
Wire Wire Line
	5700 4450 6100 4450
Wire Wire Line
	5700 4550 6100 4550
Wire Wire Line
	5700 4650 6100 4650
Wire Wire Line
	5700 4750 6100 4750
Wire Wire Line
	5700 4850 6100 4850
Wire Wire Line
	6100 2350 6100 2750
Wire Wire Line
	6100 2750 6500 2750
Wire Wire Line
	6100 4950 6100 5350
Wire Wire Line
	6100 5350 6500 5350
Wire Wire Line
	6750 3100 7350 3100
Wire Wire Line
	6900 1150 7150 1150
Wire Wire Line
	6900 1250 7150 1250
Wire Wire Line
	6900 1350 7150 1350
Wire Wire Line
	6900 1450 7150 1450
Wire Wire Line
	6900 1550 7150 1550
Wire Wire Line
	6900 1650 7150 1650
Wire Wire Line
	6900 1750 7150 1750
Wire Wire Line
	6900 1850 7150 1850
Wire Wire Line
	6900 2450 7450 2450
Wire Wire Line
	6900 2550 7350 2550
Wire Wire Line
	6900 3750 7150 3750
Wire Wire Line
	6900 3850 7150 3850
Wire Wire Line
	6900 3950 7150 3950
Wire Wire Line
	6900 4050 7150 4050
Wire Wire Line
	6900 4150 7150 4150
Wire Wire Line
	6900 4250 7150 4250
Wire Wire Line
	6900 4350 7150 4350
Wire Wire Line
	6900 4450 7150 4450
Wire Wire Line
	6900 5050 7550 5050
Wire Wire Line
	6900 5150 7350 5150
Wire Wire Line
	7350 2550 7350 2850
Wire Wire Line
	7350 2850 7350 3100
Wire Wire Line
	7350 2850 9550 2850
Wire Wire Line
	8500 1150 8750 1150
Wire Wire Line
	8500 1250 8750 1250
Wire Wire Line
	8500 1350 8750 1350
Wire Wire Line
	8500 1450 8750 1450
Wire Wire Line
	8500 1550 8750 1550
Wire Wire Line
	8500 1650 8750 1650
Wire Wire Line
	8500 1750 8750 1750
Wire Wire Line
	8500 1850 8750 1850
Wire Wire Line
	8500 3750 8750 3750
Wire Wire Line
	8500 3850 8750 3850
Wire Wire Line
	8500 3950 8750 3950
Wire Wire Line
	8500 4050 8750 4050
Wire Wire Line
	8500 4150 8750 4150
Wire Wire Line
	8500 4250 8750 4250
Wire Wire Line
	8500 4350 8750 4350
Wire Wire Line
	8500 4450 8750 4450
Wire Wire Line
	9750 3750 10300 3750
Wire Wire Line
	9750 3850 10300 3850
Wire Wire Line
	9750 3950 10300 3950
Wire Wire Line
	9750 4050 10300 4050
Wire Wire Line
	9750 4150 10300 4150
Wire Wire Line
	9750 4250 10300 4250
Wire Wire Line
	9750 4350 10300 4350
Wire Wire Line
	9750 4450 10300 4450
Wire Wire Line
	10150 2150 9750 2150
Wire Wire Line
	10150 2850 10150 2150
Wire Wire Line
	10150 4750 9750 4750
Wire Wire Line
	10300 1150 9750 1150
Wire Wire Line
	10300 1250 9750 1250
Wire Wire Line
	10300 1350 9750 1350
Wire Wire Line
	10300 1450 9750 1450
Wire Wire Line
	10300 1550 9750 1550
Wire Wire Line
	10300 1650 9750 1650
Wire Wire Line
	10300 1750 9750 1750
Wire Wire Line
	10300 1850 9750 1850
Wire Bus Line
	1650 900  1500 900 
Wire Bus Line
	1850 750  1500 750 
Wire Bus Line
	5600 2950 3750 2950
Wire Bus Line
	7250 900  7450 900 
Wire Bus Line
	7250 2050 7450 2050
Wire Bus Line
	7250 3500 7450 3500
Wire Bus Line
	7250 4650 7450 4650
Wire Bus Line
	10500 2850 10400 2850
Text Label 2250 1150 2    50   ~ 0
LUTA11
Text Label 2250 1450 2    50   ~ 0
LUTA9
Text Label 2250 1750 2    50   ~ 0
LUTA8
Text Label 2250 2050 2    50   ~ 0
LUTA10
Text Label 2250 2350 2    50   ~ 0
SEL-~A~B
Text Label 2250 3450 2    50   ~ 0
LUTA7
Text Label 2250 3750 2    50   ~ 0
LUTA5
Text Label 2250 4050 2    50   ~ 0
LUTA4
Text Label 2250 4350 2    50   ~ 0
LUTA6
Text Label 2250 4650 2    50   ~ 0
SEL-~A~B
Text Label 2250 5750 2    50   ~ 0
LUTA3
Text Label 2250 6050 2    50   ~ 0
LUTA1
Text Label 2250 6350 2    50   ~ 0
LUTA0
Text Label 2250 6650 2    50   ~ 0
LUTA2
Text Label 2250 6950 2    50   ~ 0
SEL-~A~B
Text Label 3650 1150 2    50   ~ 0
RAM-A11
Text Label 3650 1450 2    50   ~ 0
RAM-A9
Text Label 3650 1750 2    50   ~ 0
RAM-A8
Text Label 3650 2050 2    50   ~ 0
RAM-A10
Text Label 3650 3450 2    50   ~ 0
RAM-A7
Text Label 3650 3750 2    50   ~ 0
RAM-A5
Text Label 3650 4050 2    50   ~ 0
RAM-A4
Text Label 3650 4350 2    50   ~ 0
RAM-A6
Text Label 3650 5750 2    50   ~ 0
RAM-A3
Text Label 3650 6050 2    50   ~ 0
RAM-A1
Text Label 3650 6350 2    50   ~ 0
RAM-A0
Text Label 3650 6650 2    50   ~ 0
RAM-A2
Text Label 5700 1150 0    50   ~ 0
RAM-A0
Text Label 5700 1250 0    50   ~ 0
RAM-A1
Text Label 5700 1350 0    50   ~ 0
RAM-A2
Text Label 5700 1450 0    50   ~ 0
RAM-A3
Text Label 5700 1550 0    50   ~ 0
RAM-A4
Text Label 5700 1650 0    50   ~ 0
RAM-A5
Text Label 5700 1750 0    50   ~ 0
RAM-A6
Text Label 5700 1850 0    50   ~ 0
RAM-A7
Text Label 5700 1950 0    50   ~ 0
RAM-A8
Text Label 5700 2050 0    50   ~ 0
RAM-A9
Text Label 5700 2150 0    50   ~ 0
RAM-A10
Text Label 5700 2250 0    50   ~ 0
RAM-A11
Text Label 5700 3750 0    50   ~ 0
RAM-A0
Text Label 5700 3850 0    50   ~ 0
RAM-A1
Text Label 5700 3950 0    50   ~ 0
RAM-A2
Text Label 5700 4050 0    50   ~ 0
RAM-A3
Text Label 5700 4150 0    50   ~ 0
RAM-A4
Text Label 5700 4250 0    50   ~ 0
RAM-A5
Text Label 5700 4350 0    50   ~ 0
RAM-A6
Text Label 5700 4450 0    50   ~ 0
RAM-A7
Text Label 5700 4550 0    50   ~ 0
RAM-A8
Text Label 5700 4650 0    50   ~ 0
RAM-A9
Text Label 5700 4750 0    50   ~ 0
RAM-A10
Text Label 5700 4850 0    50   ~ 0
RAM-A11
Text Label 6950 1150 0    50   ~ 0
B0
Text Label 6950 1250 0    50   ~ 0
B1
Text Label 6950 1350 0    50   ~ 0
B2
Text Label 6950 1450 0    50   ~ 0
B3
Text Label 6950 1550 0    50   ~ 0
G0
Text Label 6950 1650 0    50   ~ 0
G1
Text Label 6950 1750 0    50   ~ 0
G2
Text Label 6950 1850 0    50   ~ 0
G3
Text Label 6950 2450 0    50   ~ 0
~WR
Text Label 6950 2550 0    50   ~ 0
~OE
Text Label 6950 3750 0    50   ~ 0
R0
Text Label 6950 3850 0    50   ~ 0
R1
Text Label 6950 3950 0    50   ~ 0
R2
Text Label 6950 4050 0    50   ~ 0
R3
Text Label 6950 4150 0    50   ~ 0
F0
Text Label 6950 4250 0    50   ~ 0
F1
Text Label 6950 4350 0    50   ~ 0
F2
Text Label 6950 4450 0    50   ~ 0
F3
Text Label 6950 5050 0    50   ~ 0
~WR
Text Label 6950 5150 0    50   ~ 0
~OE
Text Label 8550 1150 0    50   ~ 0
G3
Text Label 8550 1250 0    50   ~ 0
G2
Text Label 8550 1350 0    50   ~ 0
G1
Text Label 8550 1450 0    50   ~ 0
G0
Text Label 8550 1550 0    50   ~ 0
B3
Text Label 8550 1650 0    50   ~ 0
B0
Text Label 8550 1750 0    50   ~ 0
B1
Text Label 8550 1850 0    50   ~ 0
B2
Text Label 8550 3750 0    50   ~ 0
F3
Text Label 8550 3850 0    50   ~ 0
F2
Text Label 8550 3950 0    50   ~ 0
F1
Text Label 8550 4050 0    50   ~ 0
F0
Text Label 8550 4150 0    50   ~ 0
R3
Text Label 8550 4250 0    50   ~ 0
R2
Text Label 8550 4350 0    50   ~ 0
R1
Text Label 8550 4450 0    50   ~ 0
R0
Text Label 9500 2850 2    50   ~ 0
~OE
Text Label 9800 1150 0    50   ~ 0
BUS-DATA7
Text Label 9800 1250 0    50   ~ 0
BUS-DATA6
Text Label 9800 1350 0    50   ~ 0
BUS-DATA5
Text Label 9800 1450 0    50   ~ 0
BUS-DATA4
Text Label 9800 1550 0    50   ~ 0
BUS-DATA3
Text Label 9800 1650 0    50   ~ 0
BUS-DATA0
Text Label 9800 1750 0    50   ~ 0
BUS-DATA1
Text Label 9800 1850 0    50   ~ 0
BUS-DATA2
Text Label 9800 2150 0    50   ~ 0
~BUS-E
Text Label 9800 3750 0    50   ~ 0
BUS-DATA15
Text Label 9800 3850 0    50   ~ 0
BUS-DATA14
Text Label 9800 3950 0    50   ~ 0
BUS-DATA13
Text Label 9800 4050 0    50   ~ 0
BUS-DATA12
Text Label 9800 4150 0    50   ~ 0
BUS-DATA11
Text Label 9800 4250 0    50   ~ 0
BUS-DATA10
Text Label 9800 4350 0    50   ~ 0
BUS-DATA9
Text Label 9800 4450 0    50   ~ 0
BUS-DATA8
Text Label 9800 4750 0    50   ~ 0
~BUS-E
Text HLabel 1500 750  0    50   Input ~ 0
LUTA[0..11]
Text HLabel 1500 900  0    50   Input ~ 0
LUTB[0..11]
Text HLabel 1950 6950 0    50   Input ~ 0
SEL-~A~B
Text HLabel 6550 3100 0    50   Input ~ 0
~RAM-OE
Text HLabel 7450 900  2    50   Output ~ 0
B[0..3]
Text HLabel 7450 2050 2    50   Output ~ 0
G[0..3]
Text HLabel 7450 3500 2    50   Output ~ 0
R[0..3]
Text HLabel 7450 4650 2    50   Output ~ 0
F[0..3]
Text HLabel 7750 5050 2    50   Input ~ 0
~RAM-WR
Text HLabel 10500 2850 2    50   Input ~ 0
BUS-DATA[0..15]
$Comp
L power:VCC #PWR0401
U 1 1 5E1DB035
P 2750 850
F 0 "#PWR0401" H 2750 700 50  0001 C CNN
F 1 "VCC" H 2750 1000 50  0000 C CNN
F 2 "" H 2750 850 50  0001 C CNN
F 3 "" H 2750 850 50  0001 C CNN
	1    2750 850 
	-1   0    0    -1  
$EndComp
$Comp
L power:VCC #PWR0402
U 1 1 5E1DB969
P 2750 3150
F 0 "#PWR0402" H 2750 3000 50  0001 C CNN
F 1 "VCC" H 2750 3300 50  0000 C CNN
F 2 "" H 2750 3150 50  0001 C CNN
F 3 "" H 2750 3150 50  0001 C CNN
	1    2750 3150
	-1   0    0    -1  
$EndComp
$Comp
L power:VCC #PWR0403
U 1 1 5E1DBDC8
P 2750 5450
F 0 "#PWR0403" H 2750 5300 50  0001 C CNN
F 1 "VCC" H 2750 5600 50  0000 C CNN
F 2 "" H 2750 5450 50  0001 C CNN
F 3 "" H 2750 5450 50  0001 C CNN
	1    2750 5450
	-1   0    0    -1  
$EndComp
$Comp
L power:VCC #PWR0289
U 1 1 5E08242F
P 6500 950
F 0 "#PWR0289" H 6500 800 50  0001 C CNN
F 1 "VCC" H 6500 1100 50  0000 C CNN
F 2 "" H 6500 950 50  0001 C CNN
F 3 "" H 6500 950 50  0001 C CNN
	1    6500 950 
	-1   0    0    -1  
$EndComp
$Comp
L power:VCC #PWR0290
U 1 1 5E082856
P 6500 3550
F 0 "#PWR0290" H 6500 3400 50  0001 C CNN
F 1 "VCC" H 6500 3700 50  0000 C CNN
F 2 "" H 6500 3550 50  0001 C CNN
F 3 "" H 6500 3550 50  0001 C CNN
	1    6500 3550
	-1   0    0    -1  
$EndComp
$Comp
L power:VCC #PWR0282
U 1 1 5DF59ABE
P 6900 2150
F 0 "#PWR0282" H 6900 2000 50  0001 C CNN
F 1 "VCC" H 6800 2200 50  0000 C CNN
F 2 "" H 6900 2150 50  0001 C CNN
F 3 "" H 6900 2150 50  0001 C CNN
	1    6900 2150
	-1   0    0    -1  
$EndComp
$Comp
L power:VCC #PWR0281
U 1 1 5DF51900
P 6900 4750
F 0 "#PWR0281" H 6900 4600 50  0001 C CNN
F 1 "VCC" H 6800 4800 50  0000 C CNN
F 2 "" H 6900 4750 50  0001 C CNN
F 3 "" H 6900 4750 50  0001 C CNN
	1    6900 4750
	-1   0    0    -1  
$EndComp
$Comp
L power:VCC #PWR0288
U 1 1 5E0820BB
P 9250 850
F 0 "#PWR0288" H 9250 700 50  0001 C CNN
F 1 "VCC" H 9250 1000 50  0000 C CNN
F 2 "" H 9250 850 50  0001 C CNN
F 3 "" H 9250 850 50  0001 C CNN
	1    9250 850 
	-1   0    0    -1  
$EndComp
$Comp
L power:VCC #PWR0287
U 1 1 5E081D86
P 9250 3450
F 0 "#PWR0287" H 9250 3300 50  0001 C CNN
F 1 "VCC" H 9250 3600 50  0000 C CNN
F 2 "" H 9250 3450 50  0001 C CNN
F 3 "" H 9250 3450 50  0001 C CNN
	1    9250 3450
	-1   0    0    -1  
$EndComp
$Comp
L power:VCC #PWR0284
U 1 1 5DECD715
P 9750 2050
F 0 "#PWR0284" H 9750 1900 50  0001 C CNN
F 1 "VCC" H 9650 2100 50  0000 C CNN
F 2 "" H 9750 2050 50  0001 C CNN
F 3 "" H 9750 2050 50  0001 C CNN
	1    9750 2050
	-1   0    0    -1  
$EndComp
$Comp
L power:VCC #PWR0283
U 1 1 5DEE5634
P 9750 4650
F 0 "#PWR0283" H 9750 4500 50  0001 C CNN
F 1 "VCC" H 9650 4700 50  0000 C CNN
F 2 "" H 9750 4650 50  0001 C CNN
F 3 "" H 9750 4650 50  0001 C CNN
	1    9750 4650
	-1   0    0    -1  
$EndComp
$Comp
L power:GND #PWR0245
U 1 1 5E1DA9CE
P 2750 2750
F 0 "#PWR0245" H 2750 2500 50  0001 C CNN
F 1 "GND" H 2755 2577 50  0001 C CNN
F 2 "" H 2750 2750 50  0001 C CNN
F 3 "" H 2750 2750 50  0001 C CNN
	1    2750 2750
	1    0    0    -1  
$EndComp
$Comp
L power:GND #PWR0102
U 1 1 5DE199B5
P 2750 5050
F 0 "#PWR0102" H 2750 4800 50  0001 C CNN
F 1 "GND" H 2755 4877 50  0001 C CNN
F 2 "" H 2750 5050 50  0001 C CNN
F 3 "" H 2750 5050 50  0001 C CNN
	1    2750 5050
	1    0    0    -1  
$EndComp
$Comp
L power:GND #PWR0158
U 1 1 5E1DA3AB
P 2750 7350
F 0 "#PWR0158" H 2750 7100 50  0001 C CNN
F 1 "GND" H 2755 7177 50  0001 C CNN
F 2 "" H 2750 7350 50  0001 C CNN
F 3 "" H 2750 7350 50  0001 C CNN
	1    2750 7350
	1    0    0    -1  
$EndComp
$Comp
L power:GND #PWR0101
U 1 1 5DE1655B
P 6500 2750
F 0 "#PWR0101" H 6500 2500 50  0001 C CNN
F 1 "GND" H 6505 2577 50  0001 C CNN
F 2 "" H 6500 2750 50  0001 C CNN
F 3 "" H 6500 2750 50  0001 C CNN
	1    6500 2750
	1    0    0    -1  
$EndComp
$Comp
L power:GND #PWR0103
U 1 1 5DE203BA
P 6500 5350
F 0 "#PWR0103" H 6500 5100 50  0001 C CNN
F 1 "GND" H 6505 5177 50  0001 C CNN
F 2 "" H 6500 5350 50  0001 C CNN
F 3 "" H 6500 5350 50  0001 C CNN
	1    6500 5350
	1    0    0    -1  
$EndComp
$Comp
L power:GND #PWR0291
U 1 1 5DEA22B5
P 6750 3300
F 0 "#PWR0291" H 6750 3050 50  0001 C CNN
F 1 "GND" H 6755 3127 50  0001 C CNN
F 2 "" H 6750 3300 50  0001 C CNN
F 3 "" H 6750 3300 50  0001 C CNN
	1    6750 3300
	1    0    0    -1  
$EndComp
$Comp
L power:GND #PWR0277
U 1 1 5DE6DEA9
P 6900 2250
F 0 "#PWR0277" H 6900 2000 50  0001 C CNN
F 1 "GND" H 6905 2077 50  0001 C CNN
F 2 "" H 6900 2250 50  0001 C CNN
F 3 "" H 6900 2250 50  0001 C CNN
	1    6900 2250
	1    0    0    -1  
$EndComp
$Comp
L power:GND #PWR0278
U 1 1 5DE6E1EE
P 6900 4850
F 0 "#PWR0278" H 6900 4600 50  0001 C CNN
F 1 "GND" H 6905 4677 50  0001 C CNN
F 2 "" H 6900 4850 50  0001 C CNN
F 3 "" H 6900 4850 50  0001 C CNN
	1    6900 4850
	1    0    0    -1  
$EndComp
$Comp
L power:GND #PWR0286
U 1 1 5E080739
P 9250 2450
F 0 "#PWR0286" H 9250 2200 50  0001 C CNN
F 1 "GND" H 9255 2277 50  0001 C CNN
F 2 "" H 9250 2450 50  0001 C CNN
F 3 "" H 9250 2450 50  0001 C CNN
	1    9250 2450
	1    0    0    -1  
$EndComp
$Comp
L power:GND #PWR0285
U 1 1 5E0802CB
P 9250 5050
F 0 "#PWR0285" H 9250 4800 50  0001 C CNN
F 1 "GND" H 9255 4877 50  0001 C CNN
F 2 "" H 9250 5050 50  0001 C CNN
F 3 "" H 9250 5050 50  0001 C CNN
	1    9250 5050
	1    0    0    -1  
$EndComp
$Comp
L Device:R_Small R?
U 1 1 5DE7A6C3
P 6650 3100
AR Path="/5DDBF667/5DE7A6C3" Ref="R?"  Part="1" 
AR Path="/5DDE81DD/5DE7A6C3" Ref="R37"  Part="1" 
F 0 "R37" V 6454 3100 50  0000 C CNN
F 1 "220" V 6545 3100 50  0000 C CNN
F 2 "" H 6650 3100 50  0001 C CNN
F 3 "~" H 6650 3100 50  0001 C CNN
	1    6650 3100
	0    1    1    0   
$EndComp
$Comp
L Device:C_Small C25
U 1 1 5DE9642B
P 6750 3200
F 0 "C25" H 6842 3246 50  0000 L CNN
F 1 "C_Small" H 6842 3155 50  0000 L CNN
F 2 "" H 6750 3200 50  0001 C CNN
F 3 "~" H 6750 3200 50  0001 C CNN
	1    6750 3200
	1    0    0    -1  
$EndComp
$Comp
L Device:Ferrite_Bead_Small FB?
U 1 1 5DE7A6CA
P 7650 5050
AR Path="/5DDBF667/5DE7A6CA" Ref="FB?"  Part="1" 
AR Path="/5DDE81DD/5DE7A6CA" Ref="FB26"  Part="1" 
F 0 "FB26" V 7800 5050 50  0000 C CNN
F 1 "Ferrite_Bead_Small" V 7504 5050 50  0001 C CNN
F 2 "" V 7580 5050 50  0001 C CNN
F 3 "~" H 7650 5050 50  0001 C CNN
	1    7650 5050
	0    -1   -1   0   
$EndComp
$Comp
L 74xx:74LS04 UH8
U 4 1 5DE70E01
P 9850 2850
F 0 "UH8" H 9850 2550 50  0000 C CNN
F 1 "74LS04" H 9850 2650 50  0000 C CNN
F 2 "" H 9850 2850 50  0001 C CNN
F 3 "http://www.ti.com/lit/gpn/sn74LS04" H 9850 2850 50  0001 C CNN
	4    9850 2850
	1    0    0    -1  
$EndComp
$Comp
L CPS2-Custom:M5M5178P U?
U 1 1 5DDF8BF4
P 6500 1850
AR Path="/5DDBF667/5DDF8BF4" Ref="U?"  Part="1" 
AR Path="/5DDE81DD/5DDF8BF4" Ref="UD4"  Part="1" 
F 0 "UD4" H 6250 2750 50  0000 C CNN
F 1 "M5M5178P" H 6750 950 50  0000 C CNN
F 2 "" H 6400 1550 50  0001 C CNN
F 3 "" H 6400 1550 50  0001 C CNN
	1    6500 1850
	1    0    0    -1  
$EndComp
$Comp
L CPS2-Custom:M5M5178P U?
U 1 1 5DE2039C
P 6500 4450
AR Path="/5DDBF667/5DE2039C" Ref="U?"  Part="1" 
AR Path="/5DDE81DD/5DE2039C" Ref="UD5"  Part="1" 
F 0 "UD5" H 6250 5300 50  0000 C CNN
F 1 "M5M5178P" H 6750 3600 50  0000 C CNN
F 2 "" H 6400 4150 50  0001 C CNN
F 3 "" H 6400 4150 50  0001 C CNN
	1    6500 4450
	1    0    0    -1  
$EndComp
$Comp
L 74xx:74LS245 UH4
U 1 1 5DE703D2
P 9250 1650
F 0 "UH4" H 9500 2300 50  0000 C CNN
F 1 "74LS245" H 9050 950 50  0000 C CNN
F 2 "" H 9250 1650 50  0001 C CNN
F 3 "http://www.ti.com/lit/gpn/sn74LS245" H 9250 1650 50  0001 C CNN
	1    9250 1650
	-1   0    0    -1  
$EndComp
$Comp
L 74xx:74LS245 UH5
U 1 1 5DEE562E
P 9250 4250
F 0 "UH5" H 9500 4900 50  0000 C CNN
F 1 "74LS245" H 9050 3550 50  0000 C CNN
F 2 "" H 9250 4250 50  0001 C CNN
F 3 "http://www.ti.com/lit/gpn/sn74LS245" H 9250 4250 50  0001 C CNN
	1    9250 4250
	-1   0    0    -1  
$EndComp
$Comp
L 74xx:74LS157 UU?
U 1 1 5DDF8BC6
P 2750 1750
AR Path="/5DDBF667/5DDF8BC6" Ref="UU?"  Part="1" 
AR Path="/5DDE81DD/5DDF8BC6" Ref="UU7"  Part="1" 
F 0 "UU7" H 2500 2550 50  0000 C CNN
F 1 "74LS157" H 2950 850 50  0000 C CNN
F 2 "" H 2750 1750 50  0001 C CNN
F 3 "http://www.ti.com/lit/gpn/sn74LS157" H 2750 1750 50  0001 C CNN
	1    2750 1750
	1    0    0    -1  
$EndComp
$Comp
L 74xx:74LS157 UV?
U 1 1 5DDF8BCC
P 2750 4050
AR Path="/5DDBF667/5DDF8BCC" Ref="UV?"  Part="1" 
AR Path="/5DDE81DD/5DDF8BCC" Ref="UV7"  Part="1" 
F 0 "UV7" H 2500 4850 50  0000 C CNN
F 1 "74LS157" H 2950 3150 50  0000 C CNN
F 2 "" H 2750 4050 50  0001 C CNN
F 3 "http://www.ti.com/lit/gpn/sn74LS157" H 2750 4050 50  0001 C CNN
	1    2750 4050
	1    0    0    -1  
$EndComp
$Comp
L 74xx:74LS157 UW?
U 1 1 5DDF8BD2
P 2750 6350
AR Path="/5DDBF667/5DDF8BD2" Ref="UW?"  Part="1" 
AR Path="/5DDE81DD/5DDF8BD2" Ref="UW7"  Part="1" 
F 0 "UW7" H 2500 7100 50  0000 C CNN
F 1 "74LS157" H 2950 5450 50  0000 C CNN
F 2 "" H 2750 6350 50  0001 C CNN
F 3 "http://www.ti.com/lit/gpn/sn74LS157" H 2750 6350 50  0001 C CNN
	1    2750 6350
	1    0    0    -1  
$EndComp
Text Label 2250 6450 2    50   ~ 0
LUTB0
Text Label 2250 6150 2    50   ~ 0
LUTB1
Text Label 2250 6750 2    50   ~ 0
LUTB2
Text Label 2250 5850 2    50   ~ 0
LUTB3
Text Label 2250 4150 2    50   ~ 0
LUTB4
Text Label 2250 3850 2    50   ~ 0
LUTB5
Text Label 2250 4450 2    50   ~ 0
LUTB6
Text Label 2250 3550 2    50   ~ 0
LUTB7
Text Label 2250 1850 2    50   ~ 0
LUTB8
Text Label 2250 1550 2    50   ~ 0
LUTB9
Text Label 2250 2150 2    50   ~ 0
LUTB10
Text Label 2250 1250 2    50   ~ 0
LUTB11
Wire Bus Line
	7250 4250 7250 4650
Wire Bus Line
	7250 3500 7250 3950
Wire Bus Line
	7250 1650 7250 2050
Wire Bus Line
	7250 900  7250 1350
Wire Bus Line
	3750 1250 3750 2950
Wire Bus Line
	10400 2850 10400 4350
Wire Bus Line
	10400 1250 10400 2850
Wire Bus Line
	3750 2950 3750 6550
Wire Bus Line
	1650 900  1650 6650
Wire Bus Line
	1850 750  1850 6550
Wire Bus Line
	5600 1250 5600 2950
Wire Bus Line
	5600 2950 5600 4750
$EndSCHEMATC
