EESchema Schematic File Version 4
EELAYER 30 0
EELAYER END
$Descr A4 11693 8268
encoding utf-8
Sheet 4 5
Title ""
Date ""
Rev ""
Comp ""
Comment1 ""
Comment2 ""
Comment3 ""
Comment4 ""
$EndDescr
Text Notes -3250 -6900 0    50   ~ 0
BUS31
Text Notes -3250 -6200 0    50   ~ 0
BUS30
Text Notes -3250 -5500 0    50   ~ 0
BUS29
Text Notes -3250 -4800 0    50   ~ 0
BUS28
Text Notes -3250 -4100 0    50   ~ 0
BUS27
Text Notes -3250 -3400 0    50   ~ 0
BUS26
Text Notes -3250 -2700 0    50   ~ 0
BUS25
Text Notes -3250 -2000 0    50   ~ 0
BUS24
Text Notes -3250 -1300 0    50   ~ 0
BUS23
Text Notes -3250 -600 0    50   ~ 0
BUS22
Text Notes -3250 100  0    50   ~ 0
BUS21
Text Notes -3250 800  0    50   ~ 0
BUS20
Text Notes -3250 1500 0    50   ~ 0
BUS19
Text Notes -3250 2200 0    50   ~ 0
BUS18
Text Notes -3250 2900 0    50   ~ 0
BUS17
Text Notes -3250 3600 0    50   ~ 0
BUS16
Text Notes -3250 4300 0    50   ~ 0
BUS15
Text Notes -3250 5000 0    50   ~ 0
BUS14
Text Notes -3250 5700 0    50   ~ 0
BUS13
Text Notes -3250 6400 0    50   ~ 0
BUS12
Text Notes -3250 7100 0    50   ~ 0
BUS11
Text Notes -3250 7800 0    50   ~ 0
BUS10
Text Notes -3250 8500 0    50   ~ 0
BUS9
Text Notes -3250 9200 0    50   ~ 0
BUS8
Text Notes -3250 9900 0    50   ~ 0
BUS7
Text Notes -3250 10600 0    50   ~ 0
BUS6
Text Notes -3250 11300 0    50   ~ 0
BUS5
Text Notes -3250 12000 0    50   ~ 0
BUS4
Text Notes -3250 12700 0    50   ~ 0
BUS3
Text Notes -3250 13400 0    50   ~ 0
BUS2
Text Notes -3250 14100 0    50   ~ 0
BUS1
Text Notes -3250 14800 0    50   ~ 0
BUS0
Text GLabel -3250 -7050 2    50   3State ~ 0
38
Text GLabel -3250 -6350 2    50   3State ~ 0
39
Text GLabel -3250 -5650 2    50   3State ~ 0
40
Text GLabel -3250 -4950 2    50   3State ~ 0
42
Text GLabel -3250 -4250 2    50   3State ~ 0
43
Text GLabel -3250 -3550 2    50   3State ~ 0
44
Text GLabel -3250 -2850 2    50   3State ~ 0
45
Text GLabel -3250 -2150 2    50   3State ~ 0
47
Text GLabel -3250 -1450 2    50   3State ~ 0
48
Text GLabel -3250 -750 2    50   3State ~ 0
49
Text GLabel -3250 -50  2    50   3State ~ 0
50
Text GLabel -3250 650  2    50   3State ~ 0
52
Text GLabel -3250 1350 2    50   3State ~ 0
53
Text GLabel -3250 2050 2    50   3State ~ 0
54
Text GLabel -3250 2750 2    50   3State ~ 0
55
Text GLabel -3250 3450 2    50   3State ~ 0
56
Text GLabel -3250 4150 2    50   3State ~ 0
57
Text GLabel -3250 4850 2    50   3State ~ 0
58
Text GLabel -3250 5550 2    50   3State ~ 0
59
Text GLabel -3250 6250 2    50   3State ~ 0
62
Text GLabel -3250 6950 2    50   3State ~ 0
63
Text GLabel -3250 7650 2    50   3State ~ 0
64
Text GLabel -3250 8350 2    50   3State ~ 0
65
Text GLabel -3250 9050 2    50   3State ~ 0
66
Text GLabel -3250 9750 2    50   3State ~ 0
67
Text GLabel -3250 10450 2    50   3State ~ 0
68
Text GLabel -3250 11150 2    50   3State ~ 0
69
Text GLabel -3250 11850 2    50   3State ~ 0
70
Text GLabel -3250 12550 2    50   3State ~ 0
72
Text GLabel -3250 13250 2    50   3State ~ 0
73
Text GLabel -3250 13950 2    50   3State ~ 0
74
Text GLabel -3250 14650 2    50   3State ~ 0
75
$Comp
L CG24-cells:O4R U6R148
U 1 1 5EA82074
P -3550 -7050
F 0 "U6R148" H -3550 -6733 50  0000 C CNN
F 1 "O4R" H -3550 -6824 50  0000 C CNN
F 2 "" H -3550 -7050 50  0001 C CNN
F 3 "" H -3550 -7050 50  0001 C CNN
	1    -3550 -7050
	1    0    0    -1  
$EndComp
$Comp
L CG24-cells:O4R U10R150
U 1 1 5EA82083
P -3550 -6350
F 0 "U10R150" H -3550 -6033 50  0000 C CNN
F 1 "O4R" H -3550 -6124 50  0000 C CNN
F 2 "" H -3550 -6350 50  0001 C CNN
F 3 "" H -3550 -6350 50  0001 C CNN
	1    -3550 -6350
	1    0    0    -1  
$EndComp
$Comp
L CG24-cells:O4R U8R148
U 1 1 5EA82077
P -3550 -5650
F 0 "U8R148" H -3550 -5333 50  0000 C CNN
F 1 "O4R" H -3550 -5424 50  0000 C CNN
F 2 "" H -3550 -5650 50  0001 C CNN
F 3 "" H -3550 -5650 50  0001 C CNN
	1    -3550 -5650
	1    0    0    -1  
$EndComp
$Comp
L CG24-cells:O4R U12R150
U 1 1 5EA8206F
P -3550 -4950
F 0 "U12R150" H -3550 -4633 50  0000 C CNN
F 1 "O4R" H -3550 -4724 50  0000 C CNN
F 2 "" H -3550 -4950 50  0001 C CNN
F 3 "" H -3550 -4950 50  0001 C CNN
	1    -3550 -4950
	1    0    0    -1  
$EndComp
$Comp
L CG24-cells:O4R U14R150
U 1 1 5EA8207C
P -3550 -4250
F 0 "U14R150" H -3550 -3933 50  0000 C CNN
F 1 "O4R" H -3550 -4024 50  0000 C CNN
F 2 "" H -3550 -4250 50  0001 C CNN
F 3 "" H -3550 -4250 50  0001 C CNN
	1    -3550 -4250
	1    0    0    -1  
$EndComp
$Comp
L CG24-cells:O4R U16R150
U 1 1 5EA82079
P -3550 -3550
F 0 "U16R150" H -3550 -3233 50  0000 C CNN
F 1 "O4R" H -3550 -3324 50  0000 C CNN
F 2 "" H -3550 -3550 50  0001 C CNN
F 3 "" H -3550 -3550 50  0001 C CNN
	1    -3550 -3550
	1    0    0    -1  
$EndComp
$Comp
L CG24-cells:O4R U18R150
U 1 1 5EA82081
P -3550 -2850
F 0 "U18R150" H -3550 -2533 50  0000 C CNN
F 1 "O4R" H -3550 -2624 50  0000 C CNN
F 2 "" H -3550 -2850 50  0001 C CNN
F 3 "" H -3550 -2850 50  0001 C CNN
	1    -3550 -2850
	1    0    0    -1  
$EndComp
$Comp
L CG24-cells:O4R U20R150
U 1 1 5EA82070
P -3550 -2150
F 0 "U20R150" H -3550 -1833 50  0000 C CNN
F 1 "O4R" H -3550 -1924 50  0000 C CNN
F 2 "" H -3550 -2150 50  0001 C CNN
F 3 "" H -3550 -2150 50  0001 C CNN
	1    -3550 -2150
	1    0    0    -1  
$EndComp
$Comp
L CG24-cells:O4R U18R148
U 1 1 5EA8208E
P -3550 -1450
F 0 "U18R148" H -3550 -1133 50  0000 C CNN
F 1 "O4R" H -3550 -1224 50  0000 C CNN
F 2 "" H -3550 -1450 50  0001 C CNN
F 3 "" H -3550 -1450 50  0001 C CNN
	1    -3550 -1450
	1    0    0    -1  
$EndComp
$Comp
L CG24-cells:O4R U22R150
U 1 1 5EA82086
P -3550 -750
F 0 "U22R150" H -3550 -433 50  0000 C CNN
F 1 "O4R" H -3550 -524 50  0000 C CNN
F 2 "" H -3550 -750 50  0001 C CNN
F 3 "" H -3550 -750 50  0001 C CNN
	1    -3550 -750
	1    0    0    -1  
$EndComp
$Comp
L CG24-cells:O4R U20R148
U 1 1 5EA8208B
P -3550 -50
F 0 "U20R148" H -3550 267 50  0000 C CNN
F 1 "O4R" H -3550 176 50  0000 C CNN
F 2 "" H -3550 -50 50  0001 C CNN
F 3 "" H -3550 -50 50  0001 C CNN
	1    -3550 -50 
	1    0    0    -1  
$EndComp
$Comp
L CG24-cells:O4R U24R150
U 1 1 5EA8207D
P -3550 650
F 0 "U24R150" H -3550 967 50  0000 C CNN
F 1 "O4R" H -3550 876 50  0000 C CNN
F 2 "" H -3550 650 50  0001 C CNN
F 3 "" H -3550 650 50  0001 C CNN
	1    -3550 650 
	1    0    0    -1  
$EndComp
$Comp
L CG24-cells:O4R U26R150
U 1 1 5EA82087
P -3550 1350
F 0 "U26R150" H -3550 1667 50  0000 C CNN
F 1 "O4R" H -3550 1576 50  0000 C CNN
F 2 "" H -3550 1350 50  0001 C CNN
F 3 "" H -3550 1350 50  0001 C CNN
	1    -3550 1350
	1    0    0    -1  
$EndComp
$Comp
L CG24-cells:O4R U28R150
U 1 1 5EA82072
P -3550 2050
F 0 "U28R150" H -3550 2367 50  0000 C CNN
F 1 "O4R" H -3550 2276 50  0000 C CNN
F 2 "" H -3550 2050 50  0001 C CNN
F 3 "" H -3550 2050 50  0001 C CNN
	1    -3550 2050
	1    0    0    -1  
$EndComp
$Comp
L CG24-cells:O4R U30R150
U 1 1 5EA82073
P -3550 2750
F 0 "U30R150" H -3550 3067 50  0000 C CNN
F 1 "O4R" H -3550 2976 50  0000 C CNN
F 2 "" H -3550 2750 50  0001 C CNN
F 3 "" H -3550 2750 50  0001 C CNN
	1    -3550 2750
	1    0    0    -1  
$EndComp
$Comp
L CG24-cells:O4R U28R148
U 1 1 5EA8208D
P -3550 3450
F 0 "U28R148" H -3550 3767 50  0000 C CNN
F 1 "O4R" H -3550 3676 50  0000 C CNN
F 2 "" H -3550 3450 50  0001 C CNN
F 3 "" H -3550 3450 50  0001 C CNN
	1    -3550 3450
	1    0    0    -1  
$EndComp
$Comp
L CG24-cells:O4R U32R150
U 1 1 5EA82082
P -3550 4150
F 0 "U32R150" H -3550 4467 50  0000 C CNN
F 1 "O4R" H -3550 4376 50  0000 C CNN
F 2 "" H -3550 4150 50  0001 C CNN
F 3 "" H -3550 4150 50  0001 C CNN
	1    -3550 4150
	1    0    0    -1  
$EndComp
$Comp
L CG24-cells:O4R U30R148
U 1 1 5EA8208A
P -3550 4850
F 0 "U30R148" H -3550 5167 50  0000 C CNN
F 1 "O4R" H -3550 5076 50  0000 C CNN
F 2 "" H -3550 4850 50  0001 C CNN
F 3 "" H -3550 4850 50  0001 C CNN
	1    -3550 4850
	1    0    0    -1  
$EndComp
$Comp
L CG24-cells:O4R U32R148
U 1 1 5EA8208C
P -3550 5550
F 0 "U32R148" H -3550 5867 50  0000 C CNN
F 1 "O4R" H -3550 5776 50  0000 C CNN
F 2 "" H -3550 5550 50  0001 C CNN
F 3 "" H -3550 5550 50  0001 C CNN
	1    -3550 5550
	1    0    0    -1  
$EndComp
$Comp
L CG24-cells:O4R U32R145
U 1 1 5EA82075
P -3550 6250
F 0 "U32R145" H -3550 6567 50  0000 C CNN
F 1 "O4R" H -3550 6476 50  0000 C CNN
F 2 "" H -3550 6250 50  0001 C CNN
F 3 "" H -3550 6250 50  0001 C CNN
	1    -3550 6250
	1    0    0    -1  
$EndComp
$Comp
L CG24-cells:O4R U32R137
U 1 1 5EA82084
P -3550 6950
F 0 "U32R137" H -3550 7267 50  0000 C CNN
F 1 "O4R" H -3550 7176 50  0000 C CNN
F 2 "" H -3550 6950 50  0001 C CNN
F 3 "" H -3550 6950 50  0001 C CNN
	1    -3550 6950
	1    0    0    -1  
$EndComp
$Comp
L CG24-cells:O4R U32R140
U 1 1 5EA82088
P -3550 7650
F 0 "U32R140" H -3550 7967 50  0000 C CNN
F 1 "O4R" H -3550 7876 50  0000 C CNN
F 2 "" H -3550 7650 50  0001 C CNN
F 3 "" H -3550 7650 50  0001 C CNN
	1    -3550 7650
	1    0    0    -1  
$EndComp
$Comp
L CG24-cells:O4R U32R127
U 1 1 5EA82085
P -3550 8350
F 0 "U32R127" H -3550 8667 50  0000 C CNN
F 1 "O4R" H -3550 8576 50  0000 C CNN
F 2 "" H -3550 8350 50  0001 C CNN
F 3 "" H -3550 8350 50  0001 C CNN
	1    -3550 8350
	1    0    0    -1  
$EndComp
$Comp
L CG24-cells:O4R U32R124
U 1 1 5EA8207B
P -3550 9050
F 0 "U32R124" H -3550 9367 50  0000 C CNN
F 1 "O4R" H -3550 9276 50  0000 C CNN
F 2 "" H -3550 9050 50  0001 C CNN
F 3 "" H -3550 9050 50  0001 C CNN
	1    -3550 9050
	1    0    0    -1  
$EndComp
$Comp
L CG24-cells:O4R U32R116
U 1 1 5EA8207A
P -3550 9750
F 0 "U32R116" H -3550 10067 50  0000 C CNN
F 1 "O4R" H -3550 9976 50  0000 C CNN
F 2 "" H -3550 9750 50  0001 C CNN
F 3 "" H -3550 9750 50  0001 C CNN
	1    -3550 9750
	1    0    0    -1  
$EndComp
$Comp
L CG24-cells:O4R U32R119
U 1 1 5EA82080
P -3550 10450
F 0 "U32R119" H -3550 10767 50  0000 C CNN
F 1 "O4R" H -3550 10676 50  0000 C CNN
F 2 "" H -3550 10450 50  0001 C CNN
F 3 "" H -3550 10450 50  0001 C CNN
	1    -3550 10450
	1    0    0    -1  
$EndComp
$Comp
L CG24-cells:O4R U32R106
U 1 1 5EA82089
P -3550 11150
F 0 "U32R106" H -3550 11467 50  0000 C CNN
F 1 "O4R" H -3550 11376 50  0000 C CNN
F 2 "" H -3550 11150 50  0001 C CNN
F 3 "" H -3550 11150 50  0001 C CNN
	1    -3550 11150
	1    0    0    -1  
$EndComp
$Comp
L CG24-cells:O4R U32R103
U 1 1 5EA82071
P -3550 11850
F 0 "U32R103" H -3550 12167 50  0000 C CNN
F 1 "O4R" H -3550 12076 50  0000 C CNN
F 2 "" H -3550 11850 50  0001 C CNN
F 3 "" H -3550 11850 50  0001 C CNN
	1    -3550 11850
	1    0    0    -1  
$EndComp
$Comp
L CG24-cells:O4R U32R95
U 1 1 5EA8207F
P -3550 12550
F 0 "U32R95" H -3550 12867 50  0000 C CNN
F 1 "O4R" H -3550 12776 50  0000 C CNN
F 2 "" H -3550 12550 50  0001 C CNN
F 3 "" H -3550 12550 50  0001 C CNN
	1    -3550 12550
	1    0    0    -1  
$EndComp
$Comp
L CG24-cells:O4R U32R85
U 1 1 5EA8207E
P -3550 13250
F 0 "U32R85" H -3550 13567 50  0000 C CNN
F 1 "O4R" H -3550 13476 50  0000 C CNN
F 2 "" H -3550 13250 50  0001 C CNN
F 3 "" H -3550 13250 50  0001 C CNN
	1    -3550 13250
	1    0    0    -1  
$EndComp
$Comp
L CG24-cells:O4R U32R82
U 1 1 5EA82078
P -3550 13950
F 0 "U32R82" H -3550 14267 50  0000 C CNN
F 1 "O4R" H -3550 14176 50  0000 C CNN
F 2 "" H -3550 13950 50  0001 C CNN
F 3 "" H -3550 13950 50  0001 C CNN
	1    -3550 13950
	1    0    0    -1  
$EndComp
$Comp
L CG24-cells:O4R U32R74
U 1 1 5EA82076
P -3550 14650
F 0 "U32R74" H -3550 14967 50  0000 C CNN
F 1 "O4R" H -3550 14876 50  0000 C CNN
F 2 "" H -3550 14650 50  0001 C CNN
F 3 "" H -3550 14650 50  0001 C CNN
	1    -3550 14650
	1    0    0    -1  
$EndComp
$EndSCHEMATC
