EESchema Schematic File Version 4
EELAYER 30 0
EELAYER END
$Descr A4 11693 8268
encoding utf-8
Sheet 21 69
Title ""
Date "2020-11-26"
Rev ""
Comp ""
Comment1 "Licence: CC-BY"
Comment2 "Author: Loïc *WydD* Petit"
Comment3 ""
Comment4 ""
$EndDescr
Connection ~ 3900 3950
Connection ~ 3900 5250
Connection ~ 3900 4600
Connection ~ 5200 4400
Connection ~ 5950 4400
Connection ~ 6050 3750
Connection ~ 6150 3650
Connection ~ 6550 3550
Connection ~ 6650 3450
Connection ~ 6750 3350
Connection ~ 6850 3250
Connection ~ 6850 5300
Connection ~ 7350 5850
Connection ~ 7350 5950
Connection ~ 8850 5300
Connection ~ 5700 5100
NoConn ~ 4500 3200
NoConn ~ 4500 3850
NoConn ~ 4500 4500
NoConn ~ 4500 5150
Entry Wire Line
	3450 3000 3550 3100
Entry Wire Line
	3450 3650 3550 3750
Entry Wire Line
	3450 4300 3550 4400
Entry Wire Line
	3450 4950 3550 5050
Entry Wire Line
	4750 1450 4650 1350
Entry Wire Line
	4750 1550 4650 1450
Entry Wire Line
	4750 1650 4650 1550
Entry Wire Line
	4750 1750 4650 1650
Entry Wire Line
	4750 1950 4650 2050
Entry Wire Line
	4750 2050 4650 2150
Entry Wire Line
	4750 2150 4650 2250
Entry Wire Line
	4750 2250 4650 2350
Entry Wire Line
	8400 3250 8500 3150
Entry Wire Line
	8400 3350 8500 3250
Entry Wire Line
	8400 3450 8500 3350
Entry Wire Line
	8400 3550 8500 3450
Entry Wire Line
	8400 3650 8500 3550
Entry Wire Line
	8400 3750 8500 3650
Entry Wire Line
	8400 3850 8500 3750
Entry Wire Line
	8750 4400 8850 4500
Entry Wire Line
	8750 4500 8850 4600
Entry Wire Line
	8750 4600 8850 4700
Entry Wire Line
	8750 4700 8850 4800
Entry Wire Line
	8750 4800 8850 4900
Entry Wire Line
	8750 4900 8850 5000
Entry Wire Line
	8750 5000 8850 5100
Entry Wire Line
	8750 5100 8850 5200
Entry Wire Line
	8750 5750 8850 5650
Entry Wire Line
	8750 5850 8850 5750
Entry Wire Line
	8750 5950 8850 5850
Entry Wire Line
	8750 6050 8850 5950
Wire Wire Line
	3250 5650 3350 5650
Wire Wire Line
	3250 5750 3350 5750
Wire Wire Line
	3900 3300 3900 3950
Wire Wire Line
	3900 3950 3900 4600
Wire Wire Line
	3900 4600 3900 5250
Wire Wire Line
	3900 5250 4000 5250
Wire Wire Line
	3900 5700 3900 5250
Wire Wire Line
	4000 3100 3550 3100
Wire Wire Line
	4000 3300 3900 3300
Wire Wire Line
	4000 3750 3550 3750
Wire Wire Line
	4000 3950 3900 3950
Wire Wire Line
	4000 4400 3550 4400
Wire Wire Line
	4000 4600 3900 4600
Wire Wire Line
	4000 5050 3550 5050
Wire Wire Line
	4500 3100 6150 3100
Wire Wire Line
	4500 5050 5150 5050
Wire Wire Line
	4750 1450 5450 1450
Wire Wire Line
	4750 1550 5450 1550
Wire Wire Line
	4750 1650 5450 1650
Wire Wire Line
	4750 1750 5450 1750
Wire Wire Line
	4750 1950 5450 1950
Wire Wire Line
	4750 2050 5450 2050
Wire Wire Line
	4750 2150 5450 2150
Wire Wire Line
	4750 2250 5450 2250
Wire Wire Line
	5050 5350 5150 5350
Wire Wire Line
	5150 5350 5150 5150
Wire Wire Line
	5200 2450 5200 4400
Wire Wire Line
	5200 4400 4500 4400
Wire Wire Line
	5450 2450 5200 2450
Wire Wire Line
	5700 5100 5700 5850
Wire Wire Line
	5700 5100 7350 5100
Wire Wire Line
	5950 3850 8400 3850
Wire Wire Line
	5950 4400 5200 4400
Wire Wire Line
	5950 4400 5950 3850
Wire Wire Line
	5950 5000 5950 4400
Wire Wire Line
	5950 5000 7350 5000
Wire Wire Line
	6050 3750 4500 3750
Wire Wire Line
	6050 3750 8400 3750
Wire Wire Line
	6050 4900 6050 3750
Wire Wire Line
	6050 4900 7350 4900
Wire Wire Line
	6150 3650 6150 3100
Wire Wire Line
	6150 3650 8400 3650
Wire Wire Line
	6150 4800 6150 3650
Wire Wire Line
	6150 4800 7350 4800
Wire Wire Line
	6250 5900 6400 5900
Wire Wire Line
	6450 1800 6750 1800
Wire Wire Line
	6550 2000 6450 2000
Wire Wire Line
	6550 3550 6550 2000
Wire Wire Line
	6550 4700 6550 3550
Wire Wire Line
	6650 1900 6450 1900
Wire Wire Line
	6650 3450 6650 1900
Wire Wire Line
	6650 3450 8400 3450
Wire Wire Line
	6650 4600 6650 3450
Wire Wire Line
	6750 1800 6750 3350
Wire Wire Line
	6750 3350 6750 4500
Wire Wire Line
	6750 4500 7350 4500
Wire Wire Line
	6750 5300 6850 5300
Wire Wire Line
	6850 1700 6450 1700
Wire Wire Line
	6850 3250 6850 1700
Wire Wire Line
	6850 3250 8400 3250
Wire Wire Line
	6850 4400 6850 3250
Wire Wire Line
	6850 5300 6850 6200
Wire Wire Line
	6850 5300 7350 5300
Wire Wire Line
	6850 6200 7350 6200
Wire Wire Line
	7150 5850 7350 5850
Wire Wire Line
	7350 4400 6850 4400
Wire Wire Line
	7350 4600 6650 4600
Wire Wire Line
	7350 4700 6550 4700
Wire Wire Line
	7350 5750 7350 5850
Wire Wire Line
	7350 5850 7350 5950
Wire Wire Line
	7350 5950 7350 6050
Wire Wire Line
	8350 4400 8750 4400
Wire Wire Line
	8350 4500 8750 4500
Wire Wire Line
	8350 4600 8750 4600
Wire Wire Line
	8350 4700 8750 4700
Wire Wire Line
	8350 4800 8750 4800
Wire Wire Line
	8350 4900 8750 4900
Wire Wire Line
	8350 5000 8750 5000
Wire Wire Line
	8350 5100 8750 5100
Wire Wire Line
	8400 3350 6750 3350
Wire Wire Line
	8400 3550 6550 3550
Wire Wire Line
	8750 5750 8350 5750
Wire Wire Line
	8750 5850 8350 5850
Wire Wire Line
	8750 5950 8350 5950
Wire Wire Line
	8750 6050 8350 6050
Wire Bus Line
	3450 2800 3300 2800
Wire Bus Line
	4650 1250 4550 1250
Wire Bus Line
	4650 2450 4550 2450
Wire Bus Line
	8500 3000 8650 3000
Wire Bus Line
	8850 5300 8950 5300
Text Label 3600 3100 0    50   ~ 0
PD5
Text Label 3600 3750 0    50   ~ 0
PD6
Text Label 3600 4400 0    50   ~ 0
PD7
Text Label 3600 5050 0    50   ~ 0
PD8
Text Label 4500 3100 0    50   ~ 0
ROW6-D4
Text Label 4500 3750 0    50   ~ 0
ROW6-D5
Text Label 4500 4400 0    50   ~ 0
ROW6-D6
Text Label 4800 1950 0    50   ~ 0
CNT1-Q0
Text Label 4800 2050 0    50   ~ 0
CNT1-Q1
Text Label 4800 2150 0    50   ~ 0
CNT1-Q2
Text Label 4800 2250 0    50   ~ 0
CNT1-Q3
Text Label 5150 1450 2    50   ~ 0
CNT0-Q0
Text Label 5150 1550 2    50   ~ 0
CNT0-Q1
Text Label 5150 1650 2    50   ~ 0
CNT0-Q2
Text Label 5150 1750 2    50   ~ 0
CNT0-Q3
Text Label 8000 3250 0    50   ~ 0
ROW6-D0
Text Label 8000 3350 0    50   ~ 0
ROW6-D1
Text Label 8000 3450 0    50   ~ 0
ROW6-D2
Text Label 8000 3550 0    50   ~ 0
ROW6-D3
Text Label 8000 3650 0    50   ~ 0
ROW6-D4
Text Label 8000 3750 0    50   ~ 0
ROW6-D5
Text Label 8000 3850 0    50   ~ 0
ROW6-D6
Text Label 8450 4400 0    50   ~ 0
TD0
Text Label 8450 4500 0    50   ~ 0
TD1
Text Label 8450 4600 0    50   ~ 0
TD2
Text Label 8450 4700 0    50   ~ 0
TD3
Text Label 8450 4800 0    50   ~ 0
TD4
Text Label 8450 4900 0    50   ~ 0
TD5
Text Label 8450 5000 0    50   ~ 0
TD6
Text Label 8450 5100 0    50   ~ 0
TD7
Text Label 8450 5750 0    50   ~ 0
TD8
Text Label 8450 5850 0    50   ~ 0
TD9
Text Label 8450 5950 0    50   ~ 0
TD10
Text Label 8450 6050 0    50   ~ 0
TD11
Text HLabel 3250 5650 0    50   Input ~ 0
ZERO-XS1
Text HLabel 3250 5750 0    50   Input ~ 0
CLK8M
Text HLabel 3300 2800 0    50   Input ~ 0
PD[5..8]
Text HLabel 4550 1250 0    50   Input ~ 0
CNT0-Q[0..3]
Text HLabel 4550 2450 0    50   Input ~ 0
CNT1-Q[0..3]
Text HLabel 5050 5350 0    50   Input ~ 0
ZERO-PD6
Text HLabel 5700 5950 0    50   Input ~ 0
~ENABLE
Text HLabel 6400 5900 2    50   Output ~ 0
~ROW6-E
Text HLabel 8650 3000 2    50   Output ~ 0
ROW6-D[0..6]
Text HLabel 8950 5300 2    50   3State ~ 0
TD[0..11]
$Comp
L power:GND #PWR?
U 1 1 62F841E4
P 7150 5850
AR Path="/5FAFC3AE/62F841E4" Ref="#PWR?"  Part="1" 
AR Path="/5FBCE4A9/5FBD0B6A/62F841E4" Ref="#PWR0111"  Part="1" 
F 0 "#PWR0111" H 7150 5600 50  0001 C CNN
F 1 "GND" H 7155 5677 50  0000 C CNN
F 2 "" H 7150 5850 50  0001 C CNN
F 3 "" H 7150 5850 50  0001 C CNN
	1    7150 5850
	1    0    0    -1  
$EndComp
$Comp
L A5C:NAND02 UBU?
U 1 1 622F505A
P 3600 5700
AR Path="/622F505A" Ref="UBU?"  Part="1" 
AR Path="/621ABC04/622F505A" Ref="UBU185"  Part="1" 
AR Path="/5FAFC3AE/622F505A" Ref="UBU185"  Part="1" 
AR Path="/5FBCE4A9/5FBD0B6A/622F505A" Ref="UBU185"  Part="1" 
F 0 "UBU185" H 3625 5966 50  0000 C CNN
F 1 "NAND02" H 3625 5875 50  0000 C CNN
F 2 "" H 3600 5700 50  0001 C CNN
F 3 "" H 3600 5700 50  0001 C CNN
	1    3600 5700
	1    0    0    -1  
$EndComp
$Comp
L A5C:NAND02 UBK?
U 1 1 603DE604
P 5400 5100
AR Path="/5FAC57E1/603DE604" Ref="UBK?"  Part="1" 
AR Path="/5FAFC3AE/603DE604" Ref="UBK210"  Part="1" 
AR Path="/5FBCE4A9/5FBD0B6A/603DE604" Ref="UBK210"  Part="1" 
F 0 "UBK210" H 5425 5367 50  0000 C CNN
F 1 "NAND02" H 5425 5276 50  0000 C CNN
F 2 "" H 5400 5100 50  0001 C CNN
F 3 "" H 5400 5100 50  0001 C CNN
	1    5400 5100
	1    0    0    -1  
$EndComp
$Comp
L A5C:OR02 UBF?
U 1 1 67A11B4D
P 5950 5900
AR Path="/614CE0F4/67A11B4D" Ref="UBF?"  Part="1" 
AR Path="/5FAFC3AE/67A11B4D" Ref="UBF17"  Part="1" 
AR Path="/5FBCE4A9/5FBD0B6A/67A11B4D" Ref="UBF17"  Part="1" 
F 0 "UBF17" H 5975 6167 50  0000 C CNN
F 1 "OR02" H 5975 6076 50  0000 C CNN
F 2 "" H 6000 5900 50  0001 C CNN
F 3 "" H 6000 5900 50  0001 C CNN
	1    5950 5900
	1    0    0    -1  
$EndComp
$Comp
L A5C:DFFCOO UBH196
U 1 1 621EBD8E
P 4250 3200
AR Path="/5FAFC3AE/621EBD8E" Ref="UBH196"  Part="1" 
AR Path="/5FBCE4A9/5FBD0B6A/621EBD8E" Ref="UBH196"  Part="1" 
F 0 "UBH196" H 4250 3565 50  0000 C CNN
F 1 "DFFCOO" H 4250 3474 50  0000 C CNN
F 2 "" H 4250 3200 50  0001 C CNN
F 3 "" H 4250 3200 50  0001 C CNN
F 4 "UBH195" H 4250 3200 50  0001 C CNN "MiscRef"
	1    4250 3200
	1    0    0    -1  
$EndComp
$Comp
L A5C:DFFCOO UBH200
U 1 1 621EBD94
P 4250 3850
AR Path="/5FAFC3AE/621EBD94" Ref="UBH200"  Part="1" 
AR Path="/5FBCE4A9/5FBD0B6A/621EBD94" Ref="UBH200"  Part="1" 
F 0 "UBH200" H 4250 4215 50  0000 C CNN
F 1 "DFFCOO" H 4250 4124 50  0000 C CNN
F 2 "" H 4250 3850 50  0001 C CNN
F 3 "" H 4250 3850 50  0001 C CNN
	1    4250 3850
	1    0    0    -1  
$EndComp
$Comp
L A5C:DFFCOO UBH204
U 1 1 621EBD9A
P 4250 4500
AR Path="/5FAFC3AE/621EBD9A" Ref="UBH204"  Part="1" 
AR Path="/5FBCE4A9/5FBD0B6A/621EBD9A" Ref="UBH204"  Part="1" 
F 0 "UBH204" H 4250 4865 50  0000 C CNN
F 1 "DFFCOO" H 4250 4774 50  0000 C CNN
F 2 "" H 4250 4500 50  0001 C CNN
F 3 "" H 4250 4500 50  0001 C CNN
	1    4250 4500
	1    0    0    -1  
$EndComp
$Comp
L A5C:DFFCOO UBH208
U 1 1 621EBDA0
P 4250 5150
AR Path="/5FAFC3AE/621EBDA0" Ref="UBH208"  Part="1" 
AR Path="/5FBCE4A9/5FBD0B6A/621EBDA0" Ref="UBH208"  Part="1" 
F 0 "UBH208" H 4250 5515 50  0000 C CNN
F 1 "DFFCOO" H 4250 5424 50  0000 C CNN
F 2 "" H 4250 5150 50  0001 C CNN
F 3 "" H 4250 5150 50  0001 C CNN
	1    4250 5150
	1    0    0    -1  
$EndComp
$Comp
L A5C:M367C UBH308
U 1 1 62F7F620
P 7850 6000
AR Path="/5FAFC3AE/62F7F620" Ref="UBH308"  Part="1" 
AR Path="/5FBCE4A9/5FBD0B6A/62F7F620" Ref="UBH308"  Part="1" 
F 0 "UBH308" H 7850 6515 50  0000 C CNN
F 1 "M367C" H 7850 6424 50  0000 C CNN
F 2 "" H 8150 5800 50  0001 C CNN
F 3 "" H 8150 5800 50  0001 C CNN
	1    7850 6000
	1    0    0    -1  
$EndComp
$Comp
L A5C:M541C UBD192
U 1 1 6283AFE3
P 7850 4850
AR Path="/5FAFC3AE/6283AFE3" Ref="UBD192"  Part="1" 
AR Path="/5FBCE4A9/5FBD0B6A/6283AFE3" Ref="UBD192"  Part="1" 
F 0 "UBD192" H 7850 5565 50  0000 C CNN
F 1 "M541C" H 7850 5474 50  0000 C CNN
F 2 "" H 8150 4850 50  0001 C CNN
F 3 "" H 8150 4850 50  0001 C CNN
	1    7850 4850
	1    0    0    -1  
$EndComp
$Comp
L A5C:MUX24H UBK195
U 1 1 60E317D9
P 5950 2050
AR Path="/5FAFC3AE/60E317D9" Ref="UBK195"  Part="1" 
AR Path="/5FBCE4A9/5FBD0B6A/60E317D9" Ref="UBK195"  Part="1" 
F 0 "UBK195" H 5950 2915 50  0000 C CNN
F 1 "MUX24H" H 5950 2824 50  0000 C CNN
F 2 "" H 5950 2050 50  0001 C CNN
F 3 "" H 5950 2050 50  0001 C CNN
F 4 "UBK197;UBK200;UBK204;UBK207" H 5950 2050 50  0001 C CNN "MiscRef"
	1    5950 2050
	1    0    0    -1  
$EndComp
Text HLabel 6750 5300 0    50   Input ~ 0
~DEBUG
Wire Bus Line
	3450 2800 3450 4950
Wire Bus Line
	4650 1250 4650 1650
Wire Bus Line
	4650 2050 4650 2450
Wire Bus Line
	8850 5300 8850 5950
Wire Bus Line
	8500 3000 8500 3750
Wire Bus Line
	8850 4500 8850 5300
$EndSCHEMATC
