EESchema Schematic File Version 4
EELAYER 30 0
EELAYER END
$Descr A3 16535 11693
encoding utf-8
Sheet 23 83
Title "CPS Reverse Engineering: DL-0311"
Date "2021-09-12"
Rev ""
Comp ""
Comment1 ""
Comment2 ""
Comment3 "Licence: CC-BY"
Comment4 "Author: Loïc *WydD* Petit"
$EndDescr
Connection ~ 4350 7150
Connection ~ 4350 7050
Connection ~ 9650 5250
Connection ~ 9950 5550
Connection ~ 9750 5350
Connection ~ 9650 5750
Connection ~ 8800 5800
Connection ~ 8800 5350
Connection ~ 8750 7100
Connection ~ 8900 7100
Connection ~ 4250 8400
Connection ~ 9850 6050
Connection ~ 9750 5950
Connection ~ 9950 6150
Connection ~ 9850 5450
Connection ~ 12950 5600
Connection ~ 8800 6250
Connection ~ 9950 7100
Connection ~ 9850 6650
Connection ~ 9750 6200
Connection ~ 9550 5300
Connection ~ 10950 7900
Connection ~ 11900 7500
Connection ~ 11050 7800
Connection ~ 11800 7300
Connection ~ 10850 8000
Connection ~ 10750 8100
Connection ~ 11800 6650
Connection ~ 11900 6200
Connection ~ 9950 3150
Connection ~ 11050 3600
Connection ~ 11800 2450
Connection ~ 11800 6000
Connection ~ 9950 6750
Connection ~ 11900 6850
Connection ~ 12950 3350
Connection ~ 12950 6900
Connection ~ 12950 6250
Connection ~ 10600 8750
Connection ~ 3150 8450
Connection ~ 3150 3700
Connection ~ 5700 7650
Connection ~ 8250 7100
Connection ~ 10600 1600
Connection ~ 8800 2500
Connection ~ 11900 2650
Connection ~ 12950 2700
NoConn ~ 3850 7250
NoConn ~ 13550 6050
NoConn ~ 13550 5400
NoConn ~ 13550 2500
NoConn ~ 13550 3150
NoConn ~ 13550 7350
NoConn ~ 13550 6700
NoConn ~ 3850 2600
Entry Wire Line
	2450 2400 2550 2500
Entry Wire Line
	2450 3100 2550 3200
Entry Wire Line
	2450 3200 2550 3300
Entry Wire Line
	2450 3300 2550 3400
Entry Wire Line
	2450 3400 2550 3500
Entry Wire Line
	2450 7150 2550 7250
Entry Wire Line
	2450 7850 2550 7950
Entry Wire Line
	2450 7950 2550 8050
Entry Wire Line
	2450 8050 2550 8150
Entry Wire Line
	2450 8150 2550 8250
Entry Wire Line
	5600 7050 5700 7150
Entry Wire Line
	5600 7150 5700 7250
Entry Wire Line
	5600 7250 5700 7350
Entry Wire Line
	5600 7350 5700 7450
Entry Wire Line
	5600 7950 5700 7850
Entry Wire Line
	5600 8050 5700 7950
Entry Wire Line
	5600 8150 5700 8050
Entry Wire Line
	5600 8250 5700 8150
Entry Wire Line
	5750 3200 5850 3300
Entry Wire Line
	5750 3300 5850 3400
Entry Wire Line
	5750 3400 5850 3500
Entry Wire Line
	5750 3500 5850 3600
Entry Wire Line
	14700 2600 14800 2700
Entry Wire Line
	14700 3250 14800 3350
Entry Wire Line
	14700 5500 14800 5400
Entry Wire Line
	14700 6150 14800 6050
Wire Wire Line
	2400 3700 3150 3700
Wire Wire Line
	2400 8450 3150 8450
Wire Wire Line
	2550 2500 3350 2500
Wire Wire Line
	2550 3200 3350 3200
Wire Wire Line
	2550 3300 3350 3300
Wire Wire Line
	2550 3400 3350 3400
Wire Wire Line
	2550 3500 3350 3500
Wire Wire Line
	2550 7250 3350 7250
Wire Wire Line
	2550 7950 3350 7950
Wire Wire Line
	2550 8050 3350 8050
Wire Wire Line
	2550 8150 3350 8150
Wire Wire Line
	2550 8250 3350 8250
Wire Wire Line
	3150 2700 3150 3700
Wire Wire Line
	3150 2700 3350 2700
Wire Wire Line
	3150 3700 3350 3700
Wire Wire Line
	3150 7450 3150 8450
Wire Wire Line
	3150 7450 3350 7450
Wire Wire Line
	3150 8450 3350 8450
Wire Wire Line
	3250 3800 3250 2400
Wire Wire Line
	3250 3800 3350 3800
Wire Wire Line
	3250 8550 3250 7150
Wire Wire Line
	3250 8550 3350 8550
Wire Wire Line
	3850 7350 4350 7350
Wire Wire Line
	4050 4050 4250 4050
Wire Wire Line
	4050 8800 4250 8800
Wire Wire Line
	4150 3200 4350 3200
Wire Wire Line
	4150 3300 4350 3300
Wire Wire Line
	4150 3400 4350 3400
Wire Wire Line
	4150 3500 4350 3500
Wire Wire Line
	4150 7950 4350 7950
Wire Wire Line
	4150 8050 4350 8050
Wire Wire Line
	4150 8150 4350 8150
Wire Wire Line
	4150 8250 4350 8250
Wire Wire Line
	4250 3650 4350 3650
Wire Wire Line
	4250 4050 4250 3650
Wire Wire Line
	4250 7500 4250 8400
Wire Wire Line
	4250 8400 4250 8800
Wire Wire Line
	4250 8400 4350 8400
Wire Wire Line
	4350 7050 4350 6950
Wire Wire Line
	4350 7150 4350 7050
Wire Wire Line
	4350 7250 4350 7150
Wire Wire Line
	4350 7500 4250 7500
Wire Wire Line
	5350 3200 5750 3200
Wire Wire Line
	5350 3300 5750 3300
Wire Wire Line
	5350 3400 5750 3400
Wire Wire Line
	5350 3500 5750 3500
Wire Wire Line
	5350 7050 5600 7050
Wire Wire Line
	5350 7150 5600 7150
Wire Wire Line
	5350 7250 5600 7250
Wire Wire Line
	5350 7350 5600 7350
Wire Wire Line
	5350 7950 5600 7950
Wire Wire Line
	5350 8050 5600 8050
Wire Wire Line
	5350 8150 5600 8150
Wire Wire Line
	5350 8250 5600 8250
Wire Wire Line
	8050 7100 8250 7100
Wire Wire Line
	8250 4350 8250 7100
Wire Wire Line
	8250 7100 8750 7100
Wire Wire Line
	8350 5250 8900 5250
Wire Wire Line
	8350 8100 8350 5250
Wire Wire Line
	8350 8100 10750 8100
Wire Wire Line
	8450 5700 8900 5700
Wire Wire Line
	8450 8000 8450 5700
Wire Wire Line
	8450 8000 10850 8000
Wire Wire Line
	8550 6150 8900 6150
Wire Wire Line
	8550 7900 8550 6150
Wire Wire Line
	8550 7900 10950 7900
Wire Wire Line
	8650 2400 8900 2400
Wire Wire Line
	8650 3600 8650 2400
Wire Wire Line
	8650 3600 11050 3600
Wire Wire Line
	8650 6600 8900 6600
Wire Wire Line
	8650 7800 8650 6600
Wire Wire Line
	8650 7800 11050 7800
Wire Wire Line
	8750 7100 8900 7100
Wire Wire Line
	8750 7350 8750 7100
Wire Wire Line
	8750 7350 11150 7350
Wire Wire Line
	8800 1600 8600 1600
Wire Wire Line
	8800 1600 8800 2500
Wire Wire Line
	8800 2500 8800 5350
Wire Wire Line
	8800 5350 8800 5800
Wire Wire Line
	8800 5800 8800 6250
Wire Wire Line
	8800 6250 8800 6700
Wire Wire Line
	8800 6700 8900 6700
Wire Wire Line
	8900 2500 8800 2500
Wire Wire Line
	8900 5350 8800 5350
Wire Wire Line
	8900 5800 8800 5800
Wire Wire Line
	8900 6250 8800 6250
Wire Wire Line
	8900 7050 8900 7100
Wire Wire Line
	8900 7100 8900 7150
Wire Wire Line
	9450 2450 10100 2450
Wire Wire Line
	9450 5300 9550 5300
Wire Wire Line
	9450 5750 9650 5750
Wire Wire Line
	9450 6200 9750 6200
Wire Wire Line
	9450 7100 9950 7100
Wire Wire Line
	9550 4450 9550 5300
Wire Wire Line
	9550 4450 9650 4450
Wire Wire Line
	9550 5300 9550 7200
Wire Wire Line
	9650 4350 8250 4350
Wire Wire Line
	9650 4600 9650 5250
Wire Wire Line
	9650 4600 10200 4600
Wire Wire Line
	9650 5250 9650 5750
Wire Wire Line
	9650 5750 9650 7200
Wire Wire Line
	9750 4700 9750 5350
Wire Wire Line
	9750 4700 10200 4700
Wire Wire Line
	9750 5350 9750 5950
Wire Wire Line
	9750 5350 10050 5350
Wire Wire Line
	9750 5950 9750 6200
Wire Wire Line
	9750 5950 10100 5950
Wire Wire Line
	9750 6200 9750 7200
Wire Wire Line
	9850 4800 9850 5450
Wire Wire Line
	9850 4800 10200 4800
Wire Wire Line
	9850 5450 9850 6050
Wire Wire Line
	9850 5450 10050 5450
Wire Wire Line
	9850 6050 9850 6650
Wire Wire Line
	9850 6050 10100 6050
Wire Wire Line
	9850 6650 9450 6650
Wire Wire Line
	9850 6650 9850 7200
Wire Wire Line
	9850 6650 10100 6650
Wire Wire Line
	9950 2550 9950 3150
Wire Wire Line
	9950 2550 10100 2550
Wire Wire Line
	9950 3150 9950 4050
Wire Wire Line
	9950 3150 11150 3150
Wire Wire Line
	9950 4050 11400 4050
Wire Wire Line
	9950 5550 9950 5150
Wire Wire Line
	9950 5550 9950 6150
Wire Wire Line
	9950 6150 9950 6750
Wire Wire Line
	9950 6150 10100 6150
Wire Wire Line
	9950 6750 9950 7100
Wire Wire Line
	9950 6750 10100 6750
Wire Wire Line
	9950 7200 9950 7100
Wire Wire Line
	10050 5250 9650 5250
Wire Wire Line
	10050 5550 9950 5550
Wire Wire Line
	10200 4500 10200 4400
Wire Wire Line
	10600 1600 10400 1600
Wire Wire Line
	10600 1600 11900 1600
Wire Wire Line
	10600 2000 10600 1600
Wire Wire Line
	10600 8350 10600 8750
Wire Wire Line
	10600 8750 10400 8750
Wire Wire Line
	10600 8750 11900 8750
Wire Wire Line
	10650 2500 11150 2500
Wire Wire Line
	10650 5400 11150 5400
Wire Wire Line
	10650 6700 11150 6700
Wire Wire Line
	10750 5500 11150 5500
Wire Wire Line
	10750 8100 10750 5500
Wire Wire Line
	10850 6150 11150 6150
Wire Wire Line
	10850 8000 10850 6150
Wire Wire Line
	10950 2600 10950 3700
Wire Wire Line
	10950 3700 13900 3700
Wire Wire Line
	10950 6800 10950 7900
Wire Wire Line
	10950 7900 13900 7900
Wire Wire Line
	11050 3250 11150 3250
Wire Wire Line
	11050 3600 11050 3250
Wire Wire Line
	11050 7450 11150 7450
Wire Wire Line
	11050 7800 11050 7450
Wire Wire Line
	11150 2600 10950 2600
Wire Wire Line
	11150 6050 10650 6050
Wire Wire Line
	11150 6800 10950 6800
Wire Wire Line
	11200 2000 11800 2000
Wire Wire Line
	11200 8350 11800 8350
Wire Wire Line
	11400 4650 11400 4050
Wire Wire Line
	11700 2350 12000 2350
Wire Wire Line
	11700 3000 12000 3000
Wire Wire Line
	11700 5250 12000 5250
Wire Wire Line
	11700 5900 12000 5900
Wire Wire Line
	11700 6100 12000 6100
Wire Wire Line
	11700 7200 12000 7200
Wire Wire Line
	11800 2000 11800 2450
Wire Wire Line
	11800 2450 11800 3100
Wire Wire Line
	11800 3100 12000 3100
Wire Wire Line
	11800 5350 11800 6000
Wire Wire Line
	11800 6000 11800 6650
Wire Wire Line
	11800 6650 11800 7300
Wire Wire Line
	11800 7300 11800 8350
Wire Wire Line
	11800 7300 12000 7300
Wire Wire Line
	11900 1600 11900 2650
Wire Wire Line
	11900 2650 11900 3300
Wire Wire Line
	11900 3300 12000 3300
Wire Wire Line
	11900 5550 11900 6200
Wire Wire Line
	11900 6200 11900 6850
Wire Wire Line
	11900 6850 11900 7500
Wire Wire Line
	11900 7500 11900 8750
Wire Wire Line
	11900 7500 12000 7500
Wire Wire Line
	12000 2450 11800 2450
Wire Wire Line
	12000 2550 11700 2550
Wire Wire Line
	12000 2650 11900 2650
Wire Wire Line
	12000 3200 11700 3200
Wire Wire Line
	12000 5350 11800 5350
Wire Wire Line
	12000 5450 11700 5450
Wire Wire Line
	12000 5550 11900 5550
Wire Wire Line
	12000 6000 11800 6000
Wire Wire Line
	12000 6200 11900 6200
Wire Wire Line
	12000 6550 11300 6550
Wire Wire Line
	12000 6650 11800 6650
Wire Wire Line
	12000 6750 11700 6750
Wire Wire Line
	12000 6850 11900 6850
Wire Wire Line
	12000 7400 11700 7400
Wire Wire Line
	12850 2500 13050 2500
Wire Wire Line
	12850 3150 13050 3150
Wire Wire Line
	12850 6050 13050 6050
Wire Wire Line
	12850 6700 13050 6700
Wire Wire Line
	12850 7350 13050 7350
Wire Wire Line
	12950 1600 12750 1600
Wire Wire Line
	12950 2700 12950 1600
Wire Wire Line
	12950 2700 12950 3350
Wire Wire Line
	12950 3350 12950 5600
Wire Wire Line
	12950 3350 13050 3350
Wire Wire Line
	12950 6250 12950 5600
Wire Wire Line
	12950 6250 12950 6900
Wire Wire Line
	12950 6900 12950 7550
Wire Wire Line
	12950 7550 13050 7550
Wire Wire Line
	13050 2700 12950 2700
Wire Wire Line
	13050 5400 12850 5400
Wire Wire Line
	13050 5600 12950 5600
Wire Wire Line
	13050 6250 12950 6250
Wire Wire Line
	13050 6900 12950 6900
Wire Wire Line
	13550 2600 13900 2600
Wire Wire Line
	13550 3250 13800 3250
Wire Wire Line
	13550 5500 14100 5500
Wire Wire Line
	13550 6150 14000 6150
Wire Wire Line
	13550 6800 13900 6800
Wire Wire Line
	13550 7450 13800 7450
Wire Wire Line
	13800 3250 13800 3600
Wire Wire Line
	13800 3250 14700 3250
Wire Wire Line
	13800 3600 11050 3600
Wire Wire Line
	13800 7450 13800 7800
Wire Wire Line
	13800 7800 11050 7800
Wire Wire Line
	13900 2600 13900 3700
Wire Wire Line
	13900 2600 14700 2600
Wire Wire Line
	13900 6800 13900 7900
Wire Wire Line
	14000 6150 14000 8000
Wire Wire Line
	14000 6150 14700 6150
Wire Wire Line
	14000 8000 10850 8000
Wire Wire Line
	14100 5500 14100 8100
Wire Wire Line
	14100 5500 14700 5500
Wire Wire Line
	14100 8100 10750 8100
Wire Bus Line
	2450 2300 2350 2300
Wire Bus Line
	2450 7050 2350 7050
Wire Bus Line
	5700 7650 5850 7650
Wire Bus Line
	5850 3700 6000 3700
Wire Bus Line
	14800 4350 15050 4350
Text Label 3050 2500 2    50   ~ 0
BUS-DATA4
Text Label 3050 3200 2    50   ~ 0
BUS-DATA3
Text Label 3050 3300 2    50   ~ 0
BUS-DATA2
Text Label 3050 3400 2    50   ~ 0
BUS-DATA1
Text Label 3050 3500 2    50   ~ 0
BUS-DATA0
Text Label 3050 7250 2    50   ~ 0
BUS-DATA4
Text Label 3050 7950 2    50   ~ 0
BUS-DATA3
Text Label 3050 8050 2    50   ~ 0
BUS-DATA2
Text Label 3050 8150 2    50   ~ 0
BUS-DATA1
Text Label 3050 8250 2    50   ~ 0
BUS-DATA0
Text Label 3900 2500 0    50   ~ 0
XSHIFT4
Text Label 5400 3200 0    50   ~ 0
XSHIFT3
Text Label 5400 3300 0    50   ~ 0
XSHIFT2
Text Label 5400 3400 0    50   ~ 0
XSHIFT1
Text Label 5400 3500 0    50   ~ 0
XSHIFT0
Text Label 5400 7050 0    50   ~ 0
Y7
Text Label 5400 7150 0    50   ~ 0
Y6
Text Label 5400 7250 0    50   ~ 0
Y5
Text Label 5400 7350 0    50   ~ 0
Y4
Text Label 5400 7950 0    50   ~ 0
Y3
Text Label 5400 8050 0    50   ~ 0
Y2
Text Label 5400 8150 0    50   ~ 0
Y1
Text Label 5400 8250 0    50   ~ 0
Y0
Text Label 11300 6550 0    50   ~ 0
XSHIFT4
Text HLabel 1850 3650 0    50   Input ~ 0
~SCROLL3-X
Text HLabel 1850 3750 0    50   Input ~ 0
~CLK4M
Text HLabel 1850 8400 0    50   Input ~ 0
~SCROLL3-Y
Text HLabel 1850 8500 0    50   Input ~ 0
~CLK4M
Text HLabel 2350 2300 0    50   Input ~ 0
BUS-DATA[0..4]
Text HLabel 2350 7050 0    50   Input ~ 0
BUS-DATA[0..4]
Text HLabel 4050 4050 0    50   Input ~ 0
~SCROLL3-T
Text HLabel 4050 8800 0    50   Input ~ 0
~SCROLL3-T
Text HLabel 5850 7650 2    50   3State ~ 0
Y[0..7]
Text HLabel 6000 3700 2    50   3State ~ 0
XSHIFT[0..3]
Text HLabel 8050 7100 0    50   Input ~ 0
~SCROLL3-T
Text HLabel 8600 1600 0    50   Input ~ 0
~FLIP
Text HLabel 10400 1600 0    50   Input ~ 0
~LI
Text HLabel 10400 8750 0    50   Input ~ 0
~LI
Text HLabel 11700 2350 0    50   Input ~ 0
FLIP
Text HLabel 11700 3000 0    50   Input ~ 0
FLIP
Text HLabel 11700 7200 0    50   Input ~ 0
FLIP
Text HLabel 12750 1600 0    50   Input ~ 0
~CLK4M
Text HLabel 15050 4350 2    50   Output ~ 0
SCROLL3-X[0..3]
$Comp
L power:VCC #PWR0256
U 1 1 654FE0AA
P 3250 2400
F 0 "#PWR0256" H 3250 2250 50  0001 C CNN
F 1 "VCC" H 3265 2573 50  0000 C CNN
F 2 "" H 3250 2400 50  0001 C CNN
F 3 "" H 3250 2400 50  0001 C CNN
	1    3250 2400
	1    0    0    -1  
$EndComp
$Comp
L power:VCC #PWR0257
U 1 1 651E195B
P 3250 7150
F 0 "#PWR0257" H 3250 7000 50  0001 C CNN
F 1 "VCC" H 3265 7323 50  0000 C CNN
F 2 "" H 3250 7150 50  0001 C CNN
F 3 "" H 3250 7150 50  0001 C CNN
	1    3250 7150
	1    0    0    -1  
$EndComp
$Comp
L power:VCC #PWR0189
U 1 1 61118DE5
P 4350 6950
F 0 "#PWR0189" H 4350 6800 50  0001 C CNN
F 1 "VCC" H 4365 7123 50  0000 C CNN
F 2 "" H 4350 6950 50  0001 C CNN
F 3 "" H 4350 6950 50  0001 C CNN
	1    4350 6950
	1    0    0    -1  
$EndComp
$Comp
L power:GND #PWR0190
U 1 1 61118DCF
P 11700 5250
F 0 "#PWR0190" H 11700 5000 50  0001 C CNN
F 1 "GND" H 11705 5077 50  0001 C CNN
F 2 "" H 11700 5250 50  0001 C CNN
F 3 "" H 11700 5250 50  0001 C CNN
	1    11700 5250
	1    0    0    -1  
$EndComp
$Comp
L power:GND #PWR0191
U 1 1 61118DCA
P 11700 5900
F 0 "#PWR0191" H 11700 5650 50  0001 C CNN
F 1 "GND" H 11705 5727 50  0001 C CNN
F 2 "" H 11700 5900 50  0001 C CNN
F 3 "" H 11700 5900 50  0001 C CNN
	1    11700 5900
	1    0    0    -1  
$EndComp
$Comp
L A5C:OR02 UEJ36
U 1 1 6C156D4C
P 2100 3700
AR Path="/60E34936/6C156D4C" Ref="UEJ36"  Part="1" 
AR Path="/612D3239/612D3C7B/6C156D4C" Ref="UEJ36"  Part="1" 
F 0 "UEJ36" H 2125 3967 50  0000 C CNN
F 1 "OR02" H 2125 3876 50  0000 C CNN
F 2 "" H 2150 3700 50  0001 C CNN
F 3 "" H 2150 3700 50  0001 C CNN
	1    2100 3700
	1    0    0    -1  
$EndComp
$Comp
L A5C:OR02 UEH210
U 1 1 61118DE6
P 2100 8450
AR Path="/60E34936/61118DE6" Ref="UEH210"  Part="1" 
AR Path="/612D3239/612D3C7B/61118DE6" Ref="UEH210"  Part="1" 
F 0 "UEH210" H 2125 8717 50  0000 C CNN
F 1 "OR02" H 2125 8626 50  0000 C CNN
F 2 "" H 2150 8450 50  0001 C CNN
F 3 "" H 2150 8450 50  0001 C CNN
	1    2100 8450
	1    0    0    -1  
$EndComp
$Comp
L A5C:XNOR02 UEH152
U 1 1 61118DD2
P 9150 2450
AR Path="/60E34936/61118DD2" Ref="UEH152"  Part="1" 
AR Path="/612D3239/612D3C7B/61118DD2" Ref="UEH152"  Part="1" 
F 0 "UEH152" H 9175 2717 50  0000 C CNN
F 1 "XNOR02" H 9175 2626 50  0000 C CNN
F 2 "" H 9175 2450 50  0001 C CNN
F 3 "" H 9175 2450 50  0001 C CNN
	1    9150 2450
	1    0    0    -1  
$EndComp
$Comp
L A5C:XOR02 UEA61
U 1 1 61118DD0
P 9150 5300
AR Path="/60E34936/61118DD0" Ref="UEA61"  Part="1" 
AR Path="/612D3239/612D3C7B/61118DD0" Ref="UEA61"  Part="1" 
F 0 "UEA61" H 9175 5567 50  0000 C CNN
F 1 "XOR02" H 9175 5476 50  0000 C CNN
F 2 "" H 9150 5300 50  0001 C CNN
F 3 "" H 9150 5300 50  0001 C CNN
	1    9150 5300
	1    0    0    -1  
$EndComp
$Comp
L A5C:XNOR02 UED89
U 1 1 61118DD7
P 9150 5750
AR Path="/60E34936/61118DD7" Ref="UED89"  Part="1" 
AR Path="/612D3239/612D3C7B/61118DD7" Ref="UED89"  Part="1" 
F 0 "UED89" H 9175 6017 50  0000 C CNN
F 1 "XNOR02" H 9175 5926 50  0000 C CNN
F 2 "" H 9175 5750 50  0001 C CNN
F 3 "" H 9175 5750 50  0001 C CNN
	1    9150 5750
	1    0    0    -1  
$EndComp
$Comp
L A5C:XNOR02 UEC60
U 1 1 61118DE1
P 9150 6200
AR Path="/60E34936/61118DE1" Ref="UEC60"  Part="1" 
AR Path="/612D3239/612D3C7B/61118DE1" Ref="UEC60"  Part="1" 
F 0 "UEC60" H 9175 6467 50  0000 C CNN
F 1 "XNOR02" H 9175 6376 50  0000 C CNN
F 2 "" H 9175 6200 50  0001 C CNN
F 3 "" H 9175 6200 50  0001 C CNN
	1    9150 6200
	1    0    0    -1  
$EndComp
$Comp
L A5C:XNOR02 UEA56
U 1 1 61118DE2
P 9150 6650
AR Path="/60E34936/61118DE2" Ref="UEA56"  Part="1" 
AR Path="/612D3239/612D3C7B/61118DE2" Ref="UEA56"  Part="1" 
F 0 "UEA56" H 9175 6917 50  0000 C CNN
F 1 "XNOR02" H 9175 6826 50  0000 C CNN
F 2 "" H 9175 6650 50  0001 C CNN
F 3 "" H 9175 6650 50  0001 C CNN
	1    9150 6650
	1    0    0    -1  
$EndComp
$Comp
L A5C:NOR02 UEB32
U 1 1 61118DE0
P 9150 7100
AR Path="/60E34936/61118DE0" Ref="UEB32"  Part="1" 
AR Path="/612D3239/612D3C7B/61118DE0" Ref="UEB32"  Part="1" 
F 0 "UEB32" H 9175 7367 50  0000 C CNN
F 1 "NOR02" H 9175 7276 50  0000 C CNN
F 2 "" H 9150 7100 50  0001 C CNN
F 3 "" H 9150 7100 50  0001 C CNN
	1    9150 7100
	1    0    0    -1  
$EndComp
$Comp
L A5C:NOR02 UEA87
U 1 1 61118DD6
P 9900 4400
AR Path="/60E34936/61118DD6" Ref="UEA87"  Part="1" 
AR Path="/612D3239/612D3C7B/61118DD6" Ref="UEA87"  Part="1" 
F 0 "UEA87" H 9925 4667 50  0000 C CNN
F 1 "NOR02" H 9925 4576 50  0000 C CNN
F 2 "" H 9900 4400 50  0001 C CNN
F 3 "" H 9900 4400 50  0001 C CNN
	1    9900 4400
	1    0    0    -1  
$EndComp
$Comp
L A5C:NAND02 UEH154
U 1 1 61118DD3
P 10350 2500
AR Path="/60E34936/61118DD3" Ref="UEH154"  Part="1" 
AR Path="/612D3239/612D3C7B/61118DD3" Ref="UEH154"  Part="1" 
F 0 "UEH154" H 10375 2767 50  0000 C CNN
F 1 "NAND02" H 10375 2676 50  0000 C CNN
F 2 "" H 10350 2500 50  0001 C CNN
F 3 "" H 10350 2500 50  0001 C CNN
	1    10350 2500
	1    0    0    -1  
$EndComp
$Comp
L A5C:NAND02 UEB62
U 1 1 61118DDF
P 10350 6700
AR Path="/60E34936/61118DDF" Ref="UEB62"  Part="1" 
AR Path="/612D3239/612D3C7B/61118DDF" Ref="UEB62"  Part="1" 
F 0 "UEB62" H 10375 6967 50  0000 C CNN
F 1 "NAND02" H 10375 6876 50  0000 C CNN
F 2 "" H 10350 6700 50  0001 C CNN
F 3 "" H 10350 6700 50  0001 C CNN
	1    10350 6700
	1    0    0    -1  
$EndComp
$Comp
L A5C:XNOR02 UEG170
U 1 1 61118DC1
P 11400 2550
AR Path="/60E34936/61118DC1" Ref="UEG170"  Part="1" 
AR Path="/612D3239/612D3C7B/61118DC1" Ref="UEG170"  Part="1" 
F 0 "UEG170" H 11425 2817 50  0000 C CNN
F 1 "XNOR02" H 11425 2726 50  0000 C CNN
F 2 "" H 11425 2550 50  0001 C CNN
F 3 "" H 11425 2550 50  0001 C CNN
	1    11400 2550
	1    0    0    1   
$EndComp
$Comp
L A5C:XOR02 UEG145
U 1 1 61118DC7
P 11400 3200
AR Path="/60E34936/61118DC7" Ref="UEG145"  Part="1" 
AR Path="/612D3239/612D3C7B/61118DC7" Ref="UEG145"  Part="1" 
F 0 "UEG145" H 11425 3467 50  0000 C CNN
F 1 "XOR02" H 11425 3376 50  0000 C CNN
F 2 "" H 11400 3200 50  0001 C CNN
F 3 "" H 11400 3200 50  0001 C CNN
	1    11400 3200
	1    0    0    1   
$EndComp
$Comp
L A5C:XNOR02 UEF67
U 1 1 61118DCE
P 11400 5450
AR Path="/60E34936/61118DCE" Ref="UEF67"  Part="1" 
AR Path="/612D3239/612D3C7B/61118DCE" Ref="UEF67"  Part="1" 
F 0 "UEF67" H 11425 5717 50  0000 C CNN
F 1 "XNOR02" H 11425 5626 50  0000 C CNN
F 2 "" H 11425 5450 50  0001 C CNN
F 3 "" H 11425 5450 50  0001 C CNN
	1    11400 5450
	1    0    0    1   
$EndComp
$Comp
L A5C:XNOR02 UEA92
U 1 1 61118DC8
P 11400 6100
AR Path="/60E34936/61118DC8" Ref="UEA92"  Part="1" 
AR Path="/612D3239/612D3C7B/61118DC8" Ref="UEA92"  Part="1" 
F 0 "UEA92" H 11425 6367 50  0000 C CNN
F 1 "XNOR02" H 11425 6276 50  0000 C CNN
F 2 "" H 11425 6100 50  0001 C CNN
F 3 "" H 11425 6100 50  0001 C CNN
	1    11400 6100
	1    0    0    1   
$EndComp
$Comp
L A5C:XNOR02 UEG42
U 1 1 61118DC9
P 11400 6750
AR Path="/60E34936/61118DC9" Ref="UEG42"  Part="1" 
AR Path="/612D3239/612D3C7B/61118DC9" Ref="UEG42"  Part="1" 
F 0 "UEG42" H 11425 7017 50  0000 C CNN
F 1 "XNOR02" H 11425 6926 50  0000 C CNN
F 2 "" H 11425 6750 50  0001 C CNN
F 3 "" H 11425 6750 50  0001 C CNN
	1    11400 6750
	1    0    0    1   
$EndComp
$Comp
L A5C:XOR02 UEA33
U 1 1 61118DCB
P 11400 7400
AR Path="/60E34936/61118DCB" Ref="UEA33"  Part="1" 
AR Path="/612D3239/612D3C7B/61118DCB" Ref="UEA33"  Part="1" 
F 0 "UEA33" H 11425 7667 50  0000 C CNN
F 1 "XOR02" H 11425 7576 50  0000 C CNN
F 2 "" H 11400 7400 50  0001 C CNN
F 3 "" H 11400 7400 50  0001 C CNN
	1    11400 7400
	1    0    0    1   
$EndComp
$Comp
L A5C:NAND03 UEA85
U 1 1 61118DCC
P 10350 6050
AR Path="/60E34936/61118DCC" Ref="UEA85"  Part="1" 
AR Path="/612D3239/612D3C7B/61118DCC" Ref="UEA85"  Part="1" 
F 0 "UEA85" H 10375 6342 50  0000 C CNN
F 1 "NAND03" H 10375 6251 50  0000 C CNN
F 2 "" H 10350 6050 50  0001 C CNN
F 3 "" H 10350 6050 50  0001 C CNN
	1    10350 6050
	1    0    0    -1  
$EndComp
$Comp
L A5C:INV01 UEH120
U 1 1 61118DD1
P 10900 2000
AR Path="/60E34936/61118DD1" Ref="UEH120"  Part="1" 
AR Path="/612D3239/612D3C7B/61118DD1" Ref="UEH120"  Part="1" 
F 0 "UEH120" H 10900 2317 50  0000 C CNN
F 1 "INV01" H 10900 2226 50  0000 C CNN
F 2 "" H 10900 1800 50  0001 C CNN
F 3 "" H 10900 1800 50  0001 C CNN
	1    10900 2000
	1    0    0    -1  
$EndComp
$Comp
L A5C:INV01 UEF97
U 1 1 61118DDE
P 10900 8350
AR Path="/60E34936/61118DDE" Ref="UEF97"  Part="1" 
AR Path="/612D3239/612D3C7B/61118DDE" Ref="UEF97"  Part="1" 
F 0 "UEF97" H 10900 8667 50  0000 C CNN
F 1 "INV01" H 10900 8576 50  0000 C CNN
F 2 "" H 10900 8150 50  0001 C CNN
F 3 "" H 10900 8150 50  0001 C CNN
	1    10900 8350
	1    0    0    1   
$EndComp
$Comp
L A5C:INV01 UEG111
U 1 1 61118DD4
P 11100 4650
AR Path="/60E34936/61118DD4" Ref="UEG111"  Part="1" 
AR Path="/612D3239/612D3C7B/61118DD4" Ref="UEG111"  Part="1" 
F 0 "UEG111" H 11100 4967 50  0000 C CNN
F 1 "INV01" H 11100 4876 50  0000 C CNN
F 2 "" H 11100 4450 50  0001 C CNN
F 3 "" H 11100 4450 50  0001 C CNN
	1    11100 4650
	1    0    0    -1  
$EndComp
$Comp
L A5C:DFFCOO UEK29
U 1 1 71BB1DC1
P 3600 2600
AR Path="/60E34936/71BB1DC1" Ref="UEK29"  Part="1" 
AR Path="/612D3239/612D3C7B/71BB1DC1" Ref="UEK29"  Part="1" 
F 0 "UEK29" H 3600 2965 50  0000 C CNN
F 1 "DFFCOO" H 3600 2874 50  0000 C CNN
F 2 "" H 3600 2600 50  0001 C CNN
F 3 "" H 3600 2600 50  0001 C CNN
	1    3600 2600
	1    0    0    -1  
$EndComp
$Comp
L A5C:DFFCOO UEH138
U 1 1 61118DE8
P 3600 7350
AR Path="/60E34936/61118DE8" Ref="UEH138"  Part="1" 
AR Path="/612D3239/612D3C7B/61118DE8" Ref="UEH138"  Part="1" 
F 0 "UEH138" H 3600 7715 50  0000 C CNN
F 1 "DFFCOO" H 3600 7624 50  0000 C CNN
F 2 "" H 3600 7350 50  0001 C CNN
F 3 "" H 3600 7350 50  0001 C CNN
	1    3600 7350
	1    0    0    -1  
$EndComp
$Comp
L A5C:DFFCOO UEH163
U 1 1 61118DC0
P 13300 2600
AR Path="/60E34936/61118DC0" Ref="UEH163"  Part="1" 
AR Path="/612D3239/612D3C7B/61118DC0" Ref="UEH163"  Part="1" 
F 0 "UEH163" H 13300 2965 50  0000 C CNN
F 1 "DFFCOO" H 13300 2874 50  0000 C CNN
F 2 "" H 13300 2600 50  0001 C CNN
F 3 "" H 13300 2600 50  0001 C CNN
	1    13300 2600
	1    0    0    -1  
$EndComp
$Comp
L A5C:DFFCOO UEH148
U 1 1 61118DC6
P 13300 3250
AR Path="/60E34936/61118DC6" Ref="UEH148"  Part="1" 
AR Path="/612D3239/612D3C7B/61118DC6" Ref="UEH148"  Part="1" 
F 0 "UEH148" H 13300 3615 50  0000 C CNN
F 1 "DFFCOO" H 13300 3524 50  0000 C CNN
F 2 "" H 13300 3250 50  0001 C CNN
F 3 "" H 13300 3250 50  0001 C CNN
	1    13300 3250
	1    0    0    -1  
$EndComp
$Comp
L A5C:DFFCOO UEF60
U 1 1 61118DC4
P 13300 5500
AR Path="/60E34936/61118DC4" Ref="UEF60"  Part="1" 
AR Path="/612D3239/612D3C7B/61118DC4" Ref="UEF60"  Part="1" 
F 0 "UEF60" H 13300 5865 50  0000 C CNN
F 1 "DFFCOO" H 13300 5774 50  0000 C CNN
F 2 "" H 13300 5500 50  0001 C CNN
F 3 "" H 13300 5500 50  0001 C CNN
	1    13300 5500
	1    0    0    -1  
$EndComp
$Comp
L A5C:DFFCOO UEA102
U 1 1 61118DD9
P 13300 6150
AR Path="/60E34936/61118DD9" Ref="UEA102"  Part="1" 
AR Path="/612D3239/612D3C7B/61118DD9" Ref="UEA102"  Part="1" 
F 0 "UEA102" H 13300 6515 50  0000 C CNN
F 1 "DFFCOO" H 13300 6424 50  0000 C CNN
F 2 "" H 13300 6150 50  0001 C CNN
F 3 "" H 13300 6150 50  0001 C CNN
	1    13300 6150
	1    0    0    -1  
$EndComp
$Comp
L A5C:DFFCOO UEG34
U 1 1 61118DDC
P 13300 6800
AR Path="/60E34936/61118DDC" Ref="UEG34"  Part="1" 
AR Path="/612D3239/612D3C7B/61118DDC" Ref="UEG34"  Part="1" 
F 0 "UEG34" H 13300 7165 50  0000 C CNN
F 1 "DFFCOO" H 13300 7074 50  0000 C CNN
F 2 "" H 13300 6800 50  0001 C CNN
F 3 "" H 13300 6800 50  0001 C CNN
	1    13300 6800
	1    0    0    -1  
$EndComp
$Comp
L A5C:DFFCOO UEB34
U 1 1 61118DDD
P 13300 7450
AR Path="/60E34936/61118DDD" Ref="UEB34"  Part="1" 
AR Path="/612D3239/612D3C7B/61118DDD" Ref="UEB34"  Part="1" 
F 0 "UEB34" H 13300 7815 50  0000 C CNN
F 1 "DFFCOO" H 13300 7724 50  0000 C CNN
F 2 "" H 13300 7450 50  0001 C CNN
F 3 "" H 13300 7450 50  0001 C CNN
	1    13300 7450
	1    0    0    -1  
$EndComp
$Comp
L A5C:NAND04 UEC81
U 1 1 61118DCD
P 10350 5400
AR Path="/60E34936/61118DCD" Ref="UEC81"  Part="1" 
AR Path="/612D3239/612D3C7B/61118DCD" Ref="UEC81"  Part="1" 
F 0 "UEC81" H 10350 5742 50  0000 C CNN
F 1 "NAND04" H 10350 5651 50  0000 C CNN
F 2 "" H 10350 5150 50  0001 C CNN
F 3 "" H 10350 5150 50  0001 C CNN
	1    10350 5400
	1    0    0    -1  
$EndComp
$Comp
L A5C:NAND04 UEC83
U 1 1 61118DD5
P 10500 4650
AR Path="/60E34936/61118DD5" Ref="UEC83"  Part="1" 
AR Path="/612D3239/612D3C7B/61118DD5" Ref="UEC83"  Part="1" 
F 0 "UEC83" H 10500 4992 50  0000 C CNN
F 1 "NAND04" H 10500 4901 50  0000 C CNN
F 2 "" H 10500 4400 50  0001 C CNN
F 3 "" H 10500 4400 50  0001 C CNN
	1    10500 4650
	1    0    0    -1  
$EndComp
$Comp
L A5C:AOI22 UEH160
U 1 1 61118DC2
P 12400 2450
AR Path="/60E34936/61118DC2" Ref="UEH160"  Part="1" 
AR Path="/612D3239/612D3C7B/61118DC2" Ref="UEH160"  Part="1" 
F 0 "UEH160" H 12425 2767 50  0000 C CNN
F 1 "AOI22" H 12425 2676 50  0000 C CNN
F 2 "" H 12550 2450 50  0001 C CNN
F 3 "" H 12550 2450 50  0001 C CNN
	1    12400 2450
	1    0    0    -1  
$EndComp
$Comp
L A5C:AOI22 UEH145
U 1 1 61118DC5
P 12400 3100
AR Path="/60E34936/61118DC5" Ref="UEH145"  Part="1" 
AR Path="/612D3239/612D3C7B/61118DC5" Ref="UEH145"  Part="1" 
F 0 "UEH145" H 12425 3417 50  0000 C CNN
F 1 "AOI22" H 12425 3326 50  0000 C CNN
F 2 "" H 12550 3100 50  0001 C CNN
F 3 "" H 12550 3100 50  0001 C CNN
	1    12400 3100
	1    0    0    -1  
$EndComp
$Comp
L A5C:AOI22 UEF70
U 1 1 61118DC3
P 12400 5350
AR Path="/60E34936/61118DC3" Ref="UEF70"  Part="1" 
AR Path="/612D3239/612D3C7B/61118DC3" Ref="UEF70"  Part="1" 
F 0 "UEF70" H 12425 5667 50  0000 C CNN
F 1 "AOI22" H 12425 5576 50  0000 C CNN
F 2 "" H 12550 5350 50  0001 C CNN
F 3 "" H 12550 5350 50  0001 C CNN
	1    12400 5350
	1    0    0    -1  
$EndComp
$Comp
L A5C:AOI22 UEA100
U 1 1 61118DD8
P 12400 6000
AR Path="/60E34936/61118DD8" Ref="UEA100"  Part="1" 
AR Path="/612D3239/612D3C7B/61118DD8" Ref="UEA100"  Part="1" 
F 0 "UEA100" H 12425 6317 50  0000 C CNN
F 1 "AOI22" H 12425 6226 50  0000 C CNN
F 2 "" H 12550 6000 50  0001 C CNN
F 3 "" H 12550 6000 50  0001 C CNN
	1    12400 6000
	1    0    0    -1  
$EndComp
$Comp
L A5C:AOI22 UEG38
U 1 1 61118DDA
P 12400 6650
AR Path="/60E34936/61118DDA" Ref="UEG38"  Part="1" 
AR Path="/612D3239/612D3C7B/61118DDA" Ref="UEG38"  Part="1" 
F 0 "UEG38" H 12425 6967 50  0000 C CNN
F 1 "AOI22" H 12425 6876 50  0000 C CNN
F 2 "" H 12550 6650 50  0001 C CNN
F 3 "" H 12550 6650 50  0001 C CNN
	1    12400 6650
	1    0    0    -1  
$EndComp
$Comp
L A5C:AOI22 UEB39
U 1 1 61118DDB
P 12400 7300
AR Path="/60E34936/61118DDB" Ref="UEB39"  Part="1" 
AR Path="/612D3239/612D3C7B/61118DDB" Ref="UEB39"  Part="1" 
F 0 "UEB39" H 12425 7617 50  0000 C CNN
F 1 "AOI22" H 12425 7526 50  0000 C CNN
F 2 "" H 12550 7300 50  0001 C CNN
F 3 "" H 12550 7300 50  0001 C CNN
	1    12400 7300
	1    0    0    -1  
$EndComp
$Comp
L A5C:M175CL UEK146
U 1 1 6C156D41
P 3750 3500
AR Path="/60E34936/6C156D41" Ref="UEK146"  Part="1" 
AR Path="/612D3239/612D3C7B/6C156D41" Ref="UEK146"  Part="1" 
F 0 "UEK146" H 3750 4065 50  0000 C CNN
F 1 "M175CL" H 3750 3974 50  0000 C CNN
F 2 "" H 3750 3300 50  0001 C CNN
F 3 "" H 3750 3300 50  0001 C CNN
	1    3750 3500
	1    0    0    -1  
$EndComp
$Comp
L A5C:M175CL UEH185
U 1 1 61118DE7
P 3750 8250
AR Path="/60E34936/61118DE7" Ref="UEH185"  Part="1" 
AR Path="/612D3239/612D3C7B/61118DE7" Ref="UEH185"  Part="1" 
F 0 "UEH185" H 3750 8815 50  0000 C CNN
F 1 "M175CL" H 3750 8724 50  0000 C CNN
F 2 "" H 3750 8050 50  0001 C CNN
F 3 "" H 3750 8050 50  0001 C CNN
	1    3750 8250
	1    0    0    -1  
$EndComp
$Comp
L A5C:M368C UEJ?
U 1 1 6C156D5F
P 4850 3450
AR Path="/604B5523/6C156D5F" Ref="UEJ?"  Part="1" 
AR Path="/6C156D5F" Ref="UEJ157"  Part="1" 
AR Path="/60E34936/6C156D5F" Ref="UEJ157"  Part="1" 
AR Path="/612D3239/612D3C7B/6C156D5F" Ref="UEJ157"  Part="1" 
F 0 "UEJ157" H 4850 3960 50  0000 C CNN
F 1 "M368C" H 4850 3870 50  0000 C CNN
F 2 "" H 5150 3250 50  0001 C CNN
F 3 "" H 5150 3250 50  0001 C CNN
	1    4850 3450
	1    0    0    -1  
$EndComp
$Comp
L A5C:M368C UEK?
U 1 1 61118DE3
P 4850 7300
AR Path="/604B5523/61118DE3" Ref="UEK?"  Part="1" 
AR Path="/61118DE3" Ref="UEH121"  Part="1" 
AR Path="/60E34936/61118DE3" Ref="UEH121"  Part="1" 
AR Path="/612D3239/612D3C7B/61118DE3" Ref="UEH121"  Part="1" 
F 0 "UEH121" H 4850 7810 50  0000 C CNN
F 1 "M368C" H 4850 7720 50  0000 C CNN
F 2 "" H 5150 7100 50  0001 C CNN
F 3 "" H 5150 7100 50  0001 C CNN
	1    4850 7300
	1    0    0    -1  
$EndComp
$Comp
L A5C:M368C UEK?
U 1 1 61118DE4
P 4850 8200
AR Path="/604B5523/61118DE4" Ref="UEK?"  Part="1" 
AR Path="/61118DE4" Ref="UEH178"  Part="1" 
AR Path="/60E34936/61118DE4" Ref="UEH178"  Part="1" 
AR Path="/612D3239/612D3C7B/61118DE4" Ref="UEH178"  Part="1" 
F 0 "UEH178" H 4850 8710 50  0000 C CNN
F 1 "M368C" H 4850 8620 50  0000 C CNN
F 2 "" H 5150 8000 50  0001 C CNN
F 3 "" H 5150 8000 50  0001 C CNN
	1    4850 8200
	1    0    0    -1  
$EndComp
Wire Wire Line
	3850 2500 4250 2500
Connection ~ 13800 3250
Connection ~ 13900 2600
Connection ~ 14000 6150
Connection ~ 14100 5500
Connection ~ 14800 4350
Text Label 14200 6150 0    50   ~ 0
SCROLL3-X0
Text Label 14200 5500 0    50   ~ 0
SCROLL3-X1
Text Label 14200 3250 0    50   ~ 0
SCROLL3-X2
Text Label 14200 2600 0    50   ~ 0
SCROLL3-X3
Wire Wire Line
	13900 6800 14200 6800
Wire Bus Line
	14800 4350 14800 6050
Wire Bus Line
	14800 2700 14800 4350
Wire Bus Line
	5850 3300 5850 3700
Wire Bus Line
	5700 7650 5700 8150
Wire Bus Line
	5700 7150 5700 7650
Wire Bus Line
	2450 7050 2450 8150
Wire Bus Line
	2450 2300 2450 3400
Connection ~ 13900 6800
Text HLabel 14200 6800 2    50   Output ~ 0
SECOND-BLOCK
$EndSCHEMATC
