EESchema Schematic File Version 4
EELAYER 30 0
EELAYER END
$Descr A4 11693 8268
encoding utf-8
Sheet 5 17
Title ""
Date "2019-10-17"
Rev ""
Comp ""
Comment1 ""
Comment2 "Licence: CC-BY"
Comment3 "Author: Loic *WydD* Petit"
Comment4 "Project: CPS2 Reverse Engineering: 93646B"
$EndDescr
Connection ~ 4350 4650
Connection ~ 4350 4550
Connection ~ 4850 4450
Connection ~ 4350 4950
Connection ~ 4850 4950
Connection ~ 4350 2550
Connection ~ 5450 5750
NoConn ~ 4350 5050
NoConn ~ 4350 5450
NoConn ~ 4350 5550
NoConn ~ 4350 5650
NoConn ~ 4850 5650
NoConn ~ 4850 5550
NoConn ~ 4850 5450
NoConn ~ 4150 6950
Entry Wire Line
	3650 5250 3750 5150
Entry Wire Line
	3650 5350 3750 5250
Entry Wire Line
	3650 5450 3750 5350
Entry Wire Line
	3650 6700 3750 6800
Entry Wire Line
	3650 6950 3750 7050
Entry Wire Line
	3750 2750 3650 2650
Entry Wire Line
	3750 2850 3650 2750
Entry Wire Line
	3750 2950 3650 2850
Entry Wire Line
	3750 3050 3650 2950
Entry Wire Line
	3750 3150 3650 3050
Entry Wire Line
	3750 3250 3650 3150
Entry Wire Line
	3750 3350 3650 3250
Entry Wire Line
	3750 3450 3650 3350
Entry Wire Line
	3750 3550 3650 3450
Entry Wire Line
	3750 3650 3650 3550
Entry Wire Line
	3750 3750 3650 3650
Entry Wire Line
	3750 3850 3650 3750
Entry Wire Line
	3750 3950 3650 3850
Entry Wire Line
	3750 4050 3650 3950
Entry Wire Line
	3750 4150 3650 4050
Entry Wire Line
	3750 4250 3650 4150
Entry Wire Line
	5350 5050 5450 5150
Entry Wire Line
	5350 5250 5450 5350
Entry Wire Line
	5450 3550 5550 3450
Entry Wire Line
	5450 3650 5550 3550
Entry Wire Line
	5450 3750 5550 3650
Entry Wire Line
	5450 3850 5550 3750
Entry Wire Line
	5450 3950 5550 3850
Entry Wire Line
	5450 4050 5550 3950
Entry Wire Line
	5450 4150 5550 4050
Entry Wire Line
	5450 4250 5550 4150
Entry Wire Line
	5450 4650 5550 4750
Entry Wire Line
	5450 4750 5550 4850
Entry Wire Line
	5450 6700 5350 6800
Entry Wire Line
	5450 6950 5350 7050
Entry Wire Line
	5500 2550 5400 2650
Entry Wire Line
	5500 2850 5400 2950
Entry Wire Line
	5500 2950 5400 3050
Entry Wire Line
	5500 3050 5400 3150
Entry Wire Line
	5500 3150 5400 3250
Entry Wire Line
	5500 3350 5400 3450
Entry Wire Line
	5650 5050 5550 4950
Entry Wire Line
	8400 4350 8500 4250
Entry Wire Line
	8400 4450 8500 4350
Wire Wire Line
	3750 5150 4350 5150
Wire Wire Line
	3750 5250 4350 5250
Wire Wire Line
	3750 5350 4350 5350
Wire Wire Line
	4150 6800 3750 6800
Wire Wire Line
	4150 7050 3750 7050
Wire Wire Line
	4200 2550 4350 2550
Wire Wire Line
	4200 4350 4350 4350
Wire Wire Line
	4200 4550 4350 4550
Wire Wire Line
	4200 4950 4350 4950
Wire Wire Line
	4350 2650 4350 2550
Wire Wire Line
	4350 2750 3750 2750
Wire Wire Line
	4350 2850 3750 2850
Wire Wire Line
	4350 2950 3750 2950
Wire Wire Line
	4350 3050 3750 3050
Wire Wire Line
	4350 3150 3750 3150
Wire Wire Line
	4350 3250 3750 3250
Wire Wire Line
	4350 3350 3750 3350
Wire Wire Line
	4350 3450 3750 3450
Wire Wire Line
	4350 3550 3750 3550
Wire Wire Line
	4350 3650 3750 3650
Wire Wire Line
	4350 3750 3750 3750
Wire Wire Line
	4350 3850 3750 3850
Wire Wire Line
	4350 3950 3750 3950
Wire Wire Line
	4350 4050 3750 4050
Wire Wire Line
	4350 4150 3750 4150
Wire Wire Line
	4350 4250 3750 4250
Wire Wire Line
	4350 4550 4350 4450
Wire Wire Line
	4350 4650 4350 4550
Wire Wire Line
	4350 4650 4350 4750
Wire Wire Line
	4350 4850 4350 4950
Wire Wire Line
	4850 2550 4900 2550
Wire Wire Line
	4850 3550 5450 3550
Wire Wire Line
	4850 3650 5450 3650
Wire Wire Line
	4850 3750 5450 3750
Wire Wire Line
	4850 3850 5450 3850
Wire Wire Line
	4850 3950 5450 3950
Wire Wire Line
	4850 4050 5450 4050
Wire Wire Line
	4850 4150 5450 4150
Wire Wire Line
	4850 4250 5450 4250
Wire Wire Line
	4850 4350 4850 4450
Wire Wire Line
	4850 4550 5450 4550
Wire Wire Line
	4850 4650 5450 4650
Wire Wire Line
	4850 4750 5450 4750
Wire Wire Line
	4850 4850 4850 4950
Wire Wire Line
	4850 5050 5350 5050
Wire Wire Line
	4850 5150 5300 5150
Wire Wire Line
	4850 5250 5350 5250
Wire Wire Line
	4900 2450 4900 2550
Wire Wire Line
	4950 6800 5350 6800
Wire Wire Line
	4950 7050 5350 7050
Wire Wire Line
	5000 2450 4900 2450
Wire Wire Line
	5000 4450 4850 4450
Wire Wire Line
	5000 4950 4850 4950
Wire Wire Line
	5000 5350 4850 5350
Wire Wire Line
	5400 2650 4850 2650
Wire Wire Line
	5400 2750 4850 2750
Wire Wire Line
	5400 2850 4850 2850
Wire Wire Line
	5400 2950 4850 2950
Wire Wire Line
	5400 3050 4850 3050
Wire Wire Line
	5400 3150 4850 3150
Wire Wire Line
	5400 3250 4850 3250
Wire Wire Line
	5400 3350 4850 3350
Wire Wire Line
	5400 3450 4850 3450
Wire Wire Line
	6250 5050 5650 5050
Wire Wire Line
	7700 4350 8400 4350
Wire Wire Line
	7700 4450 8400 4450
Wire Wire Line
	8150 3850 8700 3850
Wire Wire Line
	8150 3950 8700 3950
Wire Bus Line
	3650 2650 3050 2650
Wire Bus Line
	5450 5750 5850 5750
Wire Bus Line
	5450 7450 3650 7450
Wire Bus Line
	5500 2550 6150 2550
Wire Bus Line
	5500 2850 6150 2850
Wire Bus Line
	5500 3350 6150 3350
Wire Bus Line
	5550 4750 6100 4750
Wire Bus Line
	6150 3450 5550 3450
Wire Bus Line
	8500 4150 8700 4150
Text Label 3750 6800 0    50   ~ 0
EEPROM3
Text Label 3750 7050 0    50   ~ 0
EEPROM1
Text Label 3800 5150 0    50   ~ 0
EEPROM1
Text Label 3800 5250 0    50   ~ 0
EEPROM2
Text Label 3800 5350 0    50   ~ 0
EEPROM4
Text Label 4300 2750 2    50   ~ 0
CODE-ADDR16
Text Label 4300 2850 2    50   ~ 0
CODE-ADDR15
Text Label 4300 2950 2    50   ~ 0
CODE-ADDR14
Text Label 4300 3050 2    50   ~ 0
CODE-ADDR13
Text Label 4300 3150 2    50   ~ 0
CODE-ADDR12
Text Label 4300 3250 2    50   ~ 0
CODE-ADDR11
Text Label 4300 3350 2    50   ~ 0
CODE-ADDR10
Text Label 4300 3450 2    50   ~ 0
CODE-ADDR9
Text Label 4300 3550 2    50   ~ 0
CODE-ADDR8
Text Label 4300 3650 2    50   ~ 0
CODE-ADDR7
Text Label 4300 3750 2    50   ~ 0
CODE-ADDR6
Text Label 4300 3850 2    50   ~ 0
CODE-ADDR5
Text Label 4300 3950 2    50   ~ 0
CODE-ADDR4
Text Label 4300 4050 2    50   ~ 0
CODE-ADDR3
Text Label 4300 4150 2    50   ~ 0
CODE-ADDR2
Text Label 4300 4250 2    50   ~ 0
CODE-ADDR1
Text Label 4850 2750 0    50   ~ 0
CONTROL-OUT2
Text Label 4850 3350 0    50   ~ 0
CONTROL-OUT3
Text Label 4900 3550 0    50   ~ 0
CODE-DATA7
Text Label 4900 3650 0    50   ~ 0
CODE-DATA6
Text Label 4900 3750 0    50   ~ 0
CODE-DATA5
Text Label 4900 3850 0    50   ~ 0
CODE-DATA4
Text Label 4900 3950 0    50   ~ 0
CODE-DATA3
Text Label 4900 4050 0    50   ~ 0
CODE-DATA2
Text Label 4900 4150 0    50   ~ 0
CODE-DATA1
Text Label 4900 4250 0    50   ~ 0
CODE-DATA0
Text Label 4900 5050 0    50   ~ 0
EEPROM5
Text Label 4900 5150 0    50   ~ 0
CN1-C25
Text Label 4900 5250 0    50   ~ 0
EEPROM3
Text Label 4950 2650 0    50   ~ 0
CN1-C17
Text Label 4950 2850 0    50   ~ 0
CIF155
Text Label 4950 2950 0    50   ~ 0
CN1-C19
Text Label 4950 3050 0    50   ~ 0
CN1-C20
Text Label 4950 3150 0    50   ~ 0
CN1-C21
Text Label 4950 3250 0    50   ~ 0
CN1-C22
Text Label 4950 3450 0    50   ~ 0
CN1-C23
Text Label 4950 4550 0    50   ~ 0
SECURITY5
Text Label 4950 4650 0    50   ~ 0
CN1-C18
Text Label 4950 4750 0    50   ~ 0
CN1-C24
Text Label 5000 6800 0    50   ~ 0
EEPROM4
Text Label 5000 7050 0    50   ~ 0
EEPROM2
Text Label 6150 5050 2    50   ~ 0
CN1-C25
Text Label 7750 4350 0    50   ~ 0
CONTROL-OUT2
Text Label 7750 4450 0    50   ~ 0
CONTROL-OUT3
Text Label 8200 3850 0    50   ~ 0
SECURITY5
Text Label 8300 3950 0    50   ~ 0
CIF155
Text HLabel 3050 2650 0    50   BiDi ~ 0
CODE-ADDR[1..16]
Text HLabel 4200 4350 0    50   Input ~ 0
~CPSB-OBJUP
Text HLabel 5000 2450 2    50   Input ~ 0
CLK8M
Text HLabel 5850 5750 2    50   BiDi ~ 0
EEPROM[1..5]
Text HLabel 6100 4750 2    50   BiDi ~ 0
CN1-C[17..25]
Text HLabel 6150 2550 2    50   BiDi ~ 0
CN1-C[17..25]
Text HLabel 6150 2850 2    50   BiDi ~ 0
CN1-C[17..25]
Text HLabel 6150 3350 2    50   BiDi ~ 0
CN1-C[17..25]
Text HLabel 6150 3450 2    50   BiDi ~ 0
CODE-DATA[0..7]
Text HLabel 8700 3850 2    50   Input ~ 0
SECURITY5
Text HLabel 8700 3950 2    50   Input ~ 0
~Z80-BUS
Text HLabel 8700 4150 2    50   Input ~ 0
CONTROL-OUT[2..3]
$Comp
L power:VCC #PWR?
U 1 1 5DB4CD8D
P 4200 4950
AR Path="/6492EFBF/5DB4CD8D" Ref="#PWR?"  Part="1" 
AR Path="/5DB4CD8D" Ref="#PWR?"  Part="1" 
AR Path="/5DB29FF0/5DB4CD8D" Ref="#PWR0162"  Part="1" 
F 0 "#PWR0162" H 4200 4800 50  0001 C CNN
F 1 "VCC" H 4217 5123 50  0000 C TNN
F 2 "" H 4200 4950 50  0001 C CNN
F 3 "" H 4200 4950 50  0001 C CNN
	1    4200 4950
	-1   0    0    -1  
$EndComp
$Comp
L power:VCC #PWR?
U 1 1 64A8BF2E
P 4550 6600
AR Path="/6492EFBF/64A8BF2E" Ref="#PWR?"  Part="1" 
AR Path="/64A8BF2E" Ref="#PWR?"  Part="1" 
AR Path="/5DB29FF0/64A8BF2E" Ref="#PWR0166"  Part="1" 
F 0 "#PWR0166" H 4550 6450 50  0001 C CNN
F 1 "VCC" H 4567 6773 50  0000 C CNN
F 2 "" H 4550 6600 50  0001 C CNN
F 3 "" H 4550 6600 50  0001 C CNN
	1    4550 6600
	1    0    0    -1  
$EndComp
$Comp
L power:VCC #PWR?
U 1 1 5DB4837C
P 5000 4450
AR Path="/6492EFBF/5DB4837C" Ref="#PWR?"  Part="1" 
AR Path="/5DB4837C" Ref="#PWR?"  Part="1" 
AR Path="/5DB29FF0/5DB4837C" Ref="#PWR0103"  Part="1" 
F 0 "#PWR0103" H 5000 4300 50  0001 C CNN
F 1 "VCC" H 5017 4623 50  0000 C TNN
F 2 "" H 5000 4450 50  0001 C CNN
F 3 "" H 5000 4450 50  0001 C CNN
	1    5000 4450
	1    0    0    -1  
$EndComp
$Comp
L power:VCC #PWR?
U 1 1 5DB4EE7F
P 5000 4950
AR Path="/6492EFBF/5DB4EE7F" Ref="#PWR?"  Part="1" 
AR Path="/5DB4EE7F" Ref="#PWR?"  Part="1" 
AR Path="/5DB29FF0/5DB4EE7F" Ref="#PWR0163"  Part="1" 
F 0 "#PWR0163" H 5000 4800 50  0001 C CNN
F 1 "VCC" H 5017 5123 50  0000 C TNN
F 2 "" H 5000 4950 50  0001 C CNN
F 3 "" H 5000 4950 50  0001 C CNN
	1    5000 4950
	1    0    0    -1  
$EndComp
$Comp
L power:GND #PWR?
U 1 1 5DB7A05F
P 4200 2550
AR Path="/6492EFBF/5DB7A05F" Ref="#PWR?"  Part="1" 
AR Path="/5DB7A05F" Ref="#PWR?"  Part="1" 
AR Path="/5DB29FF0/5DB7A05F" Ref="#PWR0165"  Part="1" 
F 0 "#PWR0165" H 4200 2300 50  0001 C CNN
F 1 "GND" H 4205 2377 50  0001 C CNN
F 2 "" H 4200 2550 50  0001 C CNN
F 3 "" H 4200 2550 50  0001 C CNN
	1    4200 2550
	-1   0    0    -1  
$EndComp
$Comp
L power:GND #PWR?
U 1 1 5DB48382
P 4200 4550
AR Path="/6492EFBF/5DB48382" Ref="#PWR?"  Part="1" 
AR Path="/5DB48382" Ref="#PWR?"  Part="1" 
AR Path="/5DB29FF0/5DB48382" Ref="#PWR0104"  Part="1" 
F 0 "#PWR0104" H 4200 4300 50  0001 C CNN
F 1 "GND" H 4205 4377 50  0001 C CNN
F 2 "" H 4200 4550 50  0001 C CNN
F 3 "" H 4200 4550 50  0001 C CNN
	1    4200 4550
	-1   0    0    -1  
$EndComp
$Comp
L power:GND #PWR?
U 1 1 64A8BF34
P 4550 7250
AR Path="/6492EFBF/64A8BF34" Ref="#PWR?"  Part="1" 
AR Path="/64A8BF34" Ref="#PWR?"  Part="1" 
AR Path="/5DB29FF0/64A8BF34" Ref="#PWR0167"  Part="1" 
F 0 "#PWR0167" H 4550 7000 50  0001 C CNN
F 1 "GND" H 4555 7077 50  0001 C CNN
F 2 "" H 4550 7250 50  0001 C CNN
F 3 "" H 4550 7250 50  0001 C CNN
	1    4550 7250
	-1   0    0    -1  
$EndComp
$Comp
L power:GND #PWR?
U 1 1 5DB5967A
P 5000 5350
AR Path="/6492EFBF/5DB5967A" Ref="#PWR?"  Part="1" 
AR Path="/5DB5967A" Ref="#PWR?"  Part="1" 
AR Path="/5DB29FF0/5DB5967A" Ref="#PWR0164"  Part="1" 
F 0 "#PWR0164" H 5000 5100 50  0001 C CNN
F 1 "GND" H 5005 5177 50  0001 C CNN
F 2 "" H 5000 5350 50  0001 C CNN
F 3 "" H 5000 5350 50  0001 C CNN
	1    5000 5350
	1    0    0    -1  
$EndComp
$Comp
L CPS2-Custom:MSM16811 U2C?
U 1 1 64A8BF27
P 4550 6900
AR Path="/64A8BF27" Ref="U2C?"  Part="1" 
AR Path="/5DB29FF0/64A8BF27" Ref="UC2"  Part="1" 
F 0 "UC2" H 4300 7150 50  0000 C CNN
F 1 "MSM16811" H 4800 6600 50  0000 C CNN
F 2 "" H 5050 6850 50  0001 C CNN
F 3 "" H 5050 6850 50  0001 C CNN
	1    4550 6900
	1    0    0    -1  
$EndComp
$Comp
L CPS2-Custom:CN7_2x32 CN7
U 1 1 5DB41393
P 4550 4050
F 0 "CN7" H 4600 5700 50  0000 C CNN
F 1 "CN7_2x32" H 4600 5676 50  0001 C CNN
F 2 "" H 4550 4050 50  0001 C CNN
F 3 "~" H 4550 4050 50  0001 C CNN
	1    4550 4050
	1    0    0    -1  
$EndComp
Wire Bus Line
	5450 5150 5450 5750
Wire Bus Line
	5550 4750 5550 4950
Wire Bus Line
	8500 4150 8500 4350
Wire Bus Line
	5450 5750 5450 7450
Wire Bus Line
	5500 2850 5500 3150
Wire Bus Line
	3650 5250 3650 7450
Wire Bus Line
	5550 3450 5550 4150
Wire Bus Line
	3650 2650 3650 4150
$EndSCHEMATC
