EESchema Schematic File Version 4
EELAYER 30 0
EELAYER END
$Descr A3 16535 11693
encoding utf-8
Sheet 54 83
Title "CPS Reverse Engineering: DL-0311"
Date "2021-09-12"
Rev ""
Comp ""
Comment1 ""
Comment2 ""
Comment3 "Licence: CC-BY"
Comment4 "Author: Loïc *WydD* Petit"
$EndDescr
Connection ~ 7650 2150
Connection ~ 7050 1900
Connection ~ 7550 3350
Connection ~ 7650 3450
Connection ~ 7650 2700
Connection ~ 7450 3250
Connection ~ 7550 2600
Connection ~ 3200 4550
Connection ~ 4400 4550
Connection ~ 4400 3250
Connection ~ 4300 3050
Connection ~ 4300 4350
Connection ~ 6550 3300
Connection ~ 6550 3950
Connection ~ 6250 3850
Connection ~ 6650 4500
Connection ~ 7550 4100
Connection ~ 7450 4000
Connection ~ 6350 3200
Connection ~ 6650 2550
Connection ~ 6550 2650
Connection ~ 6450 2550
Connection ~ 6650 3850
Connection ~ 7350 3900
Connection ~ 6650 3200
Connection ~ 6150 4500
Connection ~ 5450 3300
Connection ~ 4300 3700
Connection ~ 5450 3950
Connection ~ 4400 3900
Connection ~ 5450 8850
Connection ~ 5450 8200
Connection ~ 4300 7950
Connection ~ 4400 8150
Connection ~ 6250 8750
Connection ~ 6650 7450
Connection ~ 6650 8100
Connection ~ 6450 7450
Connection ~ 6550 7550
Connection ~ 6150 9400
Connection ~ 6650 9400
Connection ~ 7550 9000
Connection ~ 6550 8850
Connection ~ 6650 8750
Connection ~ 7350 8800
Connection ~ 7450 8900
Connection ~ 7650 8350
Connection ~ 7650 7600
Connection ~ 4300 9250
Connection ~ 4400 9450
Connection ~ 3200 9450
Connection ~ 4400 8800
Connection ~ 4300 8600
Connection ~ 7450 8150
Connection ~ 6350 8100
Connection ~ 6550 8200
Connection ~ 7550 8250
Connection ~ 7650 7050
Connection ~ 7550 7500
Connection ~ 5450 4600
Connection ~ 5450 9500
Connection ~ 11200 3650
Connection ~ 11200 2750
Connection ~ 11200 7150
Connection ~ 10500 2000
Connection ~ 12950 2000
Connection ~ 9600 5800
Connection ~ 12950 5800
Connection ~ 11200 4700
NoConn ~ 6050 3100
NoConn ~ 6050 2450
NoConn ~ 8900 4800
NoConn ~ 6050 4400
NoConn ~ 6050 3750
NoConn ~ 6050 8650
NoConn ~ 6050 8000
NoConn ~ 6050 7350
NoConn ~ 6050 9300
NoConn ~ 8900 9700
Entry Wire Line
	3300 2300 3200 2200
Entry Wire Line
	3300 2950 3200 2850
Entry Wire Line
	3300 3600 3200 3500
Entry Wire Line
	3300 3900 3200 3800
Entry Wire Line
	3300 7200 3200 7100
Entry Wire Line
	3300 7850 3200 7750
Entry Wire Line
	3300 8500 3200 8400
Entry Wire Line
	3300 8800 3200 8700
Entry Wire Line
	8200 5300 8300 5400
Entry Wire Line
	8200 5400 8300 5500
Entry Wire Line
	8200 5500 8300 5600
Entry Wire Line
	8200 5600 8300 5700
Entry Wire Line
	8200 10200 8300 10100
Entry Wire Line
	8200 10300 8300 10200
Entry Wire Line
	8200 10400 8300 10300
Entry Wire Line
	8200 10500 8300 10400
Entry Wire Line
	10600 1700 10500 1800
Entry Wire Line
	10600 2300 10500 2200
Entry Wire Line
	10600 2400 10500 2300
Entry Wire Line
	10600 2500 10500 2400
Entry Wire Line
	10600 2600 10500 2500
Entry Wire Line
	10600 3200 10500 3100
Entry Wire Line
	10600 3300 10500 3200
Entry Wire Line
	10600 3400 10500 3300
Entry Wire Line
	10600 3500 10500 3400
Entry Wire Line
	10600 4250 10500 4150
Entry Wire Line
	10600 4350 10500 4250
Entry Wire Line
	10600 4450 10500 4350
Entry Wire Line
	10600 4550 10500 4450
Entry Wire Line
	10750 6600 10850 6700
Entry Wire Line
	10750 6700 10850 6800
Entry Wire Line
	10750 6800 10850 6900
Entry Wire Line
	10750 6900 10850 7000
Entry Wire Line
	12850 1400 12950 1300
Entry Wire Line
	12850 1700 12950 1800
Entry Wire Line
	12850 2300 12950 2200
Entry Wire Line
	12850 2400 12950 2300
Entry Wire Line
	12850 2500 12950 2400
Entry Wire Line
	12850 2600 12950 2500
Entry Wire Line
	12850 3200 12950 3300
Entry Wire Line
	12850 3300 12950 3400
Entry Wire Line
	12850 3400 12950 3500
Entry Wire Line
	12850 3500 12950 3600
Entry Wire Line
	12850 4250 12950 4350
Entry Wire Line
	12850 4350 12950 4450
Entry Wire Line
	12850 4450 12950 4550
Entry Wire Line
	12850 4550 12950 4650
Entry Wire Line
	12950 6800 12850 6700
Entry Wire Line
	12950 6900 12850 6800
Entry Wire Line
	12950 7000 12850 6900
Entry Wire Line
	12950 7100 12850 7000
Wire Wire Line
	2850 4550 3200 4550
Wire Wire Line
	2850 9450 3200 9450
Wire Wire Line
	3200 4350 3200 4550
Wire Wire Line
	3200 9250 3200 9450
Wire Wire Line
	3300 2300 4500 2300
Wire Wire Line
	3300 2950 4500 2950
Wire Wire Line
	3300 3600 4500 3600
Wire Wire Line
	3300 3900 4100 3900
Wire Wire Line
	3300 7200 4500 7200
Wire Wire Line
	3300 7850 4500 7850
Wire Wire Line
	3300 8500 4500 8500
Wire Wire Line
	3300 8800 4100 8800
Wire Wire Line
	3800 4350 4300 4350
Wire Wire Line
	3800 9250 4300 9250
Wire Wire Line
	3900 1150 3900 4450
Wire Wire Line
	3900 1150 9400 1150
Wire Wire Line
	3900 4450 4500 4450
Wire Wire Line
	3900 6050 3900 9350
Wire Wire Line
	3900 6050 9400 6050
Wire Wire Line
	3900 9350 4500 9350
Wire Wire Line
	4000 1250 4000 3800
Wire Wire Line
	4000 1250 9300 1250
Wire Wire Line
	4000 3800 4500 3800
Wire Wire Line
	4000 6150 4000 8700
Wire Wire Line
	4000 6150 9300 6150
Wire Wire Line
	4000 8700 4500 8700
Wire Wire Line
	4100 1350 4100 3150
Wire Wire Line
	4100 1350 9200 1350
Wire Wire Line
	4100 3150 4500 3150
Wire Wire Line
	4100 3900 4100 4250
Wire Wire Line
	4100 4250 4500 4250
Wire Wire Line
	4100 6250 4100 8050
Wire Wire Line
	4100 6250 9200 6250
Wire Wire Line
	4100 8050 4500 8050
Wire Wire Line
	4100 8800 4100 9150
Wire Wire Line
	4100 9150 4500 9150
Wire Wire Line
	4200 1450 4200 2500
Wire Wire Line
	4200 1450 9100 1450
Wire Wire Line
	4200 2500 4500 2500
Wire Wire Line
	4200 6350 4200 7400
Wire Wire Line
	4200 6350 9100 6350
Wire Wire Line
	4200 7400 4500 7400
Wire Wire Line
	4300 2400 4300 3050
Wire Wire Line
	4300 3050 4300 3700
Wire Wire Line
	4300 3700 4300 4350
Wire Wire Line
	4300 4350 4500 4350
Wire Wire Line
	4300 7300 4300 7950
Wire Wire Line
	4300 7950 4300 8600
Wire Wire Line
	4300 8600 4300 9250
Wire Wire Line
	4300 9250 4500 9250
Wire Wire Line
	4400 2600 4500 2600
Wire Wire Line
	4400 3250 4400 2600
Wire Wire Line
	4400 3900 4400 3250
Wire Wire Line
	4400 4550 3200 4550
Wire Wire Line
	4400 4550 4400 3900
Wire Wire Line
	4400 7500 4500 7500
Wire Wire Line
	4400 8150 4400 7500
Wire Wire Line
	4400 8800 4400 8150
Wire Wire Line
	4400 9450 3200 9450
Wire Wire Line
	4400 9450 4400 8800
Wire Wire Line
	4500 2400 4300 2400
Wire Wire Line
	4500 3050 4300 3050
Wire Wire Line
	4500 3250 4400 3250
Wire Wire Line
	4500 3700 4300 3700
Wire Wire Line
	4500 3900 4400 3900
Wire Wire Line
	4500 4550 4400 4550
Wire Wire Line
	4500 7300 4300 7300
Wire Wire Line
	4500 7950 4300 7950
Wire Wire Line
	4500 8150 4400 8150
Wire Wire Line
	4500 8600 4300 8600
Wire Wire Line
	4500 8800 4400 8800
Wire Wire Line
	4500 9450 4400 9450
Wire Wire Line
	5350 4700 5450 4700
Wire Wire Line
	5350 9600 5450 9600
Wire Wire Line
	5450 2650 5450 3300
Wire Wire Line
	5450 3300 5450 3950
Wire Wire Line
	5450 3950 5450 4600
Wire Wire Line
	5450 4600 5450 4700
Wire Wire Line
	5450 4600 5550 4600
Wire Wire Line
	5450 7550 5450 8200
Wire Wire Line
	5450 8200 5450 8850
Wire Wire Line
	5450 8850 5450 9500
Wire Wire Line
	5450 9500 5450 9600
Wire Wire Line
	5450 9500 5550 9500
Wire Wire Line
	5550 2450 5350 2450
Wire Wire Line
	5550 2650 5450 2650
Wire Wire Line
	5550 3100 5350 3100
Wire Wire Line
	5550 3300 5450 3300
Wire Wire Line
	5550 3750 5350 3750
Wire Wire Line
	5550 3950 5450 3950
Wire Wire Line
	5550 4400 5350 4400
Wire Wire Line
	5550 7350 5350 7350
Wire Wire Line
	5550 7550 5450 7550
Wire Wire Line
	5550 8000 5350 8000
Wire Wire Line
	5550 8200 5450 8200
Wire Wire Line
	5550 8650 5350 8650
Wire Wire Line
	5550 8850 5450 8850
Wire Wire Line
	5550 9300 5350 9300
Wire Wire Line
	6050 2550 6450 2550
Wire Wire Line
	6050 3200 6350 3200
Wire Wire Line
	6050 4500 6150 4500
Wire Wire Line
	6050 7450 6450 7450
Wire Wire Line
	6050 8100 6350 8100
Wire Wire Line
	6050 9400 6150 9400
Wire Wire Line
	6100 1900 7050 1900
Wire Wire Line
	6150 4500 6150 5600
Wire Wire Line
	6150 9400 6150 10500
Wire Wire Line
	6250 3850 6050 3850
Wire Wire Line
	6250 3850 6250 5500
Wire Wire Line
	6250 5500 6650 5500
Wire Wire Line
	6250 8750 6050 8750
Wire Wire Line
	6250 8750 6250 10400
Wire Wire Line
	6250 10400 6650 10400
Wire Wire Line
	6350 3200 6350 5400
Wire Wire Line
	6350 8100 6350 10300
Wire Wire Line
	6450 2550 6450 5300
Wire Wire Line
	6450 2550 6650 2550
Wire Wire Line
	6450 7450 6450 10200
Wire Wire Line
	6450 7450 6650 7450
Wire Wire Line
	6550 2050 6400 2050
Wire Wire Line
	6550 2050 6550 2650
Wire Wire Line
	6550 2650 6650 2650
Wire Wire Line
	6550 3300 6550 2650
Wire Wire Line
	6550 3950 6550 3300
Wire Wire Line
	6550 4600 6550 3950
Wire Wire Line
	6550 6950 6400 6950
Wire Wire Line
	6550 6950 6550 7550
Wire Wire Line
	6550 7550 6650 7550
Wire Wire Line
	6550 8200 6550 7550
Wire Wire Line
	6550 8850 6550 8200
Wire Wire Line
	6550 9500 6550 8850
Wire Wire Line
	6650 2250 6650 2550
Wire Wire Line
	6650 2250 8550 2250
Wire Wire Line
	6650 2800 6650 3200
Wire Wire Line
	6650 2800 8400 2800
Wire Wire Line
	6650 3200 6350 3200
Wire Wire Line
	6650 3300 6550 3300
Wire Wire Line
	6650 3550 6650 3850
Wire Wire Line
	6650 3850 6250 3850
Wire Wire Line
	6650 3950 6550 3950
Wire Wire Line
	6650 4250 6650 4500
Wire Wire Line
	6650 4500 6150 4500
Wire Wire Line
	6650 4600 6550 4600
Wire Wire Line
	6650 5300 6450 5300
Wire Wire Line
	6650 5400 6350 5400
Wire Wire Line
	6650 5600 6150 5600
Wire Wire Line
	6650 5750 6550 5750
Wire Wire Line
	6650 7150 6650 7450
Wire Wire Line
	6650 7150 8550 7150
Wire Wire Line
	6650 7700 6650 8100
Wire Wire Line
	6650 7700 8400 7700
Wire Wire Line
	6650 8100 6350 8100
Wire Wire Line
	6650 8200 6550 8200
Wire Wire Line
	6650 8450 6650 8750
Wire Wire Line
	6650 8750 6250 8750
Wire Wire Line
	6650 8850 6550 8850
Wire Wire Line
	6650 9150 6650 9400
Wire Wire Line
	6650 9400 6150 9400
Wire Wire Line
	6650 9500 6550 9500
Wire Wire Line
	6650 10200 6450 10200
Wire Wire Line
	6650 10300 6350 10300
Wire Wire Line
	6650 10500 6150 10500
Wire Wire Line
	6650 10650 6550 10650
Wire Wire Line
	7050 2150 7050 1900
Wire Wire Line
	7050 2150 7250 2150
Wire Wire Line
	7200 2600 7550 2600
Wire Wire Line
	7200 3250 7450 3250
Wire Wire Line
	7200 7500 7550 7500
Wire Wire Line
	7200 8150 7450 8150
Wire Wire Line
	7250 2150 7250 4650
Wire Wire Line
	7250 4650 7750 4650
Wire Wire Line
	7250 9550 7750 9550
Wire Wire Line
	7350 3900 7200 3900
Wire Wire Line
	7350 3900 7350 4750
Wire Wire Line
	7350 4750 8300 4750
Wire Wire Line
	7350 8800 7200 8800
Wire Wire Line
	7350 9650 7350 8800
Wire Wire Line
	7350 9650 8300 9650
Wire Wire Line
	7450 3250 7750 3250
Wire Wire Line
	7450 4000 7450 3250
Wire Wire Line
	7450 4850 7450 4000
Wire Wire Line
	7450 4850 8300 4850
Wire Wire Line
	7450 8150 7750 8150
Wire Wire Line
	7450 8900 7450 8150
Wire Wire Line
	7450 8900 7450 9750
Wire Wire Line
	7450 9750 8300 9750
Wire Wire Line
	7550 2600 7750 2600
Wire Wire Line
	7550 3350 7550 2600
Wire Wire Line
	7550 4100 7550 3350
Wire Wire Line
	7550 4100 7550 4950
Wire Wire Line
	7550 7500 7750 7500
Wire Wire Line
	7550 8250 7550 7500
Wire Wire Line
	7550 9000 7550 8250
Wire Wire Line
	7550 9850 7550 9000
Wire Wire Line
	7650 1850 7600 1850
Wire Wire Line
	7650 1850 7650 2150
Wire Wire Line
	7650 2150 7650 2700
Wire Wire Line
	7650 2700 7650 3450
Wire Wire Line
	7650 3450 7650 4200
Wire Wire Line
	7650 3450 7750 3450
Wire Wire Line
	7650 4200 7750 4200
Wire Wire Line
	7650 6750 7600 6750
Wire Wire Line
	7650 6750 7650 7050
Wire Wire Line
	7650 7050 7650 7600
Wire Wire Line
	7650 7600 7650 8350
Wire Wire Line
	7650 8350 7650 9100
Wire Wire Line
	7650 8350 7750 8350
Wire Wire Line
	7650 9100 7750 9100
Wire Wire Line
	7750 2700 7650 2700
Wire Wire Line
	7750 3350 7550 3350
Wire Wire Line
	7750 3900 7350 3900
Wire Wire Line
	7750 4000 7450 4000
Wire Wire Line
	7750 4100 7550 4100
Wire Wire Line
	7750 4550 7200 4550
Wire Wire Line
	7750 7600 7650 7600
Wire Wire Line
	7750 8250 7550 8250
Wire Wire Line
	7750 8800 7350 8800
Wire Wire Line
	7750 8900 7450 8900
Wire Wire Line
	7750 9000 7550 9000
Wire Wire Line
	7750 9450 7200 9450
Wire Wire Line
	8200 5300 7650 5300
Wire Wire Line
	8200 5400 7650 5400
Wire Wire Line
	8200 5500 7650 5500
Wire Wire Line
	8200 5600 7650 5600
Wire Wire Line
	8200 10200 7650 10200
Wire Wire Line
	8200 10300 7650 10300
Wire Wire Line
	8200 10400 7650 10400
Wire Wire Line
	8200 10500 7650 10500
Wire Wire Line
	8300 4600 8300 4650
Wire Wire Line
	8300 4950 7550 4950
Wire Wire Line
	8300 9550 8300 9500
Wire Wire Line
	8300 9850 7550 9850
Wire Wire Line
	8400 2750 8400 2800
Wire Wire Line
	8400 7650 8400 7700
Wire Wire Line
	8450 3450 8450 3550
Wire Wire Line
	8450 3550 6650 3550
Wire Wire Line
	8450 4150 8450 4250
Wire Wire Line
	8450 4250 6650 4250
Wire Wire Line
	8450 8350 8450 8450
Wire Wire Line
	8450 8450 6650 8450
Wire Wire Line
	8450 9050 8450 9150
Wire Wire Line
	8450 9150 6650 9150
Wire Wire Line
	8550 2150 7650 2150
Wire Wire Line
	8550 2650 8300 2650
Wire Wire Line
	8550 2750 8400 2750
Wire Wire Line
	8550 3350 8300 3350
Wire Wire Line
	8550 3450 8450 3450
Wire Wire Line
	8550 4050 8350 4050
Wire Wire Line
	8550 4150 8450 4150
Wire Wire Line
	8550 7050 7650 7050
Wire Wire Line
	8550 7550 8300 7550
Wire Wire Line
	8550 7650 8400 7650
Wire Wire Line
	8550 8250 8300 8250
Wire Wire Line
	8550 8350 8450 8350
Wire Wire Line
	8550 8950 8350 8950
Wire Wire Line
	8550 9050 8450 9050
Wire Wire Line
	9100 2200 9100 1450
Wire Wire Line
	9100 2700 9200 2700
Wire Wire Line
	9100 3400 9300 3400
Wire Wire Line
	9100 4100 9400 4100
Wire Wire Line
	9100 7100 9100 6350
Wire Wire Line
	9100 7600 9200 7600
Wire Wire Line
	9100 8300 9300 8300
Wire Wire Line
	9100 9000 9400 9000
Wire Wire Line
	9200 1350 9200 2700
Wire Wire Line
	9200 6250 9200 7600
Wire Wire Line
	9300 1250 9300 3400
Wire Wire Line
	9300 6150 9300 8300
Wire Wire Line
	9400 1150 9400 4100
Wire Wire Line
	9400 6050 9400 9000
Wire Wire Line
	10950 7150 11200 7150
Wire Wire Line
	11200 1850 11200 2750
Wire Wire Line
	11200 2750 11200 3650
Wire Wire Line
	11200 3650 11300 3650
Wire Wire Line
	11200 4700 11200 3650
Wire Wire Line
	11200 4700 11200 7150
Wire Wire Line
	11200 7150 11300 7150
Wire Wire Line
	11300 1700 10600 1700
Wire Wire Line
	11300 1850 11200 1850
Wire Wire Line
	11300 2300 10600 2300
Wire Wire Line
	11300 2400 10600 2400
Wire Wire Line
	11300 2500 10600 2500
Wire Wire Line
	11300 2600 10600 2600
Wire Wire Line
	11300 2750 11200 2750
Wire Wire Line
	11300 3200 10600 3200
Wire Wire Line
	11300 3300 10600 3300
Wire Wire Line
	11300 3400 10600 3400
Wire Wire Line
	11300 3500 10600 3500
Wire Wire Line
	11300 4250 10600 4250
Wire Wire Line
	11300 4350 10600 4350
Wire Wire Line
	11300 4450 10600 4450
Wire Wire Line
	11300 4550 10600 4550
Wire Wire Line
	11300 4700 11200 4700
Wire Wire Line
	11300 6700 10850 6700
Wire Wire Line
	11300 6800 10850 6800
Wire Wire Line
	11300 6900 10850 6900
Wire Wire Line
	11300 7000 10850 7000
Wire Wire Line
	12300 1700 12850 1700
Wire Wire Line
	12850 1400 12300 1400
Wire Wire Line
	12850 2300 12300 2300
Wire Wire Line
	12850 2400 12300 2400
Wire Wire Line
	12850 2500 12300 2500
Wire Wire Line
	12850 2600 12300 2600
Wire Wire Line
	12850 3200 12300 3200
Wire Wire Line
	12850 3300 12300 3300
Wire Wire Line
	12850 3400 12300 3400
Wire Wire Line
	12850 3500 12300 3500
Wire Wire Line
	12850 4250 12300 4250
Wire Wire Line
	12850 4350 12300 4350
Wire Wire Line
	12850 4450 12300 4450
Wire Wire Line
	12850 4550 12300 4550
Wire Wire Line
	12850 6700 12300 6700
Wire Wire Line
	12850 6800 12300 6800
Wire Wire Line
	12850 6900 12300 6900
Wire Wire Line
	12850 7000 12300 7000
Wire Wire Line
	13050 1500 12300 1500
Wire Wire Line
	13050 1600 12300 1600
Wire Bus Line
	3200 2100 3100 2100
Wire Bus Line
	3200 7000 3100 7000
Wire Bus Line
	8300 9950 9600 9950
Wire Bus Line
	9600 5800 8300 5800
Wire Bus Line
	9600 5800 12950 5800
Wire Bus Line
	9600 9950 9600 5800
Wire Bus Line
	10500 1800 10500 2000
Wire Bus Line
	10500 2000 10400 2000
Wire Bus Line
	10500 2950 10400 2950
Wire Bus Line
	10750 6500 10650 6500
Wire Bus Line
	12950 1300 13050 1300
Wire Bus Line
	12950 1800 12950 2000
Wire Bus Line
	12950 2000 13050 2000
Wire Bus Line
	12950 5800 13200 5800
Wire Bus Line
	12950 7200 13050 7200
Text Notes 3050 3100 1    50   ~ 0
SPRITE-HI
Text Notes 3100 8200 1    50   ~ 0
SPRITE-LO
Text Notes 3600 1450 2    50   ~ 0
INC when\nSPRITE-X-READY & LI
Text Notes 3600 1950 2    50   ~ 0
LOAD WHEN\nSCAN-243 OR\n[SPRITE-BLOCK-READY & LI]
Text Notes 3650 6450 2    50   ~ 0
INC when\nLI
Text Notes 3650 6750 2    50   ~ 0
LOAD WHEN\nSPRITE-X-READY & LI
Text Notes 6450 1000 2    50   ~ 0
- Y FLIP\n+ ~Y FLIP
Text Notes 6450 6650 2    50   ~ 0
- X FLIP\n+ ~X FLIP
Text Label 3350 2300 0    50   ~ 0
TILE-YOFF3
Text Label 3350 2950 0    50   ~ 0
TILE-YOFF2
Text Label 3350 3600 0    50   ~ 0
TILE-YOFF1
Text Label 3350 3900 0    50   ~ 0
TILE-YOFF0
Text Label 3350 7200 0    50   ~ 0
TILE-XOFF3
Text Label 3350 7850 0    50   ~ 0
TILE-XOFF2
Text Label 3350 8500 0    50   ~ 0
TILE-XOFF1
Text Label 3350 8800 0    50   ~ 0
TILE-XOFF0
Text Label 4600 5500 0    50   ~ 0
~LI
Text Label 7050 1800 2    50   ~ 0
~LI
Text Label 7050 6700 2    50   ~ 0
~LI
Text Label 8200 5300 2    50   ~ 0
GFX-ADDR11
Text Label 8200 5400 2    50   ~ 0
GFX-ADDR10
Text Label 8200 5500 2    50   ~ 0
GFX-ADDR9
Text Label 8200 5600 2    50   ~ 0
GFX-ADDR8
Text Label 8200 10200 2    50   ~ 0
GFX-ADDR7
Text Label 8200 10300 2    50   ~ 0
GFX-ADDR6
Text Label 8200 10400 2    50   ~ 0
GFX-ADDR5
Text Label 8200 10500 2    50   ~ 0
GFX-ADDR4
Text Label 10650 1700 0    50   ~ 0
~COLOUR4
Text Label 10650 2300 0    50   ~ 0
~COLOUR3
Text Label 10650 2400 0    50   ~ 0
~COLOUR2
Text Label 10650 2500 0    50   ~ 0
~COLOUR1
Text Label 10650 2600 0    50   ~ 0
~COLOUR0
Text Label 11100 3200 2    50   ~ 0
~TILE-BASE7
Text Label 11100 3300 2    50   ~ 0
~TILE-BASE6
Text Label 11100 3400 2    50   ~ 0
~TILE-BASE5
Text Label 11100 3500 2    50   ~ 0
~TILE-BASE4
Text Label 11100 4250 2    50   ~ 0
~TILE-BASE3
Text Label 11100 4350 2    50   ~ 0
~TILE-BASE2
Text Label 11100 4450 2    50   ~ 0
~TILE-BASE1
Text Label 11100 4550 2    50   ~ 0
~TILE-BASE0
Text Label 11150 6700 2    50   ~ 0
COL8
Text Label 11150 6800 2    50   ~ 0
COL7
Text Label 11150 6900 2    50   ~ 0
COL6
Text Label 11150 7000 2    50   ~ 0
COL5
Text Label 12300 1400 0    50   ~ 0
_CPC0
Text Label 12300 1700 0    50   ~ 0
_CB4
Text Label 12800 6700 2    50   ~ 0
ROMA-Y3
Text Label 12800 6800 2    50   ~ 0
ROMA-Y2
Text Label 12800 6900 2    50   ~ 0
ROMA-Y1
Text Label 12800 7000 2    50   ~ 0
ROMA-Y0
Text Label 12850 2300 2    50   ~ 0
_CB3
Text Label 12850 2400 2    50   ~ 0
_CB2
Text Label 12850 2500 2    50   ~ 0
_CB1
Text Label 12850 2600 2    50   ~ 0
_CB0
Text Label 12850 3200 2    50   ~ 0
GFX-ADDR19
Text Label 12850 3300 2    50   ~ 0
GFX-ADDR18
Text Label 12850 3400 2    50   ~ 0
GFX-ADDR17
Text Label 12850 3500 2    50   ~ 0
GFX-ADDR16
Text Label 12850 4250 2    50   ~ 0
GFX-ADDR15
Text Label 12850 4350 2    50   ~ 0
GFX-ADDR14
Text Label 12850 4450 2    50   ~ 0
GFX-ADDR13
Text Label 12850 4550 2    50   ~ 0
GFX-ADDR12
Text HLabel 2850 4550 0    50   Input ~ 0
~SPRITE-BLOCK-RESET
Text HLabel 2850 9450 0    50   Input ~ 0
~SPRITE-X-READY-LI
Text HLabel 3100 2100 0    50   Input ~ 0
TILE-YOFF[0..3]
Text HLabel 3100 7000 0    50   Input ~ 0
TILE-XOFF[0..3]
Text HLabel 4000 5500 0    50   Input ~ 0
LI
Text HLabel 5350 4700 0    50   Input ~ 0
~CLK4M
Text HLabel 5350 9600 0    50   Input ~ 0
~CLK4M
Text HLabel 5500 1900 0    50   Input ~ 0
SPRITE-X-READY
Text HLabel 6400 2050 0    50   Input ~ 0
~ATTR-YFLIP
Text HLabel 6400 6950 0    50   Input ~ 0
~ATTR-XFLIP
Text HLabel 6550 5750 0    50   Input ~ 0
~SPRITE-T
Text HLabel 6550 10650 0    50   Input ~ 0
~SPRITE-T
Text HLabel 10400 2000 0    50   Input ~ 0
~COLOUR[0..4]
Text HLabel 10400 2950 0    50   Input ~ 0
~TILE-BASE[0..7]
Text HLabel 10650 6500 0    50   Input ~ 0
COL[5..8]
Text HLabel 10950 7150 0    50   Input ~ 0
~SPRITE-T
Text HLabel 11300 1400 0    50   Input ~ 0
~LOOKUP
Text HLabel 11300 1500 0    50   Input ~ 0
~YFLIP
Text HLabel 11300 1600 0    50   Input ~ 0
~XFLIP
Text HLabel 13050 1300 2    50   3State ~ 0
_CPC[0..0]
Text HLabel 13050 1500 2    50   3State ~ 0
_YFLIP
Text HLabel 13050 1600 2    50   3State ~ 0
_XFLIP
Text HLabel 13050 2000 2    50   3State ~ 0
_CB[0..4]
Text HLabel 13050 7200 2    50   3State ~ 0
ROMA-Y[0..3]
Text HLabel 13200 5800 2    50   3State ~ 0
GFX-ADDR[4..19]
$Comp
L power:GND #PWR0167
U 1 1 61118D07
P 7050 6800
F 0 "#PWR0167" H 7050 6550 50  0001 C CNN
F 1 "GND" H 7055 6627 50  0000 C CNN
F 2 "" H 7050 6800 50  0001 C CNN
F 3 "" H 7050 6800 50  0001 C CNN
	1    7050 6800
	1    0    0    -1  
$EndComp
$Comp
L power:GND #PWR0166
U 1 1 61118CF6
P 7250 9550
F 0 "#PWR0166" H 7250 9300 50  0001 C CNN
F 1 "GND" H 7255 9377 50  0000 C CNN
F 2 "" H 7250 9550 50  0001 C CNN
F 3 "" H 7250 9550 50  0001 C CNN
	1    7250 9550
	1    0    0    -1  
$EndComp
$Comp
L A5C:XNOR02 UBB157
U 1 1 61118CEA
P 6900 2600
F 0 "UBB157" H 6925 2867 50  0000 C CNN
F 1 "XNOR02" H 6925 2776 50  0000 C CNN
F 2 "" H 6925 2600 50  0001 C CNN
F 3 "" H 6925 2600 50  0001 C CNN
	1    6900 2600
	1    0    0    -1  
$EndComp
$Comp
L A5C:XNOR02 UBB151
U 1 1 61118CEB
P 6900 3250
F 0 "UBB151" H 6925 3517 50  0000 C CNN
F 1 "XNOR02" H 6925 3426 50  0000 C CNN
F 2 "" H 6925 3250 50  0001 C CNN
F 3 "" H 6925 3250 50  0001 C CNN
	1    6900 3250
	1    0    0    -1  
$EndComp
$Comp
L A5C:XNOR02 UBB160
U 1 1 61118CF1
P 6900 3900
F 0 "UBB160" H 6925 4167 50  0000 C CNN
F 1 "XNOR02" H 6925 4076 50  0000 C CNN
F 2 "" H 6925 3900 50  0001 C CNN
F 3 "" H 6925 3900 50  0001 C CNN
	1    6900 3900
	1    0    0    -1  
$EndComp
$Comp
L A5C:XOR02 UBB65
U 1 1 61118CF2
P 6900 4550
F 0 "UBB65" H 6925 4817 50  0000 C CNN
F 1 "XOR02" H 6925 4726 50  0000 C CNN
F 2 "" H 6900 4550 50  0001 C CNN
F 3 "" H 6900 4550 50  0001 C CNN
	1    6900 4550
	1    0    0    -1  
$EndComp
$Comp
L A5C:XNOR02 UAD461
U 1 1 61118D06
P 6900 7500
F 0 "UAD461" H 6925 7767 50  0000 C CNN
F 1 "XNOR02" H 6925 7676 50  0000 C CNN
F 2 "" H 6925 7500 50  0001 C CNN
F 3 "" H 6925 7500 50  0001 C CNN
	1    6900 7500
	1    0    0    -1  
$EndComp
$Comp
L A5C:XNOR02 UAD443
U 1 1 61118D0B
P 6900 8150
F 0 "UAD443" H 6925 8417 50  0000 C CNN
F 1 "XNOR02" H 6925 8326 50  0000 C CNN
F 2 "" H 6925 8150 50  0001 C CNN
F 3 "" H 6925 8150 50  0001 C CNN
	1    6900 8150
	1    0    0    -1  
$EndComp
$Comp
L A5C:XNOR02 UAD446
U 1 1 61118D0A
P 6900 8800
F 0 "UAD446" H 6925 9067 50  0000 C CNN
F 1 "XNOR02" H 6925 8976 50  0000 C CNN
F 2 "" H 6925 8800 50  0001 C CNN
F 3 "" H 6925 8800 50  0001 C CNN
	1    6900 8800
	1    0    0    -1  
$EndComp
$Comp
L A5C:XOR02 UAD507
U 1 1 61118CF5
P 6900 9450
F 0 "UAD507" H 6925 9717 50  0000 C CNN
F 1 "XOR02" H 6925 9626 50  0000 C CNN
F 2 "" H 6900 9450 50  0001 C CNN
F 3 "" H 6900 9450 50  0001 C CNN
	1    6900 9450
	1    0    0    -1  
$EndComp
$Comp
L A5C:NOR02 UAD500
U 1 1 61118CE6
P 7300 1850
F 0 "UAD500" H 7325 2117 50  0000 C CNN
F 1 "NOR02" H 7325 2026 50  0000 C CNN
F 2 "" H 7300 1850 50  0001 C CNN
F 3 "" H 7300 1850 50  0001 C CNN
	1    7300 1850
	1    0    0    -1  
$EndComp
$Comp
L A5C:NOR02 UAD504
U 1 1 61118D05
P 7300 6750
F 0 "UAD504" H 7325 7017 50  0000 C CNN
F 1 "NOR02" H 7325 6926 50  0000 C CNN
F 2 "" H 7300 6750 50  0001 C CNN
F 3 "" H 7300 6750 50  0001 C CNN
	1    7300 6750
	1    0    0    -1  
$EndComp
$Comp
L A5C:NAND02 UBB170
U 1 1 61118CE8
P 8000 2650
F 0 "UBB170" H 8025 2917 50  0000 C CNN
F 1 "NAND02" H 8025 2826 50  0000 C CNN
F 2 "" H 8000 2650 50  0001 C CNN
F 3 "" H 8000 2650 50  0001 C CNN
	1    8000 2650
	1    0    0    -1  
$EndComp
$Comp
L A5C:NOR02 UBB68
U 1 1 61118CF0
P 8000 4600
F 0 "UBB68" H 8025 4867 50  0000 C CNN
F 1 "NOR02" H 8025 4776 50  0000 C CNN
F 2 "" H 8000 4600 50  0001 C CNN
F 3 "" H 8000 4600 50  0001 C CNN
	1    8000 4600
	1    0    0    -1  
$EndComp
$Comp
L A5C:NAND02 UAD329
U 1 1 61118D08
P 8000 7550
F 0 "UAD329" H 8025 7817 50  0000 C CNN
F 1 "NAND02" H 8025 7726 50  0000 C CNN
F 2 "" H 8000 7550 50  0001 C CNN
F 3 "" H 8000 7550 50  0001 C CNN
	1    8000 7550
	1    0    0    -1  
$EndComp
$Comp
L A5C:NOR02 UAD510
U 1 1 61118CF4
P 8000 9500
F 0 "UAD510" H 8025 9767 50  0000 C CNN
F 1 "NOR02" H 8025 9676 50  0000 C CNN
F 2 "" H 8000 9500 50  0001 C CNN
F 3 "" H 8000 9500 50  0001 C CNN
	1    8000 9500
	1    0    0    -1  
$EndComp
$Comp
L A5C:XOR02 UBA155
U 1 1 61118CE7
P 8800 2200
F 0 "UBA155" H 8825 2467 50  0000 C CNN
F 1 "XOR02" H 8825 2376 50  0000 C CNN
F 2 "" H 8800 2200 50  0001 C CNN
F 3 "" H 8800 2200 50  0001 C CNN
	1    8800 2200
	1    0    0    -1  
$EndComp
$Comp
L A5C:XNOR02 UBC147
U 1 1 61118CEE
P 8800 2700
F 0 "UBC147" H 8825 2967 50  0000 C CNN
F 1 "XNOR02" H 8825 2876 50  0000 C CNN
F 2 "" H 8825 2700 50  0001 C CNN
F 3 "" H 8825 2700 50  0001 C CNN
	1    8800 2700
	1    0    0    -1  
$EndComp
$Comp
L A5C:XNOR02 UBA165
U 1 1 61118CEC
P 8800 3400
F 0 "UBA165" H 8825 3667 50  0000 C CNN
F 1 "XNOR02" H 8825 3576 50  0000 C CNN
F 2 "" H 8825 3400 50  0001 C CNN
F 3 "" H 8825 3400 50  0001 C CNN
	1    8800 3400
	1    0    0    -1  
$EndComp
$Comp
L A5C:XNOR02 UBB116
U 1 1 61118CED
P 8800 4100
F 0 "UBB116" H 8825 4367 50  0000 C CNN
F 1 "XNOR02" H 8825 4276 50  0000 C CNN
F 2 "" H 8825 4100 50  0001 C CNN
F 3 "" H 8825 4100 50  0001 C CNN
	1    8800 4100
	1    0    0    -1  
$EndComp
$Comp
L A5C:XOR02 UAC276
U 1 1 61118D0F
P 8800 7100
F 0 "UAC276" H 8825 7367 50  0000 C CNN
F 1 "XOR02" H 8825 7276 50  0000 C CNN
F 2 "" H 8800 7100 50  0001 C CNN
F 3 "" H 8800 7100 50  0001 C CNN
	1    8800 7100
	1    0    0    -1  
$EndComp
$Comp
L A5C:XNOR02 UAD179
U 1 1 61118D0E
P 8800 7600
F 0 "UAD179" H 8825 7867 50  0000 C CNN
F 1 "XNOR02" H 8825 7776 50  0000 C CNN
F 2 "" H 8825 7600 50  0001 C CNN
F 3 "" H 8825 7600 50  0001 C CNN
	1    8800 7600
	1    0    0    -1  
$EndComp
$Comp
L A5C:XNOR02 UAD214
U 1 1 61118D0D
P 8800 8300
F 0 "UAD214" H 8825 8567 50  0000 C CNN
F 1 "XNOR02" H 8825 8476 50  0000 C CNN
F 2 "" H 8825 8300 50  0001 C CNN
F 3 "" H 8825 8300 50  0001 C CNN
	1    8800 8300
	1    0    0    -1  
$EndComp
$Comp
L A5C:XNOR02 UAD303
U 1 1 61118D0C
P 8800 9000
F 0 "UAD303" H 8825 9267 50  0000 C CNN
F 1 "XNOR02" H 8825 9176 50  0000 C CNN
F 2 "" H 8825 9000 50  0001 C CNN
F 3 "" H 8825 9000 50  0001 C CNN
	1    8800 9000
	1    0    0    -1  
$EndComp
$Comp
L A5C:NAND03 UBB171
U 1 1 61118CE9
P 8000 3350
F 0 "UBB171" H 8025 3642 50  0000 C CNN
F 1 "NAND03" H 8025 3551 50  0000 C CNN
F 2 "" H 8000 3350 50  0001 C CNN
F 3 "" H 8000 3350 50  0001 C CNN
	1    8000 3350
	1    0    0    -1  
$EndComp
$Comp
L A5C:NAND03 UAD343
U 1 1 61118D09
P 8000 8250
F 0 "UAD343" H 8025 8542 50  0000 C CNN
F 1 "NAND03" H 8025 8451 50  0000 C CNN
F 2 "" H 8000 8250 50  0001 C CNN
F 3 "" H 8000 8250 50  0001 C CNN
	1    8000 8250
	1    0    0    -1  
$EndComp
$Comp
L A5C:INV01 UBA108
U 1 1 61118CDD
P 3500 4350
F 0 "UBA108" H 3500 4667 50  0000 C CNN
F 1 "INV01" H 3500 4576 50  0000 C CNN
F 2 "" H 3500 4150 50  0001 C CNN
F 3 "" H 3500 4150 50  0001 C CNN
	1    3500 4350
	1    0    0    -1  
$EndComp
$Comp
L A5C:INV01 UAC152
U 1 1 61118CDF
P 3500 9250
F 0 "UAC152" H 3500 9567 50  0000 C CNN
F 1 "INV01" H 3500 9476 50  0000 C CNN
F 2 "" H 3500 9050 50  0001 C CNN
F 3 "" H 3500 9050 50  0001 C CNN
	1    3500 9250
	1    0    0    -1  
$EndComp
$Comp
L A5C:INV01 UAD485
U 1 1 61118CDE
P 4300 5500
F 0 "UAD485" H 4300 5817 50  0000 C CNN
F 1 "INV01" H 4300 5726 50  0000 C CNN
F 2 "" H 4300 5300 50  0001 C CNN
F 3 "" H 4300 5300 50  0001 C CNN
	1    4300 5500
	1    0    0    -1  
$EndComp
$Comp
L A5C:INV01 UAD271
U 1 1 61118D2D
P 5800 1900
F 0 "UAD271" H 5800 2217 50  0000 C CNN
F 1 "INV01" H 5800 2126 50  0000 C CNN
F 2 "" H 5800 1700 50  0001 C CNN
F 3 "" H 5800 1700 50  0001 C CNN
	1    5800 1900
	1    0    0    -1  
$EndComp
$Comp
L A5C:DFFCOO UAD467
U 1 1 61118D2B
P 5800 2550
F 0 "UAD467" H 5800 2915 50  0000 C CNN
F 1 "DFFCOO" H 5800 2824 50  0000 C CNN
F 2 "" H 5800 2550 50  0001 C CNN
F 3 "" H 5800 2550 50  0001 C CNN
	1    5800 2550
	1    0    0    -1  
$EndComp
$Comp
L A5C:DFFCOO UBC135
U 1 1 61118D2C
P 5800 3200
F 0 "UBC135" H 5800 3565 50  0000 C CNN
F 1 "DFFCOO" H 5800 3474 50  0000 C CNN
F 2 "" H 5800 3200 50  0001 C CNN
F 3 "" H 5800 3200 50  0001 C CNN
	1    5800 3200
	1    0    0    -1  
$EndComp
$Comp
L A5C:DFFCOO UBA63
U 1 1 61118D26
P 5800 3850
F 0 "UBA63" H 5800 4215 50  0000 C CNN
F 1 "DFFCOO" H 5800 4124 50  0000 C CNN
F 2 "" H 5800 3850 50  0001 C CNN
F 3 "" H 5800 3850 50  0001 C CNN
	1    5800 3850
	1    0    0    -1  
$EndComp
$Comp
L A5C:DFFCOO UBB119
U 1 1 61118D27
P 5800 4500
F 0 "UBB119" H 5800 4865 50  0000 C CNN
F 1 "DFFCOO" H 5800 4774 50  0000 C CNN
F 2 "" H 5800 4500 50  0001 C CNN
F 3 "" H 5800 4500 50  0001 C CNN
	1    5800 4500
	1    0    0    -1  
$EndComp
$Comp
L A5C:DFFCOO UAC298
U 1 1 61118CE0
P 5800 7450
F 0 "UAC298" H 5800 7815 50  0000 C CNN
F 1 "DFFCOO" H 5800 7724 50  0000 C CNN
F 2 "" H 5800 7450 50  0001 C CNN
F 3 "" H 5800 7450 50  0001 C CNN
	1    5800 7450
	1    0    0    -1  
$EndComp
$Comp
L A5C:DFFCOO UAD164
U 1 1 61118CE1
P 5800 8100
F 0 "UAD164" H 5800 8465 50  0000 C CNN
F 1 "DFFCOO" H 5800 8374 50  0000 C CNN
F 2 "" H 5800 8100 50  0001 C CNN
F 3 "" H 5800 8100 50  0001 C CNN
	1    5800 8100
	1    0    0    -1  
$EndComp
$Comp
L A5C:DFFCOO UAD196
U 1 1 61118CE2
P 5800 8750
F 0 "UAD196" H 5800 9115 50  0000 C CNN
F 1 "DFFCOO" H 5800 9024 50  0000 C CNN
F 2 "" H 5800 8750 50  0001 C CNN
F 3 "" H 5800 8750 50  0001 C CNN
	1    5800 8750
	1    0    0    -1  
$EndComp
$Comp
L A5C:DFFCOO UAD346
U 1 1 61118CFA
P 5800 9400
F 0 "UAD346" H 5800 9765 50  0000 C CNN
F 1 "DFFCOO" H 5800 9674 50  0000 C CNN
F 2 "" H 5800 9400 50  0001 C CNN
F 3 "" H 5800 9400 50  0001 C CNN
	1    5800 9400
	1    0    0    -1  
$EndComp
$Comp
L A5C:NAND04 UBB166
U 1 1 61118CEF
P 8050 4050
F 0 "UBB166" H 8050 4392 50  0000 C CNN
F 1 "NAND04" H 8050 4301 50  0000 C CNN
F 2 "" H 8050 3800 50  0001 C CNN
F 3 "" H 8050 3800 50  0001 C CNN
	1    8050 4050
	1    0    0    -1  
$EndComp
$Comp
L A5C:NAND04 UAD340
U 1 1 61118CF3
P 8050 8950
F 0 "UAD340" H 8050 9292 50  0000 C CNN
F 1 "NAND04" H 8050 9201 50  0000 C CNN
F 2 "" H 8050 8700 50  0001 C CNN
F 3 "" H 8050 8700 50  0001 C CNN
	1    8050 8950
	1    0    0    -1  
$EndComp
$Comp
L A5C:NAND04 UBB163
U 1 1 61118CE5
P 8600 4800
F 0 "UBB163" H 8600 5142 50  0000 C CNN
F 1 "NAND04" H 8600 5051 50  0000 C CNN
F 2 "" H 8600 4550 50  0001 C CNN
F 3 "" H 8600 4550 50  0001 C CNN
	1    8600 4800
	1    0    0    -1  
$EndComp
$Comp
L A5C:NAND04 UAD464
U 1 1 61118CFC
P 8600 9700
F 0 "UAD464" H 8600 10042 50  0000 C CNN
F 1 "NAND04" H 8600 9951 50  0000 C CNN
F 2 "" H 8600 9450 50  0001 C CNN
F 3 "" H 8600 9450 50  0001 C CNN
	1    8600 9700
	1    0    0    -1  
$EndComp
$Comp
L A5C:AOI22 UBA119
U 1 1 61118D2A
P 4900 2400
F 0 "UBA119" H 4925 2717 50  0000 C CNN
F 1 "AOI22" H 4925 2626 50  0000 C CNN
F 2 "" H 5050 2400 50  0001 C CNN
F 3 "" H 5050 2400 50  0001 C CNN
	1    4900 2400
	1    0    0    -1  
$EndComp
$Comp
L A5C:AOI22 UBC119
U 1 1 61118D28
P 4900 3050
F 0 "UBC119" H 4925 3367 50  0000 C CNN
F 1 "AOI22" H 4925 3276 50  0000 C CNN
F 2 "" H 5050 3050 50  0001 C CNN
F 3 "" H 5050 3050 50  0001 C CNN
	1    4900 3050
	1    0    0    -1  
$EndComp
$Comp
L A5C:AOI22 UBA90
U 1 1 61118D29
P 4900 3700
F 0 "UBA90" H 4925 4017 50  0000 C CNN
F 1 "AOI22" H 4925 3926 50  0000 C CNN
F 2 "" H 5050 3700 50  0001 C CNN
F 3 "" H 5050 3700 50  0001 C CNN
	1    4900 3700
	1    0    0    -1  
$EndComp
$Comp
L A5C:AOI22 UBB113
U 1 1 61118D25
P 4900 4350
F 0 "UBB113" H 4925 4667 50  0000 C CNN
F 1 "AOI22" H 4925 4576 50  0000 C CNN
F 2 "" H 5050 4350 50  0001 C CNN
F 3 "" H 5050 4350 50  0001 C CNN
	1    4900 4350
	1    0    0    -1  
$EndComp
$Comp
L A5C:AOI22 UAC270
U 1 1 61118CE3
P 4900 7300
F 0 "UAC270" H 4925 7617 50  0000 C CNN
F 1 "AOI22" H 4925 7526 50  0000 C CNN
F 2 "" H 5050 7300 50  0001 C CNN
F 3 "" H 5050 7300 50  0001 C CNN
	1    4900 7300
	1    0    0    -1  
$EndComp
$Comp
L A5C:AOI22 UAD174
U 1 1 61118CF9
P 4900 7950
F 0 "UAD174" H 4925 8267 50  0000 C CNN
F 1 "AOI22" H 4925 8176 50  0000 C CNN
F 2 "" H 5050 7950 50  0001 C CNN
F 3 "" H 5050 7950 50  0001 C CNN
	1    4900 7950
	1    0    0    -1  
$EndComp
$Comp
L A5C:AOI22 UAD168
U 1 1 61118CF8
P 4900 8600
F 0 "UAD168" H 4925 8917 50  0000 C CNN
F 1 "AOI22" H 4925 8826 50  0000 C CNN
F 2 "" H 5050 8600 50  0001 C CNN
F 3 "" H 5050 8600 50  0001 C CNN
	1    4900 8600
	1    0    0    -1  
$EndComp
$Comp
L A5C:AOI22 UAD260
U 1 1 61118CF7
P 4900 9250
F 0 "UAD260" H 4925 9567 50  0000 C CNN
F 1 "AOI22" H 4925 9476 50  0000 C CNN
F 2 "" H 5050 9250 50  0001 C CNN
F 3 "" H 5050 9250 50  0001 C CNN
	1    4900 9250
	1    0    0    -1  
$EndComp
$Comp
L A5C:M367C UBI0
U 1 1 61118CE4
P 7150 5550
F 0 "UBI0" H 7150 6065 50  0000 C CNN
F 1 "M367C" H 7150 5974 50  0000 C CNN
F 2 "" H 7450 5350 50  0001 C CNN
F 3 "" H 7450 5350 50  0001 C CNN
	1    7150 5550
	1    0    0    -1  
$EndComp
$Comp
L A5C:M367C UEE254
U 1 1 79264D39
P 7150 10450
F 0 "UEE254" H 7150 10965 50  0000 C CNN
F 1 "M367C" H 7150 10874 50  0000 C CNN
F 2 "" H 7450 10250 50  0001 C CNN
F 3 "" H 7450 10250 50  0001 C CNN
	1    7150 10450
	1    0    0    -1  
$EndComp
$Comp
L A5C:M368C UCC?
U 1 1 623A9CB7
P 11800 1650
AR Path="/604B5523/623A9CB7" Ref="UCC?"  Part="1" 
AR Path="/623A9CB7" Ref="UCC?"  Part="1" 
AR Path="/611554F0/623A9CB7" Ref="UCC?"  Part="1" 
AR Path="/6126D1C9/623A9CB7" Ref="UCC137"  Part="1" 
AR Path="/612CA5FA/612CAD7D/623A9CB7" Ref="UCC137"  Part="1" 
F 0 "UCC137" H 11800 2160 50  0000 C CNN
F 1 "M368C" H 11800 2070 50  0000 C CNN
F 2 "" H 12100 1450 50  0001 C CNN
F 3 "" H 12100 1450 50  0001 C CNN
	1    11800 1650
	1    0    0    -1  
$EndComp
$Comp
L A5C:M368C UCC?
U 1 1 623A9CB1
P 11800 2550
AR Path="/604B5523/623A9CB1" Ref="UCC?"  Part="1" 
AR Path="/623A9CB1" Ref="UCC?"  Part="1" 
AR Path="/611554F0/623A9CB1" Ref="UCC?"  Part="1" 
AR Path="/6126D1C9/623A9CB1" Ref="UCC33"  Part="1" 
AR Path="/612CA5FA/612CAD7D/623A9CB1" Ref="UCC33"  Part="1" 
F 0 "UCC33" H 11800 3060 50  0000 C CNN
F 1 "M368C" H 11800 2970 50  0000 C CNN
F 2 "" H 12100 2350 50  0001 C CNN
F 3 "" H 12100 2350 50  0001 C CNN
	1    11800 2550
	1    0    0    -1  
$EndComp
$Comp
L A5C:M368C UCC?
U 1 1 623F8947
P 11800 3450
AR Path="/604B5523/623F8947" Ref="UCC?"  Part="1" 
AR Path="/623F8947" Ref="UCC?"  Part="1" 
AR Path="/6116C2BE/623F8947" Ref="UCC?"  Part="1" 
AR Path="/6126D1C9/623F8947" Ref="UCA129"  Part="1" 
AR Path="/612CA5FA/612CAD7D/623F8947" Ref="UCA129"  Part="1" 
F 0 "UCA129" H 11800 3960 50  0000 C CNN
F 1 "M368C" H 11800 3870 50  0000 C CNN
F 2 "" H 12100 3250 50  0001 C CNN
F 3 "" H 12100 3250 50  0001 C CNN
	1    11800 3450
	1    0    0    -1  
$EndComp
$Comp
L A5C:M368C UCC?
U 1 1 623F8941
P 11800 4500
AR Path="/604B5523/623F8941" Ref="UCC?"  Part="1" 
AR Path="/623F8941" Ref="UCC?"  Part="1" 
AR Path="/6116C2BE/623F8941" Ref="UCC?"  Part="1" 
AR Path="/6126D1C9/623F8941" Ref="UCC41"  Part="1" 
AR Path="/612CA5FA/612CAD7D/623F8941" Ref="UCC41"  Part="1" 
F 0 "UCC41" H 11800 5010 50  0000 C CNN
F 1 "M368C" H 11800 4920 50  0000 C CNN
F 2 "" H 12100 4300 50  0001 C CNN
F 3 "" H 12100 4300 50  0001 C CNN
	1    11800 4500
	1    0    0    -1  
$EndComp
$Comp
L A5C:M367C UEH254
U 1 1 61118DB4
P 11800 6950
F 0 "UEH254" H 11800 7465 50  0000 C CNN
F 1 "M367C" H 11800 7374 50  0000 C CNN
F 2 "" H 12100 6750 50  0001 C CNN
F 3 "" H 12100 6750 50  0001 C CNN
	1    11800 6950
	1    0    0    -1  
$EndComp
Wire Bus Line
	3200 2100 3200 3800
Wire Bus Line
	3200 7000 3200 8700
Wire Bus Line
	8300 5400 8300 5800
Wire Bus Line
	8300 9950 8300 10400
Wire Bus Line
	10500 2000 10500 2500
Wire Bus Line
	10750 6500 10750 6900
Wire Bus Line
	12950 2000 12950 2500
Wire Bus Line
	12950 6800 12950 7200
Wire Bus Line
	10500 2950 10500 4450
Wire Bus Line
	12950 3300 12950 5800
$EndSCHEMATC
