EESchema Schematic File Version 4
EELAYER 30 0
EELAYER END
$Descr A4 11693 8268
encoding utf-8
Sheet 28 83
Title "CPS Reverse Engineering: DL-0311"
Date "2021-09-12"
Rev ""
Comp ""
Comment1 ""
Comment2 ""
Comment3 "Licence: CC-BY"
Comment4 "Author: Loïc *WydD* Petit"
$EndDescr
Connection ~ 3700 2450
Connection ~ 3700 4250
Connection ~ 3700 3350
Connection ~ 3700 6050
Connection ~ 3700 5150
Connection ~ 3700 6650
Connection ~ 8100 3050
Connection ~ 8100 5550
Connection ~ 8100 4850
Connection ~ 8100 3950
Connection ~ 9700 3200
Connection ~ 3700 7200
Connection ~ 3000 7400
Entry Wire Line
	3000 1000 3100 1100
Entry Wire Line
	3000 1100 3100 1200
Entry Wire Line
	3000 1200 3100 1300
Entry Wire Line
	3000 1300 3100 1400
Entry Wire Line
	3000 1900 3100 2000
Entry Wire Line
	3000 2000 3100 2100
Entry Wire Line
	3000 2100 3100 2200
Entry Wire Line
	3000 2200 3100 2300
Entry Wire Line
	3000 2800 3100 2900
Entry Wire Line
	3000 2900 3100 3000
Entry Wire Line
	3000 3000 3100 3100
Entry Wire Line
	3000 3100 3100 3200
Entry Wire Line
	3000 3700 3100 3800
Entry Wire Line
	3000 3800 3100 3900
Entry Wire Line
	3000 3900 3100 4000
Entry Wire Line
	3000 4000 3100 4100
Entry Wire Line
	3000 4600 3100 4700
Entry Wire Line
	3000 4700 3100 4800
Entry Wire Line
	3000 4800 3100 4900
Entry Wire Line
	3000 4900 3100 5000
Entry Wire Line
	3000 5500 3100 5600
Entry Wire Line
	3000 5600 3100 5700
Entry Wire Line
	3000 5700 3100 5800
Entry Wire Line
	3000 5800 3100 5900
Entry Wire Line
	3000 6350 3100 6450
Entry Wire Line
	3000 6900 3100 7000
Entry Wire Line
	3000 7300 3100 7200
Entry Wire Line
	5200 1100 5300 1000
Entry Wire Line
	5200 1200 5300 1100
Entry Wire Line
	5200 1300 5300 1200
Entry Wire Line
	5200 1400 5300 1300
Entry Wire Line
	5200 2000 5300 1900
Entry Wire Line
	5200 2100 5300 2000
Entry Wire Line
	5200 2200 5300 2100
Entry Wire Line
	5200 2300 5300 2200
Entry Wire Line
	5200 2900 5300 2800
Entry Wire Line
	5200 3000 5300 2900
Entry Wire Line
	5200 3100 5300 3000
Entry Wire Line
	5200 3200 5300 3100
Entry Wire Line
	5200 3800 5300 3700
Entry Wire Line
	5200 3900 5300 3800
Entry Wire Line
	5200 4000 5300 3900
Entry Wire Line
	5200 4100 5300 4000
Entry Wire Line
	5200 4700 5300 4600
Entry Wire Line
	5200 4800 5300 4700
Entry Wire Line
	5200 4900 5300 4800
Entry Wire Line
	5200 5000 5300 4900
Entry Wire Line
	5200 5600 5300 5500
Entry Wire Line
	5200 5700 5300 5600
Entry Wire Line
	5200 5800 5300 5900
Entry Wire Line
	5200 5900 5300 6000
Entry Wire Line
	5200 6450 5300 6550
Entry Wire Line
	5200 7000 5300 7100
Entry Wire Line
	7600 1600 7700 1700
Entry Wire Line
	7600 1700 7700 1800
Entry Wire Line
	7600 1800 7700 1900
Entry Wire Line
	7600 1900 7700 2000
Entry Wire Line
	7600 2500 7700 2600
Entry Wire Line
	7600 2600 7700 2700
Entry Wire Line
	7600 2700 7700 2800
Entry Wire Line
	7600 2800 7700 2900
Entry Wire Line
	7600 3400 7700 3500
Entry Wire Line
	7600 3500 7700 3600
Entry Wire Line
	7600 3600 7700 3700
Entry Wire Line
	7600 3700 7700 3800
Entry Wire Line
	7600 4300 7700 4400
Entry Wire Line
	7600 4400 7700 4500
Entry Wire Line
	7600 4500 7700 4600
Entry Wire Line
	7600 4600 7700 4700
Entry Wire Line
	7600 5200 7700 5300
Entry Wire Line
	7600 5650 7700 5550
Entry Wire Line
	9600 1700 9700 1800
Entry Wire Line
	9600 1800 9700 1900
Entry Wire Line
	9600 1900 9700 2000
Entry Wire Line
	9600 2000 9700 2100
Entry Wire Line
	9600 2600 9700 2700
Entry Wire Line
	9600 2700 9700 2800
Entry Wire Line
	9600 2800 9700 2900
Entry Wire Line
	9600 2900 9700 3000
Entry Wire Line
	9600 3500 9700 3400
Entry Wire Line
	9600 3600 9700 3500
Entry Wire Line
	9600 3700 9700 3600
Entry Wire Line
	9600 3800 9700 3700
Entry Wire Line
	9600 4400 9700 4300
Entry Wire Line
	9600 4500 9700 4400
Entry Wire Line
	9600 4600 9700 4500
Entry Wire Line
	9600 4700 9700 4600
Entry Wire Line
	9600 5300 9700 5200
Wire Wire Line
	3100 1100 3800 1100
Wire Wire Line
	3100 1200 3800 1200
Wire Wire Line
	3100 1300 3800 1300
Wire Wire Line
	3100 1400 3800 1400
Wire Wire Line
	3100 2000 3800 2000
Wire Wire Line
	3100 2100 3800 2100
Wire Wire Line
	3100 2200 3800 2200
Wire Wire Line
	3100 2300 3800 2300
Wire Wire Line
	3100 2900 3800 2900
Wire Wire Line
	3100 3000 3800 3000
Wire Wire Line
	3100 3100 3800 3100
Wire Wire Line
	3100 3200 3800 3200
Wire Wire Line
	3100 3800 3800 3800
Wire Wire Line
	3100 3900 3800 3900
Wire Wire Line
	3100 4000 3800 4000
Wire Wire Line
	3100 4100 3800 4100
Wire Wire Line
	3100 4700 3800 4700
Wire Wire Line
	3100 4800 3800 4800
Wire Wire Line
	3100 4900 3800 4900
Wire Wire Line
	3100 5000 3800 5000
Wire Wire Line
	3100 5600 3800 5600
Wire Wire Line
	3100 5700 3800 5700
Wire Wire Line
	3100 5800 3800 5800
Wire Wire Line
	3100 5900 3800 5900
Wire Wire Line
	3100 6450 4100 6450
Wire Wire Line
	3100 7000 4100 7000
Wire Wire Line
	3700 1550 3800 1550
Wire Wire Line
	3700 2450 3700 1550
Wire Wire Line
	3700 3350 3700 2450
Wire Wire Line
	3700 4250 3700 3350
Wire Wire Line
	3700 5150 3700 4250
Wire Wire Line
	3700 6050 3700 5150
Wire Wire Line
	3700 6050 3700 6650
Wire Wire Line
	3700 6650 3700 7200
Wire Wire Line
	3700 7200 3100 7200
Wire Wire Line
	3700 7200 4500 7200
Wire Wire Line
	3800 2450 3700 2450
Wire Wire Line
	3800 3350 3700 3350
Wire Wire Line
	3800 4250 3700 4250
Wire Wire Line
	3800 5150 3700 5150
Wire Wire Line
	3800 6050 3700 6050
Wire Wire Line
	4400 6550 4500 6550
Wire Wire Line
	4400 7100 4500 7100
Wire Wire Line
	4500 6450 5200 6450
Wire Wire Line
	4500 6650 3700 6650
Wire Wire Line
	4500 6650 4500 6550
Wire Wire Line
	4500 7000 5200 7000
Wire Wire Line
	4500 7200 4500 7100
Wire Wire Line
	5200 1100 4800 1100
Wire Wire Line
	5200 1200 4800 1200
Wire Wire Line
	5200 1300 4800 1300
Wire Wire Line
	5200 1400 4800 1400
Wire Wire Line
	5200 2000 4800 2000
Wire Wire Line
	5200 2100 4800 2100
Wire Wire Line
	5200 2200 4800 2200
Wire Wire Line
	5200 2300 4800 2300
Wire Wire Line
	5200 2900 4800 2900
Wire Wire Line
	5200 3000 4800 3000
Wire Wire Line
	5200 3100 4800 3100
Wire Wire Line
	5200 3200 4800 3200
Wire Wire Line
	5200 3800 4800 3800
Wire Wire Line
	5200 3900 4800 3900
Wire Wire Line
	5200 4000 4800 4000
Wire Wire Line
	5200 4100 4800 4100
Wire Wire Line
	5200 4700 4800 4700
Wire Wire Line
	5200 4800 4800 4800
Wire Wire Line
	5200 4900 4800 4900
Wire Wire Line
	5200 5000 4800 5000
Wire Wire Line
	5200 5600 4800 5600
Wire Wire Line
	5200 5700 4800 5700
Wire Wire Line
	5200 5800 4800 5800
Wire Wire Line
	5200 5900 4800 5900
Wire Wire Line
	7700 1700 8200 1700
Wire Wire Line
	7700 1800 8200 1800
Wire Wire Line
	7700 1900 8200 1900
Wire Wire Line
	7700 2000 8200 2000
Wire Wire Line
	7700 2600 8200 2600
Wire Wire Line
	7700 2700 8200 2700
Wire Wire Line
	7700 2800 8200 2800
Wire Wire Line
	7700 2900 8200 2900
Wire Wire Line
	7700 3500 8200 3500
Wire Wire Line
	7700 3600 8200 3600
Wire Wire Line
	7700 3700 8200 3700
Wire Wire Line
	7700 3800 8200 3800
Wire Wire Line
	7700 4400 8200 4400
Wire Wire Line
	7700 4500 8200 4500
Wire Wire Line
	7700 4600 8200 4600
Wire Wire Line
	7700 4700 8200 4700
Wire Wire Line
	7700 5300 8500 5300
Wire Wire Line
	7700 5550 8100 5550
Wire Wire Line
	8100 2150 8100 3050
Wire Wire Line
	8100 3050 8100 3950
Wire Wire Line
	8100 3050 8200 3050
Wire Wire Line
	8100 3950 8100 4850
Wire Wire Line
	8100 5550 8100 4850
Wire Wire Line
	8100 5550 9000 5550
Wire Wire Line
	8200 2150 8100 2150
Wire Wire Line
	8200 3950 8100 3950
Wire Wire Line
	8200 4850 8100 4850
Wire Wire Line
	8800 5400 9000 5400
Wire Wire Line
	8900 5300 9600 5300
Wire Wire Line
	9000 5400 9000 5550
Wire Wire Line
	9200 1700 9600 1700
Wire Wire Line
	9200 1800 9600 1800
Wire Wire Line
	9200 1900 9600 1900
Wire Wire Line
	9200 2000 9600 2000
Wire Wire Line
	9200 2600 9600 2600
Wire Wire Line
	9200 2700 9600 2700
Wire Wire Line
	9200 2800 9600 2800
Wire Wire Line
	9200 2900 9600 2900
Wire Wire Line
	9200 3500 9600 3500
Wire Wire Line
	9200 3600 9600 3600
Wire Wire Line
	9200 3700 9600 3700
Wire Wire Line
	9200 3800 9600 3800
Wire Wire Line
	9200 4400 9600 4400
Wire Wire Line
	9200 4500 9600 4500
Wire Wire Line
	9200 4600 9600 4600
Wire Wire Line
	9200 4700 9600 4700
Wire Bus Line
	3000 850  2900 850 
Wire Bus Line
	3000 4500 2900 4500
Wire Bus Line
	3000 7300 3000 7400
Wire Bus Line
	3000 7400 2900 7400
Wire Bus Line
	3000 7400 6550 7400
Wire Bus Line
	5300 900  5400 900 
Wire Bus Line
	5300 7200 5400 7200
Wire Bus Line
	6550 5650 7600 5650
Wire Bus Line
	6550 7400 6550 5650
Wire Bus Line
	7600 1500 7500 1500
Wire Bus Line
	7600 3250 7500 3250
Wire Bus Line
	9700 3200 9850 3200
Text Label 3150 1100 0    50   ~ 0
~RAM-TILE0
Text Label 3150 1200 0    50   ~ 0
~RAM-TILE1
Text Label 3150 1300 0    50   ~ 0
~RAM-TILE2
Text Label 3150 1400 0    50   ~ 0
~RAM-TILE3
Text Label 3150 2000 0    50   ~ 0
~RAM-TILE4
Text Label 3150 2100 0    50   ~ 0
~RAM-TILE5
Text Label 3150 2200 0    50   ~ 0
~RAM-TILE6
Text Label 3150 2300 0    50   ~ 0
~RAM-TILE7
Text Label 3150 2900 0    50   ~ 0
~RAM-TILE8
Text Label 3150 3000 0    50   ~ 0
~RAM-TILE9
Text Label 3150 3100 0    50   ~ 0
~RAM-TILE10
Text Label 3150 3200 0    50   ~ 0
~RAM-TILE11
Text Label 3150 3800 0    50   ~ 0
~RAM-TILE12
Text Label 3150 3900 0    50   ~ 0
~RAM-TILE13
Text Label 3150 4000 0    50   ~ 0
~RAM-TILE14
Text Label 3150 4100 0    50   ~ 0
~RAM-TILE15
Text Label 3150 4700 0    50   ~ 0
~RAM-ATTR0
Text Label 3150 4800 0    50   ~ 0
~RAM-ATTR1
Text Label 3150 4900 0    50   ~ 0
~RAM-ATTR2
Text Label 3150 5000 0    50   ~ 0
~RAM-ATTR3
Text Label 3150 5600 0    50   ~ 0
~RAM-ATTR4
Text Label 3150 5700 0    50   ~ 0
~RAM-ATTR5
Text Label 3150 5800 0    50   ~ 0
~RAM-ATTR6
Text Label 3150 5900 0    50   ~ 0
~RAM-ATTR7
Text Label 3150 6450 0    50   ~ 0
~RAM-ATTR8
Text Label 3150 7000 0    50   ~ 0
~RAM-ATTR9
Text Label 3150 7200 0    50   ~ 0
~DEBUG3
Text Label 4850 1100 0    50   ~ 0
ROMA0
Text Label 4850 1200 0    50   ~ 0
ROMA1
Text Label 4850 1300 0    50   ~ 0
ROMA2
Text Label 4850 1400 0    50   ~ 0
ROMA3
Text Label 4850 2000 0    50   ~ 0
ROMA4
Text Label 4850 2100 0    50   ~ 0
ROMA5
Text Label 4850 2200 0    50   ~ 0
ROMA6
Text Label 4850 2300 0    50   ~ 0
ROMA7
Text Label 4850 2900 0    50   ~ 0
ROMA8
Text Label 4850 3000 0    50   ~ 0
ROMA9
Text Label 4850 3100 0    50   ~ 0
ROMA10
Text Label 4850 3200 0    50   ~ 0
ROMA11
Text Label 4850 3800 0    50   ~ 0
ROMA12
Text Label 4850 3900 0    50   ~ 0
ROMA13
Text Label 4850 4000 0    50   ~ 0
ROMA14
Text Label 4850 4100 0    50   ~ 0
ROMA15
Text Label 4850 4700 0    50   ~ 0
ROMA16
Text Label 4850 4800 0    50   ~ 0
ROMA17
Text Label 4850 4900 0    50   ~ 0
ROMA18
Text Label 4850 5000 0    50   ~ 0
ROMA19
Text Label 4850 5600 0    50   ~ 0
ROMA20
Text Label 4850 5700 0    50   ~ 0
ROMA21
Text Label 4850 5800 0    50   ~ 0
CB0
Text Label 4850 5900 0    50   ~ 0
CB1
Text Label 4850 6450 0    50   ~ 0
CB2
Text Label 4850 7000 0    50   ~ 0
CB3
Text Label 7700 5550 0    50   ~ 0
~DEBUG2
Text Label 7750 1700 0    50   ~ 0
COL1
Text Label 7750 1800 0    50   ~ 0
COL2
Text Label 7750 1900 0    50   ~ 0
COL3
Text Label 7750 2000 0    50   ~ 0
COL4
Text Label 7750 2600 0    50   ~ 0
COL5
Text Label 7750 2700 0    50   ~ 0
COL6
Text Label 7750 2800 0    50   ~ 0
COL7
Text Label 7750 2900 0    50   ~ 0
COL8
Text Label 7750 3500 0    50   ~ 0
LINE0
Text Label 7750 3600 0    50   ~ 0
LINE1
Text Label 7750 3700 0    50   ~ 0
LINE2
Text Label 7750 3800 0    50   ~ 0
LINE3
Text Label 7750 4400 0    50   ~ 0
LINE4
Text Label 7750 4500 0    50   ~ 0
LINE5
Text Label 7750 4600 0    50   ~ 0
LINE6
Text Label 7750 4700 0    50   ~ 0
LINE7
Text Label 7750 5300 0    50   ~ 0
LINE8
Text Label 9250 1700 0    50   ~ 0
ROMA0
Text Label 9250 1800 0    50   ~ 0
ROMA1
Text Label 9250 1900 0    50   ~ 0
ROMA2
Text Label 9250 2000 0    50   ~ 0
ROMA3
Text Label 9250 2600 0    50   ~ 0
ROMA4
Text Label 9250 2700 0    50   ~ 0
ROMA5
Text Label 9250 2800 0    50   ~ 0
ROMA6
Text Label 9250 2900 0    50   ~ 0
ROMA7
Text Label 9250 3500 0    50   ~ 0
ROMA8
Text Label 9250 3600 0    50   ~ 0
ROMA9
Text Label 9250 3700 0    50   ~ 0
ROMA10
Text Label 9250 3800 0    50   ~ 0
ROMA11
Text Label 9250 4400 0    50   ~ 0
ROMA12
Text Label 9250 4500 0    50   ~ 0
ROMA13
Text Label 9250 4600 0    50   ~ 0
ROMA14
Text Label 9250 4700 0    50   ~ 0
ROMA15
Text Label 9250 5300 0    50   ~ 0
ROMA20
Text HLabel 2900 850  0    50   Input ~ 0
~RAM-TILE[0..15]
Text HLabel 2900 4500 0    50   Input ~ 0
~RAM-ATTR[0..9]
Text HLabel 2900 7400 0    50   Input ~ 0
~DEBUG[2..3]
Text HLabel 5400 900  2    50   3State ~ 0
ROMA[0..21]
Text HLabel 5400 7200 2    50   3State ~ 0
CB[0..3]
Text HLabel 7500 1500 0    50   Input ~ 0
COL[1..8]
Text HLabel 7500 3250 0    50   Input ~ 0
LINE[0..8]
Text HLabel 9850 3200 2    50   3State ~ 0
ROMA[0..21]
$Comp
L A5C:TINVBF UAD284
U 1 1 71813703
P 4300 6450
AR Path="/7FFFFFFF/6107D154/71813703" Ref="UAD284"  Part="1" 
AR Path="/61118D89/6107D154/71813703" Ref="UAD284"  Part="1" 
AR Path="/61116467/61185445/71813703" Ref="UAD284"  Part="1" 
AR Path="/6112ED26/71813703" Ref="UAD284"  Part="1" 
F 0 "UAD284" H 4300 6715 50  0000 C CNN
F 1 "TINVBF" H 4300 6624 50  0000 C CNN
F 2 "" H 3800 6400 50  0001 C CNN
F 3 "" H 3800 6400 50  0001 C CNN
	1    4300 6450
	1    0    0    -1  
$EndComp
$Comp
L A5C:TINVBF UAD228
U 1 1 71813709
P 4300 7000
AR Path="/7FFFFFFF/6107D154/71813709" Ref="UAD228"  Part="1" 
AR Path="/61118D89/6107D154/71813709" Ref="UAD228"  Part="1" 
AR Path="/61116467/61185445/71813709" Ref="UAD228"  Part="1" 
AR Path="/6112ED26/71813709" Ref="UAD228"  Part="1" 
F 0 "UAD228" H 4300 7265 50  0000 C CNN
F 1 "TINVBF" H 4300 7174 50  0000 C CNN
F 2 "" H 3800 6950 50  0001 C CNN
F 3 "" H 3800 6950 50  0001 C CNN
	1    4300 7000
	1    0    0    -1  
$EndComp
$Comp
L A5C:M125C UCB215
U 1 1 617C2831
P 8700 5300
F 0 "UCB215" H 8700 5565 50  0000 C CNN
F 1 "M125C" H 8700 5474 50  0000 C CNN
F 2 "" H 8200 5250 50  0001 C CNN
F 3 "" H 8200 5250 50  0001 C CNN
	1    8700 5300
	1    0    0    -1  
$EndComp
$Comp
L A5C:M368C UCC?
U 1 1 644528B5
P 4300 1350
AR Path="/604B5523/644528B5" Ref="UCC?"  Part="1" 
AR Path="/644528B5" Ref="UCC418"  Part="1" 
AR Path="/7FFFFFFF/6107D154/644528B5" Ref="UCC418"  Part="1" 
AR Path="/61118D89/6107D154/644528B5" Ref="UCC418"  Part="1" 
AR Path="/61116467/61185445/644528B5" Ref="UCC418"  Part="1" 
AR Path="/6112ED26/644528B5" Ref="UCC418"  Part="1" 
F 0 "UCC418" H 4300 1860 50  0000 C CNN
F 1 "M368C" H 4300 1770 50  0000 C CNN
F 2 "" H 4600 1150 50  0001 C CNN
F 3 "" H 4600 1150 50  0001 C CNN
	1    4300 1350
	1    0    0    -1  
$EndComp
$Comp
L A5C:M368C UCC?
U 1 1 6315CBD9
P 4300 2250
AR Path="/604B5523/6315CBD9" Ref="UCC?"  Part="1" 
AR Path="/6315CBD9" Ref="UBJ0"  Part="1" 
AR Path="/7FFFFFFF/6107D154/6315CBD9" Ref="UBJ0"  Part="1" 
AR Path="/61118D89/6107D154/6315CBD9" Ref="UBJ0"  Part="1" 
AR Path="/61116467/61185445/6315CBD9" Ref="UBJ0"  Part="1" 
AR Path="/6112ED26/6315CBD9" Ref="UBJ0"  Part="1" 
F 0 "UBJ0" H 4300 2760 50  0000 C CNN
F 1 "M368C" H 4300 2670 50  0000 C CNN
F 2 "" H 4600 2050 50  0001 C CNN
F 3 "" H 4600 2050 50  0001 C CNN
	1    4300 2250
	1    0    0    -1  
$EndComp
$Comp
L A5C:M368C UCC?
U 1 1 62EA93B7
P 4300 3150
AR Path="/604B5523/62EA93B7" Ref="UCC?"  Part="1" 
AR Path="/62EA93B7" Ref="UCC403"  Part="1" 
AR Path="/7FFFFFFF/6107D154/62EA93B7" Ref="UCC403"  Part="1" 
AR Path="/61118D89/6107D154/62EA93B7" Ref="UCC403"  Part="1" 
AR Path="/61116467/61185445/62EA93B7" Ref="UCC403"  Part="1" 
AR Path="/6112ED26/62EA93B7" Ref="UCC403"  Part="1" 
F 0 "UCC403" H 4300 3660 50  0000 C CNN
F 1 "M368C" H 4300 3570 50  0000 C CNN
F 2 "" H 4600 2950 50  0001 C CNN
F 3 "" H 4600 2950 50  0001 C CNN
	1    4300 3150
	1    0    0    -1  
$EndComp
$Comp
L A5C:M368C UCC?
U 1 1 62BF3B52
P 4300 4050
AR Path="/604B5523/62BF3B52" Ref="UCC?"  Part="1" 
AR Path="/62BF3B52" Ref="UCC211"  Part="1" 
AR Path="/7FFFFFFF/6107D154/62BF3B52" Ref="UCC211"  Part="1" 
AR Path="/61118D89/6107D154/62BF3B52" Ref="UCC211"  Part="1" 
AR Path="/61116467/61185445/62BF3B52" Ref="UCC211"  Part="1" 
AR Path="/6112ED26/62BF3B52" Ref="UCC211"  Part="1" 
F 0 "UCC211" H 4300 4560 50  0000 C CNN
F 1 "M368C" H 4300 4470 50  0000 C CNN
F 2 "" H 4600 3850 50  0001 C CNN
F 3 "" H 4600 3850 50  0001 C CNN
	1    4300 4050
	1    0    0    -1  
$EndComp
$Comp
L A5C:M368C UBK?
U 1 1 6268ED1A
P 4300 4950
AR Path="/604B5523/6268ED1A" Ref="UBK?"  Part="1" 
AR Path="/6268ED1A" Ref="UCC92"  Part="1" 
AR Path="/7FFFFFFF/6107D154/6268ED1A" Ref="UCC92"  Part="1" 
AR Path="/61118D89/6107D154/6268ED1A" Ref="UCC92"  Part="1" 
AR Path="/61116467/61185445/6268ED1A" Ref="UCC92"  Part="1" 
AR Path="/6112ED26/6268ED1A" Ref="UCC92"  Part="1" 
F 0 "UCC92" H 4300 5460 50  0000 C CNN
F 1 "M368C" H 4300 5370 50  0000 C CNN
F 2 "" H 4600 4750 50  0001 C CNN
F 3 "" H 4600 4750 50  0001 C CNN
	1    4300 4950
	1    0    0    -1  
$EndComp
$Comp
L A5C:M368C UCC?
U 1 1 6637BC79
P 4300 5850
AR Path="/604B5523/6637BC79" Ref="UCC?"  Part="1" 
AR Path="/6637BC79" Ref="UCB137"  Part="1" 
AR Path="/7FFFFFFF/6107D154/6637BC79" Ref="UCB137"  Part="1" 
AR Path="/61118D89/6107D154/6637BC79" Ref="UCB137"  Part="1" 
AR Path="/61116467/61185445/6637BC79" Ref="UCB137"  Part="1" 
AR Path="/6112ED26/6637BC79" Ref="UCB137"  Part="1" 
F 0 "UCB137" H 4300 6360 50  0000 C CNN
F 1 "M368C" H 4300 6270 50  0000 C CNN
F 2 "" H 4600 5650 50  0001 C CNN
F 3 "" H 4600 5650 50  0001 C CNN
	1    4300 5850
	1    0    0    -1  
$EndComp
$Comp
L A5C:M367C UEI265
U 1 1 62234762
P 8700 1950
F 0 "UEI265" H 8700 2465 50  0000 C CNN
F 1 "M367C" H 8700 2374 50  0000 C CNN
F 2 "" H 9000 1750 50  0001 C CNN
F 3 "" H 9000 1750 50  0001 C CNN
	1    8700 1950
	1    0    0    -1  
$EndComp
$Comp
L A5C:M367C UEK254
U 1 1 62234D2B
P 8700 2850
F 0 "UEK254" H 8700 3365 50  0000 C CNN
F 1 "M367C" H 8700 3274 50  0000 C CNN
F 2 "" H 9000 2650 50  0001 C CNN
F 3 "" H 9000 2650 50  0001 C CNN
	1    8700 2850
	1    0    0    -1  
$EndComp
$Comp
L A5C:M367C UEJ254
U 1 1 61E3667C
P 8700 3750
F 0 "UEJ254" H 8700 4265 50  0000 C CNN
F 1 "M367C" H 8700 4174 50  0000 C CNN
F 2 "" H 9000 3550 50  0001 C CNN
F 3 "" H 9000 3550 50  0001 C CNN
	1    8700 3750
	1    0    0    -1  
$EndComp
$Comp
L A5C:M367C UEJ272
U 1 1 62233990
P 8700 4650
F 0 "UEJ272" H 8700 5165 50  0000 C CNN
F 1 "M367C" H 8700 5074 50  0000 C CNN
F 2 "" H 9000 4450 50  0001 C CNN
F 3 "" H 9000 4450 50  0001 C CNN
	1    8700 4650
	1    0    0    -1  
$EndComp
Wire Bus Line
	5300 5900 5300 7200
Wire Bus Line
	3000 4500 3000 6900
Wire Bus Line
	7600 1500 7600 2800
Wire Bus Line
	7600 3250 7600 5200
Wire Bus Line
	9700 1800 9700 3200
Wire Bus Line
	9700 3200 9700 5200
Wire Bus Line
	3000 850  3000 4000
Wire Bus Line
	5300 900  5300 5600
$EndSCHEMATC
