EESchema Schematic File Version 4
EELAYER 30 0
EELAYER END
$Descr A4 11693 8268
encoding utf-8
Sheet 9 83
Title "CPS Reverse Engineering: DL-0311"
Date "2021-09-12"
Rev ""
Comp ""
Comment1 ""
Comment2 ""
Comment3 "Licence: CC-BY"
Comment4 "Author: Loïc *WydD* Petit"
$EndDescr
Connection ~ 6900 4700
Connection ~ 6900 4800
Connection ~ 5850 4100
Connection ~ 5750 4000
Connection ~ 6900 5000
Connection ~ 7000 4250
Connection ~ 6900 4900
Connection ~ 3250 3450
Connection ~ 2950 3150
Connection ~ 5650 3900
Connection ~ 4550 3450
Connection ~ 4450 3350
Connection ~ 5550 3800
Connection ~ 4350 3250
Connection ~ 6900 3000
Connection ~ 6900 2900
Connection ~ 6900 2300
Connection ~ 6900 2100
Connection ~ 6900 2200
Connection ~ 7000 4600
Connection ~ 6900 3100
Connection ~ 7000 3350
Connection ~ 6900 3200
Connection ~ 4550 4600
Entry Wire Line
	8700 2000 8800 2100
Entry Wire Line
	8700 2100 8800 2200
Entry Wire Line
	8700 2200 8800 2300
Entry Wire Line
	8700 2300 8800 2400
Entry Wire Line
	8700 2900 8800 3000
Entry Wire Line
	8700 3000 8800 3100
Entry Wire Line
	8700 3100 8800 3200
Entry Wire Line
	8700 3200 8800 3300
Entry Wire Line
	8700 3800 8800 3900
Entry Wire Line
	8700 3900 8800 4000
Entry Wire Line
	8700 4000 8800 4100
Entry Wire Line
	8700 4100 8800 4200
Entry Wire Line
	8700 4700 8800 4800
Entry Wire Line
	8700 4800 8800 4900
Entry Wire Line
	8700 4900 8800 5000
Entry Wire Line
	8700 5000 8800 5100
Wire Wire Line
	2700 3150 2700 4100
Wire Wire Line
	2700 4100 2800 4100
Wire Wire Line
	2800 3450 3250 3450
Wire Wire Line
	2800 4000 2800 3450
Wire Wire Line
	2950 3150 2700 3150
Wire Wire Line
	2950 3150 2950 3900
Wire Wire Line
	2950 3900 3350 3900
Wire Wire Line
	3050 3250 3050 3800
Wire Wire Line
	3050 3250 4350 3250
Wire Wire Line
	3050 3800 3350 3800
Wire Wire Line
	3150 3350 3150 3700
Wire Wire Line
	3150 3700 3350 3700
Wire Wire Line
	3250 3450 3250 3600
Wire Wire Line
	3250 3600 3350 3600
Wire Wire Line
	3350 4050 3350 4000
Wire Wire Line
	4350 3250 4350 4100
Wire Wire Line
	4350 4100 4650 4100
Wire Wire Line
	4350 4400 4650 4400
Wire Wire Line
	4450 3350 3150 3350
Wire Wire Line
	4450 3350 4450 4000
Wire Wire Line
	4450 4000 4650 4000
Wire Wire Line
	4550 3450 3250 3450
Wire Wire Line
	4550 3450 4550 3900
Wire Wire Line
	4550 3450 5550 3450
Wire Wire Line
	4550 4300 4550 4600
Wire Wire Line
	4550 4600 4350 4600
Wire Wire Line
	4550 4600 7000 4600
Wire Wire Line
	4650 3800 4250 3800
Wire Wire Line
	4650 3900 4550 3900
Wire Wire Line
	4650 4300 4550 4300
Wire Wire Line
	5450 3900 5650 3900
Wire Wire Line
	5450 4000 5750 4000
Wire Wire Line
	5550 3450 5550 3800
Wire Wire Line
	5550 3800 5450 3800
Wire Wire Line
	5550 3800 7100 3800
Wire Wire Line
	5650 3350 4450 3350
Wire Wire Line
	5650 3900 5650 3350
Wire Wire Line
	5650 3900 7100 3900
Wire Wire Line
	5750 3250 4350 3250
Wire Wire Line
	5750 4000 5750 3250
Wire Wire Line
	5750 4000 7100 4000
Wire Wire Line
	5850 3150 2950 3150
Wire Wire Line
	5850 4100 5450 4100
Wire Wire Line
	5850 4100 5850 3150
Wire Wire Line
	6900 2100 6900 2000
Wire Wire Line
	6900 2200 6900 2100
Wire Wire Line
	6900 2300 6900 2200
Wire Wire Line
	6900 2300 6900 2900
Wire Wire Line
	6900 3000 6900 2900
Wire Wire Line
	6900 3100 6900 3000
Wire Wire Line
	6900 3200 6900 3100
Wire Wire Line
	6900 4700 6900 3200
Wire Wire Line
	6900 4800 6900 4700
Wire Wire Line
	6900 4900 6900 4800
Wire Wire Line
	6900 5000 6900 4900
Wire Wire Line
	7000 2450 7100 2450
Wire Wire Line
	7000 3350 7000 2450
Wire Wire Line
	7000 4250 7000 3350
Wire Wire Line
	7000 4600 7000 4250
Wire Wire Line
	7000 5150 7000 4600
Wire Wire Line
	7100 2000 6900 2000
Wire Wire Line
	7100 2100 6900 2100
Wire Wire Line
	7100 2200 6900 2200
Wire Wire Line
	7100 2300 6900 2300
Wire Wire Line
	7100 2900 6900 2900
Wire Wire Line
	7100 3000 6900 3000
Wire Wire Line
	7100 3100 6900 3100
Wire Wire Line
	7100 3200 6900 3200
Wire Wire Line
	7100 3350 7000 3350
Wire Wire Line
	7100 4100 5850 4100
Wire Wire Line
	7100 4250 7000 4250
Wire Wire Line
	7100 4700 6900 4700
Wire Wire Line
	7100 4800 6900 4800
Wire Wire Line
	7100 4900 6900 4900
Wire Wire Line
	7100 5000 6900 5000
Wire Wire Line
	7100 5150 7000 5150
Wire Wire Line
	8100 2000 8700 2000
Wire Wire Line
	8100 2100 8700 2100
Wire Wire Line
	8100 2200 8700 2200
Wire Wire Line
	8100 2300 8700 2300
Wire Wire Line
	8100 2900 8700 2900
Wire Wire Line
	8100 3000 8700 3000
Wire Wire Line
	8100 3100 8700 3100
Wire Wire Line
	8100 3200 8700 3200
Wire Wire Line
	8100 3800 8700 3800
Wire Wire Line
	8100 3900 8700 3900
Wire Wire Line
	8100 4000 8700 4000
Wire Wire Line
	8100 4100 8700 4100
Wire Wire Line
	8100 4700 8700 4700
Wire Wire Line
	8100 4800 8700 4800
Wire Wire Line
	8100 4900 8700 4900
Wire Wire Line
	8100 5000 8700 5000
Wire Bus Line
	8800 5200 8900 5200
Text Label 8100 2000 0    50   ~ 0
BUS-DATA14
Text Label 8100 2100 0    50   ~ 0
BUS-DATA15
Text Label 8100 2200 0    50   ~ 0
BUS-DATA0
Text Label 8100 2300 0    50   ~ 0
BUS-DATA1
Text Label 8100 2900 0    50   ~ 0
BUS-DATA2
Text Label 8100 3000 0    50   ~ 0
BUS-DATA3
Text Label 8100 3100 0    50   ~ 0
BUS-DATA4
Text Label 8100 3200 0    50   ~ 0
BUS-DATA5
Text Label 8100 3800 0    50   ~ 0
BUS-DATA6
Text Label 8100 3900 0    50   ~ 0
BUS-DATA7
Text Label 8100 4000 0    50   ~ 0
BUS-DATA8
Text Label 8100 4100 0    50   ~ 0
BUS-DATA9
Text Label 8100 4700 0    50   ~ 0
BUS-DATA10
Text Label 8100 4800 0    50   ~ 0
BUS-DATA11
Text Label 8100 4900 0    50   ~ 0
BUS-DATA12
Text Label 8100 5000 0    50   ~ 0
BUS-DATA13
Text HLabel 4350 4400 0    50   Input ~ 0
~CPS-ID-RESET
Text HLabel 4350 4600 0    50   Input ~ 0
~CPS-ID
Text HLabel 8900 5200 2    50   3State ~ 0
BUS-DATA[0..15]
$Comp
L power:GND #PWR0149
U 1 1 61118D5F
P 6900 5000
F 0 "#PWR0149" H 6900 4750 50  0001 C CNN
F 1 "GND" H 6905 4827 50  0000 C CNN
F 2 "" H 6900 5000 50  0001 C CNN
F 3 "" H 6900 5000 50  0001 C CNN
	1    6900 5000
	1    0    0    -1  
$EndComp
$Comp
L A5C:XNOR02 UBH100
U 1 1 61118D5C
P 3050 4050
F 0 "UBH100" H 3075 3783 50  0000 C CNN
F 1 "XNOR02" H 3075 3874 50  0000 C CNN
F 2 "" H 3075 4050 50  0001 C CNN
F 3 "" H 3075 4050 50  0001 C CNN
	1    3050 4050
	1    0    0    -1  
$EndComp
$Comp
L A5C:OAI41 UBH75
U 1 1 61118D5E
P 3800 3800
F 0 "UBH75" H 3800 4181 50  0000 C CNN
F 1 "OAI41" H 3800 4090 50  0000 C CNN
F 2 "" H 3800 3650 50  0001 C CNN
F 3 "" H 3800 3650 50  0001 C CNN
	1    3800 3800
	1    0    0    1   
$EndComp
$Comp
L A5C:M175C UBH55
U 1 1 61118D5D
P 5050 4100
F 0 "UBH55" H 5050 4665 50  0000 C CNN
F 1 "M175C" H 5050 4574 50  0000 C CNN
F 2 "" H 5050 3900 50  0001 C CNN
F 3 "" H 5050 3900 50  0001 C CNN
	1    5050 4100
	1    0    0    -1  
$EndComp
$Comp
L A5C:M367C UCA70
U 1 1 61118D6E
P 7600 2250
F 0 "UCA70" H 7600 2765 50  0000 C CNN
F 1 "M367C" H 7600 2674 50  0000 C CNN
F 2 "" H 7900 2050 50  0001 C CNN
F 3 "" H 7900 2050 50  0001 C CNN
	1    7600 2250
	1    0    0    -1  
$EndComp
$Comp
L A5C:M367C UCB26
U 1 1 61118D6F
P 7600 3150
F 0 "UCB26" H 7600 3665 50  0000 C CNN
F 1 "M367C" H 7600 3574 50  0000 C CNN
F 2 "" H 7900 2950 50  0001 C CNN
F 3 "" H 7900 2950 50  0001 C CNN
	1    7600 3150
	1    0    0    -1  
$EndComp
$Comp
L A5C:M367C UBH22
U 1 1 61118D70
P 7600 4050
F 0 "UBH22" H 7600 4565 50  0000 C CNN
F 1 "M367C" H 7600 4474 50  0000 C CNN
F 2 "" H 7900 3850 50  0001 C CNN
F 3 "" H 7900 3850 50  0001 C CNN
	1    7600 4050
	1    0    0    -1  
$EndComp
$Comp
L A5C:M367C UCA55
U 1 1 61118D71
P 7600 4950
F 0 "UCA55" H 7600 5465 50  0000 C CNN
F 1 "M367C" H 7600 5374 50  0000 C CNN
F 2 "" H 7900 4750 50  0001 C CNN
F 3 "" H 7900 4750 50  0001 C CNN
	1    7600 4950
	1    0    0    -1  
$EndComp
Text Notes 5000 5000 0    50   ~ 0
DATA[6..9] contains a counter incremented\non each read. It is unused by CPS games.
Wire Bus Line
	8800 2100 8800 5200
$EndSCHEMATC
