EESchema Schematic File Version 4
EELAYER 30 0
EELAYER END
$Descr A3 16535 11693
encoding utf-8
Sheet 30 83
Title "CPS Reverse Engineering: DL-0311"
Date "2021-09-12"
Rev ""
Comp ""
Comment1 ""
Comment2 ""
Comment3 "Licence: CC-BY"
Comment4 "Author: Loïc *WydD* Petit"
$EndDescr
Connection ~ 8050 3650
Connection ~ 8250 1850
Connection ~ 8150 3550
Connection ~ 8550 1550
Connection ~ 8450 1650
Connection ~ 8350 1750
Connection ~ 6750 4050
Connection ~ 6850 2150
Connection ~ 5750 2150
Connection ~ 6850 4150
Connection ~ 7850 3850
Connection ~ 7950 3750
Connection ~ 6750 8950
Connection ~ 6850 7050
Connection ~ 9100 8450
Connection ~ 5650 4050
Connection ~ 4450 4300
Connection ~ 5650 4750
Connection ~ 5750 4150
Connection ~ 5750 7050
Connection ~ 4450 7200
Connection ~ 5650 8950
Connection ~ 5650 9600
Connection ~ 9000 6750
Connection ~ 8900 6650
Connection ~ 8700 6450
Connection ~ 8800 6550
Connection ~ 9300 8650
Connection ~ 9400 8750
Connection ~ 9200 8550
Connection ~ 9500 2550
Connection ~ 9500 8950
Connection ~ 4450 9200
Entry Wire Line
	3800 1900 3900 1800
Entry Wire Line
	3800 2000 3900 1900
Entry Wire Line
	3800 2100 3900 2000
Entry Wire Line
	3800 2200 3900 2100
Entry Wire Line
	3800 3900 3900 3800
Entry Wire Line
	3800 4000 3900 3900
Entry Wire Line
	3800 4100 3900 4000
Entry Wire Line
	3800 4200 3900 4100
Entry Wire Line
	3800 6600 3900 6700
Entry Wire Line
	3800 6700 3900 6800
Entry Wire Line
	3800 6800 3900 6900
Entry Wire Line
	3800 6900 3900 7000
Entry Wire Line
	3800 8600 3900 8700
Entry Wire Line
	3800 8700 3900 8800
Entry Wire Line
	3800 8800 3900 8900
Entry Wire Line
	3800 8900 3900 9000
Entry Wire Line
	4050 6100 4150 6200
Entry Wire Line
	4050 6200 4150 6300
Entry Wire Line
	4050 6300 4150 6400
Entry Wire Line
	4050 6400 4150 6500
Entry Wire Line
	4050 8100 4150 8200
Entry Wire Line
	4050 8200 4150 8300
Entry Wire Line
	4050 8300 4150 8400
Entry Wire Line
	4050 8400 4150 8500
Entry Wire Line
	4150 1300 4050 1400
Entry Wire Line
	4150 1400 4050 1500
Entry Wire Line
	4150 1500 4050 1600
Entry Wire Line
	4150 1600 4050 1700
Entry Wire Line
	4150 3300 4050 3400
Entry Wire Line
	4150 3400 4050 3500
Entry Wire Line
	4150 3500 4050 3600
Entry Wire Line
	4150 3600 4050 3700
Entry Wire Line
	11900 1200 12000 1100
Entry Wire Line
	11900 1700 12000 1600
Entry Wire Line
	11900 2200 12000 2100
Entry Wire Line
	11900 2700 12000 2600
Entry Wire Line
	11900 3200 12000 3100
Entry Wire Line
	11900 3700 12000 3600
Entry Wire Line
	11900 4200 12000 4100
Entry Wire Line
	11900 4700 12000 4600
Entry Wire Line
	11900 5600 12000 5500
Entry Wire Line
	11900 6100 12000 6000
Entry Wire Line
	11900 6600 12000 6500
Entry Wire Line
	11900 7100 12000 7000
Entry Wire Line
	11900 7600 12000 7500
Entry Wire Line
	11900 8100 12000 8000
Entry Wire Line
	11900 8600 12000 8500
Entry Wire Line
	11900 9100 12000 9000
Wire Wire Line
	3900 1800 4550 1800
Wire Wire Line
	3900 1900 4550 1900
Wire Wire Line
	3900 2000 4550 2000
Wire Wire Line
	3900 2100 4550 2100
Wire Wire Line
	3900 3800 4550 3800
Wire Wire Line
	3900 3900 4550 3900
Wire Wire Line
	3900 4000 4550 4000
Wire Wire Line
	3900 4100 4550 4100
Wire Wire Line
	3900 6700 4550 6700
Wire Wire Line
	3900 6800 4550 6800
Wire Wire Line
	3900 6900 4550 6900
Wire Wire Line
	3900 7000 4550 7000
Wire Wire Line
	3900 8700 4550 8700
Wire Wire Line
	3900 8800 4550 8800
Wire Wire Line
	3900 8900 4550 8900
Wire Wire Line
	3900 9000 4550 9000
Wire Wire Line
	4350 9200 4450 9200
Wire Wire Line
	4450 2300 4450 4300
Wire Wire Line
	4450 2300 4550 2300
Wire Wire Line
	4450 4300 4450 7200
Wire Wire Line
	4450 7200 4450 9200
Wire Wire Line
	4550 1300 4150 1300
Wire Wire Line
	4550 1400 4150 1400
Wire Wire Line
	4550 1500 4150 1500
Wire Wire Line
	4550 1600 4150 1600
Wire Wire Line
	4550 3300 4150 3300
Wire Wire Line
	4550 3400 4150 3400
Wire Wire Line
	4550 3500 4150 3500
Wire Wire Line
	4550 3600 4150 3600
Wire Wire Line
	4550 4300 4450 4300
Wire Wire Line
	4550 6200 4150 6200
Wire Wire Line
	4550 6300 4150 6300
Wire Wire Line
	4550 6400 4150 6400
Wire Wire Line
	4550 6500 4150 6500
Wire Wire Line
	4550 7200 4450 7200
Wire Wire Line
	4550 8200 4150 8200
Wire Wire Line
	4550 8300 4150 8300
Wire Wire Line
	4550 8400 4150 8400
Wire Wire Line
	4550 8500 4150 8500
Wire Wire Line
	4550 9200 4450 9200
Wire Wire Line
	5500 4750 5650 4750
Wire Wire Line
	5550 1550 5850 1550
Wire Wire Line
	5550 1650 5850 1650
Wire Wire Line
	5550 1750 5850 1750
Wire Wire Line
	5550 1850 5850 1850
Wire Wire Line
	5550 3550 5850 3550
Wire Wire Line
	5550 3650 5850 3650
Wire Wire Line
	5550 3750 5850 3750
Wire Wire Line
	5550 3850 5850 3850
Wire Wire Line
	5550 6450 5850 6450
Wire Wire Line
	5550 6550 5850 6550
Wire Wire Line
	5550 6650 5850 6650
Wire Wire Line
	5550 6750 5850 6750
Wire Wire Line
	5550 8450 5850 8450
Wire Wire Line
	5550 8550 5850 8550
Wire Wire Line
	5550 8650 5850 8650
Wire Wire Line
	5550 8750 5850 8750
Wire Wire Line
	5650 2050 5650 4050
Wire Wire Line
	5650 4050 5650 4750
Wire Wire Line
	5650 4750 6750 4750
Wire Wire Line
	5650 6950 5650 8950
Wire Wire Line
	5650 8950 5650 9600
Wire Wire Line
	5650 8950 5850 8950
Wire Wire Line
	5650 9600 5500 9600
Wire Wire Line
	5650 9600 6750 9600
Wire Wire Line
	5750 2150 5750 1300
Wire Wire Line
	5750 2150 5850 2150
Wire Wire Line
	5750 4150 5750 2150
Wire Wire Line
	5750 4150 5850 4150
Wire Wire Line
	5750 7050 5750 4150
Wire Wire Line
	5750 7050 5850 7050
Wire Wire Line
	5750 9050 5750 7050
Wire Wire Line
	5850 2050 5650 2050
Wire Wire Line
	5850 4050 5650 4050
Wire Wire Line
	5850 6950 5650 6950
Wire Wire Line
	5850 9050 5750 9050
Wire Wire Line
	6650 1550 6950 1550
Wire Wire Line
	6650 1650 6950 1650
Wire Wire Line
	6650 1750 6950 1750
Wire Wire Line
	6650 1850 6950 1850
Wire Wire Line
	6650 3550 6950 3550
Wire Wire Line
	6650 3650 6950 3650
Wire Wire Line
	6650 3750 6950 3750
Wire Wire Line
	6650 3850 6950 3850
Wire Wire Line
	6650 6450 6950 6450
Wire Wire Line
	6650 6550 6950 6550
Wire Wire Line
	6650 6650 6950 6650
Wire Wire Line
	6650 6750 6950 6750
Wire Wire Line
	6650 8450 6950 8450
Wire Wire Line
	6650 8550 6950 8550
Wire Wire Line
	6650 8650 6950 8650
Wire Wire Line
	6650 8750 6950 8750
Wire Wire Line
	6750 2050 6750 4050
Wire Wire Line
	6750 4750 6750 4050
Wire Wire Line
	6750 6950 6750 8950
Wire Wire Line
	6750 8950 6750 9600
Wire Wire Line
	6750 8950 6950 8950
Wire Wire Line
	6850 2150 6850 1300
Wire Wire Line
	6850 2150 6950 2150
Wire Wire Line
	6850 4150 6850 2150
Wire Wire Line
	6850 4150 6950 4150
Wire Wire Line
	6850 7050 6850 4150
Wire Wire Line
	6850 7050 6950 7050
Wire Wire Line
	6850 9050 6850 7050
Wire Wire Line
	6950 2050 6750 2050
Wire Wire Line
	6950 4050 6750 4050
Wire Wire Line
	6950 6950 6750 6950
Wire Wire Line
	6950 9050 6850 9050
Wire Wire Line
	7750 1550 8550 1550
Wire Wire Line
	7750 1650 8450 1650
Wire Wire Line
	7750 1750 8350 1750
Wire Wire Line
	7750 1850 8250 1850
Wire Wire Line
	7750 3550 8150 3550
Wire Wire Line
	7750 3650 8050 3650
Wire Wire Line
	7750 3750 7950 3750
Wire Wire Line
	7750 3850 7850 3850
Wire Wire Line
	7750 6450 8700 6450
Wire Wire Line
	7750 6550 8800 6550
Wire Wire Line
	7750 6650 8900 6650
Wire Wire Line
	7750 6750 9000 6750
Wire Wire Line
	7750 8450 9100 8450
Wire Wire Line
	7750 8550 9200 8550
Wire Wire Line
	7750 8650 9300 8650
Wire Wire Line
	7750 8750 9400 8750
Wire Wire Line
	7850 3850 7850 8250
Wire Wire Line
	7850 3850 9600 3850
Wire Wire Line
	7850 8250 9600 8250
Wire Wire Line
	7950 3750 9600 3750
Wire Wire Line
	7950 8150 7950 3750
Wire Wire Line
	7950 8150 9600 8150
Wire Wire Line
	8050 3650 8050 8050
Wire Wire Line
	8050 3650 9600 3650
Wire Wire Line
	8050 8050 9600 8050
Wire Wire Line
	8150 3550 9600 3550
Wire Wire Line
	8150 7950 8150 3550
Wire Wire Line
	8150 7950 9600 7950
Wire Wire Line
	8250 1850 8250 6250
Wire Wire Line
	8250 1850 9600 1850
Wire Wire Line
	8250 6250 9600 6250
Wire Wire Line
	8350 1750 9600 1750
Wire Wire Line
	8350 6150 8350 1750
Wire Wire Line
	8350 6150 9600 6150
Wire Wire Line
	8450 1650 8450 6050
Wire Wire Line
	8450 1650 9600 1650
Wire Wire Line
	8450 6050 9600 6050
Wire Wire Line
	8550 1550 9600 1550
Wire Wire Line
	8550 5950 8550 1550
Wire Wire Line
	8550 5950 9600 5950
Wire Wire Line
	8700 2050 9600 2050
Wire Wire Line
	8700 6450 8700 2050
Wire Wire Line
	8700 6450 9600 6450
Wire Wire Line
	8800 2150 8800 6550
Wire Wire Line
	8800 2150 9600 2150
Wire Wire Line
	8800 6550 9600 6550
Wire Wire Line
	8900 2250 9600 2250
Wire Wire Line
	8900 6650 8900 2250
Wire Wire Line
	8900 6650 9600 6650
Wire Wire Line
	9000 2350 9000 6750
Wire Wire Line
	9000 2350 9600 2350
Wire Wire Line
	9000 6750 9600 6750
Wire Wire Line
	9100 4050 9600 4050
Wire Wire Line
	9100 8450 9100 4050
Wire Wire Line
	9100 8450 9600 8450
Wire Wire Line
	9200 4150 9200 8550
Wire Wire Line
	9200 4150 9600 4150
Wire Wire Line
	9200 8550 9600 8550
Wire Wire Line
	9300 4250 9600 4250
Wire Wire Line
	9300 8650 9300 4250
Wire Wire Line
	9300 8650 9600 8650
Wire Wire Line
	9400 4350 9400 8750
Wire Wire Line
	9400 4350 9600 4350
Wire Wire Line
	9400 8750 9600 8750
Wire Wire Line
	9450 2550 9500 2550
Wire Wire Line
	9450 8950 9500 8950
Wire Wire Line
	9500 2550 9500 4550
Wire Wire Line
	9500 2550 9600 2550
Wire Wire Line
	9500 6950 9500 8950
Wire Wire Line
	9500 8950 9600 8950
Wire Wire Line
	9600 4550 9500 4550
Wire Wire Line
	9600 6950 9500 6950
Wire Wire Line
	10600 1800 10800 1800
Wire Wire Line
	10600 1900 10900 1900
Wire Wire Line
	10600 2100 10800 2100
Wire Wire Line
	10600 3800 10800 3800
Wire Wire Line
	10600 3900 10900 3900
Wire Wire Line
	10600 4100 10800 4100
Wire Wire Line
	10600 6200 10800 6200
Wire Wire Line
	10600 6300 10900 6300
Wire Wire Line
	10600 6500 10800 6500
Wire Wire Line
	10600 8200 10800 8200
Wire Wire Line
	10600 8300 10900 8300
Wire Wire Line
	10600 8500 10800 8500
Wire Wire Line
	10800 1200 11000 1200
Wire Wire Line
	10800 1800 10800 1200
Wire Wire Line
	10800 2100 10800 2700
Wire Wire Line
	10800 2700 11000 2700
Wire Wire Line
	10800 3200 11000 3200
Wire Wire Line
	10800 3800 10800 3200
Wire Wire Line
	10800 4100 10800 4700
Wire Wire Line
	10800 4700 11000 4700
Wire Wire Line
	10800 5600 11000 5600
Wire Wire Line
	10800 6200 10800 5600
Wire Wire Line
	10800 6500 10800 7100
Wire Wire Line
	10800 7100 11000 7100
Wire Wire Line
	10800 7600 11000 7600
Wire Wire Line
	10800 8200 10800 7600
Wire Wire Line
	10800 8500 10800 9100
Wire Wire Line
	10800 9100 11000 9100
Wire Wire Line
	10900 1700 11000 1700
Wire Wire Line
	10900 1900 10900 1700
Wire Wire Line
	10900 2000 10600 2000
Wire Wire Line
	10900 2200 10900 2000
Wire Wire Line
	10900 3700 11000 3700
Wire Wire Line
	10900 3900 10900 3700
Wire Wire Line
	10900 4000 10600 4000
Wire Wire Line
	10900 4200 10900 4000
Wire Wire Line
	10900 6100 11000 6100
Wire Wire Line
	10900 6300 10900 6100
Wire Wire Line
	10900 6400 10600 6400
Wire Wire Line
	10900 6600 10900 6400
Wire Wire Line
	10900 8100 11000 8100
Wire Wire Line
	10900 8300 10900 8100
Wire Wire Line
	10900 8400 10600 8400
Wire Wire Line
	10900 8600 10900 8400
Wire Wire Line
	11000 2200 10900 2200
Wire Wire Line
	11000 4200 10900 4200
Wire Wire Line
	11000 6600 10900 6600
Wire Wire Line
	11000 8600 10900 8600
Wire Wire Line
	11600 1200 11900 1200
Wire Wire Line
	11600 1700 11900 1700
Wire Wire Line
	11600 2200 11900 2200
Wire Wire Line
	11600 2700 11900 2700
Wire Wire Line
	11600 3200 11900 3200
Wire Wire Line
	11600 3700 11900 3700
Wire Wire Line
	11600 4200 11900 4200
Wire Wire Line
	11600 4700 11900 4700
Wire Wire Line
	11600 5600 11900 5600
Wire Wire Line
	11600 6100 11900 6100
Wire Wire Line
	11600 6600 11900 6600
Wire Wire Line
	11600 7100 11900 7100
Wire Wire Line
	11600 7600 11900 7600
Wire Wire Line
	11600 8100 11900 8100
Wire Wire Line
	11600 8600 11900 8600
Wire Wire Line
	11600 9100 11900 9100
Wire Bus Line
	3700 4450 4050 4450
Wire Bus Line
	3800 4350 3700 4350
Wire Bus Line
	3800 5950 3700 5950
Wire Bus Line
	4050 5850 3700 5850
Wire Bus Line
	12000 850  12200 850 
Wire Bus Line
	12000 5350 12150 5350
Text Notes 3150 7500 0    50   ~ 0
WRITE LINE
Text Notes 3200 1450 0    50   ~ 0
LINE COORD
Text Notes 3200 1950 0    50   ~ 0
COL COORD
Text Notes 3200 2700 0    50   ~ 0
READ LINE
Text Notes 3200 3450 0    50   ~ 0
LINE COORD
Text Notes 3200 3950 0    50   ~ 0
COL COORD
Text Notes 3200 6300 0    50   ~ 0
Y COORD
Text Notes 3200 6800 0    50   ~ 0
X COORD
Text Notes 3250 8350 0    50   ~ 0
Y COORD
Text Notes 3250 8850 0    50   ~ 0
X COORD
Text Label 4150 1300 0    50   ~ 0
~RY-A7
Text Label 4150 1400 0    50   ~ 0
~RY-A6
Text Label 4150 1500 0    50   ~ 0
~RY-A5
Text Label 4150 1600 0    50   ~ 0
~RY-A4
Text Label 4150 1800 0    50   ~ 0
~RX-A7
Text Label 4150 1900 0    50   ~ 0
~RX-A6
Text Label 4150 2000 0    50   ~ 0
~RX-A5
Text Label 4150 2100 0    50   ~ 0
~RX-A4
Text Label 4150 3300 0    50   ~ 0
~RY-A3
Text Label 4150 3400 0    50   ~ 0
~RY-A2
Text Label 4150 3500 0    50   ~ 0
~RY-A1
Text Label 4150 3600 0    50   ~ 0
~RY-A0
Text Label 4150 3800 0    50   ~ 0
~RX-A3
Text Label 4150 3900 0    50   ~ 0
~RX-A2
Text Label 4150 4000 0    50   ~ 0
~RX-A1
Text Label 4150 4100 0    50   ~ 0
~RX-A0
Text Label 4150 6200 0    50   ~ 0
WY-A7
Text Label 4150 6300 0    50   ~ 0
WY-A6
Text Label 4150 6400 0    50   ~ 0
WY-A5
Text Label 4150 6500 0    50   ~ 0
WY-A4
Text Label 4150 6700 0    50   ~ 0
WX-A8
Text Label 4150 6800 0    50   ~ 0
WX-A7
Text Label 4150 6900 0    50   ~ 0
WX-A6
Text Label 4150 7000 0    50   ~ 0
WX-A5
Text Label 4150 8200 0    50   ~ 0
WY-A3
Text Label 4150 8300 0    50   ~ 0
WY-A2
Text Label 4150 8400 0    50   ~ 0
WY-A1
Text Label 4150 8500 0    50   ~ 0
WY-A0
Text Label 4150 8700 0    50   ~ 0
WX-A4
Text Label 4150 8800 0    50   ~ 0
WX-A3
Text Label 4150 8900 0    50   ~ 0
WX-A2
Text Label 4150 9000 0    50   ~ 0
WX-A1
Text Label 11600 1200 0    50   ~ 0
AA7
Text Label 11600 1700 0    50   ~ 0
AA6
Text Label 11600 2200 0    50   ~ 0
AA5
Text Label 11600 2700 0    50   ~ 0
AA4
Text Label 11600 3200 0    50   ~ 0
AA3
Text Label 11600 3700 0    50   ~ 0
AA2
Text Label 11600 4200 0    50   ~ 0
AA1
Text Label 11600 4700 0    50   ~ 0
AA0
Text Label 11600 5600 0    50   ~ 0
BA7
Text Label 11600 6100 0    50   ~ 0
BA6
Text Label 11600 6600 0    50   ~ 0
BA5
Text Label 11600 7100 0    50   ~ 0
BA4
Text Label 11600 7600 0    50   ~ 0
BA3
Text Label 11600 8100 0    50   ~ 0
BA2
Text Label 11600 8600 0    50   ~ 0
BA1
Text Label 11600 9100 0    50   ~ 0
BA0
Text HLabel 3700 4350 0    50   Input ~ 0
~RX-A[0..7]
Text HLabel 3700 4450 0    50   Input ~ 0
~RY-A[0..7]
Text HLabel 3700 5850 0    50   Input ~ 0
WY-A[0..7]
Text HLabel 3700 5950 0    50   Input ~ 0
WX-A[1..8]
Text HLabel 4350 9200 0    50   Input ~ 0
ADDR-X~Y~
Text HLabel 9450 2550 0    50   Input ~ 0
A-WRITE
Text HLabel 9450 8950 0    50   Input ~ 0
B-WRITE
Text HLabel 12150 5350 2    50   Output ~ 0
BA[0..7]
Text HLabel 12200 850  2    50   Output ~ 0
AA[0..7]
$Comp
L power:VCC #PWR0229
U 1 1 61507280
P 5750 1300
F 0 "#PWR0229" H 5750 1150 50  0001 C CNN
F 1 "VCC" H 5765 1473 50  0000 C CNN
F 2 "" H 5750 1300 50  0001 C CNN
F 3 "" H 5750 1300 50  0001 C CNN
	1    5750 1300
	1    0    0    -1  
$EndComp
$Comp
L power:VCC #PWR0231
U 1 1 614944D7
P 6850 1300
F 0 "#PWR0231" H 6850 1150 50  0001 C CNN
F 1 "VCC" H 6865 1473 50  0000 C CNN
F 2 "" H 6850 1300 50  0001 C CNN
F 3 "" H 6850 1300 50  0001 C CNN
	1    6850 1300
	1    0    0    -1  
$EndComp
$Comp
L power:GND #PWR0236
U 1 1 6154CB06
P 4550 2450
F 0 "#PWR0236" H 4550 2200 50  0001 C CNN
F 1 "GND" H 4555 2277 50  0001 C CNN
F 2 "" H 4550 2450 50  0001 C CNN
F 3 "" H 4550 2450 50  0001 C CNN
	1    4550 2450
	1    0    0    -1  
$EndComp
$Comp
L power:GND #PWR0237
U 1 1 6154DD43
P 4550 4450
F 0 "#PWR0237" H 4550 4200 50  0001 C CNN
F 1 "GND" H 4555 4277 50  0001 C CNN
F 2 "" H 4550 4450 50  0001 C CNN
F 3 "" H 4550 4450 50  0001 C CNN
	1    4550 4450
	1    0    0    -1  
$EndComp
$Comp
L power:GND #PWR0238
U 1 1 6155B5EA
P 4550 7350
F 0 "#PWR0238" H 4550 7100 50  0001 C CNN
F 1 "GND" H 4555 7177 50  0001 C CNN
F 2 "" H 4550 7350 50  0001 C CNN
F 3 "" H 4550 7350 50  0001 C CNN
	1    4550 7350
	1    0    0    -1  
$EndComp
$Comp
L power:GND #PWR0239
U 1 1 61575540
P 4550 9350
F 0 "#PWR0239" H 4550 9100 50  0001 C CNN
F 1 "GND" H 4555 9177 50  0001 C CNN
F 2 "" H 4550 9350 50  0001 C CNN
F 3 "" H 4550 9350 50  0001 C CNN
	1    4550 9350
	1    0    0    -1  
$EndComp
$Comp
L power:GND #PWR0240
U 1 1 617757C9
P 9600 2700
F 0 "#PWR0240" H 9600 2450 50  0001 C CNN
F 1 "GND" H 9605 2527 50  0001 C CNN
F 2 "" H 9600 2700 50  0001 C CNN
F 3 "" H 9600 2700 50  0001 C CNN
	1    9600 2700
	1    0    0    -1  
$EndComp
$Comp
L power:GND #PWR0241
U 1 1 61775DE5
P 9600 4700
F 0 "#PWR0241" H 9600 4450 50  0001 C CNN
F 1 "GND" H 9605 4527 50  0001 C CNN
F 2 "" H 9600 4700 50  0001 C CNN
F 3 "" H 9600 4700 50  0001 C CNN
	1    9600 4700
	1    0    0    -1  
$EndComp
$Comp
L power:GND #PWR0242
U 1 1 6177A50C
P 9600 7100
F 0 "#PWR0242" H 9600 6850 50  0001 C CNN
F 1 "GND" H 9605 6927 50  0001 C CNN
F 2 "" H 9600 7100 50  0001 C CNN
F 3 "" H 9600 7100 50  0001 C CNN
	1    9600 7100
	1    0    0    -1  
$EndComp
$Comp
L power:GND #PWR0243
U 1 1 61789C53
P 9600 9100
F 0 "#PWR0243" H 9600 8850 50  0001 C CNN
F 1 "GND" H 9605 8927 50  0001 C CNN
F 2 "" H 9600 9100 50  0001 C CNN
F 3 "" H 9600 9100 50  0001 C CNN
	1    9600 9100
	1    0    0    -1  
$EndComp
$Comp
L A5C:BUF12 UDF4
U 1 1 6139547E
P 11300 1200
F 0 "UDF4" H 11300 1517 50  0000 C CNN
F 1 "BUF12" H 11300 1426 50  0000 C CNN
F 2 "" H 11300 1200 50  0001 C CNN
F 3 "" H 11300 1200 50  0001 C CNN
	1    11300 1200
	1    0    0    -1  
$EndComp
$Comp
L A5C:BUF12 UDE1
U 1 1 61395D64
P 11300 1700
F 0 "UDE1" H 11300 2017 50  0000 C CNN
F 1 "BUF12" H 11300 1926 50  0000 C CNN
F 2 "" H 11300 1700 50  0001 C CNN
F 3 "" H 11300 1700 50  0001 C CNN
	1    11300 1700
	1    0    0    -1  
$EndComp
$Comp
L A5C:BUF12 UDC2
U 1 1 61508E9B
P 11300 2200
F 0 "UDC2" H 11300 2517 50  0000 C CNN
F 1 "BUF12" H 11300 2426 50  0000 C CNN
F 2 "" H 11300 2200 50  0001 C CNN
F 3 "" H 11300 2200 50  0001 C CNN
	1    11300 2200
	1    0    0    -1  
$EndComp
$Comp
L A5C:BUF12 UDB20
U 1 1 61396CAA
P 11300 2700
F 0 "UDB20" H 11300 3017 50  0000 C CNN
F 1 "BUF12" H 11300 2926 50  0000 C CNN
F 2 "" H 11300 2700 50  0001 C CNN
F 3 "" H 11300 2700 50  0001 C CNN
	1    11300 2700
	1    0    0    -1  
$EndComp
$Comp
L A5C:BUF12 UDB16
U 1 1 613B44C0
P 11300 3200
F 0 "UDB16" H 11300 3517 50  0000 C CNN
F 1 "BUF12" H 11300 3426 50  0000 C CNN
F 2 "" H 11300 3200 50  0001 C CNN
F 3 "" H 11300 3200 50  0001 C CNN
	1    11300 3200
	1    0    0    -1  
$EndComp
$Comp
L A5C:BUF12 UDA0
U 1 1 613B44C6
P 11300 3700
F 0 "UDA0" H 11300 4017 50  0000 C CNN
F 1 "BUF12" H 11300 3926 50  0000 C CNN
F 2 "" H 11300 3700 50  0001 C CNN
F 3 "" H 11300 3700 50  0001 C CNN
	1    11300 3700
	1    0    0    -1  
$EndComp
$Comp
L A5C:BUF12 UDA2
U 1 1 613B44CC
P 11300 4200
F 0 "UDA2" H 11300 4517 50  0000 C CNN
F 1 "BUF12" H 11300 4426 50  0000 C CNN
F 2 "" H 11300 4200 50  0001 C CNN
F 3 "" H 11300 4200 50  0001 C CNN
	1    11300 4200
	1    0    0    -1  
$EndComp
$Comp
L A5C:BUF12 UDA4
U 1 1 613B44D2
P 11300 4700
F 0 "UDA4" H 11300 5017 50  0000 C CNN
F 1 "BUF12" H 11300 4926 50  0000 C CNN
F 2 "" H 11300 4700 50  0001 C CNN
F 3 "" H 11300 4700 50  0001 C CNN
	1    11300 4700
	1    0    0    -1  
$EndComp
$Comp
L A5C:BUF12 UDG12
U 1 1 613E0DFA
P 11300 5600
F 0 "UDG12" H 11300 5917 50  0000 C CNN
F 1 "BUF12" H 11300 5826 50  0000 C CNN
F 2 "" H 11300 5600 50  0001 C CNN
F 3 "" H 11300 5600 50  0001 C CNN
	1    11300 5600
	1    0    0    -1  
$EndComp
$Comp
L A5C:BUF12 UDH6
U 1 1 613E0E00
P 11300 6100
F 0 "UDH6" H 11300 6417 50  0000 C CNN
F 1 "BUF12" H 11300 6326 50  0000 C CNN
F 2 "" H 11300 6100 50  0001 C CNN
F 3 "" H 11300 6100 50  0001 C CNN
	1    11300 6100
	1    0    0    -1  
$EndComp
$Comp
L A5C:BUF12 UDG14
U 1 1 613E0E06
P 11300 6600
F 0 "UDG14" H 11300 6917 50  0000 C CNN
F 1 "BUF12" H 11300 6826 50  0000 C CNN
F 2 "" H 11300 6600 50  0001 C CNN
F 3 "" H 11300 6600 50  0001 C CNN
	1    11300 6600
	1    0    0    -1  
$EndComp
$Comp
L A5C:BUF12 UDG32
U 1 1 613E0E0C
P 11300 7100
F 0 "UDG32" H 11300 7417 50  0000 C CNN
F 1 "BUF12" H 11300 7326 50  0000 C CNN
F 2 "" H 11300 7100 50  0001 C CNN
F 3 "" H 11300 7100 50  0001 C CNN
	1    11300 7100
	1    0    0    -1  
$EndComp
$Comp
L A5C:BUF12 UDH4
U 1 1 613E0E12
P 11300 7600
F 0 "UDH4" H 11300 7917 50  0000 C CNN
F 1 "BUF12" H 11300 7826 50  0000 C CNN
F 2 "" H 11300 7600 50  0001 C CNN
F 3 "" H 11300 7600 50  0001 C CNN
	1    11300 7600
	1    0    0    -1  
$EndComp
$Comp
L A5C:BUF12 UDD4
U 1 1 613E0E18
P 11300 8100
F 0 "UDD4" H 11300 8417 50  0000 C CNN
F 1 "BUF12" H 11300 8326 50  0000 C CNN
F 2 "" H 11300 8100 50  0001 C CNN
F 3 "" H 11300 8100 50  0001 C CNN
	1    11300 8100
	1    0    0    -1  
$EndComp
$Comp
L A5C:BUF12 UDH8
U 1 1 613E0E1E
P 11300 8600
F 0 "UDH8" H 11300 8917 50  0000 C CNN
F 1 "BUF12" H 11300 8826 50  0000 C CNN
F 2 "" H 11300 8600 50  0001 C CNN
F 3 "" H 11300 8600 50  0001 C CNN
	1    11300 8600
	1    0    0    -1  
$EndComp
$Comp
L A5C:BUF12 UDG2
U 1 1 613E0E24
P 11300 9100
F 0 "UDG2" H 11300 9417 50  0000 C CNN
F 1 "BUF12" H 11300 9326 50  0000 C CNN
F 2 "" H 11300 9100 50  0001 C CNN
F 3 "" H 11300 9100 50  0001 C CNN
	1    11300 9100
	1    0    0    -1  
$EndComp
$Comp
L A5C:M175C UDE27
U 1 1 6136F71A
P 6250 1850
F 0 "UDE27" H 6250 2415 50  0000 C CNN
F 1 "M175C" H 6250 2324 50  0000 C CNN
F 2 "" H 6250 1650 50  0001 C CNN
F 3 "" H 6250 1650 50  0001 C CNN
	1    6250 1850
	1    0    0    -1  
$EndComp
$Comp
L A5C:M175C UDC8
U 1 1 61335318
P 6250 3850
F 0 "UDC8" H 6250 4415 50  0000 C CNN
F 1 "M175C" H 6250 4324 50  0000 C CNN
F 2 "" H 6250 3650 50  0001 C CNN
F 3 "" H 6250 3650 50  0001 C CNN
	1    6250 3850
	1    0    0    -1  
$EndComp
$Comp
L A5C:M175C UDF53
U 1 1 613A8DEF
P 6250 6750
F 0 "UDF53" H 6250 7315 50  0000 C CNN
F 1 "M175C" H 6250 7224 50  0000 C CNN
F 2 "" H 6250 6550 50  0001 C CNN
F 3 "" H 6250 6550 50  0001 C CNN
	1    6250 6750
	1    0    0    -1  
$EndComp
$Comp
L A5C:M175C UDH14
U 1 1 61390A71
P 6250 8750
F 0 "UDH14" H 6250 9315 50  0000 C CNN
F 1 "M175C" H 6250 9224 50  0000 C CNN
F 2 "" H 6250 8550 50  0001 C CNN
F 3 "" H 6250 8550 50  0001 C CNN
	1    6250 8750
	1    0    0    -1  
$EndComp
$Comp
L A5C:M175C UDE6
U 1 1 6136F714
P 7350 1850
F 0 "UDE6" H 7350 2415 50  0000 C CNN
F 1 "M175C" H 7350 2324 50  0000 C CNN
F 2 "" H 7350 1650 50  0001 C CNN
F 3 "" H 7350 1650 50  0001 C CNN
	1    7350 1850
	1    0    0    -1  
$EndComp
$Comp
L A5C:M175C UDA11
U 1 1 61335896
P 7350 3850
F 0 "UDA11" H 7350 4415 50  0000 C CNN
F 1 "M175C" H 7350 4324 50  0000 C CNN
F 2 "" H 7350 3650 50  0001 C CNN
F 3 "" H 7350 3650 50  0001 C CNN
	1    7350 3850
	1    0    0    -1  
$EndComp
$Comp
L A5C:M175C UDF21
U 1 1 613A8DE9
P 7350 6750
F 0 "UDF21" H 7350 7315 50  0000 C CNN
F 1 "M175C" H 7350 7224 50  0000 C CNN
F 2 "" H 7350 6550 50  0001 C CNN
F 3 "" H 7350 6550 50  0001 C CNN
	1    7350 6750
	1    0    0    -1  
$EndComp
$Comp
L A5C:M175C UDI5
U 1 1 61390A6B
P 7350 8750
F 0 "UDI5" H 7350 9315 50  0000 C CNN
F 1 "M175C" H 7350 9224 50  0000 C CNN
F 2 "" H 7350 8550 50  0001 C CNN
F 3 "" H 7350 8550 50  0001 C CNN
	1    7350 8750
	1    0    0    -1  
$EndComp
$Comp
L A5C:M258C UDE54
U 1 1 6154BCFF
P 5050 1900
F 0 "UDE54" H 5050 2765 50  0000 C CNN
F 1 "M258C" H 5050 2674 50  0000 C CNN
F 2 "" H 5050 1900 50  0001 C CNN
F 3 "" H 5050 1900 50  0001 C CNN
	1    5050 1900
	1    0    0    -1  
$EndComp
$Comp
L A5C:M258C UDG34
U 1 1 6154DD3D
P 5050 3900
F 0 "UDG34" H 5050 4765 50  0000 C CNN
F 1 "M258C" H 5050 4674 50  0000 C CNN
F 2 "" H 5050 3900 50  0001 C CNN
F 3 "" H 5050 3900 50  0001 C CNN
	1    5050 3900
	1    0    0    -1  
$EndComp
$Comp
L A5C:M157C UDG56
U 1 1 615B9A9A
P 5050 6800
F 0 "UDG56" H 5050 7665 50  0000 C CNN
F 1 "M157C" H 5050 7574 50  0000 C CNN
F 2 "" H 5050 6800 50  0001 C CNN
F 3 "" H 5050 6800 50  0001 C CNN
	1    5050 6800
	1    0    0    -1  
$EndComp
$Comp
L A5C:M157C UDG71
U 1 1 615B9AA0
P 5050 8800
F 0 "UDG71" H 5050 9665 50  0000 C CNN
F 1 "M157C" H 5050 9574 50  0000 C CNN
F 2 "" H 5050 8800 50  0001 C CNN
F 3 "" H 5050 8800 50  0001 C CNN
	1    5050 8800
	1    0    0    -1  
$EndComp
$Comp
L A5C:M157C UDF6
U 1 1 6131C494
P 10100 2150
F 0 "UDF6" H 10100 3015 50  0000 C CNN
F 1 "M157C" H 10100 2924 50  0000 C CNN
F 2 "" H 10100 2150 50  0001 C CNN
F 3 "" H 10100 2150 50  0001 C CNN
	1    10100 2150
	1    0    0    -1  
$EndComp
$Comp
L A5C:M157C UDB1
U 1 1 6131D7BF
P 10100 4150
F 0 "UDB1" H 10100 5015 50  0000 C CNN
F 1 "M157C" H 10100 4924 50  0000 C CNN
F 2 "" H 10100 4150 50  0001 C CNN
F 3 "" H 10100 4150 50  0001 C CNN
	1    10100 4150
	1    0    0    -1  
$EndComp
$Comp
L A5C:M157C UDG17
U 1 1 61351214
P 10100 6550
F 0 "UDG17" H 10100 7415 50  0000 C CNN
F 1 "M157C" H 10100 7324 50  0000 C CNN
F 2 "" H 10100 6550 50  0001 C CNN
F 3 "" H 10100 6550 50  0001 C CNN
	1    10100 6550
	1    0    0    -1  
$EndComp
$Comp
L A5C:M157C UDD9
U 1 1 6135121A
P 10100 8550
F 0 "UDD9" H 10100 9415 50  0000 C CNN
F 1 "M157C" H 10100 9324 50  0000 C CNN
F 2 "" H 10100 8550 50  0001 C CNN
F 3 "" H 10100 8550 50  0001 C CNN
	1    10100 8550
	1    0    0    -1  
$EndComp
Text HLabel 5500 9600 0    50   Input ~ 0
~CLK8M1
Text HLabel 5500 4750 0    50   Input ~ 0
~CLK8M
Wire Bus Line
	3800 1900 3800 4350
Wire Bus Line
	3800 5950 3800 8900
Wire Bus Line
	4050 1400 4050 4450
Wire Bus Line
	4050 5850 4050 8400
Wire Bus Line
	12000 850  12000 4600
Wire Bus Line
	12000 5350 12000 9000
$EndSCHEMATC
