EESchema Schematic File Version 4
EELAYER 30 0
EELAYER END
$Descr A3 11693 16535 portrait
encoding utf-8
Sheet 49 83
Title "CPS Reverse Engineering: DL-0311"
Date "2021-09-12"
Rev ""
Comp ""
Comment1 ""
Comment2 ""
Comment3 "Licence: CC-BY"
Comment4 "Author: Loïc *WydD* Petit"
$EndDescr
Connection ~ 3950 6550
Connection ~ 4150 8450
Connection ~ 4050 8250
Connection ~ 3950 8150
Connection ~ 1750 9200
Connection ~ 4150 9250
Connection ~ 4050 7450
Connection ~ 3950 8950
Connection ~ 4050 6650
Connection ~ 3950 7350
Connection ~ 2450 6700
Connection ~ 1750 6600
Connection ~ 4150 7650
Connection ~ 1750 4050
Connection ~ 5750 5300
Connection ~ 5750 5700
Connection ~ 5200 7700
Connection ~ 5200 8500
Connection ~ 6150 7600
Connection ~ 6400 6600
Connection ~ 6250 7700
Connection ~ 6400 7800
Connection ~ 6150 8300
Connection ~ 6250 6700
Connection ~ 6250 7100
Connection ~ 6150 7500
Connection ~ 6150 7300
Connection ~ 6400 7200
Connection ~ 6250 8400
Connection ~ 6050 7900
Connection ~ 6050 8200
Connection ~ 6050 8300
Connection ~ 5950 8900
Connection ~ 6050 9000
Connection ~ 5950 9100
Connection ~ 5950 8600
Connection ~ 6150 9100
Connection ~ 6250 9200
Connection ~ 4050 12700
Connection ~ 4150 12900
Connection ~ 4150 13700
Connection ~ 4050 13500
Connection ~ 3950 13400
Connection ~ 4150 14500
Connection ~ 5200 12950
Connection ~ 6500 13150
Connection ~ 6500 13550
Connection ~ 6400 13850
Connection ~ 6400 14150
Connection ~ 6700 13650
Connection ~ 6850 13750
Connection ~ 5200 9300
Connection ~ 5600 10750
Connection ~ 5600 10850
Connection ~ 2450 9300
Connection ~ 5600 10350
Connection ~ 6600 12850
Connection ~ 6600 12750
Connection ~ 6500 13450
Connection ~ 6600 12550
Connection ~ 6600 13550
Connection ~ 6200 12050
Connection ~ 6850 12450
Connection ~ 6700 12350
Connection ~ 5200 12150
Connection ~ 6850 11850
Connection ~ 6700 11950
Connection ~ 3950 12600
Connection ~ 3950 11800
Connection ~ 2450 14550
Connection ~ 2450 11950
Connection ~ 1750 11850
Connection ~ 4050 11900
Connection ~ 6700 12950
Connection ~ 6850 13050
Connection ~ 6150 2250
Connection ~ 6150 2450
Connection ~ 4450 2500
Connection ~ 4450 3300
Connection ~ 5200 3450
Connection ~ 5200 2650
Connection ~ 6400 2150
Connection ~ 6250 2050
Connection ~ 6250 1650
Connection ~ 4450 4100
Connection ~ 6050 3150
Connection ~ 6050 2850
Connection ~ 6150 3250
Connection ~ 6050 3250
Connection ~ 6150 2550
Connection ~ 6250 2650
Connection ~ 6400 2750
Connection ~ 6250 4150
Connection ~ 6250 3350
Connection ~ 6400 3450
Connection ~ 6150 4050
Connection ~ 5950 3850
Connection ~ 5950 3550
Connection ~ 5950 4050
Connection ~ 6050 3950
Connection ~ 2800 750 
Connection ~ 5200 10250
Connection ~ 5200 13750
Connection ~ 8350 5100
NoConn ~ 7700 14350
Entry Wire Line
	6800 14900 6900 14800
Entry Wire Line
	6800 15000 6900 14900
Entry Wire Line
	6800 15100 6900 15000
Entry Wire Line
	6800 15200 6900 15100
Entry Wire Line
	6850 4600 6950 4700
Entry Wire Line
	6850 4700 6950 4800
Entry Wire Line
	6850 4800 6950 4900
Entry Wire Line
	6850 4900 6950 5000
Entry Wire Line
	6850 9650 6950 9750
Entry Wire Line
	6850 9750 6950 9850
Entry Wire Line
	6850 9850 6950 9950
Entry Wire Line
	6850 9950 6950 10050
Wire Wire Line
	1750 4050 2450 4050
Wire Wire Line
	1750 6600 1750 4050
Wire Wire Line
	1750 9200 1750 6600
Wire Wire Line
	1750 9200 1750 11850
Wire Wire Line
	1750 9200 2550 9200
Wire Wire Line
	1750 11850 1750 14450
Wire Wire Line
	1750 14450 2550 14450
Wire Wire Line
	1800 14550 2450 14550
Wire Wire Line
	2350 6600 2550 6600
Wire Wire Line
	2350 11850 2550 11850
Wire Wire Line
	2450 4150 2450 6700
Wire Wire Line
	2450 6700 2450 9300
Wire Wire Line
	2450 9300 2450 11950
Wire Wire Line
	2450 9300 2550 9300
Wire Wire Line
	2450 11950 2450 14550
Wire Wire Line
	2450 14550 2550 14550
Wire Wire Line
	2550 6700 2450 6700
Wire Wire Line
	2550 11950 2450 11950
Wire Wire Line
	2800 750  2800 1250
Wire Wire Line
	2800 750  6500 750 
Wire Wire Line
	3000 4100 4450 4100
Wire Wire Line
	3100 6650 4050 6650
Wire Wire Line
	3100 9250 4150 9250
Wire Wire Line
	3100 11900 4050 11900
Wire Wire Line
	3100 14500 4150 14500
Wire Wire Line
	3250 5900 3250 9150
Wire Wire Line
	3250 9150 4250 9150
Wire Wire Line
	3250 11150 3250 14400
Wire Wire Line
	3250 11150 8650 11150
Wire Wire Line
	3250 14400 4250 14400
Wire Wire Line
	3350 6000 3350 8350
Wire Wire Line
	3350 8350 4250 8350
Wire Wire Line
	3350 11250 3350 13600
Wire Wire Line
	3350 11250 8550 11250
Wire Wire Line
	3350 13600 4250 13600
Wire Wire Line
	3400 1250 6400 1250
Wire Wire Line
	3450 6100 3450 7550
Wire Wire Line
	3450 7550 4250 7550
Wire Wire Line
	3450 11350 3450 12800
Wire Wire Line
	3450 11350 8450 11350
Wire Wire Line
	3450 12800 4250 12800
Wire Wire Line
	3550 6200 7900 6200
Wire Wire Line
	3550 6750 3550 6200
Wire Wire Line
	3550 11450 8350 11450
Wire Wire Line
	3550 12000 3550 11450
Wire Wire Line
	3650 5550 3950 5550
Wire Wire Line
	3950 6550 3950 5550
Wire Wire Line
	3950 7350 3950 6550
Wire Wire Line
	3950 8150 3950 7350
Wire Wire Line
	3950 8950 3950 8150
Wire Wire Line
	3950 8950 3950 11800
Wire Wire Line
	3950 12600 3950 11800
Wire Wire Line
	3950 13400 3950 12600
Wire Wire Line
	3950 14200 3950 13400
Wire Wire Line
	4050 850  4050 4000
Wire Wire Line
	4050 4000 4550 4000
Wire Wire Line
	4050 6650 4300 6650
Wire Wire Line
	4050 7450 4050 6650
Wire Wire Line
	4050 8250 4050 7450
Wire Wire Line
	4050 8250 4050 9050
Wire Wire Line
	4050 11900 4300 11900
Wire Wire Line
	4050 12700 4050 11900
Wire Wire Line
	4050 13500 4050 12700
Wire Wire Line
	4050 13500 4050 14300
Wire Wire Line
	4150 950  4150 3200
Wire Wire Line
	4150 3200 4550 3200
Wire Wire Line
	4150 6850 4300 6850
Wire Wire Line
	4150 7650 4150 6850
Wire Wire Line
	4150 8450 4150 7650
Wire Wire Line
	4150 9250 4150 8450
Wire Wire Line
	4150 12100 4300 12100
Wire Wire Line
	4150 12900 4150 12100
Wire Wire Line
	4150 13700 4150 12900
Wire Wire Line
	4150 14500 4150 13700
Wire Wire Line
	4250 1050 4250 2400
Wire Wire Line
	4250 2400 4550 2400
Wire Wire Line
	4250 7350 3950 7350
Wire Wire Line
	4250 7450 4050 7450
Wire Wire Line
	4250 7650 4150 7650
Wire Wire Line
	4250 8150 3950 8150
Wire Wire Line
	4250 8250 4050 8250
Wire Wire Line
	4250 8450 4150 8450
Wire Wire Line
	4250 8950 3950 8950
Wire Wire Line
	4250 9050 4050 9050
Wire Wire Line
	4250 9250 4150 9250
Wire Wire Line
	4250 12600 3950 12600
Wire Wire Line
	4250 12700 4050 12700
Wire Wire Line
	4250 12900 4150 12900
Wire Wire Line
	4250 13400 3950 13400
Wire Wire Line
	4250 13500 4050 13500
Wire Wire Line
	4250 13700 4150 13700
Wire Wire Line
	4250 14200 3950 14200
Wire Wire Line
	4250 14300 4050 14300
Wire Wire Line
	4250 14500 4150 14500
Wire Wire Line
	4300 6550 3950 6550
Wire Wire Line
	4300 6750 3550 6750
Wire Wire Line
	4300 11800 3950 11800
Wire Wire Line
	4300 12000 3550 12000
Wire Wire Line
	4350 1150 7900 1150
Wire Wire Line
	4350 1600 4350 1150
Wire Wire Line
	4350 1600 4550 1600
Wire Wire Line
	4450 1700 4450 2500
Wire Wire Line
	4450 2500 4450 3300
Wire Wire Line
	4450 3300 4450 4100
Wire Wire Line
	4450 4100 4550 4100
Wire Wire Line
	4550 1700 4450 1700
Wire Wire Line
	4550 2500 4450 2500
Wire Wire Line
	4550 3300 4450 3300
Wire Wire Line
	5050 10250 5200 10250
Wire Wire Line
	5100 1650 5300 1650
Wire Wire Line
	5100 2450 5300 2450
Wire Wire Line
	5100 3250 5300 3250
Wire Wire Line
	5100 4050 5300 4050
Wire Wire Line
	5100 7500 5300 7500
Wire Wire Line
	5100 8300 5300 8300
Wire Wire Line
	5100 9100 5300 9100
Wire Wire Line
	5100 12750 5300 12750
Wire Wire Line
	5100 13550 5300 13550
Wire Wire Line
	5100 14350 5300 14350
Wire Wire Line
	5150 6700 5350 6700
Wire Wire Line
	5200 1850 5300 1850
Wire Wire Line
	5200 2650 5200 1850
Wire Wire Line
	5200 3450 5200 2650
Wire Wire Line
	5200 3450 5300 3450
Wire Wire Line
	5200 4250 5200 3450
Wire Wire Line
	5200 6900 5350 6900
Wire Wire Line
	5200 7700 5200 6900
Wire Wire Line
	5200 8500 5200 7700
Wire Wire Line
	5200 8500 5300 8500
Wire Wire Line
	5200 9300 5200 8500
Wire Wire Line
	5200 9300 5200 10250
Wire Wire Line
	5200 10250 5200 12150
Wire Wire Line
	5200 12150 5300 12150
Wire Wire Line
	5200 12950 5200 12150
Wire Wire Line
	5200 13750 5200 12950
Wire Wire Line
	5200 13750 5300 13750
Wire Wire Line
	5200 14550 5200 13750
Wire Wire Line
	5300 2650 5200 2650
Wire Wire Line
	5300 4250 5200 4250
Wire Wire Line
	5300 7700 5200 7700
Wire Wire Line
	5300 9300 5200 9300
Wire Wire Line
	5300 11950 5150 11950
Wire Wire Line
	5300 12950 5200 12950
Wire Wire Line
	5300 14550 5200 14550
Wire Wire Line
	5600 9500 7250 9500
Wire Wire Line
	5600 10350 5600 9500
Wire Wire Line
	5600 10350 5700 10350
Wire Wire Line
	5600 10750 5600 10350
Wire Wire Line
	5600 10850 5600 10750
Wire Wire Line
	5600 10850 5600 11050
Wire Wire Line
	5600 10850 5700 10850
Wire Wire Line
	5600 11050 8650 11050
Wire Wire Line
	5700 10750 5600 10750
Wire Wire Line
	5750 4450 5750 5300
Wire Wire Line
	5750 4450 7250 4450
Wire Wire Line
	5750 5300 5850 5300
Wire Wire Line
	5750 5700 5750 5300
Wire Wire Line
	5750 5800 5750 5700
Wire Wire Line
	5750 5800 5850 5800
Wire Wire Line
	5800 1650 6250 1650
Wire Wire Line
	5800 3250 6050 3250
Wire Wire Line
	5800 4050 5950 4050
Wire Wire Line
	5800 8300 6050 8300
Wire Wire Line
	5800 9100 5950 9100
Wire Wire Line
	5800 11950 6700 11950
Wire Wire Line
	5800 12050 6200 12050
Wire Wire Line
	5800 13550 6500 13550
Wire Wire Line
	5800 13650 6000 13650
Wire Wire Line
	5800 14350 6400 14350
Wire Wire Line
	5850 5700 5750 5700
Wire Wire Line
	5850 6700 6250 6700
Wire Wire Line
	5900 14450 5800 14450
Wire Wire Line
	5900 14450 5900 15200
Wire Wire Line
	5900 15200 6800 15200
Wire Wire Line
	5950 1400 5950 3550
Wire Wire Line
	5950 3550 5950 3850
Wire Wire Line
	5950 3550 7250 3550
Wire Wire Line
	5950 3850 5950 4050
Wire Wire Line
	5950 4050 5950 4900
Wire Wire Line
	5950 4900 6850 4900
Wire Wire Line
	5950 6450 5950 8600
Wire Wire Line
	5950 8600 5950 8900
Wire Wire Line
	5950 8600 7250 8600
Wire Wire Line
	5950 8900 5950 9100
Wire Wire Line
	5950 9100 5950 9950
Wire Wire Line
	5950 9950 6850 9950
Wire Wire Line
	6000 13650 6000 15100
Wire Wire Line
	6050 1400 6050 2850
Wire Wire Line
	6050 2850 6050 3150
Wire Wire Line
	6050 2850 7250 2850
Wire Wire Line
	6050 3150 6050 3250
Wire Wire Line
	6050 3250 6050 3950
Wire Wire Line
	6050 3950 6050 4800
Wire Wire Line
	6050 6450 6050 7900
Wire Wire Line
	6050 7900 6050 8200
Wire Wire Line
	6050 7900 7250 7900
Wire Wire Line
	6050 8200 6050 8300
Wire Wire Line
	6050 8300 6050 9000
Wire Wire Line
	6050 9000 6050 9850
Wire Wire Line
	6100 12850 5800 12850
Wire Wire Line
	6100 12850 6100 15000
Wire Wire Line
	6100 15000 6800 15000
Wire Wire Line
	6150 1400 6150 2250
Wire Wire Line
	6150 2250 6150 2450
Wire Wire Line
	6150 2250 7250 2250
Wire Wire Line
	6150 2450 5800 2450
Wire Wire Line
	6150 2450 6150 2550
Wire Wire Line
	6150 2550 6150 3250
Wire Wire Line
	6150 3250 6150 4050
Wire Wire Line
	6150 4050 6150 4700
Wire Wire Line
	6150 4700 6850 4700
Wire Wire Line
	6150 6450 6150 7300
Wire Wire Line
	6150 7300 6150 7500
Wire Wire Line
	6150 7300 7250 7300
Wire Wire Line
	6150 7500 5800 7500
Wire Wire Line
	6150 7500 6150 7600
Wire Wire Line
	6150 7600 6150 8300
Wire Wire Line
	6150 8300 6150 9100
Wire Wire Line
	6150 9100 6150 9750
Wire Wire Line
	6150 9750 6850 9750
Wire Wire Line
	6200 10950 8550 10950
Wire Wire Line
	6200 12050 6200 10950
Wire Wire Line
	6200 12050 6200 14900
Wire Wire Line
	6200 14900 6800 14900
Wire Wire Line
	6250 1400 6250 1650
Wire Wire Line
	6250 1650 6250 2050
Wire Wire Line
	6250 2050 6250 2650
Wire Wire Line
	6250 2650 6250 3350
Wire Wire Line
	6250 3350 6250 4150
Wire Wire Line
	6250 4150 6250 4600
Wire Wire Line
	6250 4600 6850 4600
Wire Wire Line
	6250 6450 6250 6700
Wire Wire Line
	6250 6700 6250 7100
Wire Wire Line
	6250 7100 6250 7700
Wire Wire Line
	6250 7700 6250 8400
Wire Wire Line
	6250 8400 6250 9200
Wire Wire Line
	6250 9200 6250 9650
Wire Wire Line
	6250 9650 6850 9650
Wire Wire Line
	6250 10800 6850 10800
Wire Wire Line
	6400 1250 6400 2150
Wire Wire Line
	6400 2150 6400 2750
Wire Wire Line
	6400 2150 6500 2150
Wire Wire Line
	6400 2750 6400 3450
Wire Wire Line
	6400 2750 6500 2750
Wire Wire Line
	6400 3450 6400 4250
Wire Wire Line
	6400 3450 6500 3450
Wire Wire Line
	6400 4250 6500 4250
Wire Wire Line
	6400 5750 6400 6600
Wire Wire Line
	6400 6600 6400 7200
Wire Wire Line
	6400 6600 7250 6600
Wire Wire Line
	6400 7200 6400 7800
Wire Wire Line
	6400 7200 6500 7200
Wire Wire Line
	6400 7800 6400 8500
Wire Wire Line
	6400 7800 6500 7800
Wire Wire Line
	6400 8500 6500 8500
Wire Wire Line
	6400 10550 6400 13850
Wire Wire Line
	6400 10550 7650 10550
Wire Wire Line
	6400 13850 6400 14150
Wire Wire Line
	6400 13850 7700 13850
Wire Wire Line
	6400 14150 6400 14350
Wire Wire Line
	6450 5300 6450 9300
Wire Wire Line
	6450 9300 6500 9300
Wire Wire Line
	6500 750  6500 1550
Wire Wire Line
	6500 1550 7250 1550
Wire Wire Line
	6500 2050 6250 2050
Wire Wire Line
	6500 2550 6150 2550
Wire Wire Line
	6500 2650 6250 2650
Wire Wire Line
	6500 3150 6050 3150
Wire Wire Line
	6500 3250 6150 3250
Wire Wire Line
	6500 3350 6250 3350
Wire Wire Line
	6500 3850 5950 3850
Wire Wire Line
	6500 3950 6050 3950
Wire Wire Line
	6500 4050 6150 4050
Wire Wire Line
	6500 4150 6250 4150
Wire Wire Line
	6500 7100 6250 7100
Wire Wire Line
	6500 7600 6150 7600
Wire Wire Line
	6500 7700 6250 7700
Wire Wire Line
	6500 8200 6050 8200
Wire Wire Line
	6500 8300 6150 8300
Wire Wire Line
	6500 8400 6250 8400
Wire Wire Line
	6500 8900 5950 8900
Wire Wire Line
	6500 9000 6050 9000
Wire Wire Line
	6500 9100 6150 9100
Wire Wire Line
	6500 9200 6250 9200
Wire Wire Line
	6500 11700 6500 13150
Wire Wire Line
	6500 13150 6500 13450
Wire Wire Line
	6500 13150 7700 13150
Wire Wire Line
	6500 13450 6500 13550
Wire Wire Line
	6500 13550 6500 14250
Wire Wire Line
	6600 10450 6600 12550
Wire Wire Line
	6600 10450 7650 10450
Wire Wire Line
	6600 12550 6600 12750
Wire Wire Line
	6600 12550 7700 12550
Wire Wire Line
	6600 12750 5800 12750
Wire Wire Line
	6600 12750 6600 12850
Wire Wire Line
	6600 12850 6600 13550
Wire Wire Line
	6600 13550 6600 14350
Wire Wire Line
	6700 11700 6700 11950
Wire Wire Line
	6700 11950 6700 12350
Wire Wire Line
	6700 12350 6700 12950
Wire Wire Line
	6700 12950 6700 13650
Wire Wire Line
	6700 13650 6700 14450
Wire Wire Line
	6800 15100 6000 15100
Wire Wire Line
	6850 4800 6050 4800
Wire Wire Line
	6850 9850 6050 9850
Wire Wire Line
	6850 10800 6850 11850
Wire Wire Line
	6850 11850 6850 12450
Wire Wire Line
	6850 11850 7700 11850
Wire Wire Line
	6850 12450 6850 13050
Wire Wire Line
	6850 12450 6950 12450
Wire Wire Line
	6850 13050 6850 13750
Wire Wire Line
	6850 13050 6950 13050
Wire Wire Line
	6850 13750 6850 14600
Wire Wire Line
	6850 13750 6950 13750
Wire Wire Line
	6900 10350 6300 10350
Wire Wire Line
	6900 10350 6900 14550
Wire Wire Line
	6900 14550 6950 14550
Wire Wire Line
	6950 12350 6700 12350
Wire Wire Line
	6950 12850 6600 12850
Wire Wire Line
	6950 12950 6700 12950
Wire Wire Line
	6950 13450 6500 13450
Wire Wire Line
	6950 13550 6600 13550
Wire Wire Line
	6950 13650 6700 13650
Wire Wire Line
	6950 14150 6400 14150
Wire Wire Line
	6950 14250 6500 14250
Wire Wire Line
	6950 14350 6600 14350
Wire Wire Line
	6950 14450 6700 14450
Wire Wire Line
	7050 2100 7050 2150
Wire Wire Line
	7050 2150 7250 2150
Wire Wire Line
	7050 7150 7050 7200
Wire Wire Line
	7050 7200 7250 7200
Wire Wire Line
	7100 2750 7100 2650
Wire Wire Line
	7100 3450 7100 3300
Wire Wire Line
	7100 7800 7100 7700
Wire Wire Line
	7100 8500 7100 8350
Wire Wire Line
	7250 1650 6250 1650
Wire Wire Line
	7250 2750 7100 2750
Wire Wire Line
	7250 3450 7100 3450
Wire Wire Line
	7250 4450 7250 4050
Wire Wire Line
	7250 6700 6250 6700
Wire Wire Line
	7250 7800 7100 7800
Wire Wire Line
	7250 8500 7100 8500
Wire Wire Line
	7250 9500 7250 9100
Wire Wire Line
	7500 12400 7500 12450
Wire Wire Line
	7500 12450 7700 12450
Wire Wire Line
	7550 13050 7550 12950
Wire Wire Line
	7550 13750 7550 13600
Wire Wire Line
	7700 11950 6700 11950
Wire Wire Line
	7700 13050 7550 13050
Wire Wire Line
	7700 13750 7550 13750
Wire Wire Line
	7800 2200 8000 2200
Wire Wire Line
	7800 2800 8100 2800
Wire Wire Line
	7800 3500 8200 3500
Wire Wire Line
	7800 7250 8000 7250
Wire Wire Line
	7800 7850 8100 7850
Wire Wire Line
	7800 8550 8200 8550
Wire Wire Line
	7900 1150 7900 1600
Wire Wire Line
	7900 1600 7800 1600
Wire Wire Line
	7900 6200 7900 6650
Wire Wire Line
	7900 6650 7800 6650
Wire Wire Line
	8000 1050 4250 1050
Wire Wire Line
	8000 2200 8000 1050
Wire Wire Line
	8000 6100 3450 6100
Wire Wire Line
	8000 7250 8000 6100
Wire Wire Line
	8100 950  4150 950 
Wire Wire Line
	8100 2800 8100 950 
Wire Wire Line
	8100 6000 3350 6000
Wire Wire Line
	8100 7850 8100 6000
Wire Wire Line
	8200 850  4050 850 
Wire Wire Line
	8200 850  8200 3500
Wire Wire Line
	8200 5900 3250 5900
Wire Wire Line
	8200 5900 8200 8550
Wire Wire Line
	8250 12500 8450 12500
Wire Wire Line
	8250 13100 8550 13100
Wire Wire Line
	8250 13800 8650 13800
Wire Wire Line
	8350 11450 8350 11900
Wire Wire Line
	8350 11900 8250 11900
Wire Wire Line
	8450 10550 8800 10550
Wire Wire Line
	8450 12500 8450 11350
Wire Wire Line
	8550 10650 8800 10650
Wire Wire Line
	8550 10950 8550 10650
Wire Wire Line
	8550 13100 8550 11250
Wire Wire Line
	8650 11050 8650 10750
Wire Wire Line
	8650 11150 8650 13800
Wire Wire Line
	8800 10750 8650 10750
Wire Bus Line
	6900 14700 7700 14700
Wire Bus Line
	6950 5100 8350 5100
Wire Bus Line
	6950 10150 8350 10150
Wire Bus Line
	8350 10150 8350 5100
Wire Bus Line
	8450 5100 8350 5100
Text Notes 7550 10450 2    50   ~ 10
~ADDR10
Text Notes 7550 10550 2    50   ~ 10
~ADDR12
Text Notes 8700 10750 0    50   ~ 10
LO
Text Notes 8800 10650 2    50   ~ 10
ADDR9
Text Notes 9700 11350 2    50   ~ 10
if PALETTE-BASE0 = 0\nEnds with 0x1800\nif PALETTE-BASE0 = 1\nEnds with 0x0400
Text Label 6750 14900 2    50   ~ 0
LUT-CNT8
Text Label 6750 15000 2    50   ~ 0
LUT-CNT9
Text Label 6750 15100 2    50   ~ 0
LUT-CNT10
Text Label 6750 15200 2    50   ~ 0
LUT-CNT11
Text Label 6800 4600 2    50   ~ 0
~LUT-CNT0
Text Label 6800 4700 2    50   ~ 0
~LUT-CNT1
Text Label 6800 4800 2    50   ~ 0
~LUT-CNT2
Text Label 6800 4900 2    50   ~ 0
~LUT-CNT3
Text Label 6800 9650 2    50   ~ 0
~LUT-CNT4
Text Label 6800 9750 2    50   ~ 0
~LUT-CNT5
Text Label 6800 9850 2    50   ~ 0
~LUT-CNT6
Text Label 6800 9950 2    50   ~ 0
~LUT-CNT7
Text HLabel 1200 4000 0    50   Input ~ 0
~DEBUG5
Text HLabel 1200 4100 0    50   Input ~ 0
LUTPRO
Text HLabel 1200 14550 0    50   Input ~ 0
MAIN-RESET
Text HLabel 2200 750  0    50   Input ~ 0
~BUS-WSTLUT
Text HLabel 3050 5550 0    50   Input ~ 0
~DEBUG5
Text HLabel 5050 10250 0    50   Input ~ 0
~CLK4M
Text HLabel 7650 10650 0    50   Input ~ 0
~PALETTE-BASE0
Text HLabel 7700 14700 2    50   Output ~ 0
LUT-CNT[8..11]
Text HLabel 8450 5100 2    50   Output ~ 0
~LUT-CNT[0..7]
Text HLabel 9350 10650 2    50   Output ~ 0
WSTLUT-END
$Comp
L A5C:AND02 UAD440
U 1 1 61118E27
P 1450 4050
F 0 "UAD440" H 1475 4317 50  0000 C CNN
F 1 "AND02" H 1475 4226 50  0000 C CNN
F 2 "" H 1450 4050 50  0001 C CNN
F 3 "" H 1450 4050 50  0001 C CNN
	1    1450 4050
	1    0    0    -1  
$EndComp
$Comp
L A5C:AND02 UAD453
U 1 1 61118E26
P 2700 4100
F 0 "UAD453" H 2725 4367 50  0000 C CNN
F 1 "AND02" H 2725 4276 50  0000 C CNN
F 2 "" H 2700 4100 50  0001 C CNN
F 3 "" H 2700 4100 50  0001 C CNN
	1    2700 4100
	1    0    0    -1  
$EndComp
$Comp
L A5C:AND02 UBB98
U 1 1 61118E29
P 2800 6650
F 0 "UBB98" H 2825 6917 50  0000 C CNN
F 1 "AND02" H 2825 6826 50  0000 C CNN
F 2 "" H 2800 6650 50  0001 C CNN
F 3 "" H 2800 6650 50  0001 C CNN
	1    2800 6650
	1    0    0    -1  
$EndComp
$Comp
L A5C:AND02 UBB106
U 1 1 61118E2B
P 2800 9250
F 0 "UBB106" H 2825 9517 50  0000 C CNN
F 1 "AND02" H 2825 9426 50  0000 C CNN
F 2 "" H 2800 9250 50  0001 C CNN
F 3 "" H 2800 9250 50  0001 C CNN
	1    2800 9250
	1    0    0    -1  
$EndComp
$Comp
L A5C:AND02 UBA111
U 1 1 61118E22
P 2800 11900
F 0 "UBA111" H 2825 12167 50  0000 C CNN
F 1 "AND02" H 2825 12076 50  0000 C CNN
F 2 "" H 2800 11900 50  0001 C CNN
F 3 "" H 2800 11900 50  0001 C CNN
	1    2800 11900
	1    0    0    -1  
$EndComp
$Comp
L A5C:AND02 UAD450
U 1 1 61118E23
P 2800 14500
F 0 "UAD450" H 2825 14767 50  0000 C CNN
F 1 "AND02" H 2825 14676 50  0000 C CNN
F 2 "" H 2800 14500 50  0001 C CNN
F 3 "" H 2800 14500 50  0001 C CNN
	1    2800 14500
	1    0    0    -1  
$EndComp
$Comp
L A5C:NAND02 UBB132
U 1 1 61118E1E
P 4800 1650
F 0 "UBB132" H 4825 1917 50  0000 C CNN
F 1 "NAND02" H 4825 1826 50  0000 C CNN
F 2 "" H 4800 1650 50  0001 C CNN
F 3 "" H 4800 1650 50  0001 C CNN
	1    4800 1650
	1    0    0    -1  
$EndComp
$Comp
L A5C:NAND02 UBA154
U 1 1 61118E20
P 4800 2450
F 0 "UBA154" H 4825 2717 50  0000 C CNN
F 1 "NAND02" H 4825 2626 50  0000 C CNN
F 2 "" H 4800 2450 50  0001 C CNN
F 3 "" H 4800 2450 50  0001 C CNN
	1    4800 2450
	1    0    0    -1  
$EndComp
$Comp
L A5C:NAND02 UAD480
U 1 1 61118E1F
P 4800 3250
F 0 "UAD480" H 4825 3517 50  0000 C CNN
F 1 "NAND02" H 4825 3426 50  0000 C CNN
F 2 "" H 4800 3250 50  0001 C CNN
F 3 "" H 4800 3250 50  0001 C CNN
	1    4800 3250
	1    0    0    -1  
$EndComp
$Comp
L A5C:NAND02 UBA136
U 1 1 61118E1D
P 4800 4050
F 0 "UBA136" H 4825 4317 50  0000 C CNN
F 1 "NAND02" H 4825 4226 50  0000 C CNN
F 2 "" H 4800 4050 50  0001 C CNN
F 3 "" H 4800 4050 50  0001 C CNN
	1    4800 4050
	1    0    0    -1  
$EndComp
$Comp
L A5C:NAND02 UBI163
U 1 1 75D66ACC
P 5950 10800
F 0 "UBI163" H 5975 11067 50  0000 C CNN
F 1 "NAND02" H 5975 10976 50  0000 C CNN
F 2 "" H 5950 10800 50  0001 C CNN
F 3 "" H 5950 10800 50  0001 C CNN
	1    5950 10800
	1    0    0    -1  
$EndComp
$Comp
L A5C:NAND02 UBA163
U 1 1 61CE19F5
P 6100 5750
F 0 "UBA163" H 6125 6017 50  0000 C CNN
F 1 "NAND02" H 6125 5926 50  0000 C CNN
F 2 "" H 6100 5750 50  0001 C CNN
F 3 "" H 6100 5750 50  0001 C CNN
	1    6100 5750
	1    0    0    -1  
$EndComp
$Comp
L A5C:NOR02 UAD494
U 1 1 7B57DD89
P 6750 2100
F 0 "UAD494" H 6775 2367 50  0000 C CNN
F 1 "NOR02" H 6775 2276 50  0000 C CNN
F 2 "" H 6750 2100 50  0001 C CNN
F 3 "" H 6750 2100 50  0001 C CNN
	1    6750 2100
	1    0    0    -1  
$EndComp
$Comp
L A5C:NOR02 UBC132
U 1 1 61CE19FB
P 6750 7150
F 0 "UBC132" H 6775 7417 50  0000 C CNN
F 1 "NOR02" H 6775 7326 50  0000 C CNN
F 2 "" H 6750 7150 50  0001 C CNN
F 3 "" H 6750 7150 50  0001 C CNN
	1    6750 7150
	1    0    0    -1  
$EndComp
$Comp
L A5C:NOR02 UBE146
U 1 1 75D66AD2
P 7200 12400
F 0 "UBE146" H 7225 12667 50  0000 C CNN
F 1 "NOR02" H 7225 12576 50  0000 C CNN
F 2 "" H 7200 12400 50  0001 C CNN
F 3 "" H 7200 12400 50  0001 C CNN
	1    7200 12400
	1    0    0    -1  
$EndComp
$Comp
L A5C:XNOR02 UBB128
U 1 1 61118E1C
P 7500 1600
F 0 "UBB128" H 7525 1867 50  0000 C CNN
F 1 "XNOR02" H 7525 1776 50  0000 C CNN
F 2 "" H 7525 1600 50  0001 C CNN
F 3 "" H 7525 1600 50  0001 C CNN
	1    7500 1600
	1    0    0    -1  
$EndComp
$Comp
L A5C:XNOR02 UAD497
U 1 1 7B57DD95
P 7500 2200
F 0 "UAD497" H 7525 2467 50  0000 C CNN
F 1 "XNOR02" H 7525 2376 50  0000 C CNN
F 2 "" H 7525 2200 50  0001 C CNN
F 3 "" H 7525 2200 50  0001 C CNN
	1    7500 2200
	1    0    0    -1  
$EndComp
$Comp
L A5C:XNOR02 UAD481
U 1 1 7B57DD9B
P 7500 2800
F 0 "UAD481" H 7525 3067 50  0000 C CNN
F 1 "XNOR02" H 7525 2976 50  0000 C CNN
F 2 "" H 7525 2800 50  0001 C CNN
F 3 "" H 7525 2800 50  0001 C CNN
	1    7500 2800
	1    0    0    -1  
$EndComp
$Comp
L A5C:XNOR02 UBA143
U 1 1 7B57DDA1
P 7500 3500
F 0 "UBA143" H 7525 3767 50  0000 C CNN
F 1 "XNOR02" H 7525 3676 50  0000 C CNN
F 2 "" H 7525 3500 50  0001 C CNN
F 3 "" H 7525 3500 50  0001 C CNN
	1    7500 3500
	1    0    0    -1  
$EndComp
$Comp
L A5C:XOR02 UBC144
U 1 1 61CE1A01
P 7500 6650
F 0 "UBC144" H 7525 6917 50  0000 C CNN
F 1 "XOR02" H 7525 6826 50  0000 C CNN
F 2 "" H 7500 6650 50  0001 C CNN
F 3 "" H 7500 6650 50  0001 C CNN
	1    7500 6650
	1    0    0    -1  
$EndComp
$Comp
L A5C:XNOR02 UBC116
U 1 1 61CE1A07
P 7500 7250
F 0 "UBC116" H 7525 7517 50  0000 C CNN
F 1 "XNOR02" H 7525 7426 50  0000 C CNN
F 2 "" H 7525 7250 50  0001 C CNN
F 3 "" H 7525 7250 50  0001 C CNN
	1    7500 7250
	1    0    0    -1  
$EndComp
$Comp
L A5C:XNOR02 UBC178
U 1 1 61CE1A0D
P 7500 7850
F 0 "UBC178" H 7525 8117 50  0000 C CNN
F 1 "XNOR02" H 7525 8026 50  0000 C CNN
F 2 "" H 7525 7850 50  0001 C CNN
F 3 "" H 7525 7850 50  0001 C CNN
	1    7500 7850
	1    0    0    -1  
$EndComp
$Comp
L A5C:XNOR02 UBC151
U 1 1 61CE1A13
P 7500 8550
F 0 "UBC151" H 7525 8817 50  0000 C CNN
F 1 "XNOR02" H 7525 8726 50  0000 C CNN
F 2 "" H 7525 8550 50  0001 C CNN
F 3 "" H 7525 8550 50  0001 C CNN
	1    7500 8550
	1    0    0    -1  
$EndComp
$Comp
L A5C:XOR02 UBE132
U 1 1 75D66AD8
P 7950 11900
F 0 "UBE132" H 7975 12167 50  0000 C CNN
F 1 "XOR02" H 7975 12076 50  0000 C CNN
F 2 "" H 7950 11900 50  0001 C CNN
F 3 "" H 7950 11900 50  0001 C CNN
	1    7950 11900
	1    0    0    -1  
$EndComp
$Comp
L A5C:XNOR02 UBF135
U 1 1 75D66ADE
P 7950 12500
F 0 "UBF135" H 7975 12767 50  0000 C CNN
F 1 "XNOR02" H 7975 12676 50  0000 C CNN
F 2 "" H 7975 12500 50  0001 C CNN
F 3 "" H 7975 12500 50  0001 C CNN
	1    7950 12500
	1    0    0    -1  
$EndComp
$Comp
L A5C:XNOR02 UEB315
U 1 1 75D66AE4
P 7950 13100
F 0 "UEB315" H 7975 13367 50  0000 C CNN
F 1 "XNOR02" H 7975 13276 50  0000 C CNN
F 2 "" H 7975 13100 50  0001 C CNN
F 3 "" H 7975 13100 50  0001 C CNN
	1    7950 13100
	1    0    0    -1  
$EndComp
$Comp
L A5C:XNOR02 UEC309
U 1 1 75D66AEA
P 7950 13800
F 0 "UEC309" H 7975 14067 50  0000 C CNN
F 1 "XNOR02" H 7975 13976 50  0000 C CNN
F 2 "" H 7975 13800 50  0001 C CNN
F 3 "" H 7975 13800 50  0001 C CNN
	1    7950 13800
	1    0    0    -1  
$EndComp
$Comp
L A5C:AND03 UBF141
U 1 1 61CC82EF
P 9050 10650
F 0 "UBF141" H 9075 10942 50  0000 C CNN
F 1 "AND03" H 9075 10851 50  0000 C CNN
F 2 "" H 9050 10650 50  0001 C CNN
F 3 "" H 9050 10650 50  0001 C CNN
	1    9050 10650
	1    0    0    -1  
$EndComp
$Comp
L A5C:INV01 UBA89
U 1 1 61118E21
P 1500 14550
F 0 "UBA89" H 1500 14867 50  0000 C CNN
F 1 "INV01" H 1500 14776 50  0000 C CNN
F 2 "" H 1500 14350 50  0001 C CNN
F 3 "" H 1500 14350 50  0001 C CNN
	1    1500 14550
	1    0    0    -1  
$EndComp
$Comp
L A5C:INV01 UBB95
U 1 1 61118E2A
P 2050 6600
F 0 "UBB95" H 2050 6917 50  0000 C CNN
F 1 "INV01" H 2050 6826 50  0000 C CNN
F 2 "" H 2050 6400 50  0001 C CNN
F 3 "" H 2050 6400 50  0001 C CNN
	1    2050 6600
	1    0    0    -1  
$EndComp
$Comp
L A5C:INV01 UBA100
U 1 1 61118E24
P 2050 11850
F 0 "UBA100" H 2050 12167 50  0000 C CNN
F 1 "INV01" H 2050 12076 50  0000 C CNN
F 2 "" H 2050 11650 50  0001 C CNN
F 3 "" H 2050 11650 50  0001 C CNN
	1    2050 11850
	1    0    0    -1  
$EndComp
$Comp
L A5C:INV01 UBB133
U 1 1 61118E1A
P 2500 750
F 0 "UBB133" H 2500 1067 50  0000 C CNN
F 1 "INV01" H 2500 976 50  0000 C CNN
F 2 "" H 2500 550 50  0001 C CNN
F 3 "" H 2500 550 50  0001 C CNN
	1    2500 750 
	1    0    0    1   
$EndComp
$Comp
L A5C:INV01 UBA130
U 1 1 61118E1B
P 3100 1250
F 0 "UBA130" H 3100 1567 50  0000 C CNN
F 1 "INV01" H 3100 1476 50  0000 C CNN
F 2 "" H 3100 1050 50  0001 C CNN
F 3 "" H 3100 1050 50  0001 C CNN
	1    3100 1250
	1    0    0    -1  
$EndComp
$Comp
L A5C:INV01 UBB97
U 1 1 61118E28
P 3350 5550
F 0 "UBB97" H 3350 5867 50  0000 C CNN
F 1 "INV01" H 3350 5776 50  0000 C CNN
F 2 "" H 3350 5350 50  0001 C CNN
F 3 "" H 3350 5350 50  0001 C CNN
	1    3350 5550
	1    0    0    -1  
$EndComp
$Comp
L A5C:INV01 UEC327
U 1 1 75D66AF0
P 6000 10350
F 0 "UEC327" H 6000 10667 50  0000 C CNN
F 1 "INV01" H 6000 10576 50  0000 C CNN
F 2 "" H 6000 10150 50  0001 C CNN
F 3 "" H 6000 10150 50  0001 C CNN
	1    6000 10350
	1    0    0    -1  
$EndComp
$Comp
L A5C:INV01 UBA176
U 1 1 61CE1A25
P 6150 5300
F 0 "UBA176" H 6150 5617 50  0000 C CNN
F 1 "INV01" H 6150 5526 50  0000 C CNN
F 2 "" H 6150 5100 50  0001 C CNN
F 3 "" H 6150 5100 50  0001 C CNN
	1    6150 5300
	1    0    0    -1  
$EndComp
$Comp
L A5C:NOR03 UAD491
U 1 1 7B57DDAD
P 6800 2650
F 0 "UAD491" H 6800 2967 50  0000 C CNN
F 1 "NOR03" H 6800 2876 50  0000 C CNN
F 2 "" H 6800 2650 50  0001 C CNN
F 3 "" H 6800 2650 50  0001 C CNN
	1    6800 2650
	1    0    0    -1  
$EndComp
$Comp
L A5C:NOR03 UBC174
U 1 1 61CE1A2B
P 6800 7700
F 0 "UBC174" H 6800 8017 50  0000 C CNN
F 1 "NOR03" H 6800 7926 50  0000 C CNN
F 2 "" H 6800 7700 50  0001 C CNN
F 3 "" H 6800 7700 50  0001 C CNN
	1    6800 7700
	1    0    0    -1  
$EndComp
$Comp
L A5C:NOR03 UCB505
U 1 1 75D66AF6
P 7250 12950
F 0 "UCB505" H 7250 13267 50  0000 C CNN
F 1 "NOR03" H 7250 13176 50  0000 C CNN
F 2 "" H 7250 12950 50  0001 C CNN
F 3 "" H 7250 12950 50  0001 C CNN
	1    7250 12950
	1    0    0    -1  
$EndComp
$Comp
L A5C:DFFCOO UBB124
U 1 1 7B57DDBF
P 5550 1750
F 0 "UBB124" H 5550 2115 50  0000 C CNN
F 1 "DFFCOO" H 5550 2024 50  0000 C CNN
F 2 "" H 5550 1750 50  0001 C CNN
F 3 "" H 5550 1750 50  0001 C CNN
	1    5550 1750
	1    0    0    -1  
$EndComp
$Comp
L A5C:DFFCOO UBA158
U 1 1 7B57DE09
P 5550 2550
F 0 "UBA158" H 5550 2915 50  0000 C CNN
F 1 "DFFCOO" H 5550 2824 50  0000 C CNN
F 2 "" H 5550 2550 50  0001 C CNN
F 3 "" H 5550 2550 50  0001 C CNN
	1    5550 2550
	1    0    0    -1  
$EndComp
$Comp
L A5C:DFFCOO UBA132
U 1 1 7B57DDB3
P 5550 3350
F 0 "UBA132" H 5550 3715 50  0000 C CNN
F 1 "DFFCOO" H 5550 3624 50  0000 C CNN
F 2 "" H 5550 3350 50  0001 C CNN
F 3 "" H 5550 3350 50  0001 C CNN
	1    5550 3350
	1    0    0    -1  
$EndComp
$Comp
L A5C:DFFCOO UBA145
U 1 1 7B57DDB9
P 5550 4150
F 0 "UBA145" H 5550 4515 50  0000 C CNN
F 1 "DFFCOO" H 5550 4424 50  0000 C CNN
F 2 "" H 5550 4150 50  0001 C CNN
F 3 "" H 5550 4150 50  0001 C CNN
	1    5550 4150
	1    0    0    -1  
$EndComp
$Comp
L A5C:DFFCOO UBE119
U 1 1 61CE1A31
P 5550 7600
F 0 "UBE119" H 5550 7965 50  0000 C CNN
F 1 "DFFCOO" H 5550 7874 50  0000 C CNN
F 2 "" H 5550 7600 50  0001 C CNN
F 3 "" H 5550 7600 50  0001 C CNN
	1    5550 7600
	1    0    0    -1  
$EndComp
$Comp
L A5C:DFFCOO UBE174
U 1 1 61CE1A37
P 5550 8400
F 0 "UBE174" H 5550 8765 50  0000 C CNN
F 1 "DFFCOO" H 5550 8674 50  0000 C CNN
F 2 "" H 5550 8400 50  0001 C CNN
F 3 "" H 5550 8400 50  0001 C CNN
	1    5550 8400
	1    0    0    -1  
$EndComp
$Comp
L A5C:DFFCOO UBD143
U 1 1 61CE1A3D
P 5550 9200
F 0 "UBD143" H 5550 9565 50  0000 C CNN
F 1 "DFFCOO" H 5550 9474 50  0000 C CNN
F 2 "" H 5550 9200 50  0001 C CNN
F 3 "" H 5550 9200 50  0001 C CNN
	1    5550 9200
	1    0    0    -1  
$EndComp
$Comp
L A5C:DFFCOO UBG180
U 1 1 75D66B08
P 5550 12050
F 0 "UBG180" H 5550 12415 50  0000 C CNN
F 1 "DFFCOO" H 5550 12324 50  0000 C CNN
F 2 "" H 5550 12050 50  0001 C CNN
F 3 "" H 5550 12050 50  0001 C CNN
	1    5550 12050
	1    0    0    -1  
$EndComp
$Comp
L A5C:DFFCOO UEB275
U 1 1 75D66B53
P 5550 12850
F 0 "UEB275" H 5550 13215 50  0000 C CNN
F 1 "DFFCOO" H 5550 13124 50  0000 C CNN
F 2 "" H 5550 12850 50  0001 C CNN
F 3 "" H 5550 12850 50  0001 C CNN
	1    5550 12850
	1    0    0    -1  
$EndComp
$Comp
L A5C:DFFCOO UEB325
U 1 1 75D66AFC
P 5550 13650
F 0 "UEB325" H 5550 14015 50  0000 C CNN
F 1 "DFFCOO" H 5550 13924 50  0000 C CNN
F 2 "" H 5550 13650 50  0001 C CNN
F 3 "" H 5550 13650 50  0001 C CNN
	1    5550 13650
	1    0    0    -1  
$EndComp
$Comp
L A5C:DFFCOO UEA259
U 1 1 75D66B02
P 5550 14450
F 0 "UEA259" H 5550 14815 50  0000 C CNN
F 1 "DFFCOO" H 5550 14724 50  0000 C CNN
F 2 "" H 5550 14450 50  0001 C CNN
F 3 "" H 5550 14450 50  0001 C CNN
	1    5550 14450
	1    0    0    -1  
$EndComp
$Comp
L A5C:DFFCOO UBD137
U 1 1 61CE1A43
P 5600 6800
F 0 "UBD137" H 5600 7165 50  0000 C CNN
F 1 "DFFCOO" H 5600 7074 50  0000 C CNN
F 2 "" H 5600 6800 50  0001 C CNN
F 3 "" H 5600 6800 50  0001 C CNN
	1    5600 6800
	1    0    0    -1  
$EndComp
$Comp
L A5C:NOR04 UBA140
U 1 1 7B57DDC5
P 6800 3300
F 0 "UBA140" H 6800 3642 50  0000 C CNN
F 1 "NOR04" H 6800 3551 50  0000 C CNN
F 2 "" H 6800 3300 50  0001 C CNN
F 3 "" H 6800 3300 50  0001 C CNN
	1    6800 3300
	1    0    0    -1  
$EndComp
$Comp
L A5C:NOR04 UBC168
U 1 1 61CE1A49
P 6800 8350
F 0 "UBC168" H 6800 8692 50  0000 C CNN
F 1 "NOR04" H 6800 8601 50  0000 C CNN
F 2 "" H 6800 8350 50  0001 C CNN
F 3 "" H 6800 8350 50  0001 C CNN
	1    6800 8350
	1    0    0    -1  
$EndComp
$Comp
L A5C:NOR04 UEA308
U 1 1 75D66B0E
P 7250 13600
F 0 "UEA308" H 7250 13942 50  0000 C CNN
F 1 "NOR04" H 7250 13851 50  0000 C CNN
F 2 "" H 7250 13600 50  0001 C CNN
F 3 "" H 7250 13600 50  0001 C CNN
	1    7250 13600
	1    0    0    -1  
$EndComp
$Comp
L A5C:OAI21 UEA257
U 1 1 61118E25
P 8050 10550
F 0 "UEA257" H 8050 10867 50  0000 C CNN
F 1 "OAI21" H 8050 10776 50  0000 C CNN
F 2 "" H 8100 10400 50  0001 C CNN
F 3 "" H 8100 10400 50  0001 C CNN
	1    8050 10550
	1    0    0    -1  
$EndComp
$Comp
L A5C:AOI22 UBD113
U 1 1 61CE1A4F
P 4650 7450
F 0 "UBD113" H 4675 7767 50  0000 C CNN
F 1 "AOI22" H 4675 7676 50  0000 C CNN
F 2 "" H 4800 7450 50  0001 C CNN
F 3 "" H 4800 7450 50  0001 C CNN
	1    4650 7450
	1    0    0    -1  
$EndComp
$Comp
L A5C:AOI22 UBC159
U 1 1 61CE1A55
P 4650 8250
F 0 "UBC159" H 4675 8567 50  0000 C CNN
F 1 "AOI22" H 4675 8476 50  0000 C CNN
F 2 "" H 4800 8250 50  0001 C CNN
F 3 "" H 4800 8250 50  0001 C CNN
	1    4650 8250
	1    0    0    -1  
$EndComp
$Comp
L A5C:AOI22 UBD124
U 1 1 61CE1A5B
P 4650 9050
F 0 "UBD124" H 4675 9367 50  0000 C CNN
F 1 "AOI22" H 4675 9276 50  0000 C CNN
F 2 "" H 4800 9050 50  0001 C CNN
F 3 "" H 4800 9050 50  0001 C CNN
	1    4650 9050
	1    0    0    -1  
$EndComp
$Comp
L A5C:AOI22 UBF127
U 1 1 75D66B14
P 4650 12700
F 0 "UBF127" H 4675 13017 50  0000 C CNN
F 1 "AOI22" H 4675 12926 50  0000 C CNN
F 2 "" H 4800 12700 50  0001 C CNN
F 3 "" H 4800 12700 50  0001 C CNN
	1    4650 12700
	1    0    0    -1  
$EndComp
$Comp
L A5C:AOI22 UEB281
U 1 1 75D66B1A
P 4650 13500
F 0 "UEB281" H 4675 13817 50  0000 C CNN
F 1 "AOI22" H 4675 13726 50  0000 C CNN
F 2 "" H 4800 13500 50  0001 C CNN
F 3 "" H 4800 13500 50  0001 C CNN
	1    4650 13500
	1    0    0    -1  
$EndComp
$Comp
L A5C:AOI22 UEA266
U 1 1 75D66B20
P 4650 14300
F 0 "UEA266" H 4675 14617 50  0000 C CNN
F 1 "AOI22" H 4675 14526 50  0000 C CNN
F 2 "" H 4800 14300 50  0001 C CNN
F 3 "" H 4800 14300 50  0001 C CNN
	1    4650 14300
	1    0    0    -1  
$EndComp
$Comp
L A5C:AOI22 UBD133
U 1 1 61CE1A61
P 4700 6650
F 0 "UBD133" H 4725 6967 50  0000 C CNN
F 1 "AOI22" H 4725 6876 50  0000 C CNN
F 2 "" H 4850 6650 50  0001 C CNN
F 3 "" H 4850 6650 50  0001 C CNN
	1    4700 6650
	1    0    0    -1  
$EndComp
$Comp
L A5C:AOI22 UBD121
U 1 1 75D66B26
P 4700 11900
F 0 "UBD121" H 4725 12217 50  0000 C CNN
F 1 "AOI22" H 4725 12126 50  0000 C CNN
F 2 "" H 4850 11900 50  0001 C CNN
F 3 "" H 4850 11900 50  0001 C CNN
	1    4700 11900
	1    0    0    -1  
$EndComp
$Comp
L A5C:NOR05 UBA151
U 1 1 7B57DDE3
P 6800 4050
F 0 "UBA151" H 6875 4465 50  0000 C CNN
F 1 "NOR05" H 6875 4374 50  0000 C CNN
F 2 "" H 6800 4100 50  0001 C CNN
F 3 "" H 6800 4100 50  0001 C CNN
	1    6800 4050
	1    0    0    -1  
$EndComp
$Comp
L A5C:NOR05 UBC171
U 1 1 61CE1A67
P 6800 9100
F 0 "UBC171" H 6875 9515 50  0000 C CNN
F 1 "NOR05" H 6875 9424 50  0000 C CNN
F 2 "" H 6800 9150 50  0001 C CNN
F 3 "" H 6800 9150 50  0001 C CNN
	1    6800 9100
	1    0    0    -1  
$EndComp
$Comp
L A5C:NOR05 UEA331
U 1 1 75D66B2C
P 7250 14350
F 0 "UEA331" H 7325 14765 50  0000 C CNN
F 1 "NOR05" H 7325 14674 50  0000 C CNN
F 2 "" H 7250 14400 50  0001 C CNN
F 3 "" H 7250 14400 50  0001 C CNN
	1    7250 14350
	1    0    0    -1  
$EndComp
NoConn ~ 5850 6800
NoConn ~ 5800 7600
NoConn ~ 5800 8400
NoConn ~ 5800 9200
NoConn ~ 5800 4150
NoConn ~ 5800 3350
NoConn ~ 5800 2550
NoConn ~ 5800 1750
Wire Wire Line
	5200 6900 5200 4250
Connection ~ 5200 6900
Connection ~ 5200 4250
Wire Bus Line
	6900 14700 6900 15100
Wire Bus Line
	6950 4700 6950 5100
Wire Bus Line
	6950 9750 6950 10150
$EndSCHEMATC
