EESchema Schematic File Version 4
EELAYER 30 0
EELAYER END
$Descr A4 11693 8268
encoding utf-8
Sheet 65 83
Title "CPS Reverse Engineering: DL-0311"
Date "2021-09-12"
Rev ""
Comp ""
Comment1 ""
Comment2 ""
Comment3 "Licence: CC-BY"
Comment4 "Author: Loïc *WydD* Petit"
$EndDescr
Connection ~ 10650 4800
Connection ~ 3550 4950
Connection ~ 4950 2550
Connection ~ 6350 2200
Connection ~ 6450 2600
Connection ~ 6100 6100
Connection ~ 6250 1350
Connection ~ 6150 2500
Entry Wire Line
	1550 4300 1650 4400
Entry Wire Line
	1550 4400 1650 4500
Entry Wire Line
	1550 4500 1650 4600
Entry Wire Line
	1550 4600 1650 4700
Entry Wire Line
	1550 4700 1650 4800
Entry Wire Line
	1550 4800 1650 4900
Entry Wire Line
	1550 4900 1650 5000
Entry Wire Line
	1550 5000 1650 5100
Entry Wire Line
	2350 3450 2250 3350
Entry Wire Line
	2450 3450 2350 3350
Entry Wire Line
	2450 5950 2350 5850
Entry Wire Line
	2550 3450 2450 3350
Entry Wire Line
	2550 5950 2450 5850
Entry Wire Line
	2650 3450 2550 3350
Entry Wire Line
	2650 5950 2550 5850
Entry Wire Line
	2750 3450 2650 3350
Entry Wire Line
	2750 5950 2650 5850
Entry Wire Line
	2850 3450 2750 3350
Entry Wire Line
	2850 5950 2750 5850
Entry Wire Line
	2950 3450 2850 3350
Entry Wire Line
	2950 5950 2850 5850
Entry Wire Line
	3050 3450 2950 3350
Entry Wire Line
	3050 5950 2950 5850
Entry Wire Line
	3150 3450 3050 3350
Entry Wire Line
	3150 5950 3050 5850
Entry Wire Line
	3250 3450 3150 3350
Entry Wire Line
	3250 5950 3150 5850
Entry Wire Line
	3350 5950 3250 5850
Entry Wire Line
	8050 4150 8150 4250
Entry Wire Line
	8050 4250 8150 4350
Entry Wire Line
	8050 4350 8150 4450
Entry Wire Line
	8050 4450 8150 4550
Entry Wire Line
	8050 4550 8150 4650
Entry Wire Line
	8050 4650 8150 4750
Entry Wire Line
	8050 4750 8150 4850
Entry Wire Line
	8050 4850 8150 4950
Entry Wire Line
	8850 3150 8750 3050
Entry Wire Line
	8850 5850 8750 5950
Entry Wire Line
	8950 3150 8850 3050
Entry Wire Line
	8950 5850 8850 5950
Entry Wire Line
	9050 3150 8950 3050
Entry Wire Line
	9050 5850 8950 5950
Entry Wire Line
	9150 3150 9050 3050
Entry Wire Line
	9150 5850 9050 5950
Entry Wire Line
	9250 3150 9150 3050
Entry Wire Line
	9250 5850 9150 5950
Entry Wire Line
	9350 3150 9250 3050
Entry Wire Line
	9350 5850 9250 5950
Entry Wire Line
	9450 3150 9350 3050
Entry Wire Line
	9450 5850 9350 5950
Entry Wire Line
	9550 3150 9450 3050
Entry Wire Line
	9550 5850 9450 5950
Entry Wire Line
	9650 3150 9550 3050
Entry Wire Line
	9650 5850 9550 5950
Entry Wire Line
	9750 3150 9650 3050
Entry Wire Line
	9750 5850 9650 5950
Entry Wire Line
	9850 3150 9750 3050
Entry Wire Line
	9850 5850 9750 5950
Entry Wire Line
	9950 3150 9850 3050
Entry Wire Line
	9950 5850 9850 5950
Entry Wire Line
	10050 3150 9950 3050
Entry Wire Line
	10050 5850 9950 5950
Entry Wire Line
	10150 3150 10050 3050
Entry Wire Line
	10150 5850 10050 5950
Entry Wire Line
	10250 3150 10150 3050
Entry Wire Line
	10250 5850 10150 5950
Entry Wire Line
	10350 3150 10250 3050
Entry Wire Line
	10350 5850 10250 5950
Wire Wire Line
	2050 4400 1650 4400
Wire Wire Line
	2050 4500 1650 4500
Wire Wire Line
	2050 4600 1650 4600
Wire Wire Line
	2050 4700 1650 4700
Wire Wire Line
	2050 4800 1650 4800
Wire Wire Line
	2050 4900 1650 4900
Wire Wire Line
	2050 5000 1650 5000
Wire Wire Line
	2050 5100 1650 5100
Wire Wire Line
	2350 4050 2350 3450
Wire Wire Line
	2350 5450 2350 5850
Wire Wire Line
	2450 4050 2450 3450
Wire Wire Line
	2450 5450 2450 5850
Wire Wire Line
	2550 4050 2550 3450
Wire Wire Line
	2550 5450 2550 5850
Wire Wire Line
	2650 4050 2650 3450
Wire Wire Line
	2650 5450 2650 5850
Wire Wire Line
	2750 4050 2750 3450
Wire Wire Line
	2750 5450 2750 5850
Wire Wire Line
	2850 4050 2850 3450
Wire Wire Line
	2850 5450 2850 5850
Wire Wire Line
	2950 4050 2950 3450
Wire Wire Line
	2950 5450 2950 5850
Wire Wire Line
	3050 4050 3050 3450
Wire Wire Line
	3050 5450 3050 5850
Wire Wire Line
	3150 4050 3150 3450
Wire Wire Line
	3150 5450 3150 5850
Wire Wire Line
	3250 4050 3250 3450
Wire Wire Line
	3250 5450 3250 5850
Wire Wire Line
	3550 4950 3550 4800
Wire Wire Line
	3850 6100 3850 6650
Wire Wire Line
	3850 6100 4100 6100
Wire Wire Line
	3850 6650 3750 6650
Wire Wire Line
	4400 2550 4950 2550
Wire Wire Line
	4400 2650 5050 2650
Wire Wire Line
	4950 2200 4950 2550
Wire Wire Line
	5050 2550 4950 2550
Wire Wire Line
	5600 1350 6250 1350
Wire Wire Line
	5600 2600 6450 2600
Wire Wire Line
	6000 6650 6100 6650
Wire Wire Line
	6050 1450 6550 1450
Wire Wire Line
	6050 2400 6550 2400
Wire Wire Line
	6050 2500 6150 2500
Wire Wire Line
	6100 6100 5200 6100
Wire Wire Line
	6100 6650 6100 6100
Wire Wire Line
	6150 1550 6550 1550
Wire Wire Line
	6150 2500 6150 1550
Wire Wire Line
	6150 2500 6550 2500
Wire Wire Line
	6250 1350 6250 2300
Wire Wire Line
	6250 2300 6550 2300
Wire Wire Line
	6350 1650 6550 1650
Wire Wire Line
	6350 2200 4950 2200
Wire Wire Line
	6350 2200 6350 1650
Wire Wire Line
	6450 1750 6550 1750
Wire Wire Line
	6450 2600 6450 1750
Wire Wire Line
	6550 1350 6250 1350
Wire Wire Line
	6550 2200 6350 2200
Wire Wire Line
	6550 2600 6450 2600
Wire Wire Line
	7000 6100 6100 6100
Wire Wire Line
	8550 4250 8150 4250
Wire Wire Line
	8550 4350 8150 4350
Wire Wire Line
	8550 4450 8150 4450
Wire Wire Line
	8550 4550 8150 4550
Wire Wire Line
	8550 4650 8150 4650
Wire Wire Line
	8550 4750 8150 4750
Wire Wire Line
	8550 4850 8150 4850
Wire Wire Line
	8550 4950 8150 4950
Wire Wire Line
	8850 3750 8850 3150
Wire Wire Line
	8850 5450 8850 5850
Wire Wire Line
	8950 3750 8950 3150
Wire Wire Line
	8950 5450 8950 5850
Wire Wire Line
	9050 3750 9050 3150
Wire Wire Line
	9050 5450 9050 5850
Wire Wire Line
	9150 3750 9150 3150
Wire Wire Line
	9150 5450 9150 5850
Wire Wire Line
	9250 3750 9250 3150
Wire Wire Line
	9250 5450 9250 5850
Wire Wire Line
	9350 3750 9350 3150
Wire Wire Line
	9350 5450 9350 5850
Wire Wire Line
	9450 3750 9450 3150
Wire Wire Line
	9450 5450 9450 5850
Wire Wire Line
	9550 3750 9550 3150
Wire Wire Line
	9550 5450 9550 5850
Wire Wire Line
	9650 3750 9650 3150
Wire Wire Line
	9650 5450 9650 5850
Wire Wire Line
	9750 3750 9750 3150
Wire Wire Line
	9750 5450 9750 5850
Wire Wire Line
	9850 3750 9850 3150
Wire Wire Line
	9850 5450 9850 5850
Wire Wire Line
	9950 3750 9950 3150
Wire Wire Line
	9950 5450 9950 5850
Wire Wire Line
	10050 3750 10050 3150
Wire Wire Line
	10050 5450 10050 5850
Wire Wire Line
	10150 3750 10150 3150
Wire Wire Line
	10150 5450 10150 5850
Wire Wire Line
	10250 3750 10250 3150
Wire Wire Line
	10250 5450 10250 5850
Wire Wire Line
	10350 3750 10350 3150
Wire Wire Line
	10350 5450 10350 5850
Wire Wire Line
	10650 4650 10650 4800
Wire Bus Line
	1550 4100 1350 4100
Wire Bus Line
	5300 5950 5200 5950
Wire Bus Line
	6900 5950 7000 5950
Wire Bus Line
	8050 3950 7850 3950
Text Notes 7550 900  0    50   ~ 0
NOT [ CLK4M & BUS-SCROLL@~CLK4M~ & CNT0@~CLK4M~ & CLK8M & ~DEBUG3 ]\n
Text Notes 8250 1600 0    50   ~ 0
10 bits
Text Notes 8250 2450 0    50   ~ 0
16 bits
Text Label 2000 4400 2    50   ~ 0
ADDR0
Text Label 2000 4500 2    50   ~ 0
ADDR1
Text Label 2000 4600 2    50   ~ 0
ADDR2
Text Label 2000 4700 2    50   ~ 0
ADDR3
Text Label 2000 4800 2    50   ~ 0
ADDR4
Text Label 2000 4900 2    50   ~ 0
ADDR5
Text Label 2000 5000 2    50   ~ 0
ADDR6
Text Label 2000 5100 2    50   ~ 0
ADDR7
Text Label 2350 4000 1    50   ~ 0
BUS-DATA0
Text Label 2350 5800 1    50   ~ 0
ATTR-Q0
Text Label 2450 4000 1    50   ~ 0
BUS-DATA1
Text Label 2450 5800 1    50   ~ 0
ATTR-Q1
Text Label 2550 4000 1    50   ~ 0
BUS-DATA2
Text Label 2550 5800 1    50   ~ 0
ATTR-Q2
Text Label 2650 4000 1    50   ~ 0
BUS-DATA3
Text Label 2650 5800 1    50   ~ 0
ATTR-Q3
Text Label 2750 4000 1    50   ~ 0
BUS-DATA4
Text Label 2750 5800 1    50   ~ 0
ATTR-Q4
Text Label 2850 4000 1    50   ~ 0
BUS-DATA5
Text Label 2850 5800 1    50   ~ 0
ATTR-Q5
Text Label 2950 4000 1    50   ~ 0
BUS-DATA6
Text Label 2950 5800 1    50   ~ 0
ATTR-Q6
Text Label 3050 4000 1    50   ~ 0
BUS-DATA7
Text Label 3050 5800 1    50   ~ 0
ATTR-Q7
Text Label 3150 4000 1    50   ~ 0
BUS-DATA8
Text Label 3150 5800 1    50   ~ 0
ATTR-Q8
Text Label 3250 4000 1    50   ~ 0
BUS-DATA9
Text Label 3250 5800 1    50   ~ 0
ATTR-Q9
Text Label 3450 5950 0    50   ~ 0
ATTR-Q[0..9]
Text Label 3550 4700 0    50   ~ 0
~ATTR-WR
Text Label 7500 1600 0    50   ~ 0
~ATTR-WR
Text Label 7500 2450 0    50   ~ 0
~TILE-WR
Text Label 8200 5950 0    50   ~ 0
TILE-Q[0..15]
Text Label 8500 4250 2    50   ~ 0
ADDR0
Text Label 8500 4350 2    50   ~ 0
ADDR1
Text Label 8500 4450 2    50   ~ 0
ADDR2
Text Label 8500 4550 2    50   ~ 0
ADDR3
Text Label 8500 4650 2    50   ~ 0
ADDR4
Text Label 8500 4750 2    50   ~ 0
ADDR5
Text Label 8500 4850 2    50   ~ 0
ADDR6
Text Label 8500 4950 2    50   ~ 0
ADDR7
Text Label 8850 3700 1    50   ~ 0
BUS-DATA0
Text Label 8850 5800 1    50   ~ 0
TILE-Q0
Text Label 8950 3700 1    50   ~ 0
BUS-DATA1
Text Label 8950 5800 1    50   ~ 0
TILE-Q1
Text Label 9050 3700 1    50   ~ 0
BUS-DATA2
Text Label 9050 5800 1    50   ~ 0
TILE-Q2
Text Label 9150 3700 1    50   ~ 0
BUS-DATA3
Text Label 9150 5800 1    50   ~ 0
TILE-Q3
Text Label 9250 3700 1    50   ~ 0
BUS-DATA4
Text Label 9250 5800 1    50   ~ 0
TILE-Q4
Text Label 9350 3700 1    50   ~ 0
BUS-DATA5
Text Label 9350 5800 1    50   ~ 0
TILE-Q5
Text Label 9450 3700 1    50   ~ 0
BUS-DATA6
Text Label 9450 5800 1    50   ~ 0
TILE-Q6
Text Label 9550 3700 1    50   ~ 0
BUS-DATA7
Text Label 9550 5800 1    50   ~ 0
TILE-Q7
Text Label 9650 3700 1    50   ~ 0
BUS-DATA8
Text Label 9650 5800 1    50   ~ 0
TILE-Q8
Text Label 9750 3700 1    50   ~ 0
BUS-DATA9
Text Label 9750 5800 1    50   ~ 0
TILE-Q9
Text Label 9850 3700 1    50   ~ 0
BUS-DATA10
Text Label 9850 5800 1    50   ~ 0
TILE-Q10
Text Label 9950 3700 1    50   ~ 0
BUS-DATA11
Text Label 9950 5800 1    50   ~ 0
TILE-Q11
Text Label 10050 3700 1    50   ~ 0
BUS-DATA12
Text Label 10050 5800 1    50   ~ 0
TILE-Q12
Text Label 10150 3700 1    50   ~ 0
BUS-DATA13
Text Label 10150 5800 1    50   ~ 0
TILE-Q13
Text Label 10250 3700 1    50   ~ 0
BUS-DATA14
Text Label 10250 5800 1    50   ~ 0
TILE-Q14
Text Label 10350 3700 1    50   ~ 0
BUS-DATA15
Text Label 10350 5800 1    50   ~ 0
TILE-Q15
Text Label 10650 4550 0    50   ~ 0
~TILE-WR
Text HLabel 1350 4100 0    50   Input ~ 0
ADDR[0..7]
Text HLabel 2100 3350 0    50   Input ~ 0
BUS-DATA[0..15]
Text HLabel 3200 6550 0    50   Input ~ 0
FLIP
Text HLabel 3200 6650 0    50   Input ~ 0
~DEBUG3
Text HLabel 3200 6750 0    50   Input ~ 0
~SCROLL3-T
Text HLabel 3550 4550 2    50   Input ~ 0
CLK8M
Text HLabel 4400 2550 0    50   Input ~ 0
~DEBUG3
Text HLabel 4400 2650 0    50   Input ~ 0
~DEBUG-WR
Text HLabel 5050 1300 0    50   Input ~ 0
CLK4M
Text HLabel 5050 1400 0    50   Input ~ 0
WR
Text HLabel 5300 5950 2    50   Output ~ 0
~RAM-ATTR[0..9]
Text HLabel 5450 6600 0    50   Input ~ 0
~CLK4M
Text HLabel 5450 6700 0    50   Input ~ 0
CLK8M
Text HLabel 6050 1450 0    50   Input ~ 0
WR-ATTR
Text HLabel 6050 2400 0    50   Input ~ 0
WR-TILE
Text HLabel 6050 2500 0    50   Input ~ 0
CLK8M
Text HLabel 6900 5950 0    50   Output ~ 0
~RAM-TILE[0..15]
Text HLabel 7850 3950 0    50   Input ~ 0
ADDR[0..7]
Text HLabel 8550 3050 0    50   Input ~ 0
BUS-DATA[0..15]
Text HLabel 10650 4400 2    50   Input ~ 0
CLK8M
$Comp
L power:GND #PWR?
U 1 1 617CA4DA
P 3550 4950
AR Path="/617CA4DA/617CA4DA" Ref="#PWR?"  Part="1" 
AR Path="/7FFFFFFF/617CA4DA" Ref="#PWR0192"  Part="1" 
AR Path="/61118D89/617CA4DA" Ref="#PWR0192"  Part="1" 
AR Path="/61116467/61117C32/617CA4DA" Ref="#PWR0192"  Part="1" 
AR Path="/6112ED27/617CA4DA" Ref="#PWR0192"  Part="1" 
AR Path="/612E497E/612E4DFA/617CA4DA" Ref="#PWR0192"  Part="1" 
F 0 "#PWR0192" H 3550 4700 50  0001 C CNN
F 1 "GND" H 3555 4777 50  0001 C CNN
F 2 "" H 3550 4950 50  0001 C CNN
F 3 "" H 3550 4950 50  0001 C CNN
	1    3550 4950
	1    0    0    -1  
$EndComp
$Comp
L power:GND #PWR0193
U 1 1 61118F33
P 10650 4800
AR Path="/7FFFFFFF/61118F33" Ref="#PWR0193"  Part="1" 
AR Path="/61118D89/61118F33" Ref="#PWR0193"  Part="1" 
AR Path="/61116467/61117C32/61118F33" Ref="#PWR0193"  Part="1" 
AR Path="/6112ED27/61118F33" Ref="#PWR0193"  Part="1" 
AR Path="/612E497E/612E4DFA/61118F33" Ref="#PWR0193"  Part="1" 
F 0 "#PWR0193" H 10650 4550 50  0001 C CNN
F 1 "GND" H 10655 4627 50  0001 C CNN
F 2 "" H 10650 4800 50  0001 C CNN
F 3 "" H 10650 4800 50  0001 C CNN
	1    10650 4800
	1    0    0    -1  
$EndComp
$Comp
L A5C:AND02 UAD203
U 1 1 61118D5B
P 5300 1350
AR Path="/61116467/61117C32/61118D5B" Ref="UAD203"  Part="1" 
AR Path="/6112ED27/61118D5B" Ref="UAD203"  Part="1" 
AR Path="/612E497E/612E4DFA/61118D5B" Ref="UAD203"  Part="1" 
F 0 "UAD203" H 5325 1617 50  0000 C CNN
F 1 "AND02" H 5325 1526 50  0000 C CNN
F 2 "" H 5300 1350 50  0001 C CNN
F 3 "" H 5300 1350 50  0001 C CNN
	1    5300 1350
	1    0    0    -1  
$EndComp
$Comp
L A5C:NOR02 UAD171
U 1 1 602CA659
P 5300 2600
AR Path="/61116467/61117C32/602CA659" Ref="UAD171"  Part="1" 
AR Path="/6112ED27/602CA659" Ref="UAD171"  Part="1" 
AR Path="/612E497E/612E4DFA/602CA659" Ref="UAD171"  Part="1" 
F 0 "UAD171" H 5325 2867 50  0000 C CNN
F 1 "NOR02" H 5325 2776 50  0000 C CNN
F 2 "" H 5300 2600 50  0001 C CNN
F 3 "" H 5300 2600 50  0001 C CNN
	1    5300 2600
	1    0    0    -1  
$EndComp
$Comp
L A5C:NAND02 UAB?
U 1 1 616FC88C
P 5700 6650
AR Path="/7FFFFFFF/616FC88C" Ref="UAB?"  Part="1" 
AR Path="/61118D89/616FC88C" Ref="UAB?"  Part="1" 
AR Path="/61116467/616FC88C" Ref="UAB?"  Part="1" 
AR Path="/61116467/61117C32/616FC88C" Ref="UAB165"  Part="1" 
AR Path="/6112ED27/616FC88C" Ref="UAB165"  Part="1" 
AR Path="/612E497E/612E4DFA/616FC88C" Ref="UAB165"  Part="1" 
F 0 "UAB165" H 5725 6917 50  0000 C CNN
F 1 "NAND02P" H 5725 6826 50  0000 C CNN
F 2 "" H 5700 6650 50  0001 C CNN
F 3 "" H 5700 6650 50  0001 C CNN
	1    5700 6650
	1    0    0    -1  
$EndComp
$Comp
L A5C:NAND03 UAD?
U 1 1 64E7C360
P 3450 6650
AR Path="/7FFFFFFF/6178A503/64E7C360" Ref="UAD?"  Part="1" 
AR Path="/61118D89/6178A503/64E7C360" Ref="UAD?"  Part="1" 
AR Path="/61116467/61117C32/6178A503/64E7C360" Ref="UAD?"  Part="1" 
AR Path="/6112ED27/6178A503/64E7C360" Ref="UAD?"  Part="1" 
AR Path="/6112ED27/64E7C360" Ref="UAD117"  Part="1" 
AR Path="/612E497E/612E4DFA/64E7C360" Ref="UAD117"  Part="1" 
F 0 "UAD117" H 3475 6942 50  0000 C CNN
F 1 "NAND03" H 3475 6851 50  0000 C CNN
F 2 "" H 3450 6650 50  0001 C CNN
F 3 "" H 3450 6650 50  0001 C CNN
	1    3450 6650
	1    0    0    -1  
$EndComp
$Comp
L A5C:AOI41 UAD200
U 1 1 6033C63F
P 7000 1550
AR Path="/61116467/61117C32/6033C63F" Ref="UAD200"  Part="1" 
AR Path="/6112ED27/6033C63F" Ref="UAD200"  Part="1" 
AR Path="/612E497E/612E4DFA/6033C63F" Ref="UAD200"  Part="1" 
F 0 "UAD200" H 7025 1942 50  0000 C CNN
F 1 "AOI41" H 7025 1851 50  0000 C CNN
F 2 "" H 7200 1550 50  0001 C CNN
F 3 "" H 7200 1550 50  0001 C CNN
	1    7000 1550
	1    0    0    -1  
$EndComp
$Comp
L A5C:AOI41 UAD206
U 1 1 6033CA99
P 7000 2400
AR Path="/61116467/61117C32/6033CA99" Ref="UAD206"  Part="1" 
AR Path="/6112ED27/6033CA99" Ref="UAD206"  Part="1" 
AR Path="/612E497E/612E4DFA/6033CA99" Ref="UAD206"  Part="1" 
F 0 "UAD206" H 7025 2792 50  0000 C CNN
F 1 "AOI41" H 7025 2701 50  0000 C CNN
F 2 "" H 7200 2400 50  0001 C CNN
F 3 "" H 7200 2400 50  0001 C CNN
	1    7000 2400
	1    0    0    -1  
$EndComp
$Comp
L A5C:SSR256-10 UF?
U 1 1 61783A92
P 2800 4750
AR Path="/61783A92" Ref="UF?"  Part="1" 
AR Path="/7FFFFFFF/61783A92" Ref="UF0"  Part="1" 
AR Path="/61118D89/61783A92" Ref="UF0"  Part="1" 
AR Path="/61116467/61117C32/61783A92" Ref="UF0"  Part="1" 
AR Path="/6112ED27/61783A92" Ref="UF0"  Part="1" 
AR Path="/612E497E/612E4DFA/61783A92" Ref="UF0"  Part="1" 
F 0 "UF0" H 2650 4850 100 0000 L CNN
F 1 "SSR256-10" H 2350 4650 100 0000 L CNN
F 2 "" H 2800 4900 50  0001 C CNN
F 3 "" H 2800 4900 50  0001 C CNN
	1    2800 4750
	1    0    0    -1  
$EndComp
$Comp
L A5C:SSR256-16 UF?
U 1 1 61118F32
P 9600 4600
AR Path="/61118F32" Ref="UF?"  Part="1" 
AR Path="/7FFFFFFF/61118F32" Ref="UF1"  Part="1" 
AR Path="/61118D89/61118F32" Ref="UF1"  Part="1" 
AR Path="/61116467/61117C32/61118F32" Ref="UF1"  Part="1" 
AR Path="/6112ED27/61118F32" Ref="UF1"  Part="1" 
AR Path="/612E497E/612E4DFA/61118F32" Ref="UF1"  Part="1" 
F 0 "UF1" H 9500 4700 100 0000 L CNN
F 1 "SSR256-16" H 9150 4500 100 0000 L CNN
F 2 "" H 9600 4750 50  0001 C CNN
F 3 "" H 9600 4750 50  0001 C CNN
	1    9600 4600
	1    0    0    -1  
$EndComp
$Sheet
S 4100 5800 1100 450 
U 6178A503
F0 "sram0-out-buffer" 50
F1 "sram0-out-buffer.sch" 50
F2 "CLK" I R 5200 6100 50 
F3 "IN[0..9]" I L 4100 5950 50 
F4 "~OUT[0..9]" O R 5200 5950 50 
F5 "XFLIP" I L 4100 6100 50 
$EndSheet
$Sheet
S 7000 5800 1100 450 
U 60A9C2DF
F0 "sram1-out-buffer" 50
F1 "sram1-out-buffer.sch" 50
F2 "CLK" I L 7000 6100 50 
F3 "IN[0..15]" I R 8100 5950 50 
F4 "~OUT[0..15]" O L 7000 5950 50 
$EndSheet
Wire Bus Line
	1550 4100 1550 5000
Wire Bus Line
	2100 3350 3150 3350
Wire Bus Line
	2450 5950 4100 5950
Wire Bus Line
	8050 3950 8050 4850
Wire Bus Line
	8100 5950 10250 5950
Wire Bus Line
	8550 3050 10250 3050
$EndSCHEMATC
