EESchema Schematic File Version 4
EELAYER 30 0
EELAYER END
$Descr A4 11693 8268
encoding utf-8
Sheet 42 83
Title "CPS Reverse Engineering: DL-0311"
Date "2021-09-12"
Rev ""
Comp ""
Comment1 ""
Comment2 ""
Comment3 "Licence: CC-BY"
Comment4 "Author: Loïc *WydD* Petit"
$EndDescr
Connection ~ 3400 2050
Connection ~ 3300 6500
Connection ~ 3000 6100
Connection ~ 3500 1950
Connection ~ 2100 1300
Connection ~ 2950 2650
Connection ~ 1950 2750
Connection ~ 3900 3200
Connection ~ 7450 6050
Connection ~ 5500 5750
Connection ~ 3100 6000
Connection ~ 2350 6600
Connection ~ 3200 6700
Connection ~ 3000 5300
NoConn ~ 4500 3000
NoConn ~ 4500 3650
NoConn ~ 3550 950 
NoConn ~ 2700 950 
NoConn ~ 4650 2050
NoConn ~ 4650 2250
NoConn ~ 4650 2550
NoConn ~ 4650 1950
NoConn ~ 9400 3800
NoConn ~ 10200 3900
Entry Wire Line
	1750 5900 1850 6000
Entry Wire Line
	1750 6500 1850 6600
Wire Wire Line
	1950 2350 2050 2350
Wire Wire Line
	1950 2750 1800 2750
Wire Wire Line
	1950 2750 1950 2350
Wire Wire Line
	2050 2650 2050 2450
Wire Wire Line
	2050 2650 2950 2650
Wire Wire Line
	2100 1050 2100 1300
Wire Wire Line
	2100 1300 1950 1300
Wire Wire Line
	2100 1300 2950 1300
Wire Wire Line
	1850 6000 3100 6000
Wire Wire Line
	1850 6600 2350 6600
Wire Wire Line
	2200 1050 2100 1050
Wire Wire Line
	2350 5800 3500 5800
Wire Wire Line
	2350 6600 2350 5800
Wire Wire Line
	2700 850  3050 850 
Wire Wire Line
	2850 1850 3850 1850
Wire Wire Line
	2850 2050 3400 2050
Wire Wire Line
	2850 2150 3850 2150
Wire Wire Line
	2950 1050 3050 1050
Wire Wire Line
	2950 1300 2950 1050
Wire Wire Line
	2950 2650 3850 2650
Wire Wire Line
	2950 6600 3500 6600
Wire Wire Line
	3000 5300 2900 5300
Wire Wire Line
	3000 5300 3000 6100
Wire Wire Line
	3000 5300 3100 5300
Wire Wire Line
	3000 6100 3500 6100
Wire Wire Line
	3000 6900 3000 6100
Wire Wire Line
	3000 6900 3500 6900
Wire Wire Line
	3100 6000 3100 6800
Wire Wire Line
	3100 6000 3500 6000
Wire Wire Line
	3400 2050 3400 3650
Wire Wire Line
	3400 2050 3850 2050
Wire Wire Line
	3400 3650 4000 3650
Wire Wire Line
	3200 5900 3200 6700
Wire Wire Line
	3200 6700 3200 7000
Wire Wire Line
	3200 6700 3500 6700
Wire Wire Line
	3200 7000 2950 7000
Wire Wire Line
	3500 1950 2850 1950
Wire Wire Line
	3500 3000 3500 1950
Wire Wire Line
	3300 5700 3300 6500
Wire Wire Line
	3300 5700 3500 5700
Wire Wire Line
	3300 6500 3300 7100
Wire Wire Line
	3300 7100 2950 7100
Wire Wire Line
	3750 2450 3750 2750
Wire Wire Line
	3750 2750 1950 2750
Wire Wire Line
	3500 5900 3200 5900
Wire Wire Line
	3500 6500 3300 6500
Wire Wire Line
	3500 6800 3100 6800
Wire Wire Line
	3800 3200 3900 3200
Wire Wire Line
	3850 1950 3500 1950
Wire Wire Line
	3850 2450 3750 2450
Wire Wire Line
	3850 2650 3850 2550
Wire Wire Line
	3900 3200 3900 3850
Wire Wire Line
	3900 3850 4000 3850
Wire Wire Line
	3700 5300 4300 5300
Wire Wire Line
	4000 3000 3500 3000
Wire Wire Line
	4000 3200 3900 3200
Wire Wire Line
	4500 3100 5350 3100
Wire Wire Line
	4500 3750 5450 3750
Wire Wire Line
	4650 2350 5550 2350
Wire Wire Line
	4650 2450 4850 2450
Wire Wire Line
	4850 1850 4650 1850
Wire Wire Line
	4850 5250 5600 5250
Wire Wire Line
	4950 5450 4950 6750
Wire Wire Line
	5250 1900 5250 2150
Wire Wire Line
	5250 2150 4650 2150
Wire Wire Line
	5350 2000 5550 2000
Wire Wire Line
	5350 3100 5350 2000
Wire Wire Line
	5450 2450 5450 3750
Wire Wire Line
	5450 2450 5550 2450
Wire Wire Line
	5550 1900 5250 1900
Wire Wire Line
	5400 4800 5400 5550
Wire Wire Line
	5400 4800 8600 4800
Wire Wire Line
	5400 5750 5500 5750
Wire Wire Line
	5500 4900 6500 4900
Wire Wire Line
	5500 5350 5500 4900
Wire Wire Line
	5500 5750 5500 6150
Wire Wire Line
	5500 6150 7100 6150
Wire Wire Line
	5600 5350 5500 5350
Wire Wire Line
	5600 5550 5400 5550
Wire Wire Line
	5600 5750 5500 5750
Wire Wire Line
	5600 6050 5600 5850
Wire Wire Line
	6400 5250 6800 5250
Wire Wire Line
	6400 5350 6600 5350
Wire Wire Line
	6400 5550 6700 5550
Wire Wire Line
	6500 4900 6500 5450
Wire Wire Line
	6500 5450 6400 5450
Wire Wire Line
	6600 4600 6600 5350
Wire Wire Line
	6600 4600 9200 4600
Wire Wire Line
	6700 4700 6700 5550
Wire Wire Line
	6800 5250 6800 5350
Wire Wire Line
	6800 5350 7600 5350
Wire Wire Line
	6900 5250 6900 5950
Wire Wire Line
	6900 5250 7600 5250
Wire Wire Line
	6900 5950 4450 5950
Wire Wire Line
	8800 4150 8800 4000
Wire Wire Line
	8800 4150 9600 4150
Wire Wire Line
	7100 6150 7100 5750
Wire Wire Line
	8900 4000 8800 4000
Wire Wire Line
	7450 6050 5600 6050
Wire Wire Line
	7500 4900 8500 4900
Wire Wire Line
	7500 5450 7500 4900
Wire Wire Line
	7500 5450 7600 5450
Wire Wire Line
	7600 5750 7100 5750
Wire Wire Line
	7600 5850 7600 6050
Wire Wire Line
	7600 6050 7450 6050
Wire Wire Line
	9400 3900 9500 3900
Wire Wire Line
	9500 3800 9700 3800
Wire Wire Line
	9500 3900 9500 3800
Wire Wire Line
	9600 4000 9600 4150
Wire Wire Line
	9600 4000 9700 4000
Wire Wire Line
	8400 5250 8600 5250
Wire Wire Line
	8400 5550 8500 5550
Wire Wire Line
	8500 4900 8500 5550
Wire Wire Line
	8600 4800 8600 5250
Wire Wire Line
	8600 5450 8400 5450
Wire Bus Line
	1650 5900 1750 5900
Wire Bus Line
	1650 6500 1750 6500
Text Notes 4650 1750 0    50   ~ 0
COL4 OR\nCOL == 3
Text Notes 4450 6050 0    50   ~ 0
~W-CAS1\n\n(presync)
Text Notes 4450 6850 0    50   ~ 0
~W-CAS0\n\n(presync)
Text Notes 4850 5350 0    50   ~ 0
~CAS ENABLE\n\n(presync)
Text Notes 6450 1800 0    50   ~ 0
NOT (COL = 0 or 256)
Text Notes 6500 2600 0    50   ~ 0
NOT (\n  COL = 0-1 or\n  COL = 256-257 or\n  COL = 4-5 mod 16\n)
Text Label 1900 6000 0    50   ~ 0
WY-A8
Text Label 1900 6600 0    50   ~ 0
WX-A0
Text Label 8900 3800 2    50   ~ 0
WY-A8
Text HLabel 1800 2750 0    50   Input ~ 0
~CLK8M
Text HLabel 1650 5900 0    50   Input ~ 0
WY-A[8..8]
Text HLabel 1650 6500 0    50   Input ~ 0
WX-A[0..0]
Text HLabel 1950 1300 0    50   Input ~ 0
~CLK8M
Text HLabel 2050 1850 0    50   Input ~ 0
_R-CAS
Text HLabel 2050 1950 0    50   Input ~ 0
_~R-OE
Text HLabel 2050 2050 0    50   Input ~ 0
_~W-OE
Text HLabel 2050 2150 0    50   Input ~ 0
_FWE
Text HLabel 2200 850  0    50   Input ~ 0
~FLIP
Text HLabel 2900 5300 0    50   Input ~ 0
_~W-CAS-E
Text HLabel 2950 7000 0    50   Input ~ 0
_W-CAS
Text HLabel 2950 7100 0    50   Input ~ 0
~SCAN-240-245
Text HLabel 3550 850  2    50   Output ~ 0
R-SOE
Text HLabel 3800 3200 0    50   Input ~ 0
CLK8M
Text HLabel 4300 5200 0    50   Input ~ 0
~REWEN
Text HLabel 4850 1850 2    50   Output ~ 0
R-CAS
Text HLabel 4850 2450 2    50   Output ~ 0
FWE
Text HLabel 5400 5750 0    50   Input ~ 0
~CLK8M1
Text HLabel 6100 1950 2    50   Output ~ 0
R-OE
Text HLabel 7600 5550 0    50   Input ~ 0
SPRITE-X0
Text HLabel 10200 3800 2    50   Output ~ 0
OBJEO
Text HLabel 8600 5450 2    50   Output ~ 0
W-SOE
$Comp
L power:VCC #PWR0232
U 1 1 6C3D7546
P 2950 2650
F 0 "#PWR0232" H 2950 2500 50  0001 C CNN
F 1 "VCC" H 2965 2823 50  0000 C CNN
F 2 "" H 2950 2650 50  0001 C CNN
F 3 "" H 2950 2650 50  0001 C CNN
	1    2950 2650
	1    0    0    -1  
$EndComp
$Comp
L power:VCC #PWR0233
U 1 1 61118E80
P 7450 6050
F 0 "#PWR0233" H 7450 5900 50  0001 C CNN
F 1 "VCC" H 7465 6223 50  0000 C CNN
F 2 "" H 7450 6050 50  0001 C CNN
F 3 "" H 7450 6050 50  0001 C CNN
	1    7450 6050
	1    0    0    -1  
$EndComp
$Comp
L A5C:AND02 UDJ38
U 1 1 6B4E8E36
P 4550 5250
F 0 "UDJ38" H 4575 5517 50  0000 C CNN
F 1 "AND02" H 4575 5426 50  0000 C CNN
F 2 "" H 4550 5250 50  0001 C CNN
F 3 "" H 4550 5250 50  0001 C CNN
	1    4550 5250
	1    0    0    -1  
$EndComp
$Comp
L A5C:OR02 UDL42
U 1 1 75597667
P 5800 1950
F 0 "UDL42" H 5825 2217 50  0000 C CNN
F 1 "OR02" H 5825 2126 50  0000 C CNN
F 2 "" H 5850 1950 50  0001 C CNN
F 3 "" H 5850 1950 50  0001 C CNN
	1    5800 1950
	1    0    0    -1  
$EndComp
$Comp
L A5C:OR02 UDK36
U 1 1 71D05FBB
P 5800 2400
F 0 "UDK36" H 5825 2667 50  0000 C CNN
F 1 "OR02" H 5825 2576 50  0000 C CNN
F 2 "" H 5850 2400 50  0001 C CNN
F 3 "" H 5850 2400 50  0001 C CNN
	1    5800 2400
	1    0    0    -1  
$EndComp
$Comp
L A5C:INV01 UDK52
U 1 1 68F55171
P 2650 6600
F 0 "UDK52" H 2650 6917 50  0000 C CNN
F 1 "INV01" H 2650 6826 50  0000 C CNN
F 2 "" H 2650 6400 50  0001 C CNN
F 3 "" H 2650 6400 50  0001 C CNN
	1    2650 6600
	1    0    0    -1  
$EndComp
$Comp
L A5C:INV01 UDJ40
U 1 1 6B4EB1FA
P 3400 5300
F 0 "UDJ40" H 3400 5617 50  0000 C CNN
F 1 "INV01" H 3400 5526 50  0000 C CNN
F 2 "" H 3400 5100 50  0001 C CNN
F 3 "" H 3400 5100 50  0001 C CNN
	1    3400 5300
	1    0    0    -1  
$EndComp
$Comp
L A5C:DFFCOO UDI31
U 1 1 750BB197
P 2450 950
F 0 "UDI31" H 2450 1315 50  0000 C CNN
F 1 "DFFCOO" H 2450 1224 50  0000 C CNN
F 2 "" H 2450 950 50  0001 C CNN
F 3 "" H 2450 950 50  0001 C CNN
	1    2450 950 
	1    0    0    -1  
$EndComp
$Comp
L A5C:DFFCOO UDI27
U 1 1 74BE9975
P 3300 950
F 0 "UDI27" H 3300 1315 50  0000 C CNN
F 1 "DFFCOO" H 3300 1224 50  0000 C CNN
F 2 "" H 3300 950 50  0001 C CNN
F 3 "" H 3300 950 50  0001 C CNN
	1    3300 950 
	1    0    0    -1  
$EndComp
$Comp
L A5C:DFFCOO UDL44
U 1 1 75801238
P 4250 3100
F 0 "UDL44" H 4250 3465 50  0000 C CNN
F 1 "DFFCOO" H 4250 3374 50  0000 C CNN
F 2 "" H 4250 3100 50  0001 C CNN
F 3 "" H 4250 3100 50  0001 C CNN
	1    4250 3100
	1    0    0    -1  
$EndComp
$Comp
L A5C:DFFCOO UDJ31
U 1 1 722FDAA4
P 4250 3750
F 0 "UDJ31" H 4250 4115 50  0000 C CNN
F 1 "DFFCOO" H 4250 4024 50  0000 C CNN
F 2 "" H 4250 3750 50  0001 C CNN
F 3 "" H 4250 3750 50  0001 C CNN
	1    4250 3750
	1    0    0    -1  
$EndComp
$Comp
L A5C:DFFCOO UDJ89
U 1 1 61118E85
P 9150 3900
F 0 "UDJ89" H 9150 4265 50  0000 C CNN
F 1 "DFFCOO" H 9150 4174 50  0000 C CNN
F 2 "" H 9150 3900 50  0001 C CNN
F 3 "" H 9150 3900 50  0001 C CNN
	1    9150 3900
	1    0    0    -1  
$EndComp
$Comp
L A5C:DFFCOO UDJ95
U 1 1 61118E84
P 9950 3900
F 0 "UDJ95" H 9950 4265 50  0000 C CNN
F 1 "DFFCOO" H 9950 4174 50  0000 C CNN
F 2 "" H 9950 3900 50  0001 C CNN
F 3 "" H 9950 3900 50  0001 C CNN
	1    9950 3900
	1    0    0    -1  
$EndComp
$Comp
L A5C:AOI41 UDK45
U 1 1 68F52DB8
P 3950 5900
F 0 "UDK45" H 3975 6292 50  0000 C CNN
F 1 "AOI41" H 3975 6201 50  0000 C CNN
F 2 "" H 4150 5900 50  0001 C CNN
F 3 "" H 4150 5900 50  0001 C CNN
	1    3950 5900
	1    0    0    -1  
$EndComp
$Comp
L A5C:AOI41 UDK49
U 1 1 68F5432D
P 3950 6700
F 0 "UDK49" H 3975 7092 50  0000 C CNN
F 1 "AOI41" H 3975 7001 50  0000 C CNN
F 2 "" H 4150 6700 50  0001 C CNN
F 3 "" H 4150 6700 50  0001 C CNN
	1    3950 6700
	1    0    0    -1  
$EndComp
$Comp
L A5C:M175C UDL22
U 1 1 67B18207
P 2450 2150
F 0 "UDL22" H 2450 2715 50  0000 C CNN
F 1 "M175C" H 2450 2624 50  0000 C CNN
F 2 "" H 2450 1950 50  0001 C CNN
F 3 "" H 2450 1950 50  0001 C CNN
	1    2450 2150
	1    0    0    -1  
$EndComp
$Comp
L A5C:M175C UDJ2
U 1 1 6FA3691D
P 6000 5550
F 0 "UDJ2" H 6000 6115 50  0000 C CNN
F 1 "M175C" H 6000 6024 50  0000 C CNN
F 2 "" H 6000 5350 50  0001 C CNN
F 3 "" H 6000 5350 50  0001 C CNN
	1    6000 5550
	1    0    0    -1  
$EndComp
$Comp
L A5C:M175C UDJ41
U 1 1 6FC6B2A3
P 8000 5550
F 0 "UDJ41" H 8000 6115 50  0000 C CNN
F 1 "M175C" H 8000 6024 50  0000 C CNN
F 2 "" H 8000 5350 50  0001 C CNN
F 3 "" H 8000 5350 50  0001 C CNN
	1    8000 5550
	1    0    0    -1  
$EndComp
$Comp
L A5C:M175CLH UDL2
U 1 1 6BE7775D
P 4250 2150
F 0 "UDL2" H 4250 2715 50  0000 C CNN
F 1 "M175CLH" H 4250 2624 50  0000 C CNN
F 2 "" H 4250 1950 50  0001 C CNN
F 3 "" H 4250 1950 50  0001 C CNN
	1    4250 2150
	1    0    0    -1  
$EndComp
Text HLabel 6100 2400 2    50   Output ~ 0
W-OE
Wire Wire Line
	8400 5350 9000 5350
Wire Wire Line
	6700 4700 9100 4700
Connection ~ 9000 5350
Wire Wire Line
	9000 5350 9000 5800
Wire Wire Line
	9000 5800 9200 5800
Wire Wire Line
	9000 5350 9200 5350
Wire Wire Line
	9100 5700 9200 5700
Text HLabel 10300 5950 2    50   Output ~ 0
W-CAS[0..1]
Text Label 9750 5750 0    50   ~ 0
W-CAS1
Text Label 9750 5300 0    50   ~ 0
W-CAS0
Wire Bus Line
	10200 5950 10300 5950
Wire Wire Line
	9750 5750 10100 5750
Wire Wire Line
	9750 5300 10100 5300
Wire Wire Line
	9200 4600 9200 5250
Wire Wire Line
	9100 4700 9100 5700
Entry Wire Line
	10100 5750 10200 5850
Entry Wire Line
	10100 5300 10200 5400
Wire Wire Line
	8700 4000 8800 4000
Text HLabel 8700 4000 0    50   Input ~ 0
~CLK8M1
Connection ~ 8800 4000
$Comp
L A5C:NOR02 UDJ22
U 1 1 615AE399
P 9450 5300
F 0 "UDJ22" H 9475 5567 50  0000 C CNN
F 1 "NOR02" H 9475 5476 50  0000 C CNN
F 2 "" H 9450 5300 50  0001 C CNN
F 3 "" H 9450 5300 50  0001 C CNN
	1    9450 5300
	1    0    0    -1  
$EndComp
$Comp
L A5C:NOR02 UDJ24
U 1 1 615AEE89
P 9450 5750
F 0 "UDJ24" H 9475 6017 50  0000 C CNN
F 1 "NOR02" H 9475 5926 50  0000 C CNN
F 2 "" H 9450 5750 50  0001 C CNN
F 3 "" H 9450 5750 50  0001 C CNN
	1    9450 5750
	1    0    0    -1  
$EndComp
Wire Wire Line
	4950 5450 5600 5450
Wire Wire Line
	4450 6750 4950 6750
Text Notes 4950 4850 0    50   ~ 0
0
Text Notes 8900 5850 0    50   ~ 0
0
Text Notes 5000 6650 0    50   ~ 0
~SCAN-240-245~ & W-CAS & ~WX-A0~ & WY-A8
Text Notes 5000 6400 0    50   ~ 0
~SCAN-240-245~ & W-CAS & WX-A0 & WY-A8
Wire Bus Line
	10200 5400 10200 5950
$EndSCHEMATC
