EESchema Schematic File Version 4
EELAYER 30 0
EELAYER END
$Descr A3 16535 11693
encoding utf-8
Sheet 17 83
Title "CPS Reverse Engineering: DL-0311"
Date "2021-09-12"
Rev ""
Comp ""
Comment1 ""
Comment2 ""
Comment3 "Licence: CC-BY"
Comment4 "Author: Loïc *WydD* Petit"
$EndDescr
Connection ~ 10550 10350
Connection ~ 10550 8500
Connection ~ 10550 3550
Connection ~ 10550 6950
Connection ~ 10550 5100
Connection ~ 10550 1700
Connection ~ 4950 5950
Connection ~ 5050 6250
Connection ~ 4850 6050
Connection ~ 4850 9450
Connection ~ 4850 2650
Connection ~ 6550 6300
Connection ~ 6550 9700
Connection ~ 9850 3650
Connection ~ 9850 5300
Connection ~ 9850 7050
Connection ~ 9850 8700
Connection ~ 9850 10450
Connection ~ 6550 10900
Connection ~ 2300 9400
Connection ~ 4500 6050
Connection ~ 4600 6600
Connection ~ 4600 10000
Connection ~ 4500 9450
Connection ~ 4950 8850
Connection ~ 5050 9100
Connection ~ 3700 9950
Connection ~ 3650 8850
NoConn ~ 7150 9500
NoConn ~ 10450 10250
NoConn ~ 10450 6850
NoConn ~ 10450 3450
NoConn ~ 7150 2700
NoConn ~ 7150 6100
NoConn ~ 10450 1800
NoConn ~ 10450 5200
NoConn ~ 10450 8600
Entry Wire Line
	2150 2300 2250 2400
Entry Wire Line
	2150 2400 2250 2500
Entry Wire Line
	2150 2500 2250 2600
Entry Wire Line
	2150 2600 2250 2700
Entry Wire Line
	2150 2700 2250 2800
Entry Wire Line
	2150 2800 2250 2900
Entry Wire Line
	11150 3550 11250 3450
Entry Wire Line
	11150 6950 11250 6850
Entry Wire Line
	11150 10350 11250 10250
Entry Wire Line
	11400 1700 11500 1600
Entry Wire Line
	11400 5100 11500 5000
Entry Wire Line
	11400 8500 11500 8400
Wire Wire Line
	2200 9400 2300 9400
Wire Wire Line
	2250 2400 2850 2400
Wire Wire Line
	2250 2500 2850 2500
Wire Wire Line
	2250 2600 2850 2600
Wire Wire Line
	2250 2700 2850 2700
Wire Wire Line
	2250 2800 2850 2800
Wire Wire Line
	2250 2900 2850 2900
Wire Wire Line
	2300 9400 3700 9400
Wire Wire Line
	2300 10450 2300 9400
Wire Wire Line
	3100 10450 2300 10450
Wire Wire Line
	3650 8850 3550 8850
Wire Wire Line
	3650 9100 3650 8850
Wire Wire Line
	3650 9100 5050 9100
Wire Wire Line
	3700 9500 3700 9950
Wire Wire Line
	3700 10050 3700 10450
Wire Wire Line
	4250 8850 4950 8850
Wire Wire Line
	4250 9450 4500 9450
Wire Wire Line
	4250 10000 4600 10000
Wire Wire Line
	4500 2650 4500 6050
Wire Wire Line
	4500 6050 4500 9450
Wire Wire Line
	4500 9450 4850 9450
Wire Wire Line
	4600 3200 8800 3200
Wire Wire Line
	4600 6600 4600 3200
Wire Wire Line
	4600 6600 4600 10000
Wire Wire Line
	4600 6600 8800 6600
Wire Wire Line
	4600 10000 8800 10000
Wire Wire Line
	4850 2650 4500 2650
Wire Wire Line
	4850 2650 5550 2650
Wire Wire Line
	4850 2950 4850 2650
Wire Wire Line
	4850 2950 5550 2950
Wire Wire Line
	4850 6050 4500 6050
Wire Wire Line
	4850 6050 5550 6050
Wire Wire Line
	4850 6350 4850 6050
Wire Wire Line
	4850 6350 5550 6350
Wire Wire Line
	4850 9450 5550 9450
Wire Wire Line
	4850 9750 4850 9450
Wire Wire Line
	4850 9750 5550 9750
Wire Wire Line
	4950 2550 4950 5950
Wire Wire Line
	4950 2550 5550 2550
Wire Wire Line
	4950 5950 4950 8850
Wire Wire Line
	4950 5950 5550 5950
Wire Wire Line
	4950 8850 4950 9350
Wire Wire Line
	4950 9350 5550 9350
Wire Wire Line
	5050 2850 5050 6250
Wire Wire Line
	5050 2850 5550 2850
Wire Wire Line
	5050 6250 5050 9100
Wire Wire Line
	5050 6250 5550 6250
Wire Wire Line
	5050 9100 5050 9650
Wire Wire Line
	5050 9650 5550 9650
Wire Wire Line
	6450 10900 6550 10900
Wire Wire Line
	6550 2900 6650 2900
Wire Wire Line
	6550 6300 6550 2900
Wire Wire Line
	6550 9700 6550 6300
Wire Wire Line
	6550 10900 6550 9700
Wire Wire Line
	6650 2700 6450 2700
Wire Wire Line
	6650 6100 6450 6100
Wire Wire Line
	6650 6300 6550 6300
Wire Wire Line
	6650 9500 6450 9500
Wire Wire Line
	6650 9700 6550 9700
Wire Wire Line
	7150 2800 7800 2800
Wire Wire Line
	7150 6200 7800 6200
Wire Wire Line
	7150 9600 7800 9600
Wire Wire Line
	7800 3100 7800 2800
Wire Wire Line
	7800 6500 7800 6200
Wire Wire Line
	7800 9900 7800 9600
Wire Wire Line
	8000 2650 8100 2650
Wire Wire Line
	8000 2800 8000 2650
Wire Wire Line
	8000 6050 8100 6050
Wire Wire Line
	8000 6200 8000 6050
Wire Wire Line
	8000 9450 8100 9450
Wire Wire Line
	8000 9600 8000 9450
Wire Wire Line
	8650 800  8850 800 
Wire Wire Line
	8650 1700 9050 1700
Wire Wire Line
	8650 2600 8850 2600
Wire Wire Line
	8650 4200 8850 4200
Wire Wire Line
	8650 5100 9050 5100
Wire Wire Line
	8650 6000 8850 6000
Wire Wire Line
	8650 7600 8850 7600
Wire Wire Line
	8650 8500 9050 8500
Wire Wire Line
	8650 9400 8850 9400
Wire Wire Line
	8700 3700 8700 3950
Wire Wire Line
	8700 3950 10550 3950
Wire Wire Line
	8700 7100 8700 7350
Wire Wire Line
	8700 7350 10550 7350
Wire Wire Line
	8700 10500 8700 10750
Wire Wire Line
	8700 10750 10550 10750
Wire Wire Line
	8750 1250 8650 1250
Wire Wire Line
	8750 1600 8750 1250
Wire Wire Line
	8750 1800 8750 2150
Wire Wire Line
	8750 2150 8650 2150
Wire Wire Line
	8750 4650 8650 4650
Wire Wire Line
	8750 5000 8750 4650
Wire Wire Line
	8750 5200 8750 5550
Wire Wire Line
	8750 5550 8650 5550
Wire Wire Line
	8750 8050 8650 8050
Wire Wire Line
	8750 8400 8750 8050
Wire Wire Line
	8750 8600 8750 8950
Wire Wire Line
	8750 8950 8650 8950
Wire Wire Line
	8800 3100 7800 3100
Wire Wire Line
	8800 3700 8700 3700
Wire Wire Line
	8800 3800 8200 3800
Wire Wire Line
	8800 6500 7800 6500
Wire Wire Line
	8800 7100 8700 7100
Wire Wire Line
	8800 7200 8200 7200
Wire Wire Line
	8800 9900 7800 9900
Wire Wire Line
	8800 10500 8700 10500
Wire Wire Line
	8800 10600 8200 10600
Wire Wire Line
	8850 800  8850 1500
Wire Wire Line
	8850 1500 9050 1500
Wire Wire Line
	8850 1900 9050 1900
Wire Wire Line
	8850 2600 8850 1900
Wire Wire Line
	8850 4200 8850 4900
Wire Wire Line
	8850 4900 9050 4900
Wire Wire Line
	8850 5300 9050 5300
Wire Wire Line
	8850 6000 8850 5300
Wire Wire Line
	8850 7600 8850 8300
Wire Wire Line
	8850 8300 9050 8300
Wire Wire Line
	8850 8700 9050 8700
Wire Wire Line
	8850 9400 8850 8700
Wire Wire Line
	9050 1600 8750 1600
Wire Wire Line
	9050 1800 8750 1800
Wire Wire Line
	9050 5000 8750 5000
Wire Wire Line
	9050 5200 8750 5200
Wire Wire Line
	9050 8400 8750 8400
Wire Wire Line
	9050 8600 8750 8600
Wire Wire Line
	9700 1700 9950 1700
Wire Wire Line
	9700 3450 9950 3450
Wire Wire Line
	9700 5100 9950 5100
Wire Wire Line
	9700 6850 9950 6850
Wire Wire Line
	9700 8500 9950 8500
Wire Wire Line
	9700 10250 9950 10250
Wire Wire Line
	9850 1900 9850 3650
Wire Wire Line
	9850 3650 9850 5300
Wire Wire Line
	9850 3650 9950 3650
Wire Wire Line
	9850 5300 9850 7050
Wire Wire Line
	9850 7050 9850 8700
Wire Wire Line
	9850 8700 9850 10450
Wire Wire Line
	9850 10450 9850 10900
Wire Wire Line
	9850 10900 6550 10900
Wire Wire Line
	9950 1900 9850 1900
Wire Wire Line
	9950 5300 9850 5300
Wire Wire Line
	9950 7050 9850 7050
Wire Wire Line
	9950 8700 9850 8700
Wire Wire Line
	9950 10450 9850 10450
Wire Wire Line
	10450 3550 10550 3550
Wire Wire Line
	10450 6950 10550 6950
Wire Wire Line
	10450 8500 10550 8500
Wire Wire Line
	10450 10350 10550 10350
Wire Wire Line
	10550 1700 10450 1700
Wire Wire Line
	10550 1700 10550 2800
Wire Wire Line
	10550 1700 11400 1700
Wire Wire Line
	10550 2800 8000 2800
Wire Wire Line
	10550 3550 10550 3950
Wire Wire Line
	10550 3550 11150 3550
Wire Wire Line
	10550 5100 10450 5100
Wire Wire Line
	10550 5100 10550 6200
Wire Wire Line
	10550 5100 11400 5100
Wire Wire Line
	10550 6200 8000 6200
Wire Wire Line
	10550 6950 10550 7350
Wire Wire Line
	10550 6950 11150 6950
Wire Wire Line
	10550 8500 10550 9600
Wire Wire Line
	10550 8500 11400 8500
Wire Wire Line
	10550 9600 8000 9600
Wire Wire Line
	10550 10350 10550 10750
Wire Wire Line
	10550 10350 11150 10350
Wire Bus Line
	2150 2200 2050 2200
Wire Bus Line
	11250 1100 11700 1100
Wire Bus Line
	11500 1250 11700 1250
Text Notes 10650 1600 0    50   ~ 0
GFX-CHNL
Text Notes 10650 3450 0    50   ~ 0
~GFX-CHNL
Text Notes 10650 5000 0    50   ~ 0
GFX-CHNL
Text Notes 10650 6850 0    50   ~ 0
~GFX-CHNL
Text Notes 10650 8400 0    50   ~ 0
GFX-CHNL
Text Notes 10650 10250 0    50   ~ 0
~GFX-CHNL
Text Label 2300 2400 0    50   ~ 0
GFX-ADDR10
Text Label 2300 2500 0    50   ~ 0
GFX-ADDR11
Text Label 2300 2600 0    50   ~ 0
GFX-ADDR12
Text Label 2300 2700 0    50   ~ 0
GFX-ADDR13
Text Label 2300 2800 0    50   ~ 0
GFX-ADDR14
Text Label 2300 2900 0    50   ~ 0
GFX-ADDR15
Text Label 5550 2450 2    50   ~ 0
GFX-ADDR15
Text Label 5550 2750 2    50   ~ 0
GFX-ADDR13
Text Label 5550 5850 2    50   ~ 0
GFX-ADDR14
Text Label 5550 6150 2    50   ~ 0
GFX-ADDR12
Text Label 5550 9250 2    50   ~ 0
GFX-ADDR13
Text Label 5550 9550 2    50   ~ 0
GFX-ADDR11
Text Label 8100 750  2    50   ~ 0
GFX-ADDR15
Text Label 8100 1200 2    50   ~ 0
GFX-ADDR14
Text Label 8100 1650 2    50   ~ 0
GFX-ADDR13
Text Label 8100 2100 2    50   ~ 0
GFX-ADDR12
Text Label 8100 2550 2    50   ~ 0
~GFX-CHNL
Text Label 8100 4150 2    50   ~ 0
GFX-ADDR14
Text Label 8100 4250 2    50   ~ 0
SCROLL1.GFX-CHNL
Text Label 8100 4600 2    50   ~ 0
GFX-ADDR13
Text Label 8100 4700 2    50   ~ 0
ELSE.GFX-CHNL
Text Label 8100 5050 2    50   ~ 0
GFX-ADDR12
Text Label 8100 5150 2    50   ~ 0
STARS.GFX-CHNL
Text Label 8100 5500 2    50   ~ 0
GFX-ADDR11
Text Label 8100 5600 2    50   ~ 0
SCROLL3.GFX-CHNL
Text Label 8100 5950 2    50   ~ 0
~GFX-CHNL
Text Label 8100 7550 2    50   ~ 0
GFX-ADDR13
Text Label 8100 7650 2    50   ~ 0
SCROLL1.GFX-CHNL
Text Label 8100 8000 2    50   ~ 0
GFX-ADDR12
Text Label 8100 8100 2    50   ~ 0
ELSE.GFX-CHNL
Text Label 8100 8450 2    50   ~ 0
GFX-ADDR11
Text Label 8100 8550 2    50   ~ 0
STARS.GFX-CHNL
Text Label 8100 9000 2    50   ~ 0
SCROLL3.GFX-CHNL
Text Label 8100 9350 2    50   ~ 0
~GFX-CHNL
Text Label 8200 3800 0    50   ~ 0
~GFX-CHNL
Text Label 8200 7200 0    50   ~ 0
~GFX-CHNL
Text Label 8200 10600 0    50   ~ 0
~GFX-CHNL
Text Label 8800 3300 2    50   ~ 0
GFX-ADDR14
Text Label 8800 3400 2    50   ~ 0
ELSE.GFX-CHNL
Text Label 8800 3500 2    50   ~ 0
GFX-ADDR12
Text Label 8800 3600 2    50   ~ 0
SCROLL3.GFX-CHNL
Text Label 8800 6700 2    50   ~ 0
GFX-ADDR13
Text Label 8800 6800 2    50   ~ 0
ELSE.GFX-CHNL
Text Label 8800 6900 2    50   ~ 0
GFX-ADDR11
Text Label 8800 7000 2    50   ~ 0
SCROLL3.GFX-CHNL
Text Label 8800 10100 2    50   ~ 0
GFX-ADDR12
Text Label 8800 10200 2    50   ~ 0
ELSE.GFX-CHNL
Text Label 8800 10300 2    50   ~ 0
GFX-ADDR10
Text Label 8800 10400 2    50   ~ 0
SCROLL3.GFX-CHNL
Text Label 10650 1700 0    50   ~ 0
B-ROMA14
Text Label 10650 3550 0    50   ~ 0
A-ROMA14
Text Label 10650 5100 0    50   ~ 0
B-ROMA13
Text Label 10650 6950 0    50   ~ 0
A-ROMA13
Text Label 10650 8500 0    50   ~ 0
B-ROMA12
Text Label 10650 10350 0    50   ~ 0
A-ROMA12
Text HLabel 2050 2200 0    50   Input ~ 0
GFX-ADDR[10..15]
Text HLabel 2200 9400 0    50   Input ~ 0
~GFX-CHNL
Text HLabel 3100 9950 0    50   Input ~ 0
~SCROLL1-STARS
Text HLabel 3550 8850 0    50   Input ~ 0
SCROLL3-STARS
Text HLabel 6450 10900 0    50   Input ~ 0
~CLK4M
Text HLabel 8100 850  0    50   Input ~ 0
SCROLL1.GFX-CHNL
Text HLabel 8100 1300 0    50   Input ~ 0
ELSE.GFX-CHNL
Text HLabel 8100 1750 0    50   Input ~ 0
STARS.GFX-CHNL
Text HLabel 8100 2200 0    50   Input ~ 0
SCROLL3.GFX-CHNL
Text HLabel 11700 1100 2    50   Output ~ 0
A-ROMA[12..14]
Text HLabel 11700 1250 2    50   Output ~ 0
B-ROMA[12..14]
$Comp
L A5C:AND02 UEG198
U 1 1 62F135C0
P 3950 9450
F 0 "UEG198" H 3975 9717 50  0000 C CNN
F 1 "AND02" H 3975 9626 50  0000 C CNN
F 2 "" H 3950 9450 50  0001 C CNN
F 3 "" H 3950 9450 50  0001 C CNN
	1    3950 9450
	1    0    0    -1  
$EndComp
$Comp
L A5C:AND02 UEG211
U 1 1 62F135C6
P 3950 10000
F 0 "UEG211" H 3975 10267 50  0000 C CNN
F 1 "AND02" H 3975 10176 50  0000 C CNN
F 2 "" H 3950 10000 50  0001 C CNN
F 3 "" H 3950 10000 50  0001 C CNN
	1    3950 10000
	1    0    0    -1  
$EndComp
$Comp
L A5C:NAND02 UEI158
U 1 1 62F1356B
P 8350 800
F 0 "UEI158" H 8375 1067 50  0000 C CNN
F 1 "NAND02" H 8375 976 50  0000 C CNN
F 2 "" H 8350 800 50  0001 C CNN
F 3 "" H 8350 800 50  0001 C CNN
	1    8350 800 
	1    0    0    -1  
$EndComp
$Comp
L A5C:NAND02 UEI155
U 1 1 62F13565
P 8350 1250
F 0 "UEI155" H 8375 1517 50  0000 C CNN
F 1 "NAND02" H 8375 1426 50  0000 C CNN
F 2 "" H 8350 1250 50  0001 C CNN
F 3 "" H 8350 1250 50  0001 C CNN
	1    8350 1250
	1    0    0    -1  
$EndComp
$Comp
L A5C:NAND02 UEH170
U 1 1 62F1355F
P 8350 1700
F 0 "UEH170" H 8375 1967 50  0000 C CNN
F 1 "NAND02" H 8375 1876 50  0000 C CNN
F 2 "" H 8350 1700 50  0001 C CNN
F 3 "" H 8350 1700 50  0001 C CNN
	1    8350 1700
	1    0    0    -1  
$EndComp
$Comp
L A5C:NAND02 UEI180
U 1 1 62F13559
P 8350 2150
F 0 "UEI180" H 8375 2417 50  0000 C CNN
F 1 "NAND02" H 8375 2326 50  0000 C CNN
F 2 "" H 8350 2150 50  0001 C CNN
F 3 "" H 8350 2150 50  0001 C CNN
	1    8350 2150
	1    0    0    -1  
$EndComp
$Comp
L A5C:NAND02 UEI157
U 1 1 62F13553
P 8350 2600
F 0 "UEI157" H 8375 2867 50  0000 C CNN
F 1 "NAND02" H 8375 2776 50  0000 C CNN
F 2 "" H 8350 2600 50  0001 C CNN
F 3 "" H 8350 2600 50  0001 C CNN
	1    8350 2600
	1    0    0    -1  
$EndComp
$Comp
L A5C:NAND02 UEA118
U 1 1 62F13451
P 8350 4200
F 0 "UEA118" H 8375 4467 50  0000 C CNN
F 1 "NAND02" H 8375 4376 50  0000 C CNN
F 2 "" H 8350 4200 50  0001 C CNN
F 3 "" H 8350 4200 50  0001 C CNN
	1    8350 4200
	1    0    0    -1  
$EndComp
$Comp
L A5C:NAND02 UEA95
U 1 1 62F1344B
P 8350 4650
F 0 "UEA95" H 8375 4917 50  0000 C CNN
F 1 "NAND02" H 8375 4826 50  0000 C CNN
F 2 "" H 8350 4650 50  0001 C CNN
F 3 "" H 8350 4650 50  0001 C CNN
	1    8350 4650
	1    0    0    -1  
$EndComp
$Comp
L A5C:NAND02 UEA113
U 1 1 62F13445
P 8350 5100
F 0 "UEA113" H 8375 5367 50  0000 C CNN
F 1 "NAND02" H 8375 5276 50  0000 C CNN
F 2 "" H 8350 5100 50  0001 C CNN
F 3 "" H 8350 5100 50  0001 C CNN
	1    8350 5100
	1    0    0    -1  
$EndComp
$Comp
L A5C:NAND02 UEA124
U 1 1 62F1343F
P 8350 5550
F 0 "UEA124" H 8375 5817 50  0000 C CNN
F 1 "NAND02" H 8375 5726 50  0000 C CNN
F 2 "" H 8350 5550 50  0001 C CNN
F 3 "" H 8350 5550 50  0001 C CNN
	1    8350 5550
	1    0    0    -1  
$EndComp
$Comp
L A5C:NAND02 UEA111
U 1 1 62F13439
P 8350 6000
F 0 "UEA111" H 8375 6267 50  0000 C CNN
F 1 "NAND02" H 8375 6176 50  0000 C CNN
F 2 "" H 8350 6000 50  0001 C CNN
F 3 "" H 8350 6000 50  0001 C CNN
	1    8350 6000
	1    0    0    -1  
$EndComp
$Comp
L A5C:NAND02 UEC91
U 1 1 62F13488
P 8350 7600
F 0 "UEC91" H 8375 7867 50  0000 C CNN
F 1 "NAND02" H 8375 7776 50  0000 C CNN
F 2 "" H 8350 7600 50  0001 C CNN
F 3 "" H 8350 7600 50  0001 C CNN
	1    8350 7600
	1    0    0    -1  
$EndComp
$Comp
L A5C:NAND02 UED96
U 1 1 62F1348E
P 8350 8050
F 0 "UED96" H 8375 8317 50  0000 C CNN
F 1 "NAND02" H 8375 8226 50  0000 C CNN
F 2 "" H 8350 8050 50  0001 C CNN
F 3 "" H 8350 8050 50  0001 C CNN
	1    8350 8050
	1    0    0    -1  
$EndComp
$Comp
L A5C:NAND02 UEC75
U 1 1 62F13494
P 8350 8500
F 0 "UEC75" H 8375 8767 50  0000 C CNN
F 1 "NAND02" H 8375 8676 50  0000 C CNN
F 2 "" H 8350 8500 50  0001 C CNN
F 3 "" H 8350 8500 50  0001 C CNN
	1    8350 8500
	1    0    0    -1  
$EndComp
$Comp
L A5C:NAND02 UEC73
U 1 1 62F1349A
P 8350 8950
F 0 "UEC73" H 8375 9217 50  0000 C CNN
F 1 "NAND02" H 8375 9126 50  0000 C CNN
F 2 "" H 8350 8950 50  0001 C CNN
F 3 "" H 8350 8950 50  0001 C CNN
	1    8350 8950
	1    0    0    -1  
$EndComp
$Comp
L A5C:NAND02 UEF93
U 1 1 62F134A0
P 8350 9400
F 0 "UEF93" H 8375 9667 50  0000 C CNN
F 1 "NAND02" H 8375 9576 50  0000 C CNN
F 2 "" H 8350 9400 50  0001 C CNN
F 3 "" H 8350 9400 50  0001 C CNN
	1    8350 9400
	1    0    0    -1  
$EndComp
$Comp
L A5C:INV01 UEI196
U 1 1 62F135B9
P 3400 9950
F 0 "UEI196" H 3400 10267 50  0000 C CNN
F 1 "INV01" H 3400 10176 50  0000 C CNN
F 2 "" H 3400 9750 50  0001 C CNN
F 3 "" H 3400 9750 50  0001 C CNN
	1    3400 9950
	1    0    0    -1  
$EndComp
$Comp
L A5C:INV01 UEG210
U 1 1 62F135B2
P 3400 10450
F 0 "UEG210" H 3400 10767 50  0000 C CNN
F 1 "INV01" H 3400 10676 50  0000 C CNN
F 2 "" H 3400 10250 50  0001 C CNN
F 3 "" H 3400 10250 50  0001 C CNN
	1    3400 10450
	1    0    0    -1  
$EndComp
$Comp
L A5C:INV01 UEI179
U 1 1 62F134F3
P 3950 8850
F 0 "UEI179" H 3950 9167 50  0000 C CNN
F 1 "INV01" H 3950 9076 50  0000 C CNN
F 2 "" H 3950 8650 50  0001 C CNN
F 3 "" H 3950 8650 50  0001 C CNN
	1    3950 8850
	1    0    0    -1  
$EndComp
$Comp
L A5C:DFFCOO UEH217
U 1 1 62F13586
P 6900 2800
F 0 "UEH217" H 6900 3165 50  0000 C CNN
F 1 "DFFCOO" H 6900 3074 50  0000 C CNN
F 2 "" H 6900 2800 50  0001 C CNN
F 3 "" H 6900 2800 50  0001 C CNN
	1    6900 2800
	1    0    0    -1  
$EndComp
$Comp
L A5C:DFFCOO UEH156
U 1 1 62F134FD
P 6900 6200
F 0 "UEH156" H 6900 6565 50  0000 C CNN
F 1 "DFFCOO" H 6900 6474 50  0000 C CNN
F 2 "" H 6900 6200 50  0001 C CNN
F 3 "" H 6900 6200 50  0001 C CNN
	1    6900 6200
	1    0    0    -1  
$EndComp
$Comp
L A5C:DFFCOO UEI181
U 1 1 62F134C3
P 6900 9600
F 0 "UEI181" H 6900 9965 50  0000 C CNN
F 1 "DFFCOO" H 6900 9874 50  0000 C CNN
F 2 "" H 6900 9600 50  0001 C CNN
F 3 "" H 6900 9600 50  0001 C CNN
	1    6900 9600
	1    0    0    -1  
$EndComp
$Comp
L A5C:DFFCOO UEI149
U 1 1 62F1353D
P 10200 1800
F 0 "UEI149" H 10200 2165 50  0000 C CNN
F 1 "DFFCOO" H 10200 2074 50  0000 C CNN
F 2 "" H 10200 1800 50  0001 C CNN
F 3 "" H 10200 1800 50  0001 C CNN
	1    10200 1800
	1    0    0    -1  
$EndComp
$Comp
L A5C:DFFCOO UEH212
U 1 1 62F13523
P 10200 3550
F 0 "UEH212" H 10200 3915 50  0000 C CNN
F 1 "DFFCOO" H 10200 3824 50  0000 C CNN
F 2 "" H 10200 3550 50  0001 C CNN
F 3 "" H 10200 3550 50  0001 C CNN
	1    10200 3550
	1    0    0    -1  
$EndComp
$Comp
L A5C:DFFCOO UEA107
U 1 1 62F13423
P 10200 5200
F 0 "UEA107" H 10200 5565 50  0000 C CNN
F 1 "DFFCOO" H 10200 5474 50  0000 C CNN
F 2 "" H 10200 5200 50  0001 C CNN
F 3 "" H 10200 5200 50  0001 C CNN
	1    10200 5200
	1    0    0    -1  
$EndComp
$Comp
L A5C:DFFCOO UEG131
U 1 1 62F13409
P 10200 6950
F 0 "UEG131" H 10200 7315 50  0000 C CNN
F 1 "DFFCOO" H 10200 7224 50  0000 C CNN
F 2 "" H 10200 6950 50  0001 C CNN
F 3 "" H 10200 6950 50  0001 C CNN
	1    10200 6950
	1    0    0    -1  
$EndComp
$Comp
L A5C:DFFCOO UEF89
U 1 1 62F134D3
P 10200 8600
F 0 "UEF89" H 10200 8965 50  0000 C CNN
F 1 "DFFCOO" H 10200 8874 50  0000 C CNN
F 2 "" H 10200 8600 50  0001 C CNN
F 3 "" H 10200 8600 50  0001 C CNN
	1    10200 8600
	1    0    0    -1  
$EndComp
$Comp
L A5C:DFFCOO UEI197
U 1 1 62F134ED
P 10200 10350
F 0 "UEI197" H 10200 10715 50  0000 C CNN
F 1 "DFFCOO" H 10200 10624 50  0000 C CNN
F 2 "" H 10200 10350 50  0001 C CNN
F 3 "" H 10200 10350 50  0001 C CNN
	1    10200 10350
	1    0    0    -1  
$EndComp
$Comp
L A5C:NAND05 UEI164
U 1 1 62F1354B
P 9350 1700
F 0 "UEI164" H 9375 2090 50  0000 C CNN
F 1 "NAND05" H 9375 1999 50  0000 C CNN
F 2 "" H 9350 1400 50  0001 C CNN
F 3 "" H 9350 1400 50  0001 C CNN
	1    9350 1700
	1    0    0    -1  
$EndComp
$Comp
L A5C:NAND05 UEA115
U 1 1 62F13431
P 9350 5100
F 0 "UEA115" H 9375 5490 50  0000 C CNN
F 1 "NAND05" H 9375 5399 50  0000 C CNN
F 2 "" H 9350 4800 50  0001 C CNN
F 3 "" H 9350 4800 50  0001 C CNN
	1    9350 5100
	1    0    0    -1  
$EndComp
$Comp
L A5C:NAND05 UED82
U 1 1 62F134A6
P 9350 8500
F 0 "UED82" H 9375 8890 50  0000 C CNN
F 1 "NAND05" H 9375 8799 50  0000 C CNN
F 2 "" H 9350 8200 50  0001 C CNN
F 3 "" H 9350 8200 50  0001 C CNN
	1    9350 8500
	1    0    0    -1  
$EndComp
$Comp
L A5C:AOI32 UEJ171
U 1 1 62F1358F
P 6000 2700
F 0 "UEJ171" H 6000 3142 50  0000 C CNN
F 1 "AOI32" H 6000 3051 50  0000 C CNN
F 2 "" H 6150 2700 50  0001 C CNN
F 3 "" H 6150 2700 50  0001 C CNN
	1    6000 2700
	1    0    0    -1  
$EndComp
$Comp
L A5C:AOI32 UEI167
U 1 1 62F13506
P 6000 6100
F 0 "UEI167" H 6000 6542 50  0000 C CNN
F 1 "AOI32" H 6000 6451 50  0000 C CNN
F 2 "" H 6150 6100 50  0001 C CNN
F 3 "" H 6150 6100 50  0001 C CNN
	1    6000 6100
	1    0    0    -1  
$EndComp
$Comp
L A5C:AOI32 UEJ165
U 1 1 62F134BA
P 6000 9500
F 0 "UEJ165" H 6000 9942 50  0000 C CNN
F 1 "AOI32" H 6000 9851 50  0000 C CNN
F 2 "" H 6150 9500 50  0001 C CNN
F 3 "" H 6150 9500 50  0001 C CNN
	1    6000 9500
	1    0    0    -1  
$EndComp
$Comp
L A5C:AOI24 UEH206
U 1 1 62F1352C
P 9250 3450
F 0 "UEH206" H 9250 4017 50  0000 C CNN
F 1 "AOI24" H 9250 3926 50  0000 C CNN
F 2 "" H 9450 3750 50  0001 C CNN
F 3 "" H 9450 3750 50  0001 C CNN
	1    9250 3450
	1    0    0    -1  
$EndComp
$Comp
L A5C:AOI24 UEG162
U 1 1 62F13412
P 9250 6850
F 0 "UEG162" H 9250 7417 50  0000 C CNN
F 1 "AOI24" H 9250 7326 50  0000 C CNN
F 2 "" H 9450 7150 50  0001 C CNN
F 3 "" H 9450 7150 50  0001 C CNN
	1    9250 6850
	1    0    0    -1  
$EndComp
$Comp
L A5C:AOI24 UEI188
U 1 1 62F134E4
P 9250 10250
F 0 "UEI188" H 9250 10817 50  0000 C CNN
F 1 "AOI24" H 9250 10726 50  0000 C CNN
F 2 "" H 9450 10550 50  0001 C CNN
F 3 "" H 9450 10550 50  0001 C CNN
	1    9250 10250
	1    0    0    -1  
$EndComp
Wire Bus Line
	11250 1100 11250 10250
Wire Bus Line
	11500 1250 11500 8400
Wire Bus Line
	2150 2200 2150 2800
Text Label 8100 8900 2    50   ~ 0
GFX-ADDR10
$EndSCHEMATC
