EESchema Schematic File Version 5
EELAYER 33 0
EELAYER END
$Descr A4 11693 8268
encoding utf-8
Sheet 5 20
Title ""
Date "2020-04-12"
Rev ""
Comp ""
Comment1 ""
Comment2 "Licence: CC-BY"
Comment3 "Author: Loic *WydD* Petit"
Comment4 "Project: CPS2 Reverse Engineering: DL-1827"
Comment5 ""
Comment6 ""
Comment7 ""
Comment8 ""
Comment9 ""
$EndDescr
Connection ~ 4500 4750
Connection ~ 4500 4050
Connection ~ 4500 5500
Connection ~ 4500 2650
Connection ~ 4500 3350
Connection ~ 4500 1950
Wire Wire Line
	4050 6200 4500 6200
Wire Wire Line
	4500 1200 4500 1950
Wire Wire Line
	4500 1200 5750 1200
Wire Wire Line
	4500 1950 4500 2650
Wire Wire Line
	4500 1950 5750 1950
Wire Wire Line
	4500 2650 4500 3350
Wire Wire Line
	4500 2650 5750 2650
Wire Wire Line
	4500 3350 4500 4050
Wire Wire Line
	4500 3350 5750 3350
Wire Wire Line
	4500 4050 4500 4750
Wire Wire Line
	4500 4050 5750 4050
Wire Wire Line
	4500 4750 4500 5500
Wire Wire Line
	4500 4750 5750 4750
Wire Wire Line
	4500 5500 4500 6200
Wire Wire Line
	4500 5500 5750 5500
Wire Wire Line
	6050 950  6800 950 
Wire Wire Line
	6050 1700 6800 1700
Wire Wire Line
	6050 2400 6800 2400
Wire Wire Line
	6050 3100 6800 3100
Wire Wire Line
	6050 3800 6800 3800
Wire Wire Line
	6050 5250 6800 5250
Wire Wire Line
	6800 4500 6050 4500
Text HLabel 3450 6200 0    50   Input ~ 0
ENABLE
Text HLabel 5450 950  0    50   Input ~ 0
_CLK4M
Text HLabel 5450 1700 0    50   Input ~ 0
_CLK16M
Text HLabel 5450 2400 0    50   Input ~ 0
_SEC-CLK
Text HLabel 5450 3100 0    50   Input ~ 0
~_CPSA-RESET
Text HLabel 5450 3800 0    50   Input ~ 0
~_Z80-BUS
Text HLabel 5450 4500 0    50   Input ~ 0
_OBJRAM-BANK
Text HLabel 5450 5250 0    50   Input ~ 0
~_CPU-UDSW
Text HLabel 6800 950  2    50   Output ~ 0
CLK4M
Text HLabel 6800 1700 2    50   Output ~ 0
CLK16M
Text HLabel 6800 2400 2    50   Output ~ 0
SEC-CLK
Text HLabel 6800 3100 2    50   Output ~ 0
~CPSA-RESET
Text HLabel 6800 3800 2    50   Output ~ 0
~Z80-BUS
Text HLabel 6800 4500 2    50   Output ~ 0
OBJRAM-BANK
Text HLabel 6800 5250 2    50   Output ~ 0
~CPU-UDSW
$Comp
L CG24-cells:V1L U22R153
U 1 1 5E74CF36
P 3750 6200
AR Path="/5EA65BE6/5E74CF36" Ref="U22R153"  Part="1" 
AR Path="/5E954161/5E74CF36" Ref="U22R153"  Part="1" 
F 0 "U22R153" H 3750 5883 50  0000 C CNN
F 1 "V1L" H 3750 5974 50  0000 C CNN
F 2 "" H 3750 6000 50  0001 C CNN
F 3 "" H 3750 6000 50  0001 C CNN
	1    3750 6200
	1    0    0    1   
$EndComp
$Comp
L CG24-cells:B11 U20R180
U 1 1 5E80271B
P 5750 950
AR Path="/5EA65BE6/5E80271B" Ref="U20R180"  Part="1" 
AR Path="/5E954161/5E80271B" Ref="U20R180"  Part="1" 
F 0 "U20R180" H 5750 1267 50  0000 C CNN
F 1 "B11" H 5750 1176 50  0000 C CNN
F 2 "" H 5750 950 50  0001 C CNN
F 3 "" H 5750 950 50  0001 C CNN
	1    5750 950 
	1    0    0    -1  
$EndComp
$Comp
L CG24-cells:B11 U26R22
U 1 1 5E89EDC7
P 5750 1700
AR Path="/5EA65BE6/5E89EDC7" Ref="U26R22"  Part="1" 
AR Path="/5E954161/5E89EDC7" Ref="U26R22"  Part="1" 
F 0 "U26R22" H 5750 2017 50  0000 C CNN
F 1 "B11" H 5750 1926 50  0000 C CNN
F 2 "" H 5750 1700 50  0001 C CNN
F 3 "" H 5750 1700 50  0001 C CNN
	1    5750 1700
	1    0    0    -1  
$EndComp
$Comp
L CG24-cells:B11 U34R182
U 1 1 5E825925
P 5750 2400
AR Path="/5EA65BE6/5E825925" Ref="U34R182"  Part="1" 
AR Path="/5E954161/5E825925" Ref="U34R182"  Part="1" 
F 0 "U34R182" H 5750 2717 50  0000 C CNN
F 1 "B11" H 5750 2626 50  0000 C CNN
F 2 "" H 5750 2400 50  0001 C CNN
F 3 "" H 5750 2400 50  0001 C CNN
	1    5750 2400
	1    0    0    -1  
$EndComp
$Comp
L CG24-cells:B12 U6R22
U 1 1 5E8CB42C
P 5750 3100
AR Path="/5EA65BE6/5E8CB42C" Ref="U6R22"  Part="1" 
AR Path="/5E954161/5E8CB42C" Ref="U6R22"  Part="1" 
F 0 "U6R22" H 5750 3465 50  0000 C CNN
F 1 "B12" H 5750 3374 50  0000 C CNN
F 2 "" H 5750 3100 50  0001 C CNN
F 3 "" H 5750 3100 50  0001 C CNN
	1    5750 3100
	1    0    0    -1  
$EndComp
$Comp
L CG24-cells:B12 U6R24
U 1 1 5E8CB426
P 5750 3800
AR Path="/5EA65BE6/5E8CB426" Ref="U6R24"  Part="1" 
AR Path="/5E954161/5E8CB426" Ref="U6R24"  Part="1" 
F 0 "U6R24" H 5750 4165 50  0000 C CNN
F 1 "B12" H 5750 4074 50  0000 C CNN
F 2 "" H 5750 3800 50  0001 C CNN
F 3 "" H 5750 3800 50  0001 C CNN
	1    5750 3800
	1    0    0    -1  
$EndComp
$Comp
L CG24-cells:B12 U42R98
U 1 1 5ED56356
P 5750 4500
AR Path="/5EA65BE6/5ED56356" Ref="U42R98"  Part="1" 
AR Path="/5E954161/5ED56356" Ref="U42R98"  Part="1" 
F 0 "U42R98" H 5750 4865 50  0000 C CNN
F 1 "B12" H 5750 4774 50  0000 C CNN
F 2 "" H 5750 4500 50  0001 C CNN
F 3 "" H 5750 4500 50  0001 C CNN
	1    5750 4500
	1    0    0    -1  
$EndComp
$Comp
L CG24-cells:B12 U42R181
U 1 1 5EB97C7B
P 5750 5250
AR Path="/5EA65BE6/5EB97C7B" Ref="U42R181"  Part="1" 
AR Path="/5E954161/5EB97C7B" Ref="U42R181"  Part="1" 
F 0 "U42R181" H 5750 5615 50  0000 C CNN
F 1 "B12" H 5750 5524 50  0000 C CNN
F 2 "" H 5750 5250 50  0001 C CNN
F 3 "" H 5750 5250 50  0001 C CNN
	1    5750 5250
	1    0    0    -1  
$EndComp
$EndSCHEMATC
