EESchema Schematic File Version 4
EELAYER 30 0
EELAYER END
$Descr A4 11693 8268
encoding utf-8
Sheet 5 20
Title "DL-1727"
Date "2020-04-26"
Rev ""
Comp ""
Comment1 ""
Comment2 "Licence: CC-BY"
Comment3 "Author: Loic *WydD* Petit"
Comment4 "Project: CPS2 Reverse Engineering: DL-1727"
$EndDescr
Wire Wire Line
	1450 3200 1700 3200
Wire Wire Line
	7000 5000 7000 5450
Wire Wire Line
	7000 5000 8050 5000
Wire Wire Line
	7100 5450 7000 5450
Wire Wire Line
	7950 5100 7950 5550
Wire Wire Line
	7950 5100 8050 5100
Wire Wire Line
	7950 5100 7950 4750
Wire Wire Line
	2850 3250 3100 3250
Wire Wire Line
	8050 5450 7700 5450
Wire Wire Line
	8050 5550 7950 5550
Wire Wire Line
	3100 3150 2950 3150
Wire Wire Line
	5150 5100 5150 5650
Wire Wire Line
	5150 5650 5250 5650
Wire Wire Line
	5200 4550 5150 4550
Wire Wire Line
	5250 5100 5150 5100
Wire Wire Line
	5250 3950 5150 3950
Wire Wire Line
	5800 5700 5950 5700
Wire Wire Line
	8900 4950 8900 5400
Wire Wire Line
	8900 4950 9000 4950
Wire Wire Line
	4250 3200 3650 3200
Wire Wire Line
	9000 5400 8900 5400
Wire Wire Line
	5950 5150 5800 5150
Wire Wire Line
	5950 5400 5950 5150
Wire Wire Line
	5950 5500 6100 5500
Wire Wire Line
	5950 5700 5950 5500
Wire Wire Line
	6100 5400 5950 5400
Wire Wire Line
	6650 5450 7000 5450
Wire Wire Line
	5200 3250 4800 3250
Text Notes 2900 3850 0    50   ~ 0
High if\n0x80408x\n0x80409x\n0x8040ax\n0x8040bx\n0x8040ex
Text Notes 8750 3500 2    50   ~ 0
Low if\nIN AND /DEBUG
Text Label 4000 2650 2    50   ~ 0
12R153-Q
Text Label 8900 3650 0    50   ~ 0
14R132
$Comp
L CG24-cells:R2P U10R112
U 1 1 5ECE47B1
P 1950 3250
F 0 "U10R112" H 1975 3517 50  0000 C CNN
F 1 "R2P" H 1975 3426 50  0000 C CNN
F 2 "" H 2000 3250 50  0001 C CNN
F 3 "" H 2000 3250 50  0001 C CNN
	1    1950 3250
	1    0    0    -1  
$EndComp
$Comp
L CG24-cells:R2P U15R132
U 1 1 6E8AACF2
P 8300 5050
F 0 "U15R132" H 8325 4783 50  0000 C CNN
F 1 "R2P" H 8325 4874 50  0000 C CNN
F 2 "" H 8350 5050 50  0001 C CNN
F 3 "" H 8350 5050 50  0001 C CNN
	1    8300 5050
	1    0    0    1   
$EndComp
$Comp
L CG24-cells:R2P U14R122
U 1 1 6E93E11B
P 8300 5500
F 0 "U14R122" H 8325 5233 50  0000 C CNN
F 1 "R2P" H 8325 5324 50  0000 C CNN
F 2 "" H 8350 5500 50  0001 C CNN
F 3 "" H 8350 5500 50  0001 C CNN
	1    8300 5500
	1    0    0    1   
$EndComp
$Comp
L CG24-cells:R2P U22R163
U 1 1 6CBDB1CD
P 4500 4050
F 0 "U22R163" H 4525 4317 50  0000 C CNN
F 1 "R2P" H 4525 4226 50  0000 C CNN
F 2 "" H 4550 4050 50  0001 C CNN
F 3 "" H 4550 4050 50  0001 C CNN
	1    4500 4050
	1    0    0    -1  
$EndComp
$Comp
L CG24-cells:R2P U16R153
U 1 1 603CEB18
P 3350 3200
F 0 "U16R153" H 3375 3467 50  0000 C CNN
F 1 "R2P" H 3375 3376 50  0000 C CNN
F 2 "" H 3400 3200 50  0001 C CNN
F 3 "" H 3400 3200 50  0001 C CNN
	1    3350 3200
	1    0    0    -1  
$EndComp
$Comp
L CG24-cells:R2N U27R154
U 1 1 6C5650BD
P 5500 5150
F 0 "U27R154" H 5525 5417 50  0000 C CNN
F 1 "R2N" H 5525 5326 50  0000 C CNN
F 2 "" H 5500 5150 50  0001 C CNN
F 3 "" H 5500 5150 50  0001 C CNN
	1    5500 5150
	1    0    0    -1  
$EndComp
$Comp
L CG24-cells:N2P U28R153
U 1 1 6C567EBB
P 5500 5700
F 0 "U28R153" H 5525 5967 50  0000 C CNN
F 1 "N2P" H 5525 5876 50  0000 C CNN
F 2 "" H 5500 5700 50  0001 C CNN
F 3 "" H 5500 5700 50  0001 C CNN
	1    5500 5700
	1    0    0    -1  
$EndComp
$Comp
L CG24-cells:N2P U14R163
U 1 1 6CA377F2
P 5500 4000
F 0 "U14R163" H 5525 4267 50  0000 C CNN
F 1 "N2P" H 5525 4176 50  0000 C CNN
F 2 "" H 5500 4000 50  0001 C CNN
F 3 "" H 5500 4000 50  0001 C CNN
	1    5500 4000
	1    0    0    -1  
$EndComp
$Comp
L CG24-cells:R2N U9R123
U 1 1 685391C5
P 9250 5000
F 0 "U9R123" H 9275 5267 50  0000 C CNN
F 1 "R2N" H 9275 5176 50  0000 C CNN
F 2 "" H 9250 5000 50  0001 C CNN
F 3 "" H 9250 5000 50  0001 C CNN
	1    9250 5000
	1    0    0    -1  
$EndComp
$Comp
L CG24-cells:R2N U12R123
U 1 1 6AFA2F15
P 9250 5450
F 0 "U12R123" H 9275 5717 50  0000 C CNN
F 1 "R2N" H 9275 5626 50  0000 C CNN
F 2 "" H 9250 5450 50  0001 C CNN
F 3 "" H 9250 5450 50  0001 C CNN
	1    9250 5450
	1    0    0    -1  
$EndComp
$Comp
L CG24-cells:R2N U8R123
U 1 1 77456A23
P 9250 2700
F 0 "U8R123" H 9275 2967 50  0000 C CNN
F 1 "R2N" H 9275 2876 50  0000 C CNN
F 2 "" H 9250 2700 50  0001 C CNN
F 3 "" H 9250 2700 50  0001 C CNN
	1    9250 2700
	1    0    0    -1  
$EndComp
$Comp
L CG24-cells:R2P U26R153
U 1 1 6C5EDA1E
P 6350 5450
F 0 "U26R153" H 6375 5717 50  0000 C CNN
F 1 "R2P" H 6375 5626 50  0000 C CNN
F 2 "" H 6400 5450 50  0001 C CNN
F 3 "" H 6400 5450 50  0001 C CNN
	1    6350 5450
	1    0    0    -1  
$EndComp
$Comp
L CG24-cells:N2P U20R163
U 1 1 6058EB02
P 5450 3300
F 0 "U20R163" H 5475 3567 50  0000 C CNN
F 1 "N2P" H 5475 3476 50  0000 C CNN
F 2 "" H 5450 3300 50  0001 C CNN
F 3 "" H 5450 3300 50  0001 C CNN
	1    5450 3300
	1    0    0    -1  
$EndComp
$Comp
L CG24-cells:V1N U16R133
U 1 1 6E816685
P 7400 5450
F 0 "U16R133" H 7400 5767 50  0000 C CNN
F 1 "V1N" H 7400 5676 50  0000 C CNN
F 2 "" H 7400 5250 50  0001 C CNN
F 3 "" H 7400 5250 50  0001 C CNN
	1    7400 5450
	1    0    0    -1  
$EndComp
$Comp
L CG24-cells:V1N U13R154
U 1 1 6035750B
P 2550 3250
F 0 "U13R154" H 2550 3567 50  0000 C CNN
F 1 "V1N" H 2550 3476 50  0000 C CNN
F 2 "" H 2550 3050 50  0001 C CNN
F 3 "" H 2550 3050 50  0001 C CNN
	1    2550 3250
	1    0    0    -1  
$EndComp
$Comp
L CG24-cells:B1N U5R164
U 1 1 6C345B3C
P 5500 4550
F 0 "U5R164" H 5500 4867 50  0000 C CNN
F 1 "B1N" H 5500 4776 50  0000 C CNN
F 2 "" H 5500 4550 50  0001 C CNN
F 3 "" H 5500 4550 50  0001 C CNN
	1    5500 4550
	1    0    0    -1  
$EndComp
Text HLabel 3400 2650 0    50   Input ~ 0
REGA
Text HLabel 9850 2700 2    50   Output ~ 0
REG9-OUT
Wire Wire Line
	9850 2700 9550 2700
Text HLabel 7650 4750 0    50   Input ~ 0
~ENABLE-DATA
Wire Wire Line
	7650 4750 7950 4750
Text HLabel 5050 4550 0    50   Input ~ 0
ENABLE-ADDR
Wire Wire Line
	9000 2750 8900 2750
Wire Wire Line
	3400 2650 4100 2650
Wire Wire Line
	4100 2650 4100 3300
Wire Wire Line
	4800 4050 5250 4050
Wire Wire Line
	4250 4000 4100 4000
Wire Wire Line
	4250 3300 4100 3300
Connection ~ 4100 3300
Wire Wire Line
	4100 3300 4100 4000
$Comp
L CG24-cells:R2P U18R153
U 1 1 6053C8F5
P 4500 3250
F 0 "U18R153" H 4525 3517 50  0000 C CNN
F 1 "R2P" H 4525 3426 50  0000 C CNN
F 2 "" H 4550 3250 50  0001 C CNN
F 3 "" H 4550 3250 50  0001 C CNN
	1    4500 3250
	1    0    0    -1  
$EndComp
Wire Wire Line
	5150 3950 5150 3350
Wire Wire Line
	5150 3350 5200 3350
Wire Wire Line
	5150 3950 5150 4550
Wire Wire Line
	5150 4550 5050 4550
Connection ~ 5150 3950
Connection ~ 5150 4550
Text HLabel 5050 5200 0    50   Input ~ 0
~A-BOARD-CONNECTED
Connection ~ 5150 5100
Wire Wire Line
	5050 5200 5250 5200
Text HLabel 5050 5750 0    50   Input ~ 0
BUS-DIR
Wire Wire Line
	5050 5750 5250 5750
Wire Wire Line
	5150 4550 5150 5100
Text HLabel 3800 4100 0    50   Input ~ 0
~BUS-E
Text HLabel 1450 3200 0    50   Input ~ 0
~REGISTER-RANGE-LO
Text HLabel 1450 3300 0    50   Input ~ 0
~REGISTER-RANGE-HI
Wire Wire Line
	1450 3300 1700 3300
Text HLabel 1450 2850 0    50   Input ~ 0
~EXPANSION-RANGE
Wire Wire Line
	1450 2850 2950 2850
Wire Wire Line
	2950 2850 2950 3150
Text HLabel 5750 3300 2    50   Output ~ 0
~EXPANSION-E
Connection ~ 7950 5100
Text HLabel 8650 3650 0    50   Input ~ 0
~ENABLE
Wire Wire Line
	8650 3650 8900 3650
Connection ~ 8900 4950
Connection ~ 7000 5450
Wire Wire Line
	9000 5050 8600 5050
Wire Wire Line
	9000 5500 8600 5500
Text HLabel 7150 5850 2    50   Output ~ 0
CBUS-DATA-DIR
Wire Wire Line
	7150 5850 7000 5850
Wire Wire Line
	7000 5850 7000 5450
Connection ~ 4100 2650
Wire Wire Line
	4100 2650 9000 2650
Connection ~ 8900 3650
Wire Wire Line
	8900 3650 8900 2750
Wire Wire Line
	8900 3650 8900 4950
Wire Wire Line
	3800 4100 4250 4100
Text HLabel 9700 5450 2    50   Output ~ 0
BUS-DATA-E
Text HLabel 9700 5000 2    50   Output ~ 0
CPU-DATA-E
Wire Wire Line
	9700 5000 9550 5000
Wire Wire Line
	9550 5450 9700 5450
Text HLabel 5800 4000 2    50   Output ~ 0
~CBUS-ADDR-E
Text HLabel 5800 4550 2    50   Output ~ 0
CBUS-ADDR-DIR
$EndSCHEMATC
