EESchema Schematic File Version 4
EELAYER 30 0
EELAYER END
$Descr A3 16535 11693
encoding utf-8
Sheet 5 83
Title "CPS Reverse Engineering: DL-0311"
Date "2021-09-12"
Rev ""
Comp ""
Comment1 ""
Comment2 ""
Comment3 "Licence: CC-BY"
Comment4 "Author: Loïc *WydD* Petit"
$EndDescr
Connection ~ 3700 4200
Connection ~ 3700 4300
Connection ~ 8200 3650
Connection ~ 7400 5200
Connection ~ 7400 5300
Connection ~ 10600 9850
Connection ~ 10600 9750
Connection ~ 10600 8650
Connection ~ 14600 2850
Connection ~ 14000 2850
Connection ~ 14050 3750
Connection ~ 14050 5100
Connection ~ 12900 3250
Connection ~ 13000 3050
NoConn ~ 13600 2950
NoConn ~ 13250 4100
NoConn ~ 13250 5450
Entry Wire Line
	1150 7300 1250 7400
Entry Wire Line
	1150 7750 1250 7850
Entry Wire Line
	1150 8200 1250 8300
Entry Wire Line
	1150 8650 1250 8750
Entry Wire Line
	1150 9100 1250 9200
Entry Wire Line
	1150 9550 1250 9650
Entry Wire Line
	1150 10000 1250 10100
Entry Wire Line
	1150 10450 1250 10550
Entry Wire Line
	1150 10900 1250 11000
Entry Wire Line
	12300 1700 12400 1800
Entry Wire Line
	12300 1800 12400 1900
Entry Wire Line
	12300 1900 12400 2000
Entry Wire Line
	12300 2000 12400 2100
Entry Wire Line
	12300 2750 12400 2850
Wire Wire Line
	1250 7400 1600 7400
Wire Wire Line
	1250 7850 1800 7850
Wire Wire Line
	1250 8300 2000 8300
Wire Wire Line
	1250 8750 1600 8750
Wire Wire Line
	1250 9200 1800 9200
Wire Wire Line
	1250 9650 2000 9650
Wire Wire Line
	1250 10100 1600 10100
Wire Wire Line
	1250 10550 1800 10550
Wire Wire Line
	1250 11000 2000 11000
Wire Wire Line
	2250 950  2500 950 
Wire Wire Line
	2250 1050 2500 1050
Wire Wire Line
	2250 1150 2500 1150
Wire Wire Line
	2250 1250 2500 1250
Wire Wire Line
	2250 1350 2500 1350
Wire Wire Line
	2250 1450 2500 1450
Wire Wire Line
	2250 1750 2550 1750
Wire Wire Line
	2250 1850 2550 1850
Wire Wire Line
	2250 1950 2550 1950
Wire Wire Line
	2250 2250 2550 2250
Wire Wire Line
	2250 2350 2550 2350
Wire Wire Line
	2250 2450 2550 2450
Wire Wire Line
	2250 2750 2550 2750
Wire Wire Line
	2250 2850 2550 2850
Wire Wire Line
	2250 2950 2550 2950
Wire Wire Line
	2250 3250 2550 3250
Wire Wire Line
	2250 3350 2550 3350
Wire Wire Line
	2250 3450 2550 3450
Wire Wire Line
	2250 3750 2550 3750
Wire Wire Line
	2250 3850 2550 3850
Wire Wire Line
	2250 3950 2550 3950
Wire Wire Line
	2950 7400 2200 7400
Wire Wire Line
	2950 7850 2400 7850
Wire Wire Line
	2950 8300 2600 8300
Wire Wire Line
	2950 8750 2200 8750
Wire Wire Line
	2950 9200 2400 9200
Wire Wire Line
	2950 9650 2600 9650
Wire Wire Line
	2950 10100 2200 10100
Wire Wire Line
	2950 10550 2400 10550
Wire Wire Line
	2950 11000 2600 11000
Wire Wire Line
	3100 1850 3500 1850
Wire Wire Line
	3100 3850 3200 3850
Wire Wire Line
	3100 5000 3400 5000
Wire Wire Line
	3100 6200 3600 6200
Wire Wire Line
	3200 3350 3100 3350
Wire Wire Line
	3200 3500 3200 3350
Wire Wire Line
	3200 3600 3700 3600
Wire Wire Line
	3200 3850 3200 3600
Wire Wire Line
	3300 2850 3100 2850
Wire Wire Line
	3300 2850 3300 3400
Wire Wire Line
	3300 3400 3700 3400
Wire Wire Line
	3300 3700 3300 4400
Wire Wire Line
	3300 4400 3100 4400
Wire Wire Line
	3400 2350 3100 2350
Wire Wire Line
	3400 3300 3400 2350
Wire Wire Line
	3400 3800 3700 3800
Wire Wire Line
	3400 5000 3400 3800
Wire Wire Line
	3500 1850 3500 3200
Wire Wire Line
	3500 3200 3700 3200
Wire Wire Line
	3500 3900 3500 5600
Wire Wire Line
	3500 5600 3100 5600
Wire Wire Line
	3600 1200 3100 1200
Wire Wire Line
	3600 3100 3600 1200
Wire Wire Line
	3600 4000 3700 4000
Wire Wire Line
	3600 6200 3600 4000
Wire Wire Line
	3700 3100 3600 3100
Wire Wire Line
	3700 3300 3400 3300
Wire Wire Line
	3700 3500 3200 3500
Wire Wire Line
	3700 3700 3300 3700
Wire Wire Line
	3700 3900 3500 3900
Wire Wire Line
	3700 4100 3700 4200
Wire Wire Line
	3700 4200 3700 4300
Wire Wire Line
	3700 4600 3700 4300
Wire Wire Line
	3850 4600 3700 4600
Wire Wire Line
	4700 3600 4400 3600
Wire Wire Line
	4700 3700 4300 3700
Wire Wire Line
	5300 5750 5550 5750
Wire Wire Line
	5300 5850 5550 5850
Wire Wire Line
	5300 5950 5550 5950
Wire Wire Line
	5300 6050 5550 6050
Wire Wire Line
	5300 6150 5550 6150
Wire Wire Line
	5300 6250 5550 6250
Wire Wire Line
	5300 6550 5550 6550
Wire Wire Line
	5300 6650 5550 6650
Wire Wire Line
	5300 6750 5550 6750
Wire Wire Line
	5300 6850 5550 6850
Wire Wire Line
	5300 6950 5550 6950
Wire Wire Line
	5300 7050 5550 7050
Wire Wire Line
	5300 7350 5550 7350
Wire Wire Line
	5300 7450 5550 7450
Wire Wire Line
	5300 7550 5550 7550
Wire Wire Line
	5300 7650 5550 7650
Wire Wire Line
	5300 7750 5550 7750
Wire Wire Line
	5300 7850 5550 7850
Wire Wire Line
	5300 8150 5550 8150
Wire Wire Line
	5300 8250 5550 8250
Wire Wire Line
	5300 8350 5550 8350
Wire Wire Line
	5300 8450 5550 8450
Wire Wire Line
	5300 8550 5550 8550
Wire Wire Line
	5300 8650 5550 8650
Wire Wire Line
	5300 8950 5550 8950
Wire Wire Line
	5300 9050 5550 9050
Wire Wire Line
	5300 9150 5550 9150
Wire Wire Line
	5300 9250 5550 9250
Wire Wire Line
	5300 9350 5550 9350
Wire Wire Line
	5300 9450 5550 9450
Wire Wire Line
	5300 9750 5550 9750
Wire Wire Line
	5300 9850 5550 9850
Wire Wire Line
	5300 9950 5550 9950
Wire Wire Line
	5300 10050 5550 10050
Wire Wire Line
	5300 10150 5550 10150
Wire Wire Line
	5300 10250 5550 10250
Wire Wire Line
	5300 10550 5550 10550
Wire Wire Line
	5300 10650 5550 10650
Wire Wire Line
	5300 10750 5550 10750
Wire Wire Line
	5300 10850 5550 10850
Wire Wire Line
	5300 10950 5550 10950
Wire Wire Line
	5300 11050 5550 11050
Wire Wire Line
	6150 6000 6450 6000
Wire Wire Line
	6150 6800 6350 6800
Wire Wire Line
	6150 7600 6250 7600
Wire Wire Line
	6150 10000 6350 10000
Wire Wire Line
	6250 7600 6250 8300
Wire Wire Line
	6250 8300 6550 8300
Wire Wire Line
	6250 8500 6250 9200
Wire Wire Line
	6250 9200 6150 9200
Wire Wire Line
	6350 6800 6350 8200
Wire Wire Line
	6350 8600 6550 8600
Wire Wire Line
	6350 10000 6350 8600
Wire Wire Line
	6450 6000 6450 8100
Wire Wire Line
	6450 8100 6550 8100
Wire Wire Line
	6450 8700 6450 10800
Wire Wire Line
	6450 10800 6150 10800
Wire Wire Line
	6550 8200 6350 8200
Wire Wire Line
	6550 8400 6150 8400
Wire Wire Line
	6550 8500 6250 8500
Wire Wire Line
	6550 8700 6450 8700
Wire Wire Line
	6550 9100 6550 8800
Wire Wire Line
	6700 9100 6550 9100
Wire Wire Line
	7150 1000 7400 1000
Wire Wire Line
	7150 1100 7400 1100
Wire Wire Line
	7150 1200 7400 1200
Wire Wire Line
	7150 1300 7400 1300
Wire Wire Line
	7150 1400 7400 1400
Wire Wire Line
	7150 1500 7400 1500
Wire Wire Line
	7150 1800 7400 1800
Wire Wire Line
	7150 1900 7400 1900
Wire Wire Line
	7150 2000 7400 2000
Wire Wire Line
	7150 2100 7400 2100
Wire Wire Line
	7150 2200 7400 2200
Wire Wire Line
	7150 2300 7400 2300
Wire Wire Line
	7150 2600 7400 2600
Wire Wire Line
	7150 2700 7400 2700
Wire Wire Line
	7150 2800 7400 2800
Wire Wire Line
	7150 2900 7400 2900
Wire Wire Line
	7150 3000 7400 3000
Wire Wire Line
	7150 3100 7400 3100
Wire Wire Line
	7150 3400 7400 3400
Wire Wire Line
	7150 3500 7400 3500
Wire Wire Line
	7150 3600 7400 3600
Wire Wire Line
	7150 3700 7400 3700
Wire Wire Line
	7150 3800 7400 3800
Wire Wire Line
	7150 3900 7400 3900
Wire Wire Line
	7150 4200 7400 4200
Wire Wire Line
	7150 4300 7400 4300
Wire Wire Line
	7150 4400 7400 4400
Wire Wire Line
	7150 4500 7400 4500
Wire Wire Line
	7150 4600 7400 4600
Wire Wire Line
	7150 4700 7400 4700
Wire Wire Line
	7150 4800 7400 4800
Wire Wire Line
	7150 4900 7400 4900
Wire Wire Line
	7150 5000 7400 5000
Wire Wire Line
	7300 5300 7400 5300
Wire Wire Line
	7400 5200 7400 5100
Wire Wire Line
	7400 5300 7400 5200
Wire Wire Line
	7400 5400 7400 5300
Wire Wire Line
	7550 8350 7250 8350
Wire Wire Line
	7550 8450 7150 8450
Wire Wire Line
	8000 2850 8100 2850
Wire Wire Line
	8100 2050 8000 2050
Wire Wire Line
	8100 2400 8100 2050
Wire Wire Line
	8100 2850 8100 2500
Wire Wire Line
	8200 1250 8000 1250
Wire Wire Line
	8200 2300 8200 1250
Wire Wire Line
	8200 2600 8200 3650
Wire Wire Line
	8200 3650 8000 3650
Wire Wire Line
	8200 3650 8200 4200
Wire Wire Line
	8200 4300 8200 4800
Wire Wire Line
	8200 4800 8000 4800
Wire Wire Line
	8300 2300 8200 2300
Wire Wire Line
	8300 2400 8100 2400
Wire Wire Line
	8300 2500 8100 2500
Wire Wire Line
	8300 2600 8200 2600
Wire Wire Line
	9150 4150 8850 4150
Wire Wire Line
	9150 4250 8750 4250
Wire Wire Line
	9300 2350 9000 2350
Wire Wire Line
	9300 2450 8900 2450
Wire Wire Line
	10350 6350 10600 6350
Wire Wire Line
	10350 6450 10600 6450
Wire Wire Line
	10350 6550 10600 6550
Wire Wire Line
	10350 6650 10600 6650
Wire Wire Line
	10350 6950 10600 6950
Wire Wire Line
	10350 7050 10600 7050
Wire Wire Line
	10350 7150 10600 7150
Wire Wire Line
	10350 7250 10600 7250
Wire Wire Line
	10350 7350 11300 7350
Wire Wire Line
	10350 7650 10600 7650
Wire Wire Line
	10350 7750 10600 7750
Wire Wire Line
	10350 7850 10600 7850
Wire Wire Line
	10350 7950 10600 7950
Wire Wire Line
	10350 8050 10600 8050
Wire Wire Line
	10350 8150 10600 8150
Wire Wire Line
	10350 8250 10600 8250
Wire Wire Line
	10350 8750 10600 8750
Wire Wire Line
	10350 8850 10600 8850
Wire Wire Line
	10350 8950 10600 8950
Wire Wire Line
	10350 9050 10600 9050
Wire Wire Line
	10350 9150 10600 9150
Wire Wire Line
	10350 9250 10600 9250
Wire Wire Line
	10350 9350 10600 9350
Wire Wire Line
	10350 9450 10600 9450
Wire Wire Line
	10350 9550 10600 9550
Wire Wire Line
	10350 10150 10600 10150
Wire Wire Line
	10350 10250 10600 10250
Wire Wire Line
	10350 10350 10600 10350
Wire Wire Line
	10350 10450 10600 10450
Wire Wire Line
	10350 10550 10600 10550
Wire Wire Line
	10350 10650 10600 10650
Wire Wire Line
	10350 10750 10600 10750
Wire Wire Line
	10350 10850 10600 10850
Wire Wire Line
	10500 8650 10600 8650
Wire Wire Line
	10500 9850 10600 9850
Wire Wire Line
	10600 8650 10600 8350
Wire Wire Line
	10600 9750 10600 9650
Wire Wire Line
	10600 9850 10600 9750
Wire Wire Line
	11200 6500 11300 6500
Wire Wire Line
	11200 9250 11300 9250
Wire Wire Line
	11200 10500 11300 10500
Wire Wire Line
	11300 6500 11300 7000
Wire Wire Line
	11300 7000 11400 7000
Wire Wire Line
	11300 7200 11300 7350
Wire Wire Line
	11300 7200 11400 7200
Wire Wire Line
	11300 8000 11200 8000
Wire Wire Line
	11300 9150 11300 8000
Wire Wire Line
	11300 9350 11300 10500
Wire Wire Line
	11400 7100 11200 7100
Wire Wire Line
	12300 7100 11950 7100
Wire Wire Line
	12400 1800 13100 1800
Wire Wire Line
	12400 1900 13100 1900
Wire Wire Line
	12400 2000 13100 2000
Wire Wire Line
	12400 2100 13100 2100
Wire Wire Line
	12400 2850 13100 2850
Wire Wire Line
	12400 3050 13000 3050
Wire Wire Line
	12750 3750 12750 4100
Wire Wire Line
	12750 4500 13000 4500
Wire Wire Line
	12750 5100 12750 5450
Wire Wire Line
	12900 2400 13100 2400
Wire Wire Line
	12900 3250 12800 3250
Wire Wire Line
	12900 3250 12900 2400
Wire Wire Line
	12900 3250 13350 3250
Wire Wire Line
	13000 3050 13000 2300
Wire Wire Line
	13000 5850 12750 5850
Wire Wire Line
	13100 2300 13000 2300
Wire Wire Line
	13100 3050 13000 3050
Wire Wire Line
	13250 4200 13250 4550
Wire Wire Line
	13250 5550 13250 5900
Wire Wire Line
	13900 1800 14850 1800
Wire Wire Line
	13900 1900 14850 1900
Wire Wire Line
	13900 2000 14850 2000
Wire Wire Line
	13900 2100 14850 2100
Wire Wire Line
	14000 2850 13600 2850
Wire Wire Line
	14000 2850 14000 2600
Wire Wire Line
	14000 3100 14000 2850
Wire Wire Line
	14050 3750 12750 3750
Wire Wire Line
	14050 3750 14050 4650
Wire Wire Line
	14050 5100 12750 5100
Wire Wire Line
	14050 5100 14050 6000
Wire Wire Line
	14150 3750 14050 3750
Wire Wire Line
	14150 5100 14050 5100
Wire Wire Line
	14600 2600 14600 2850
Wire Wire Line
	14600 2850 14850 2850
Wire Wire Line
	14600 3100 14600 2850
Wire Bus Line
	1150 7150 1050 7150
Wire Bus Line
	12300 1550 12200 1550
Text Notes 4250 3250 0    50   ~ 0
~8~ & (\n 0 & 1 & 2 & 3 & ~7~ & ~8~\n 4 & ~7~\n 5 & ~7~\n 6 & ~7~\n ~6~ & 7\n ~5~ & 7\n ~4~ & ~3~ & 7\n ~4~ & ~2~ & 7\n ~4~ & ~1~ & 7\n ~4~ & ~0~ & 7\n)\n\n00xxx1111\n001xxxxxx\n00x1xxxxx\n00xx1xxxx\n010xxxxxx\n01x0xxxxx\n01xx00xxx\n01xx0x0xx\n01xx0xx0x\n01xx0xxx0
Text Notes 4900 3850 2    50   ~ 0
15 <= x < 240
Text Notes 7150 5250 2    50   ~ 0
510 (aka -2)
Text Notes 7200 7350 0    50   ~ 0
~0~ & ~1~ & ~2~ & ~8~ & OR(\n  3 & ~7~\n  4 & ~7~\n  5 & ~7~\n  6 & ~7~\n  7 & ~4~\n  7 & ~5~\n  7 & ~6~\n)
Text Notes 8450 8700 2    50   ~ 0
1 if x mod 8 AND 8 <= x < 248
Text Notes 8900 4550 0    50   ~ 0
x mod 32 AND x < 240\nOR x == -2
Text Notes 9850 2700 2    50   ~ 0
x mod 16 AND x < 240
Text Notes 10200 8700 2    50   ~ 0
239
Text Notes 10200 10150 2    50   ~ 0
240
Text Notes 10200 10300 2    50   ~ 0
244
Text Notes 10250 7700 2    50   ~ 0
240-243
Text Notes 11400 9550 0    50   ~ 0
Everything unless 239-244
Text Notes 12000 7100 0    50   ~ 0
VBLANK
Text Notes 12000 7450 0    50   ~ 0
x < 16 OR\nx >= 240 OR\nx >= 256
Text Notes 12850 7200 0    50   ~ 0
VBLANK.LUTPRO
Text Notes 14300 5800 0    50   ~ 0
Default state:\n  -> LUTPRO = 0\nIf someone writes in PALETTE-BASE\n  -> LUTPRO = 1\nWait until WSTLUT-END = 1\n  -> LUTPRO = 0 back to default
Text Label 1500 7400 2    50   ~ 0
LINE0
Text Label 1500 7850 2    50   ~ 0
LINE1
Text Label 1500 8300 2    50   ~ 0
LINE2
Text Label 1500 8750 2    50   ~ 0
LINE3
Text Label 1500 9200 2    50   ~ 0
LINE4
Text Label 1500 9650 2    50   ~ 0
LINE5
Text Label 1500 10100 2    50   ~ 0
LINE6
Text Label 1500 10550 2    50   ~ 0
LINE7
Text Label 1500 11000 2    50   ~ 0
LINE8
Text Label 2500 950  2    50   ~ 0
LINE0
Text Label 2500 1050 2    50   ~ 0
LINE1
Text Label 2500 1150 2    50   ~ 0
LINE2
Text Label 2500 1250 2    50   ~ 0
LINE3
Text Label 2500 1350 2    50   ~ 0
~LINE7
Text Label 2500 1450 2    50   ~ 0
~LINE8
Text Label 2500 1750 2    50   ~ 0
LINE4
Text Label 2500 1850 2    50   ~ 0
~LINE7
Text Label 2500 1950 2    50   ~ 0
~LINE8
Text Label 2500 2250 2    50   ~ 0
LINE5
Text Label 2500 2350 2    50   ~ 0
~LINE7
Text Label 2500 2450 2    50   ~ 0
~LINE8
Text Label 2500 2750 2    50   ~ 0
LINE6
Text Label 2500 2850 2    50   ~ 0
~LINE7
Text Label 2500 2950 2    50   ~ 0
~LINE8
Text Label 2500 3250 2    50   ~ 0
~LINE6
Text Label 2500 3350 2    50   ~ 0
LINE7
Text Label 2500 3450 2    50   ~ 0
~LINE8
Text Label 2500 3750 2    50   ~ 0
~LINE5
Text Label 2500 3850 2    50   ~ 0
LINE7
Text Label 2500 3950 2    50   ~ 0
~LINE8
Text Label 2700 7400 0    50   ~ 0
~LINE0
Text Label 2700 7850 0    50   ~ 0
~LINE1
Text Label 2700 8300 0    50   ~ 0
~LINE2
Text Label 2700 8750 0    50   ~ 0
~LINE3
Text Label 2700 9200 0    50   ~ 0
~LINE4
Text Label 2700 9650 0    50   ~ 0
~LINE5
Text Label 2700 10100 0    50   ~ 0
~LINE6
Text Label 2700 10550 0    50   ~ 0
~LINE7
Text Label 2700 11000 0    50   ~ 0
~LINE8
Text Label 4650 3600 2    50   ~ 0
VC0
Text Label 5550 5750 2    50   ~ 0
~LINE0
Text Label 5550 5850 2    50   ~ 0
~LINE1
Text Label 5550 5950 2    50   ~ 0
~LINE2
Text Label 5550 6050 2    50   ~ 0
LINE3
Text Label 5550 6150 2    50   ~ 0
~LINE7
Text Label 5550 6250 2    50   ~ 0
~LINE8
Text Label 5550 6550 2    50   ~ 0
~LINE0
Text Label 5550 6650 2    50   ~ 0
~LINE1
Text Label 5550 6750 2    50   ~ 0
~LINE2
Text Label 5550 6850 2    50   ~ 0
LINE4
Text Label 5550 6950 2    50   ~ 0
~LINE7
Text Label 5550 7050 2    50   ~ 0
~LINE8
Text Label 5550 7350 2    50   ~ 0
~LINE0
Text Label 5550 7450 2    50   ~ 0
~LINE1
Text Label 5550 7550 2    50   ~ 0
~LINE2
Text Label 5550 7650 2    50   ~ 0
LINE5
Text Label 5550 7750 2    50   ~ 0
~LINE7
Text Label 5550 7850 2    50   ~ 0
~LINE8
Text Label 5550 8150 2    50   ~ 0
~LINE0
Text Label 5550 8250 2    50   ~ 0
~LINE1
Text Label 5550 8350 2    50   ~ 0
~LINE2
Text Label 5550 8450 2    50   ~ 0
LINE6
Text Label 5550 8550 2    50   ~ 0
~LINE7
Text Label 5550 8650 2    50   ~ 0
~LINE8
Text Label 5550 8950 2    50   ~ 0
~LINE0
Text Label 5550 9050 2    50   ~ 0
~LINE1
Text Label 5550 9150 2    50   ~ 0
~LINE2
Text Label 5550 9250 2    50   ~ 0
~LINE6
Text Label 5550 9350 2    50   ~ 0
LINE7
Text Label 5550 9450 2    50   ~ 0
~LINE8
Text Label 5550 9750 2    50   ~ 0
~LINE0
Text Label 5550 9850 2    50   ~ 0
~LINE1
Text Label 5550 9950 2    50   ~ 0
~LINE2
Text Label 5550 10050 2    50   ~ 0
~LINE5
Text Label 5550 10150 2    50   ~ 0
LINE7
Text Label 5550 10250 2    50   ~ 0
~LINE8
Text Label 5550 10550 2    50   ~ 0
~LINE0
Text Label 5550 10650 2    50   ~ 0
~LINE1
Text Label 5550 10750 2    50   ~ 0
~LINE2
Text Label 5550 10850 2    50   ~ 0
~LINE4
Text Label 5550 10950 2    50   ~ 0
LINE7
Text Label 5550 11050 2    50   ~ 0
~LINE8
Text Label 7400 1000 2    50   ~ 0
~LINE0
Text Label 7400 1100 2    50   ~ 0
~LINE1
Text Label 7400 1200 2    50   ~ 0
~LINE2
Text Label 7400 1300 2    50   ~ 0
~LINE3
Text Label 7400 1400 2    50   ~ 0
~LINE6
Text Label 7400 1500 2    50   ~ 0
~LINE8
Text Label 7400 1800 2    50   ~ 0
~LINE0
Text Label 7400 1900 2    50   ~ 0
~LINE1
Text Label 7400 2000 2    50   ~ 0
~LINE2
Text Label 7400 2100 2    50   ~ 0
~LINE3
Text Label 7400 2200 2    50   ~ 0
~LINE5
Text Label 7400 2300 2    50   ~ 0
~LINE8
Text Label 7400 2600 2    50   ~ 0
~LINE0
Text Label 7400 2700 2    50   ~ 0
~LINE1
Text Label 7400 2800 2    50   ~ 0
~LINE2
Text Label 7400 2900 2    50   ~ 0
~LINE3
Text Label 7400 3000 2    50   ~ 0
~LINE7
Text Label 7400 3100 2    50   ~ 0
~LINE8
Text Label 7400 3400 2    50   ~ 0
~LINE0
Text Label 7400 3500 2    50   ~ 0
~LINE1
Text Label 7400 3600 2    50   ~ 0
~LINE2
Text Label 7400 3700 2    50   ~ 0
~LINE3
Text Label 7400 3800 2    50   ~ 0
~LINE4
Text Label 7400 3900 2    50   ~ 0
~LINE8
Text Label 7400 4200 2    50   ~ 0
~LINE0
Text Label 7400 4300 2    50   ~ 0
LINE1
Text Label 7400 4400 2    50   ~ 0
LINE2
Text Label 7400 4500 2    50   ~ 0
LINE3
Text Label 7400 4600 2    50   ~ 0
LINE4
Text Label 7400 4700 2    50   ~ 0
LINE5
Text Label 7400 4800 2    50   ~ 0
LINE6
Text Label 7400 4900 2    50   ~ 0
LINE7
Text Label 7400 5000 2    50   ~ 0
LINE8
Text Label 7500 8350 2    50   ~ 0
VC1
Text Label 9100 4150 2    50   ~ 0
VC3
Text Label 9250 2350 2    50   ~ 0
VC2
Text Label 10600 6350 2    50   ~ 0
~LINE4
Text Label 10600 6450 2    50   ~ 0
~LINE5
Text Label 10600 6550 2    50   ~ 0
~LINE6
Text Label 10600 6650 2    50   ~ 0
~LINE7
Text Label 10600 6950 2    50   ~ 0
LINE4
Text Label 10600 7050 2    50   ~ 0
LINE5
Text Label 10600 7150 2    50   ~ 0
LINE6
Text Label 10600 7250 2    50   ~ 0
LINE7
Text Label 10600 7350 2    50   ~ 0
~LINE8
Text Label 10600 7650 2    50   ~ 0
~LINE2
Text Label 10600 7750 2    50   ~ 0
~LINE3
Text Label 10600 7850 2    50   ~ 0
LINE4
Text Label 10600 7950 2    50   ~ 0
LINE5
Text Label 10600 8050 2    50   ~ 0
LINE6
Text Label 10600 8150 2    50   ~ 0
LINE7
Text Label 10600 8250 2    50   ~ 0
~LINE8
Text Label 10600 8750 2    50   ~ 0
LINE0
Text Label 10600 8850 2    50   ~ 0
LINE1
Text Label 10600 8950 2    50   ~ 0
LINE2
Text Label 10600 9050 2    50   ~ 0
LINE3
Text Label 10600 9150 2    50   ~ 0
~LINE4
Text Label 10600 9250 2    50   ~ 0
LINE5
Text Label 10600 9350 2    50   ~ 0
LINE6
Text Label 10600 9450 2    50   ~ 0
LINE7
Text Label 10600 9550 2    50   ~ 0
~LINE8
Text Label 10600 10150 2    50   ~ 0
~LINE0
Text Label 10600 10250 2    50   ~ 0
~LINE1
Text Label 10600 10350 2    50   ~ 0
~LINE3
Text Label 10600 10450 2    50   ~ 0
LINE4
Text Label 10600 10550 2    50   ~ 0
LINE5
Text Label 10600 10650 2    50   ~ 0
LINE6
Text Label 10600 10750 2    50   ~ 0
LINE7
Text Label 10600 10850 2    50   ~ 0
~LINE8
Text Label 12300 7000 2    50   ~ 0
LUTPRO
Text Label 12400 1800 0    50   ~ 0
BUS-DATA3
Text Label 12400 1900 0    50   ~ 0
BUS-DATA2
Text Label 12400 2000 0    50   ~ 0
BUS-DATA1
Text Label 12400 2100 0    50   ~ 0
BUS-DATA0
Text Label 12400 2850 0    50   ~ 0
BUS-DATA15
Text Label 13900 2850 2    50   ~ 0
VC15
Text Label 14850 1800 2    50   ~ 0
VC3
Text Label 14850 1900 2    50   ~ 0
VC2
Text Label 14850 2000 2    50   ~ 0
VC1
Text Label 14850 2100 2    50   ~ 0
VC0
Text HLabel 1050 7150 0    50   Input ~ 0
LINE[0..8]
Text HLabel 5250 3650 2    50   Output ~ 0
ROWSCROLL-INTENT
Text HLabel 8100 8400 2    50   Output ~ 0
SCROLL1-INTENT
Text HLabel 9700 4200 2    50   Output ~ 0
SCROLL3-INTENT
Text HLabel 9850 2400 2    50   Output ~ 0
SCROLL2-INTENT
Text HLabel 11850 3000 0    50   Input ~ 0
~VIDEO-CONTROL
Text HLabel 11850 3100 0    50   Input ~ 0
~CLK4M
Text HLabel 11850 9250 2    50   Output ~ 0
WSTOBJ-INTENT
Text HLabel 12200 1550 0    50   Input ~ 0
BUS-DATA[0..15]
Text HLabel 12750 4300 0    50   Input ~ 0
~CLK4M
Text HLabel 12750 4500 0    50   Input ~ 0
~RESET
Text HLabel 12750 5650 0    50   Input ~ 0
~CLK4M
Text HLabel 12750 5850 0    50   Input ~ 0
~RESET
Text HLabel 12800 3250 0    50   Input ~ 0
~RESET
Text HLabel 12850 7050 2    50   Output ~ 0
WSTLUT-INTENT
Text HLabel 13250 4650 0    50   Input ~ 0
WSTROM-END
Text HLabel 13250 4750 0    50   Input ~ 0
~WSTROM-COPY
Text HLabel 13250 6000 0    50   Input ~ 0
WSTLUT-END
Text HLabel 13250 6100 0    50   Input ~ 0
~PALETTE-BASE
Text HLabel 14150 3750 2    50   Output ~ 0
WSTROM-INTENT
Text HLabel 14150 5100 2    50   Output ~ 0
LUTPRO
Text HLabel 14850 2850 2    50   Output ~ 0
FLIP
$Comp
L power:VCC #PWR0222
U 1 1 63C23EAE
P 3850 4600
F 0 "#PWR0222" H 3850 4450 50  0001 C CNN
F 1 "VCC" H 3865 4773 50  0000 C CNN
F 2 "" H 3850 4600 50  0001 C CNN
F 3 "" H 3850 4600 50  0001 C CNN
	1    3850 4600
	1    0    0    -1  
$EndComp
$Comp
L power:VCC #PWR0221
U 1 1 6DCBBB68
P 6700 9100
F 0 "#PWR0221" H 6700 8950 50  0001 C CNN
F 1 "VCC" H 6715 9273 50  0000 C CNN
F 2 "" H 6700 9100 50  0001 C CNN
F 3 "" H 6700 9100 50  0001 C CNN
	1    6700 9100
	-1   0    0    -1  
$EndComp
$Comp
L power:VCC #PWR0218
U 1 1 707DC8D9
P 7300 5300
F 0 "#PWR0218" H 7300 5150 50  0001 C CNN
F 1 "VCC" H 7315 5473 50  0000 C CNN
F 2 "" H 7300 5300 50  0001 C CNN
F 3 "" H 7300 5300 50  0001 C CNN
	1    7300 5300
	-1   0    0    -1  
$EndComp
$Comp
L power:VCC #PWR0219
U 1 1 619F438A
P 10500 8650
F 0 "#PWR0219" H 10500 8500 50  0001 C CNN
F 1 "VCC" H 10515 8823 50  0000 C CNN
F 2 "" H 10500 8650 50  0001 C CNN
F 3 "" H 10500 8650 50  0001 C CNN
	1    10500 8650
	-1   0    0    -1  
$EndComp
$Comp
L power:VCC #PWR0220
U 1 1 61A72D9A
P 10500 9850
F 0 "#PWR0220" H 10500 9700 50  0001 C CNN
F 1 "VCC" H 10515 10023 50  0000 C CNN
F 2 "" H 10500 9850 50  0001 C CNN
F 3 "" H 10500 9850 50  0001 C CNN
	1    10500 9850
	-1   0    0    -1  
$EndComp
$Comp
L A5C:AND02 UBD38
U 1 1 6868F180
P 4950 3650
F 0 "UBD38" H 4975 3917 50  0000 C CNN
F 1 "AND02" H 4975 3826 50  0000 C CNN
F 2 "" H 4950 3650 50  0001 C CNN
F 3 "" H 4950 3650 50  0001 C CNN
	1    4950 3650
	1    0    0    -1  
$EndComp
$Comp
L A5C:AND02 UAD276
U 1 1 6E04DED9
P 7800 8400
F 0 "UAD276" H 7825 8667 50  0000 C CNN
F 1 "AND02" H 7825 8576 50  0000 C CNN
F 2 "" H 7800 8400 50  0001 C CNN
F 3 "" H 7800 8400 50  0001 C CNN
	1    7800 8400
	1    0    0    -1  
$EndComp
$Comp
L A5C:NAND02 UBB5
U 1 1 6EBA9D5C
P 8450 4250
F 0 "UBB5" H 8475 4517 50  0000 C CNN
F 1 "NAND02" H 8475 4426 50  0000 C CNN
F 2 "" H 8450 4250 50  0001 C CNN
F 3 "" H 8450 4250 50  0001 C CNN
	1    8450 4250
	1    0    0    -1  
$EndComp
$Comp
L A5C:AND02 UBB6
U 1 1 6EAE3712
P 9400 4200
F 0 "UBB6" H 9425 4467 50  0000 C CNN
F 1 "AND02" H 9425 4376 50  0000 C CNN
F 2 "" H 9400 4200 50  0001 C CNN
F 3 "" H 9400 4200 50  0001 C CNN
	1    9400 4200
	1    0    0    -1  
$EndComp
$Comp
L A5C:AND02 UBB24
U 1 1 6EA1BFD7
P 9550 2400
F 0 "UBB24" H 9575 2667 50  0000 C CNN
F 1 "AND02" H 9575 2576 50  0000 C CNN
F 2 "" H 9550 2400 50  0001 C CNN
F 3 "" H 9550 2400 50  0001 C CNN
	1    9550 2400
	1    0    0    -1  
$EndComp
$Comp
L A5C:OR02 UBH32
U 1 1 655CC4CA
P 12100 3050
F 0 "UBH32" H 12125 3317 50  0000 C CNN
F 1 "OR02" H 12125 3226 50  0000 C CNN
F 2 "" H 12150 3050 50  0001 C CNN
F 3 "" H 12150 3050 50  0001 C CNN
	1    12100 3050
	1    0    0    -1  
$EndComp
$Comp
L A5C:AND02 UBA52
U 1 1 68E84554
P 12550 7050
F 0 "UBA52" H 12575 7317 50  0000 C CNN
F 1 "AND02" H 12575 7226 50  0000 C CNN
F 2 "" H 12550 7050 50  0001 C CNN
F 3 "" H 12550 7050 50  0001 C CNN
	1    12550 7050
	1    0    0    -1  
$EndComp
$Comp
L A5C:NAND03 UBD13
U 1 1 66C5BC35
P 2800 1850
F 0 "UBD13" H 2825 2142 50  0000 C CNN
F 1 "NAND03" H 2825 2051 50  0000 C CNN
F 2 "" H 2800 1850 50  0001 C CNN
F 3 "" H 2800 1850 50  0001 C CNN
	1    2800 1850
	1    0    0    -1  
$EndComp
$Comp
L A5C:NAND03 UBD3
U 1 1 663C3C78
P 2800 2350
F 0 "UBD3" H 2825 2642 50  0000 C CNN
F 1 "NAND03" H 2825 2551 50  0000 C CNN
F 2 "" H 2800 2350 50  0001 C CNN
F 3 "" H 2800 2350 50  0001 C CNN
	1    2800 2350
	1    0    0    -1  
$EndComp
$Comp
L A5C:NAND03 UBC14
U 1 1 65D002F1
P 2800 2850
F 0 "UBC14" H 2825 3142 50  0000 C CNN
F 1 "NAND03" H 2825 3051 50  0000 C CNN
F 2 "" H 2800 2850 50  0001 C CNN
F 3 "" H 2800 2850 50  0001 C CNN
	1    2800 2850
	1    0    0    -1  
$EndComp
$Comp
L A5C:NAND03 UBD22
U 1 1 66DA6DEF
P 2800 3350
F 0 "UBD22" H 2825 3642 50  0000 C CNN
F 1 "NAND03" H 2825 3551 50  0000 C CNN
F 2 "" H 2800 3350 50  0001 C CNN
F 3 "" H 2800 3350 50  0001 C CNN
	1    2800 3350
	1    0    0    -1  
$EndComp
$Comp
L A5C:NAND03 UBD35
U 1 1 613A8D5B
P 2800 3850
F 0 "UBD35" H 2825 4142 50  0000 C CNN
F 1 "NAND03" H 2825 4051 50  0000 C CNN
F 2 "" H 2800 3850 50  0001 C CNN
F 3 "" H 2800 3850 50  0001 C CNN
	1    2800 3850
	1    0    0    -1  
$EndComp
$Comp
L A5C:AND03 UBD25
U 1 1 68F2FAF1
P 11550 9250
F 0 "UBD25" H 11575 9542 50  0000 C CNN
F 1 "AND03" H 11575 9451 50  0000 C CNN
F 2 "" H 11550 9250 50  0001 C CNN
F 3 "" H 11550 9250 50  0001 C CNN
	1    11550 9250
	1    0    0    -1  
$EndComp
$Comp
L A5C:NAND03 UBC52
U 1 1 687E334D
P 11650 7100
F 0 "UBC52" H 11675 7392 50  0000 C CNN
F 1 "NAND03" H 11675 7301 50  0000 C CNN
F 2 "" H 11650 7100 50  0001 C CNN
F 3 "" H 11650 7100 50  0001 C CNN
	1    11650 7100
	1    0    0    -1  
$EndComp
$Comp
L A5C:NBUF02 UBD52
U 1 1 60B358CF
P 1900 7400
F 0 "UBD52" H 1900 7717 50  0000 C CNN
F 1 "NBUF02" H 1900 7626 50  0000 C CNN
F 2 "" H 1900 7200 50  0001 C CNN
F 3 "" H 1900 7200 50  0001 C CNN
	1    1900 7400
	1    0    0    -1  
$EndComp
$Comp
L A5C:NBUF02 UBG71
U 1 1 60C38247
P 1900 8750
F 0 "UBG71" H 1900 9067 50  0000 C CNN
F 1 "NBUF02" H 1900 8976 50  0000 C CNN
F 2 "" H 1900 8550 50  0001 C CNN
F 3 "" H 1900 8550 50  0001 C CNN
	1    1900 8750
	1    0    0    -1  
$EndComp
$Comp
L A5C:NBUF02 UBA49
U 1 1 60CA9E83
P 1900 10100
F 0 "UBA49" H 1900 10417 50  0000 C CNN
F 1 "NBUF02" H 1900 10326 50  0000 C CNN
F 2 "" H 1900 9900 50  0001 C CNN
F 3 "" H 1900 9900 50  0001 C CNN
	1    1900 10100
	1    0    0    -1  
$EndComp
$Comp
L A5C:NBUF02 UAD331
U 1 1 60B371C8
P 2100 7850
F 0 "UAD331" H 2100 8167 50  0000 C CNN
F 1 "NBUF02" H 2100 8076 50  0000 C CNN
F 2 "" H 2100 7650 50  0001 C CNN
F 3 "" H 2100 7650 50  0001 C CNN
	1    2100 7850
	1    0    0    -1  
$EndComp
$Comp
L A5C:NBUF02 UBA16
U 1 1 60C3824D
P 2100 9200
F 0 "UBA16" H 2100 9517 50  0000 C CNN
F 1 "NBUF02" H 2100 9426 50  0000 C CNN
F 2 "" H 2100 9000 50  0001 C CNN
F 3 "" H 2100 9000 50  0001 C CNN
	1    2100 9200
	1    0    0    -1  
$EndComp
$Comp
L A5C:NBUF02 UAD257
U 1 1 60CA9E89
P 2100 10550
F 0 "UAD257" H 2100 10867 50  0000 C CNN
F 1 "NBUF02" H 2100 10776 50  0000 C CNN
F 2 "" H 2100 10350 50  0001 C CNN
F 3 "" H 2100 10350 50  0001 C CNN
	1    2100 10550
	1    0    0    -1  
$EndComp
$Comp
L A5C:NBUF02 UBG3
U 1 1 60B70BBD
P 2300 8300
F 0 "UBG3" H 2300 8617 50  0000 C CNN
F 1 "NBUF02" H 2300 8526 50  0000 C CNN
F 2 "" H 2300 8100 50  0001 C CNN
F 3 "" H 2300 8100 50  0001 C CNN
	1    2300 8300
	1    0    0    -1  
$EndComp
$Comp
L A5C:NBUF02 UBC18
U 1 1 60C38253
P 2300 9650
F 0 "UBC18" H 2300 9967 50  0000 C CNN
F 1 "NBUF02" H 2300 9876 50  0000 C CNN
F 2 "" H 2300 9450 50  0001 C CNN
F 3 "" H 2300 9450 50  0001 C CNN
	1    2300 9650
	1    0    0    -1  
$EndComp
$Comp
L A5C:NBUF02 UAB252
U 1 1 60E41DC1
P 2300 11000
F 0 "UAB252" H 2300 11317 50  0000 C CNN
F 1 "NBUF02" H 2300 11226 50  0000 C CNN
F 2 "" H 2300 10800 50  0001 C CNN
F 3 "" H 2300 10800 50  0001 C CNN
	1    2300 11000
	1    0    0    -1  
$EndComp
$Comp
L A5C:BUF12 UAD190
U 1 1 71E80BDD
P 14300 2600
F 0 "UAD190" H 14300 2917 50  0000 C CNN
F 1 "BUF12" H 14300 2826 50  0000 C CNN
F 2 "" H 14300 2600 50  0001 C CNN
F 3 "" H 14300 2600 50  0001 C CNN
	1    14300 2600
	1    0    0    -1  
$EndComp
$Comp
L A5C:BUF12 UAD222
U 1 1 71E80F65
P 14300 3100
F 0 "UAD222" H 14300 3417 50  0000 C CNN
F 1 "BUF12" H 14300 3326 50  0000 C CNN
F 2 "" H 14300 3100 50  0001 C CNN
F 3 "" H 14300 3100 50  0001 C CNN
	1    14300 3100
	1    0    0    -1  
$EndComp
$Comp
L A5C:NAND04 UBD10
U 1 1 66A3F23C
P 2800 4400
F 0 "UBD10" H 2800 4742 50  0000 C CNN
F 1 "NAND04" H 2800 4651 50  0000 C CNN
F 2 "" H 2800 4150 50  0001 C CNN
F 3 "" H 2800 4150 50  0001 C CNN
	1    2800 4400
	1    0    0    -1  
$EndComp
$Comp
L A5C:NAND04 UBD0
U 1 1 661D3158
P 2800 5000
F 0 "UBD0" H 2800 5342 50  0000 C CNN
F 1 "NAND04" H 2800 5251 50  0000 C CNN
F 2 "" H 2800 4750 50  0001 C CNN
F 3 "" H 2800 4750 50  0001 C CNN
	1    2800 5000
	1    0    0    -1  
$EndComp
$Comp
L A5C:NAND04 UBD7
U 1 1 6635F331
P 2800 5600
F 0 "UBD7" H 2800 5942 50  0000 C CNN
F 1 "NAND04" H 2800 5851 50  0000 C CNN
F 2 "" H 2800 5350 50  0001 C CNN
F 3 "" H 2800 5350 50  0001 C CNN
	1    2800 5600
	1    0    0    -1  
$EndComp
$Comp
L A5C:NAND04 UBE24
U 1 1 62008A96
P 2800 6200
F 0 "UBE24" H 2800 6542 50  0000 C CNN
F 1 "NAND04" H 2800 6451 50  0000 C CNN
F 2 "" H 2800 5950 50  0001 C CNN
F 3 "" H 2800 5950 50  0001 C CNN
	1    2800 6200
	1    0    0    -1  
$EndComp
$Comp
L A5C:NAND04 UBB40
U 1 1 6E35314B
P 8600 2450
F 0 "UBB40" H 8600 2792 50  0000 C CNN
F 1 "NAND04" H 8600 2701 50  0000 C CNN
F 2 "" H 8600 2200 50  0001 C CNN
F 3 "" H 8600 2200 50  0001 C CNN
	1    8600 2450
	1    0    0    -1  
$EndComp
$Comp
L A5C:NAND04 UBC43
U 1 1 65E107D1
P 10900 6500
F 0 "UBC43" H 10900 6842 50  0000 C CNN
F 1 "NAND04" H 10900 6751 50  0000 C CNN
F 2 "" H 10900 6250 50  0001 C CNN
F 3 "" H 10900 6250 50  0001 C CNN
	1    10900 6500
	1    0    0    -1  
$EndComp
$Comp
L A5C:NAND04 UBC49
U 1 1 65F87EF5
P 10900 7100
F 0 "UBC49" H 10900 7442 50  0000 C CNN
F 1 "NAND04" H 10900 7351 50  0000 C CNN
F 2 "" H 10900 6850 50  0001 C CNN
F 3 "" H 10900 6850 50  0001 C CNN
	1    10900 7100
	1    0    0    -1  
$EndComp
$Comp
L A5C:OAI21 UBE68
U 1 1 6110B131
P 13650 4650
F 0 "UBE68" H 13650 4967 50  0000 C CNN
F 1 "OAI21" H 13650 4876 50  0000 C CNN
F 2 "" H 13700 4500 50  0001 C CNN
F 3 "" H 13700 4500 50  0001 C CNN
	1    13650 4650
	1    0    0    -1  
$EndComp
$Comp
L A5C:OAI21 UBF89
U 1 1 7371E47A
P 13650 6000
F 0 "UBF89" H 13650 6317 50  0000 C CNN
F 1 "OAI21" H 13650 6226 50  0000 C CNN
F 2 "" H 13700 5850 50  0001 C CNN
F 3 "" H 13700 5850 50  0001 C CNN
	1    13650 6000
	1    0    0    -1  
$EndComp
$Comp
L A5C:DFFCOR UBE71
U 1 1 6110B10F
P 13000 4200
F 0 "UBE71" H 13000 4565 50  0000 C CNN
F 1 "DFFCOR" H 13000 4474 50  0000 C CNN
F 2 "" H 13000 4200 50  0001 C CNN
F 3 "" H 13000 4200 50  0001 C CNN
	1    13000 4200
	1    0    0    -1  
$EndComp
$Comp
L A5C:DFFCOR UBE106
U 1 1 7371E480
P 13000 5550
F 0 "UBE106" H 13000 5915 50  0000 C CNN
F 1 "DFFCOR" H 13000 5824 50  0000 C CNN
F 2 "" H 13000 5550 50  0001 C CNN
F 3 "" H 13000 5550 50  0001 C CNN
	1    13000 5550
	1    0    0    -1  
$EndComp
$Comp
L A5C:DFFCOR UBF24
U 1 1 66FFFA4B
P 13350 2950
F 0 "UBF24" H 13350 3315 50  0000 C CNN
F 1 "DFFCOR" H 13350 3224 50  0000 C CNN
F 2 "" H 13350 2950 50  0001 C CNN
F 3 "" H 13350 2950 50  0001 C CNN
	1    13350 2950
	1    0    0    -1  
$EndComp
$Comp
L A5C:NAND06 UBE0
U 1 1 6151669A
P 2800 1200
F 0 "UBE0" H 2800 1640 50  0000 C CNN
F 1 "NAND06" H 2800 1549 50  0000 C CNN
F 2 "" H 2750 1300 50  0001 C CNN
F 3 "" H 2750 1300 50  0001 C CNN
	1    2800 1200
	1    0    0    -1  
$EndComp
$Comp
L A5C:NAND06 UAD335
U 1 1 615F6046
P 5850 6000
F 0 "UAD335" H 5850 6440 50  0000 C CNN
F 1 "NAND06" H 5850 6349 50  0000 C CNN
F 2 "" H 5800 6100 50  0001 C CNN
F 3 "" H 5800 6100 50  0001 C CNN
	1    5850 6000
	1    0    0    -1  
$EndComp
$Comp
L A5C:NAND06 UAC316
U 1 1 613B9C57
P 5850 6800
F 0 "UAC316" H 5850 7240 50  0000 C CNN
F 1 "NAND06" H 5850 7149 50  0000 C CNN
F 2 "" H 5800 6900 50  0001 C CNN
F 3 "" H 5800 6900 50  0001 C CNN
	1    5850 6800
	1    0    0    -1  
$EndComp
$Comp
L A5C:NAND06 UAC304
U 1 1 6129293F
P 5850 7600
F 0 "UAC304" H 5850 8040 50  0000 C CNN
F 1 "NAND06" H 5850 7949 50  0000 C CNN
F 2 "" H 5800 7700 50  0001 C CNN
F 3 "" H 5800 7700 50  0001 C CNN
	1    5850 7600
	1    0    0    -1  
$EndComp
$Comp
L A5C:NAND06 UAD316
U 1 1 614CB891
P 5850 8400
F 0 "UAD316" H 5850 8840 50  0000 C CNN
F 1 "NAND06" H 5850 8749 50  0000 C CNN
F 2 "" H 5800 8500 50  0001 C CNN
F 3 "" H 5800 8500 50  0001 C CNN
	1    5850 8400
	1    0    0    -1  
$EndComp
$Comp
L A5C:NAND06 UBB16
U 1 1 6507DED3
P 5850 9200
F 0 "UBB16" H 5850 9640 50  0000 C CNN
F 1 "NAND06" H 5850 9549 50  0000 C CNN
F 2 "" H 5800 9300 50  0001 C CNN
F 3 "" H 5800 9300 50  0001 C CNN
	1    5850 9200
	1    0    0    -1  
$EndComp
$Comp
L A5C:NAND06 UBC8
U 1 1 6581A30E
P 5850 10000
F 0 "UBC8" H 5850 10440 50  0000 C CNN
F 1 "NAND06" H 5850 10349 50  0000 C CNN
F 2 "" H 5800 10100 50  0001 C CNN
F 3 "" H 5800 10100 50  0001 C CNN
	1    5850 10000
	1    0    0    -1  
$EndComp
$Comp
L A5C:NAND06 UBA3
U 1 1 64DDD518
P 5850 10800
F 0 "UBA3" H 5850 11240 50  0000 C CNN
F 1 "NAND06" H 5850 11149 50  0000 C CNN
F 2 "" H 5800 10900 50  0001 C CNN
F 3 "" H 5800 10900 50  0001 C CNN
	1    5850 10800
	1    0    0    -1  
$EndComp
$Comp
L A5C:NAND06 UBB48
U 1 1 656D4B5B
P 7700 1250
F 0 "UBB48" H 7700 1690 50  0000 C CNN
F 1 "NAND06" H 7700 1599 50  0000 C CNN
F 2 "" H 7650 1350 50  0001 C CNN
F 3 "" H 7650 1350 50  0001 C CNN
	1    7700 1250
	1    0    0    -1  
$EndComp
$Comp
L A5C:NAND06 UBB34
U 1 1 6539AF1D
P 7700 2050
F 0 "UBB34" H 7700 2490 50  0000 C CNN
F 1 "NAND06" H 7700 2399 50  0000 C CNN
F 2 "" H 7650 2150 50  0001 C CNN
F 3 "" H 7650 2150 50  0001 C CNN
	1    7700 2050
	1    0    0    -1  
$EndComp
$Comp
L A5C:NAND06 UBB42
U 1 1 654BF146
P 7700 2850
F 0 "UBB42" H 7700 3290 50  0000 C CNN
F 1 "NAND06" H 7700 3199 50  0000 C CNN
F 2 "" H 7650 2950 50  0001 C CNN
F 3 "" H 7650 2950 50  0001 C CNN
	1    7700 2850
	1    0    0    -1  
$EndComp
$Comp
L A5C:NAND06 UBB26
U 1 1 652445C2
P 7700 3650
F 0 "UBB26" H 7700 4090 50  0000 C CNN
F 1 "NAND06" H 7700 3999 50  0000 C CNN
F 2 "" H 7650 3750 50  0001 C CNN
F 3 "" H 7650 3750 50  0001 C CNN
	1    7700 3650
	1    0    0    -1  
$EndComp
$Comp
L A5C:NAND08 UAD296
U 1 1 6CCFAF39
P 6850 8450
F 0 "UAD296" H 6850 8990 50  0000 C CNN
F 1 "NAND08" H 6850 8899 50  0000 C CNN
F 2 "" H 6800 8650 50  0001 C CNN
F 3 "" H 6800 8650 50  0001 C CNN
	1    6850 8450
	1    0    0    -1  
$EndComp
$Comp
L A5C:NAND08 UBA19
U 1 1 6A09483B
P 10900 8000
F 0 "UBA19" H 10900 8540 50  0000 C CNN
F 1 "NAND08" H 10900 8449 50  0000 C CNN
F 2 "" H 10850 8200 50  0001 C CNN
F 3 "" H 10850 8200 50  0001 C CNN
	1    10900 8000
	1    0    0    -1  
$EndComp
$Comp
L A5C:NAND08 UBD30
U 1 1 60F16958
P 10900 10500
F 0 "UBD30" H 10900 11040 50  0000 C CNN
F 1 "NAND08" H 10900 10949 50  0000 C CNN
F 2 "" H 10850 10700 50  0001 C CNN
F 3 "" H 10850 10700 50  0001 C CNN
	1    10900 10500
	1    0    0    -1  
$EndComp
$Comp
L A5C:M175C UBE29
U 1 1 659039BA
P 13500 2100
F 0 "UBE29" H 13500 2665 50  0000 C CNN
F 1 "M175C" H 13500 2574 50  0000 C CNN
F 2 "" H 13500 1900 50  0001 C CNN
F 3 "" H 13500 1900 50  0001 C CNN
	1    13500 2100
	1    0    0    -1  
$EndComp
$Comp
L A5C:NAND13 UBD15
U 1 1 631BD480
P 4000 3700
F 0 "UBD15" H 4000 4490 50  0000 C CNN
F 1 "NAND13" H 4000 4399 50  0000 C CNN
F 2 "" H 3950 4150 50  0001 C CNN
F 3 "" H 3950 4150 50  0001 C CNN
	1    4000 3700
	1    0    0    -1  
$EndComp
$Comp
L A5C:NAND13 UCA163
U 1 1 6F9447B5
P 7700 4800
F 0 "UCA163" H 7700 5590 50  0000 C CNN
F 1 "NAND13" H 7700 5499 50  0000 C CNN
F 2 "" H 7650 5250 50  0001 C CNN
F 3 "" H 7650 5250 50  0001 C CNN
	1    7700 4800
	1    0    0    -1  
$EndComp
$Comp
L A5C:NAND13 UBE8
U 1 1 618F6E9F
P 10900 9250
F 0 "UBE8" H 10900 10040 50  0000 C CNN
F 1 "NAND13" H 10900 9949 50  0000 C CNN
F 2 "" H 10850 9700 50  0001 C CNN
F 3 "" H 10850 9700 50  0001 C CNN
	1    10900 9250
	1    0    0    -1  
$EndComp
Wire Wire Line
	2250 6050 2500 6050
Wire Wire Line
	2250 6150 2500 6150
Wire Wire Line
	2250 6250 2500 6250
Wire Wire Line
	2250 6350 2500 6350
Text Label 2500 6250 2    50   ~ 0
LINE7
Text Label 2500 6350 2    50   ~ 0
~LINE8
Wire Wire Line
	2250 5450 2500 5450
Wire Wire Line
	2250 5550 2500 5550
Wire Wire Line
	2250 5650 2500 5650
Wire Wire Line
	2250 5750 2500 5750
Text Label 2500 5450 2    50   ~ 0
~LINE0
Text Label 2500 5650 2    50   ~ 0
LINE7
Text Label 2500 5750 2    50   ~ 0
~LINE8
Wire Wire Line
	2250 4850 2500 4850
Wire Wire Line
	2250 5050 2500 5050
Wire Wire Line
	2250 5150 2500 5150
Text Label 2500 4850 2    50   ~ 0
~LINE1
Text Label 2500 5050 2    50   ~ 0
LINE7
Text Label 2500 5150 2    50   ~ 0
~LINE8
Text Label 2500 6050 2    50   ~ 0
~LINE3
Wire Wire Line
	2250 4950 2500 4950
Text Label 2500 5550 2    50   ~ 0
~LINE4
Text Label 2500 6150 2    50   ~ 0
~LINE4
Text Label 2500 4950 2    50   ~ 0
~LINE4
Wire Wire Line
	2250 4350 2500 4350
Wire Wire Line
	2250 4250 2500 4250
Wire Wire Line
	2250 4450 2500 4450
Wire Wire Line
	2250 4550 2500 4550
Text Label 2500 4350 2    50   ~ 0
~LINE4
Text Label 2500 4250 2    50   ~ 0
~LINE2
Text Label 2500 4450 2    50   ~ 0
LINE7
Text Label 2500 4550 2    50   ~ 0
~LINE8
Wire Bus Line
	12300 1550 12300 2750
Wire Bus Line
	1150 7150 1150 10900
$EndSCHEMATC
