EESchema Schematic File Version 4
EELAYER 30 0
EELAYER END
$Descr A3 16535 11693
encoding utf-8
Sheet 79 83
Title "CPS Reverse Engineering: DL-0311"
Date "2021-09-12"
Rev ""
Comp ""
Comment1 ""
Comment2 ""
Comment3 "Licence: CC-BY"
Comment4 "Author: Loïc *WydD* Petit"
$EndDescr
Connection ~ 10500 10450
Connection ~ 3650 10050
Connection ~ 10500 8600
Connection ~ 10500 3650
Connection ~ 10500 7050
Connection ~ 10500 5200
Connection ~ 10500 1800
Connection ~ 4900 6050
Connection ~ 5000 6350
Connection ~ 3600 8950
Connection ~ 4800 6150
Connection ~ 4800 9550
Connection ~ 4800 2750
Connection ~ 6500 6400
Connection ~ 6500 9800
Connection ~ 9800 3750
Connection ~ 9800 5400
Connection ~ 9800 7150
Connection ~ 9800 8800
Connection ~ 9800 10550
Connection ~ 6500 11000
Connection ~ 2250 9500
Connection ~ 4450 6150
Connection ~ 4550 6700
Connection ~ 4550 10100
Connection ~ 4450 9550
Connection ~ 4900 8950
Connection ~ 5000 9200
NoConn ~ 7100 9600
NoConn ~ 10400 10350
NoConn ~ 10400 6950
NoConn ~ 10400 3550
NoConn ~ 7100 2800
NoConn ~ 7100 6200
NoConn ~ 10400 1900
NoConn ~ 10400 5300
NoConn ~ 10400 8700
Entry Wire Line
	2100 2400 2200 2500
Entry Wire Line
	2100 2500 2200 2600
Entry Wire Line
	2100 2600 2200 2700
Entry Wire Line
	2100 2700 2200 2800
Entry Wire Line
	2100 2800 2200 2900
Entry Wire Line
	2100 2900 2200 3000
Entry Wire Line
	11100 3650 11200 3550
Entry Wire Line
	11100 7050 11200 6950
Entry Wire Line
	11100 10450 11200 10350
Entry Wire Line
	11350 1800 11450 1700
Entry Wire Line
	11350 5200 11450 5100
Entry Wire Line
	11350 8600 11450 8500
Wire Wire Line
	2150 9500 2250 9500
Wire Wire Line
	2200 2500 2800 2500
Wire Wire Line
	2200 2600 2800 2600
Wire Wire Line
	2200 2700 2800 2700
Wire Wire Line
	2200 2800 2800 2800
Wire Wire Line
	2200 2900 2800 2900
Wire Wire Line
	2200 3000 2800 3000
Wire Wire Line
	2250 9500 3650 9500
Wire Wire Line
	2250 10550 2250 9500
Wire Wire Line
	3050 10550 2250 10550
Wire Wire Line
	3600 8950 3500 8950
Wire Wire Line
	3600 9200 3600 8950
Wire Wire Line
	3600 9200 5000 9200
Wire Wire Line
	3650 9600 3650 10050
Wire Wire Line
	3650 10150 3650 10550
Wire Wire Line
	4200 8950 4900 8950
Wire Wire Line
	4200 9550 4450 9550
Wire Wire Line
	4200 10100 4550 10100
Wire Wire Line
	4450 2750 4450 6150
Wire Wire Line
	4450 6150 4450 9550
Wire Wire Line
	4450 9550 4800 9550
Wire Wire Line
	4550 3300 8750 3300
Wire Wire Line
	4550 6700 4550 3300
Wire Wire Line
	4550 6700 4550 10100
Wire Wire Line
	4550 6700 8750 6700
Wire Wire Line
	4550 10100 8750 10100
Wire Wire Line
	4800 2750 4450 2750
Wire Wire Line
	4800 2750 5500 2750
Wire Wire Line
	4800 3050 4800 2750
Wire Wire Line
	4800 3050 5500 3050
Wire Wire Line
	4800 6150 4450 6150
Wire Wire Line
	4800 6150 5500 6150
Wire Wire Line
	4800 6450 4800 6150
Wire Wire Line
	4800 6450 5500 6450
Wire Wire Line
	4800 9550 5500 9550
Wire Wire Line
	4800 9850 4800 9550
Wire Wire Line
	4800 9850 5500 9850
Wire Wire Line
	4900 2650 4900 6050
Wire Wire Line
	4900 2650 5500 2650
Wire Wire Line
	4900 6050 4900 8950
Wire Wire Line
	4900 6050 5500 6050
Wire Wire Line
	4900 8950 4900 9450
Wire Wire Line
	4900 9450 5500 9450
Wire Wire Line
	5000 2950 5000 6350
Wire Wire Line
	5000 2950 5500 2950
Wire Wire Line
	5000 6350 5000 9200
Wire Wire Line
	5000 6350 5500 6350
Wire Wire Line
	5000 9200 5000 9750
Wire Wire Line
	5000 9750 5500 9750
Wire Wire Line
	6400 11000 6500 11000
Wire Wire Line
	6500 3000 6600 3000
Wire Wire Line
	6500 6400 6500 3000
Wire Wire Line
	6500 9800 6500 6400
Wire Wire Line
	6500 11000 6500 9800
Wire Wire Line
	6600 2800 6400 2800
Wire Wire Line
	6600 6200 6400 6200
Wire Wire Line
	6600 6400 6500 6400
Wire Wire Line
	6600 9600 6400 9600
Wire Wire Line
	6600 9800 6500 9800
Wire Wire Line
	7100 2900 7750 2900
Wire Wire Line
	7100 6300 7750 6300
Wire Wire Line
	7100 9700 7750 9700
Wire Wire Line
	7750 3200 7750 2900
Wire Wire Line
	7750 6600 7750 6300
Wire Wire Line
	7750 10000 7750 9700
Wire Wire Line
	7950 2750 8050 2750
Wire Wire Line
	7950 2900 7950 2750
Wire Wire Line
	7950 6150 8050 6150
Wire Wire Line
	7950 6300 7950 6150
Wire Wire Line
	7950 9550 8050 9550
Wire Wire Line
	7950 9700 7950 9550
Wire Wire Line
	8600 900  8800 900 
Wire Wire Line
	8600 1800 9000 1800
Wire Wire Line
	8600 2700 8800 2700
Wire Wire Line
	8600 4300 8800 4300
Wire Wire Line
	8600 5200 9000 5200
Wire Wire Line
	8600 6100 8800 6100
Wire Wire Line
	8600 7700 8800 7700
Wire Wire Line
	8600 8600 9000 8600
Wire Wire Line
	8600 9500 8800 9500
Wire Wire Line
	8650 3800 8650 4050
Wire Wire Line
	8650 4050 10500 4050
Wire Wire Line
	8650 7200 8650 7450
Wire Wire Line
	8650 7450 10500 7450
Wire Wire Line
	8650 10600 8650 10850
Wire Wire Line
	8650 10850 10500 10850
Wire Wire Line
	8700 1350 8600 1350
Wire Wire Line
	8700 1700 8700 1350
Wire Wire Line
	8700 1900 8700 2250
Wire Wire Line
	8700 2250 8600 2250
Wire Wire Line
	8700 4750 8600 4750
Wire Wire Line
	8700 5100 8700 4750
Wire Wire Line
	8700 5300 8700 5650
Wire Wire Line
	8700 5650 8600 5650
Wire Wire Line
	8700 8150 8600 8150
Wire Wire Line
	8700 8500 8700 8150
Wire Wire Line
	8700 8700 8700 9050
Wire Wire Line
	8700 9050 8600 9050
Wire Wire Line
	8750 3200 7750 3200
Wire Wire Line
	8750 3800 8650 3800
Wire Wire Line
	8750 3900 8150 3900
Wire Wire Line
	8750 6600 7750 6600
Wire Wire Line
	8750 7200 8650 7200
Wire Wire Line
	8750 7300 8150 7300
Wire Wire Line
	8750 10000 7750 10000
Wire Wire Line
	8750 10600 8650 10600
Wire Wire Line
	8750 10700 8150 10700
Wire Wire Line
	8800 900  8800 1600
Wire Wire Line
	8800 1600 9000 1600
Wire Wire Line
	8800 2000 9000 2000
Wire Wire Line
	8800 2700 8800 2000
Wire Wire Line
	8800 4300 8800 5000
Wire Wire Line
	8800 5000 9000 5000
Wire Wire Line
	8800 5400 9000 5400
Wire Wire Line
	8800 6100 8800 5400
Wire Wire Line
	8800 7700 8800 8400
Wire Wire Line
	8800 8400 9000 8400
Wire Wire Line
	8800 8800 9000 8800
Wire Wire Line
	8800 9500 8800 8800
Wire Wire Line
	9000 1700 8700 1700
Wire Wire Line
	9000 1900 8700 1900
Wire Wire Line
	9000 5100 8700 5100
Wire Wire Line
	9000 5300 8700 5300
Wire Wire Line
	9000 8500 8700 8500
Wire Wire Line
	9000 8700 8700 8700
Wire Wire Line
	9650 1800 9900 1800
Wire Wire Line
	9650 3550 9900 3550
Wire Wire Line
	9650 5200 9900 5200
Wire Wire Line
	9650 6950 9900 6950
Wire Wire Line
	9650 8600 9900 8600
Wire Wire Line
	9650 10350 9900 10350
Wire Wire Line
	9800 2000 9800 3750
Wire Wire Line
	9800 3750 9800 5400
Wire Wire Line
	9800 3750 9900 3750
Wire Wire Line
	9800 5400 9800 7150
Wire Wire Line
	9800 7150 9800 8800
Wire Wire Line
	9800 8800 9800 10550
Wire Wire Line
	9800 10550 9800 11000
Wire Wire Line
	9800 11000 6500 11000
Wire Wire Line
	9900 2000 9800 2000
Wire Wire Line
	9900 5400 9800 5400
Wire Wire Line
	9900 7150 9800 7150
Wire Wire Line
	9900 8800 9800 8800
Wire Wire Line
	9900 10550 9800 10550
Wire Wire Line
	10400 3650 10500 3650
Wire Wire Line
	10400 7050 10500 7050
Wire Wire Line
	10400 8600 10500 8600
Wire Wire Line
	10400 10450 10500 10450
Wire Wire Line
	10500 1800 10400 1800
Wire Wire Line
	10500 1800 10500 2900
Wire Wire Line
	10500 1800 11350 1800
Wire Wire Line
	10500 2900 7950 2900
Wire Wire Line
	10500 3650 10500 4050
Wire Wire Line
	10500 3650 11100 3650
Wire Wire Line
	10500 5200 10400 5200
Wire Wire Line
	10500 5200 10500 6300
Wire Wire Line
	10500 5200 11350 5200
Wire Wire Line
	10500 6300 7950 6300
Wire Wire Line
	10500 7050 10500 7450
Wire Wire Line
	10500 7050 11100 7050
Wire Wire Line
	10500 8600 10500 9700
Wire Wire Line
	10500 8600 11350 8600
Wire Wire Line
	10500 9700 7950 9700
Wire Wire Line
	10500 10450 10500 10850
Wire Wire Line
	10500 10450 11100 10450
Wire Bus Line
	2100 2300 2000 2300
Wire Bus Line
	11200 1200 11650 1200
Wire Bus Line
	11450 1350 11650 1350
Text Notes 10600 1700 0    50   ~ 0
GFX-CHNL
Text Notes 10600 3550 0    50   ~ 0
~GFX-CHNL
Text Notes 10600 5100 0    50   ~ 0
GFX-CHNL
Text Notes 10600 6950 0    50   ~ 0
~GFX-CHNL
Text Notes 10600 8500 0    50   ~ 0
GFX-CHNL
Text Notes 10600 10350 0    50   ~ 0
~GFX-CHNL
Text Label 2250 2500 0    50   ~ 0
GFX-ADDR4
Text Label 2250 2600 0    50   ~ 0
GFX-ADDR5
Text Label 2250 2700 0    50   ~ 0
GFX-ADDR6
Text Label 2250 2800 0    50   ~ 0
GFX-ADDR7
Text Label 2250 2900 0    50   ~ 0
GFX-ADDR8
Text Label 2250 3000 0    50   ~ 0
GFX-ADDR9
Text Label 5500 2550 2    50   ~ 0
GFX-ADDR9
Text Label 5500 2850 2    50   ~ 0
GFX-ADDR7
Text Label 5500 5950 2    50   ~ 0
GFX-ADDR8
Text Label 5500 6250 2    50   ~ 0
GFX-ADDR6
Text Label 5500 9350 2    50   ~ 0
GFX-ADDR7
Text Label 5500 9650 2    50   ~ 0
GFX-ADDR5
Text Label 8050 850  2    50   ~ 0
GFX-ADDR9
Text Label 8050 1300 2    50   ~ 0
GFX-ADDR8
Text Label 8050 1750 2    50   ~ 0
GFX-ADDR7
Text Label 8050 2200 2    50   ~ 0
GFX-ADDR6
Text Label 8050 2650 2    50   ~ 0
~GFX-CHNL
Text Label 8050 4250 2    50   ~ 0
GFX-ADDR8
Text Label 8050 4350 2    50   ~ 0
SCROLL1.GFX-CHNL
Text Label 8050 4700 2    50   ~ 0
GFX-ADDR7
Text Label 8050 4800 2    50   ~ 0
ELSE.GFX-CHNL
Text Label 8050 5150 2    50   ~ 0
GFX-ADDR6
Text Label 8050 5250 2    50   ~ 0
STARS.GFX-CHNL
Text Label 8050 5600 2    50   ~ 0
GFX-ADDR5
Text Label 8050 5700 2    50   ~ 0
SCROLL3.GFX-CHNL
Text Label 8050 6050 2    50   ~ 0
~GFX-CHNL
Text Label 8050 7650 2    50   ~ 0
GFX-ADDR7
Text Label 8050 7750 2    50   ~ 0
SCROLL1.GFX-CHNL
Text Label 8050 8100 2    50   ~ 0
GFX-ADDR6
Text Label 8050 8200 2    50   ~ 0
ELSE.GFX-CHNL
Text Label 8050 8550 2    50   ~ 0
GFX-ADDR5
Text Label 8050 8650 2    50   ~ 0
STARS.GFX-CHNL
Text Label 8050 9000 2    50   ~ 0
GFX-ADDR4
Text Label 8050 9100 2    50   ~ 0
SCROLL3.GFX-CHNL
Text Label 8050 9450 2    50   ~ 0
~GFX-CHNL
Text Label 8150 3900 0    50   ~ 0
~GFX-CHNL
Text Label 8150 7300 0    50   ~ 0
~GFX-CHNL
Text Label 8150 10700 0    50   ~ 0
~GFX-CHNL
Text Label 8750 3400 2    50   ~ 0
GFX-ADDR8
Text Label 8750 3500 2    50   ~ 0
ELSE.GFX-CHNL
Text Label 8750 3600 2    50   ~ 0
GFX-ADDR6
Text Label 8750 3700 2    50   ~ 0
SCROLL3.GFX-CHNL
Text Label 8750 6800 2    50   ~ 0
GFX-ADDR7
Text Label 8750 6900 2    50   ~ 0
ELSE.GFX-CHNL
Text Label 8750 7000 2    50   ~ 0
GFX-ADDR5
Text Label 8750 7100 2    50   ~ 0
SCROLL3.GFX-CHNL
Text Label 8750 10200 2    50   ~ 0
GFX-ADDR6
Text Label 8750 10300 2    50   ~ 0
ELSE.GFX-CHNL
Text Label 8750 10400 2    50   ~ 0
GFX-ADDR4
Text Label 8750 10500 2    50   ~ 0
SCROLL3.GFX-CHNL
Text Label 10600 1800 0    50   ~ 0
B-ROMA8
Text Label 10600 3650 0    50   ~ 0
A-ROMA8
Text Label 10600 5200 0    50   ~ 0
B-ROMA7
Text Label 10600 7050 0    50   ~ 0
A-ROMA7
Text Label 10600 8600 0    50   ~ 0
B-ROMA6
Text Label 10600 10450 0    50   ~ 0
A-ROMA6
Text HLabel 2000 2300 0    50   Input ~ 0
GFX-ADDR[4..9]
Text HLabel 2150 9500 0    50   Input ~ 0
~GFX-CHNL
Text HLabel 3050 10050 0    50   Input ~ 0
~SCROLL1-STARS
Text HLabel 3500 8950 0    50   Input ~ 0
SCROLL3-STARS
Text HLabel 6400 11000 0    50   Input ~ 0
~CLK4M
Text HLabel 8050 950  0    50   Input ~ 0
SCROLL1.GFX-CHNL
Text HLabel 8050 1400 0    50   Input ~ 0
ELSE.GFX-CHNL
Text HLabel 8050 1850 0    50   Input ~ 0
STARS.GFX-CHNL
Text HLabel 8050 2300 0    50   Input ~ 0
SCROLL3.GFX-CHNL
Text HLabel 11650 1200 2    50   Output ~ 0
A-ROMA[6..8]
Text HLabel 11650 1350 2    50   Output ~ 0
B-ROMA[6..8]
$Comp
L A5C:AND02 UEB180
U 1 1 61BC81EB
P 3900 9550
F 0 "UEB180" H 3925 9817 50  0000 C CNN
F 1 "AND02" H 3925 9726 50  0000 C CNN
F 2 "" H 3900 9550 50  0001 C CNN
F 3 "" H 3900 9550 50  0001 C CNN
	1    3900 9550
	1    0    0    -1  
$EndComp
$Comp
L A5C:AND02 UEB175
U 1 1 61BC81F1
P 3900 10100
F 0 "UEB175" H 3925 10367 50  0000 C CNN
F 1 "AND02" H 3925 10276 50  0000 C CNN
F 2 "" H 3900 10100 50  0001 C CNN
F 3 "" H 3900 10100 50  0001 C CNN
	1    3900 10100
	1    0    0    -1  
$EndComp
$Comp
L A5C:NAND02 UEA177
U 1 1 618337FE
P 8300 900
F 0 "UEA177" H 8325 1167 50  0000 C CNN
F 1 "NAND02" H 8325 1076 50  0000 C CNN
F 2 "" H 8300 900 50  0001 C CNN
F 3 "" H 8300 900 50  0001 C CNN
	1    8300 900 
	1    0    0    -1  
$EndComp
$Comp
L A5C:NAND02 UEA186
U 1 1 618337F8
P 8300 1350
F 0 "UEA186" H 8325 1617 50  0000 C CNN
F 1 "NAND02" H 8325 1526 50  0000 C CNN
F 2 "" H 8300 1350 50  0001 C CNN
F 3 "" H 8300 1350 50  0001 C CNN
	1    8300 1350
	1    0    0    -1  
$EndComp
$Comp
L A5C:NAND02 UEA193
U 1 1 618337F2
P 8300 1800
F 0 "UEA193" H 8325 2067 50  0000 C CNN
F 1 "NAND02" H 8325 1976 50  0000 C CNN
F 2 "" H 8300 1800 50  0001 C CNN
F 3 "" H 8300 1800 50  0001 C CNN
	1    8300 1800
	1    0    0    -1  
$EndComp
$Comp
L A5C:NAND02 UEA184
U 1 1 618337EC
P 8300 2250
F 0 "UEA184" H 8325 2517 50  0000 C CNN
F 1 "NAND02" H 8325 2426 50  0000 C CNN
F 2 "" H 8300 2250 50  0001 C CNN
F 3 "" H 8300 2250 50  0001 C CNN
	1    8300 2250
	1    0    0    -1  
$EndComp
$Comp
L A5C:NAND02 UEA174
U 1 1 618337E6
P 8300 2700
F 0 "UEA174" H 8325 2967 50  0000 C CNN
F 1 "NAND02" H 8325 2876 50  0000 C CNN
F 2 "" H 8300 2700 50  0001 C CNN
F 3 "" H 8300 2700 50  0001 C CNN
	1    8300 2700
	1    0    0    -1  
$EndComp
$Comp
L A5C:NAND02 UED9
U 1 1 665DC44F
P 8300 4300
F 0 "UED9" H 8325 4567 50  0000 C CNN
F 1 "NAND02" H 8325 4476 50  0000 C CNN
F 2 "" H 8300 4300 50  0001 C CNN
F 3 "" H 8300 4300 50  0001 C CNN
	1    8300 4300
	1    0    0    -1  
$EndComp
$Comp
L A5C:NAND02 UEH51
U 1 1 665A9A89
P 8300 4750
F 0 "UEH51" H 8325 5017 50  0000 C CNN
F 1 "NAND02" H 8325 4926 50  0000 C CNN
F 2 "" H 8300 4750 50  0001 C CNN
F 3 "" H 8300 4750 50  0001 C CNN
	1    8300 4750
	1    0    0    -1  
$EndComp
$Comp
L A5C:NAND02 UEC16
U 1 1 665A9A83
P 8300 5200
F 0 "UEC16" H 8325 5467 50  0000 C CNN
F 1 "NAND02" H 8325 5376 50  0000 C CNN
F 2 "" H 8300 5200 50  0001 C CNN
F 3 "" H 8300 5200 50  0001 C CNN
	1    8300 5200
	1    0    0    -1  
$EndComp
$Comp
L A5C:NAND02 UEG3
U 1 1 6655B4D6
P 8300 5650
F 0 "UEG3" H 8325 5917 50  0000 C CNN
F 1 "NAND02" H 8325 5826 50  0000 C CNN
F 2 "" H 8300 5650 50  0001 C CNN
F 3 "" H 8300 5650 50  0001 C CNN
	1    8300 5650
	1    0    0    -1  
$EndComp
$Comp
L A5C:NAND02 UEG120
U 1 1 6653FF37
P 8300 6100
F 0 "UEG120" H 8325 6367 50  0000 C CNN
F 1 "NAND02" H 8325 6276 50  0000 C CNN
F 2 "" H 8300 6100 50  0001 C CNN
F 3 "" H 8300 6100 50  0001 C CNN
	1    8300 6100
	1    0    0    -1  
$EndComp
$Comp
L A5C:NAND02 UED113
U 1 1 61118E4C
P 8300 7700
F 0 "UED113" H 8325 7967 50  0000 C CNN
F 1 "NAND02" H 8325 7876 50  0000 C CNN
F 2 "" H 8300 7700 50  0001 C CNN
F 3 "" H 8300 7700 50  0001 C CNN
	1    8300 7700
	1    0    0    -1  
$EndComp
$Comp
L A5C:NAND02 UEC120
U 1 1 61118E4D
P 8300 8150
F 0 "UEC120" H 8325 8417 50  0000 C CNN
F 1 "NAND02" H 8325 8326 50  0000 C CNN
F 2 "" H 8300 8150 50  0001 C CNN
F 3 "" H 8300 8150 50  0001 C CNN
	1    8300 8150
	1    0    0    -1  
$EndComp
$Comp
L A5C:NAND02 UEC116
U 1 1 61118E4B
P 8300 8600
F 0 "UEC116" H 8325 8867 50  0000 C CNN
F 1 "NAND02" H 8325 8776 50  0000 C CNN
F 2 "" H 8300 8600 50  0001 C CNN
F 3 "" H 8300 8600 50  0001 C CNN
	1    8300 8600
	1    0    0    -1  
$EndComp
$Comp
L A5C:NAND02 UEE114
U 1 1 61118E45
P 8300 9050
F 0 "UEE114" H 8325 9317 50  0000 C CNN
F 1 "NAND02" H 8325 9226 50  0000 C CNN
F 2 "" H 8300 9050 50  0001 C CNN
F 3 "" H 8300 9050 50  0001 C CNN
	1    8300 9050
	1    0    0    -1  
$EndComp
$Comp
L A5C:NAND02 UED122
U 1 1 61118E46
P 8300 9500
F 0 "UED122" H 8325 9767 50  0000 C CNN
F 1 "NAND02" H 8325 9676 50  0000 C CNN
F 2 "" H 8300 9500 50  0001 C CNN
F 3 "" H 8300 9500 50  0001 C CNN
	1    8300 9500
	1    0    0    -1  
$EndComp
$Comp
L A5C:INV01 UEB178
U 1 1 61BC81E4
P 3350 10050
F 0 "UEB178" H 3350 10367 50  0000 C CNN
F 1 "INV01" H 3350 10276 50  0000 C CNN
F 2 "" H 3350 9850 50  0001 C CNN
F 3 "" H 3350 9850 50  0001 C CNN
	1    3350 10050
	1    0    0    -1  
$EndComp
$Comp
L A5C:INV01 UEB179
U 1 1 61BC81DD
P 3350 10550
F 0 "UEB179" H 3350 10867 50  0000 C CNN
F 1 "INV01" H 3350 10776 50  0000 C CNN
F 2 "" H 3350 10350 50  0001 C CNN
F 3 "" H 3350 10350 50  0001 C CNN
	1    3350 10550
	1    0    0    -1  
$EndComp
$Comp
L A5C:INV01 UEC162
U 1 1 61118E44
P 3900 8950
F 0 "UEC162" H 3900 9267 50  0000 C CNN
F 1 "INV01" H 3900 9176 50  0000 C CNN
F 2 "" H 3900 8750 50  0001 C CNN
F 3 "" H 3900 8750 50  0001 C CNN
	1    3900 8950
	1    0    0    -1  
$EndComp
$Comp
L A5C:DFFCOO UEA140
U 1 1 6183381A
P 6850 2900
F 0 "UEA140" H 6850 3265 50  0000 C CNN
F 1 "DFFCOO" H 6850 3174 50  0000 C CNN
F 2 "" H 6850 2900 50  0001 C CNN
F 3 "" H 6850 2900 50  0001 C CNN
	1    6850 2900
	1    0    0    -1  
$EndComp
$Comp
L A5C:DFFCOO UEA189
U 1 1 61118E43
P 6850 6300
F 0 "UEA189" H 6850 6665 50  0000 C CNN
F 1 "DFFCOO" H 6850 6574 50  0000 C CNN
F 2 "" H 6850 6300 50  0001 C CNN
F 3 "" H 6850 6300 50  0001 C CNN
	1    6850 6300
	1    0    0    -1  
$EndComp
$Comp
L A5C:DFFCOO UED187
U 1 1 61118E5D
P 6850 9700
F 0 "UED187" H 6850 10065 50  0000 C CNN
F 1 "DFFCOO" H 6850 9974 50  0000 C CNN
F 2 "" H 6850 9700 50  0001 C CNN
F 3 "" H 6850 9700 50  0001 C CNN
	1    6850 9700
	1    0    0    -1  
$EndComp
$Comp
L A5C:DFFCOO UEA170
U 1 1 618337D0
P 10150 1900
F 0 "UEA170" H 10150 2265 50  0000 C CNN
F 1 "DFFCOO" H 10150 2174 50  0000 C CNN
F 2 "" H 10150 1900 50  0001 C CNN
F 3 "" H 10150 1900 50  0001 C CNN
	1    10150 1900
	1    0    0    -1  
$EndComp
$Comp
L A5C:DFFCOO UEA154
U 1 1 618337B6
P 10150 3650
F 0 "UEA154" H 10150 4015 50  0000 C CNN
F 1 "DFFCOO" H 10150 3924 50  0000 C CNN
F 2 "" H 10150 3650 50  0001 C CNN
F 3 "" H 10150 3650 50  0001 C CNN
	1    10150 3650
	1    0    0    -1  
$EndComp
$Comp
L A5C:DFFCOO UEG50
U 1 1 6646EE6B
P 10150 5300
F 0 "UEG50" H 10150 5665 50  0000 C CNN
F 1 "DFFCOO" H 10150 5574 50  0000 C CNN
F 2 "" H 10150 5300 50  0001 C CNN
F 3 "" H 10150 5300 50  0001 C CNN
	1    10150 5300
	1    0    0    -1  
$EndComp
$Comp
L A5C:DFFCOO UEA164
U 1 1 6646EE50
P 10150 7050
F 0 "UEA164" H 10150 7415 50  0000 C CNN
F 1 "DFFCOO" H 10150 7324 50  0000 C CNN
F 2 "" H 10150 7050 50  0001 C CNN
F 3 "" H 10150 7050 50  0001 C CNN
	1    10150 7050
	1    0    0    -1  
$EndComp
$Comp
L A5C:DFFCOO UED118
U 1 1 61118E48
P 10150 8700
F 0 "UED118" H 10150 9065 50  0000 C CNN
F 1 "DFFCOO" H 10150 8974 50  0000 C CNN
F 2 "" H 10150 8700 50  0001 C CNN
F 3 "" H 10150 8700 50  0001 C CNN
	1    10150 8700
	1    0    0    -1  
$EndComp
$Comp
L A5C:DFFCOO UEE199
U 1 1 61118E4A
P 10150 10450
F 0 "UEE199" H 10150 10815 50  0000 C CNN
F 1 "DFFCOO" H 10150 10724 50  0000 C CNN
F 2 "" H 10150 10450 50  0001 C CNN
F 3 "" H 10150 10450 50  0001 C CNN
	1    10150 10450
	1    0    0    -1  
$EndComp
$Comp
L A5C:NAND05 UEA181
U 1 1 618337DE
P 9300 1800
F 0 "UEA181" H 9325 2190 50  0000 C CNN
F 1 "NAND05" H 9325 2099 50  0000 C CNN
F 2 "" H 9300 1500 50  0001 C CNN
F 3 "" H 9300 1500 50  0001 C CNN
	1    9300 1800
	1    0    0    -1  
$EndComp
$Comp
L A5C:NAND05 UEG8
U 1 1 664BEF40
P 9300 5200
F 0 "UEG8" H 9325 5590 50  0000 C CNN
F 1 "NAND05" H 9325 5499 50  0000 C CNN
F 2 "" H 9300 4900 50  0001 C CNN
F 3 "" H 9300 4900 50  0001 C CNN
	1    9300 5200
	1    0    0    -1  
$EndComp
$Comp
L A5C:NAND05 UED115
U 1 1 61118E47
P 9300 8600
F 0 "UED115" H 9325 8990 50  0000 C CNN
F 1 "NAND05" H 9325 8899 50  0000 C CNN
F 2 "" H 9300 8300 50  0001 C CNN
F 3 "" H 9300 8300 50  0001 C CNN
	1    9300 8600
	1    0    0    -1  
$EndComp
$Comp
L A5C:AOI32 UEB146
U 1 1 61833823
P 5950 2800
F 0 "UEB146" H 5950 3242 50  0000 C CNN
F 1 "AOI32" H 5950 3151 50  0000 C CNN
F 2 "" H 6100 2800 50  0001 C CNN
F 3 "" H 6100 2800 50  0001 C CNN
	1    5950 2800
	1    0    0    -1  
$EndComp
$Comp
L A5C:AOI32 UEB187
U 1 1 61118E5E
P 5950 6200
F 0 "UEB187" H 5950 6642 50  0000 C CNN
F 1 "AOI32" H 5950 6551 50  0000 C CNN
F 2 "" H 6100 6200 50  0001 C CNN
F 3 "" H 6100 6200 50  0001 C CNN
	1    5950 6200
	1    0    0    -1  
$EndComp
$Comp
L A5C:AOI32 UEB182
U 1 1 61118E5C
P 5950 9600
F 0 "UEB182" H 5950 10042 50  0000 C CNN
F 1 "AOI32" H 5950 9951 50  0000 C CNN
F 2 "" H 6100 9600 50  0001 C CNN
F 3 "" H 6100 9600 50  0001 C CNN
	1    5950 9600
	1    0    0    -1  
$EndComp
$Comp
L A5C:AOI24 UEA144
U 1 1 618337BF
P 9200 3550
F 0 "UEA144" H 9200 4117 50  0000 C CNN
F 1 "AOI24" H 9200 4026 50  0000 C CNN
F 2 "" H 9400 3850 50  0001 C CNN
F 3 "" H 9400 3850 50  0001 C CNN
	1    9200 3550
	1    0    0    -1  
$EndComp
$Comp
L A5C:AOI24 UEA159
U 1 1 6646EE59
P 9200 6950
F 0 "UEA159" H 9200 7517 50  0000 C CNN
F 1 "AOI24" H 9200 7426 50  0000 C CNN
F 2 "" H 9400 7250 50  0001 C CNN
F 3 "" H 9400 7250 50  0001 C CNN
	1    9200 6950
	1    0    0    -1  
$EndComp
$Comp
L A5C:AOI24 UEE187
U 1 1 61118E49
P 9200 10350
F 0 "UEE187" H 9200 10917 50  0000 C CNN
F 1 "AOI24" H 9200 10826 50  0000 C CNN
F 2 "" H 9400 10650 50  0001 C CNN
F 3 "" H 9400 10650 50  0001 C CNN
	1    9200 10350
	1    0    0    -1  
$EndComp
Wire Bus Line
	11200 1200 11200 10350
Wire Bus Line
	11450 1350 11450 8500
Wire Bus Line
	2100 2300 2100 2900
$EndSCHEMATC
