EESchema Schematic File Version 4
EELAYER 30 0
EELAYER END
$Descr A4 11693 8268
encoding utf-8
Sheet 10 17
Title ""
Date "2019-10-17"
Rev ""
Comp ""
Comment1 ""
Comment2 "Licence: CC-BY"
Comment3 "Author: Loic *WydD* Petit"
Comment4 "Project: CPS2 Reverse Engineering: 93646B"
$EndDescr
Connection ~ 3450 1350
Connection ~ 3450 4150
Connection ~ 3500 6550
Connection ~ 3500 3750
Connection ~ 1700 3650
Connection ~ 1700 4050
Connection ~ 2050 3550
Connection ~ 2150 3950
Connection ~ 4350 3700
Connection ~ 850  6550
Connection ~ 6600 3700
Connection ~ 5400 3700
Connection ~ 5900 5850
Connection ~ 7600 1500
Connection ~ 7600 4050
Entry Wire Line
	2600 1450 2700 1550
Entry Wire Line
	2600 1550 2700 1650
Entry Wire Line
	2600 1650 2700 1750
Entry Wire Line
	2600 1750 2700 1850
Entry Wire Line
	2600 1850 2700 1950
Entry Wire Line
	2600 1950 2700 2050
Entry Wire Line
	2600 2050 2700 2150
Entry Wire Line
	2600 2150 2700 2250
Entry Wire Line
	2600 2250 2700 2350
Entry Wire Line
	2600 2350 2700 2450
Entry Wire Line
	2600 2450 2700 2550
Entry Wire Line
	2600 2550 2700 2650
Entry Wire Line
	2600 2650 2700 2750
Entry Wire Line
	2600 2750 2700 2850
Entry Wire Line
	2600 2850 2700 2950
Entry Wire Line
	2600 2950 2700 3050
Entry Wire Line
	2600 3050 2700 3150
Entry Wire Line
	2600 3150 2700 3250
Entry Wire Line
	2600 3250 2700 3350
Entry Wire Line
	2600 3350 2700 3450
Entry Wire Line
	2600 3850 2500 3950
Entry Wire Line
	2600 4250 2700 4350
Entry Wire Line
	2600 4350 2700 4450
Entry Wire Line
	2600 4450 2700 4550
Entry Wire Line
	2600 4550 2700 4650
Entry Wire Line
	2600 4650 2700 4750
Entry Wire Line
	2600 4750 2700 4850
Entry Wire Line
	2600 4850 2700 4950
Entry Wire Line
	2600 4950 2700 5050
Entry Wire Line
	2600 5050 2700 5150
Entry Wire Line
	2600 5150 2700 5250
Entry Wire Line
	2600 5250 2700 5350
Entry Wire Line
	2600 5350 2700 5450
Entry Wire Line
	2600 5450 2700 5550
Entry Wire Line
	2600 5550 2700 5650
Entry Wire Line
	2600 5650 2700 5750
Entry Wire Line
	2600 5750 2700 5850
Entry Wire Line
	2600 5850 2700 5950
Entry Wire Line
	2600 5950 2700 6050
Entry Wire Line
	2600 6050 2700 6150
Entry Wire Line
	2600 6150 2700 6250
Entry Wire Line
	2600 6700 2700 6800
Entry Wire Line
	4250 1550 4350 1650
Entry Wire Line
	4250 1650 4350 1750
Entry Wire Line
	4250 1750 4350 1850
Entry Wire Line
	4250 1850 4350 1950
Entry Wire Line
	4250 1950 4350 2050
Entry Wire Line
	4250 2050 4350 2150
Entry Wire Line
	4250 2150 4350 2250
Entry Wire Line
	4250 2250 4350 2350
Entry Wire Line
	4250 2350 4350 2450
Entry Wire Line
	4250 2450 4350 2550
Entry Wire Line
	4250 2550 4350 2650
Entry Wire Line
	4250 2650 4350 2750
Entry Wire Line
	4250 2750 4350 2850
Entry Wire Line
	4250 2850 4350 2950
Entry Wire Line
	4250 2950 4350 3050
Entry Wire Line
	4250 3050 4350 3150
Entry Wire Line
	4250 4350 4350 4250
Entry Wire Line
	4250 4450 4350 4350
Entry Wire Line
	4250 4550 4350 4450
Entry Wire Line
	4250 4650 4350 4550
Entry Wire Line
	4250 4750 4350 4650
Entry Wire Line
	4250 4850 4350 4750
Entry Wire Line
	4250 4950 4350 4850
Entry Wire Line
	4250 5050 4350 4950
Entry Wire Line
	4250 5150 4350 5050
Entry Wire Line
	4250 5250 4350 5150
Entry Wire Line
	4250 5350 4350 5250
Entry Wire Line
	4250 5450 4350 5350
Entry Wire Line
	4250 5550 4350 5450
Entry Wire Line
	4250 5650 4350 5550
Entry Wire Line
	4250 5750 4350 5650
Entry Wire Line
	4250 5850 4350 5750
Entry Wire Line
	5500 1750 5400 1850
Entry Wire Line
	5500 1850 5400 1950
Entry Wire Line
	5500 1950 5400 2050
Entry Wire Line
	5500 2050 5400 2150
Entry Wire Line
	5500 2150 5400 2250
Entry Wire Line
	5500 2250 5400 2350
Entry Wire Line
	5500 2350 5400 2450
Entry Wire Line
	5500 2450 5400 2550
Entry Wire Line
	5500 2550 5400 2650
Entry Wire Line
	5500 2650 5400 2750
Entry Wire Line
	5500 2750 5400 2850
Entry Wire Line
	5500 2850 5400 2950
Entry Wire Line
	5500 2950 5400 3050
Entry Wire Line
	5500 3050 5400 3150
Entry Wire Line
	5500 3150 5400 3250
Entry Wire Line
	5500 3250 5400 3350
Entry Wire Line
	6600 1900 6700 1800
Entry Wire Line
	6600 2000 6700 1900
Entry Wire Line
	6600 2200 6700 2100
Entry Wire Line
	6600 2300 6700 2200
Entry Wire Line
	6600 2500 6700 2400
Entry Wire Line
	6600 2600 6700 2500
Entry Wire Line
	6600 2800 6700 2700
Entry Wire Line
	6600 2900 6700 2800
Entry Wire Line
	6600 4250 6700 4350
Entry Wire Line
	6600 4350 6700 4450
Entry Wire Line
	6600 4550 6700 4650
Entry Wire Line
	6600 4650 6700 4750
Entry Wire Line
	6600 4850 6700 4950
Entry Wire Line
	6600 4950 6700 5050
Entry Wire Line
	6600 5150 6700 5250
Entry Wire Line
	6600 5250 6700 5350
Entry Wire Line
	8400 1800 8500 1700
Entry Wire Line
	8400 2100 8500 2000
Entry Wire Line
	8400 2400 8500 2300
Entry Wire Line
	8400 2700 8500 2600
Entry Wire Line
	8400 4350 8500 4250
Entry Wire Line
	8400 4650 8500 4550
Entry Wire Line
	8400 4950 8500 4850
Entry Wire Line
	8400 5250 8500 5150
Entry Wire Line
	8500 5550 8600 5650
Entry Wire Line
	8500 5650 8600 5750
Entry Wire Line
	8500 5750 8600 5850
Entry Wire Line
	8500 5850 8600 5950
Entry Wire Line
	8500 5950 8600 6050
Entry Wire Line
	8500 6050 8600 6150
Entry Wire Line
	8500 6150 8600 6250
Entry Wire Line
	8500 6250 8600 6350
Wire Wire Line
	1050 6550 850  6550
Wire Wire Line
	1700 3550 1700 3650
Wire Wire Line
	1700 3650 1350 3650
Wire Wire Line
	1700 3650 1700 3750
Wire Wire Line
	1700 3950 1700 4050
Wire Wire Line
	1700 4050 1350 4050
Wire Wire Line
	1700 4050 1700 4150
Wire Wire Line
	2000 3750 2150 3750
Wire Wire Line
	2000 3950 2050 3950
Wire Wire Line
	2000 4150 2150 4150
Wire Wire Line
	2050 3550 2000 3550
Wire Wire Line
	2050 3950 2050 3550
Wire Wire Line
	2150 3750 2150 3950
Wire Wire Line
	2150 3950 2150 4150
Wire Wire Line
	2500 3950 2150 3950
Wire Wire Line
	2650 3550 3050 3550
Wire Wire Line
	2650 6350 3050 6350
Wire Wire Line
	2700 1550 3050 1550
Wire Wire Line
	2700 1650 3050 1650
Wire Wire Line
	2700 1750 3050 1750
Wire Wire Line
	2700 1850 3050 1850
Wire Wire Line
	2700 1950 3050 1950
Wire Wire Line
	2700 2050 3050 2050
Wire Wire Line
	2700 2150 3050 2150
Wire Wire Line
	2700 2250 3050 2250
Wire Wire Line
	2700 2350 3050 2350
Wire Wire Line
	2700 2450 3050 2450
Wire Wire Line
	2700 2550 3050 2550
Wire Wire Line
	2700 2650 3050 2650
Wire Wire Line
	2700 2750 3050 2750
Wire Wire Line
	2700 2850 3050 2850
Wire Wire Line
	2700 2950 3050 2950
Wire Wire Line
	2700 3050 3050 3050
Wire Wire Line
	2700 3150 3050 3150
Wire Wire Line
	2700 3250 3050 3250
Wire Wire Line
	2700 3350 3050 3350
Wire Wire Line
	2700 3450 3050 3450
Wire Wire Line
	2700 4350 3050 4350
Wire Wire Line
	2700 4450 3050 4450
Wire Wire Line
	2700 4550 3050 4550
Wire Wire Line
	2700 4650 3050 4650
Wire Wire Line
	2700 4750 3050 4750
Wire Wire Line
	2700 4850 3050 4850
Wire Wire Line
	2700 4950 3050 4950
Wire Wire Line
	2700 5050 3050 5050
Wire Wire Line
	2700 5150 3050 5150
Wire Wire Line
	2700 5250 3050 5250
Wire Wire Line
	2700 5350 3050 5350
Wire Wire Line
	2700 5450 3050 5450
Wire Wire Line
	2700 5550 3050 5550
Wire Wire Line
	2700 5650 3050 5650
Wire Wire Line
	2700 5750 3050 5750
Wire Wire Line
	2700 5850 3050 5850
Wire Wire Line
	2700 5950 3050 5950
Wire Wire Line
	2700 6050 3050 6050
Wire Wire Line
	2700 6150 3050 6150
Wire Wire Line
	2700 6250 3050 6250
Wire Wire Line
	2700 6800 5200 6800
Wire Wire Line
	3400 3750 3500 3750
Wire Wire Line
	3400 6550 3500 6550
Wire Wire Line
	3500 6550 3950 6550
Wire Wire Line
	3600 1350 3450 1350
Wire Wire Line
	3600 4150 3450 4150
Wire Wire Line
	3850 1550 4250 1550
Wire Wire Line
	3850 1650 4250 1650
Wire Wire Line
	3850 1750 4250 1750
Wire Wire Line
	3850 1850 4250 1850
Wire Wire Line
	3850 1950 4250 1950
Wire Wire Line
	3850 2050 4250 2050
Wire Wire Line
	3850 2150 4250 2150
Wire Wire Line
	3850 2250 4250 2250
Wire Wire Line
	3850 2350 4250 2350
Wire Wire Line
	3850 2450 4250 2450
Wire Wire Line
	3850 2550 4250 2550
Wire Wire Line
	3850 2650 4250 2650
Wire Wire Line
	3850 2750 4250 2750
Wire Wire Line
	3850 2850 4250 2850
Wire Wire Line
	3850 2950 4250 2950
Wire Wire Line
	3850 3050 4250 3050
Wire Wire Line
	3850 3300 4050 3300
Wire Wire Line
	3850 3400 4000 3400
Wire Wire Line
	3850 4350 4250 4350
Wire Wire Line
	3850 4450 4250 4450
Wire Wire Line
	3850 4550 4250 4550
Wire Wire Line
	3850 4650 4250 4650
Wire Wire Line
	3850 4750 4250 4750
Wire Wire Line
	3850 4850 4250 4850
Wire Wire Line
	3850 4950 4250 4950
Wire Wire Line
	3850 5050 4250 5050
Wire Wire Line
	3850 5150 4250 5150
Wire Wire Line
	3850 5250 4250 5250
Wire Wire Line
	3850 5350 4250 5350
Wire Wire Line
	3850 5450 4250 5450
Wire Wire Line
	3850 5550 4250 5550
Wire Wire Line
	3850 5650 4250 5650
Wire Wire Line
	3850 5750 4250 5750
Wire Wire Line
	3850 5850 4250 5850
Wire Wire Line
	3950 6200 3850 6200
Wire Wire Line
	3950 6550 3950 6200
Wire Wire Line
	4000 3400 4000 3750
Wire Wire Line
	4000 3750 3500 3750
Wire Wire Line
	4050 6100 3850 6100
Wire Wire Line
	5200 5550 7100 5550
Wire Wire Line
	5200 6800 5200 5550
Wire Wire Line
	5500 1750 5750 1750
Wire Wire Line
	5500 1850 5750 1850
Wire Wire Line
	5500 1950 5750 1950
Wire Wire Line
	5500 2050 5750 2050
Wire Wire Line
	5500 2150 5750 2150
Wire Wire Line
	5500 2250 5750 2250
Wire Wire Line
	5500 2350 5750 2350
Wire Wire Line
	5500 2450 5750 2450
Wire Wire Line
	5500 2550 5750 2550
Wire Wire Line
	5500 2650 5750 2650
Wire Wire Line
	5500 2750 5750 2750
Wire Wire Line
	5500 2850 5750 2850
Wire Wire Line
	5500 2950 5750 2950
Wire Wire Line
	5500 3050 5750 3050
Wire Wire Line
	5500 3150 5750 3150
Wire Wire Line
	5500 3250 5750 3250
Wire Wire Line
	5750 5850 5900 5850
Wire Wire Line
	5900 5850 5900 6350
Wire Wire Line
	5900 5850 6100 5850
Wire Wire Line
	6000 6350 5900 6350
Wire Wire Line
	6200 6350 6300 6350
Wire Wire Line
	6700 1800 7100 1800
Wire Wire Line
	6700 1900 7100 1900
Wire Wire Line
	6700 2100 7100 2100
Wire Wire Line
	6700 2200 7100 2200
Wire Wire Line
	6700 2400 7100 2400
Wire Wire Line
	6700 2500 7100 2500
Wire Wire Line
	6700 2700 7100 2700
Wire Wire Line
	6700 2800 7100 2800
Wire Wire Line
	6700 3000 7100 3000
Wire Wire Line
	6700 3100 7100 3100
Wire Wire Line
	6700 4350 7100 4350
Wire Wire Line
	6700 4450 7100 4450
Wire Wire Line
	6700 4650 7100 4650
Wire Wire Line
	6700 4750 7100 4750
Wire Wire Line
	6700 4950 7100 4950
Wire Wire Line
	6700 5050 7100 5050
Wire Wire Line
	6700 5250 7100 5250
Wire Wire Line
	6700 5350 7100 5350
Wire Wire Line
	6700 5850 7100 5850
Wire Wire Line
	7100 5650 7100 5850
Wire Wire Line
	7750 1500 7600 1500
Wire Wire Line
	7750 4050 7600 4050
Wire Wire Line
	8100 1800 8400 1800
Wire Wire Line
	8100 2100 8400 2100
Wire Wire Line
	8100 2400 8400 2400
Wire Wire Line
	8100 2700 8400 2700
Wire Wire Line
	8100 4350 8400 4350
Wire Wire Line
	8100 4650 8400 4650
Wire Wire Line
	8100 4950 8400 4950
Wire Wire Line
	8100 5250 8400 5250
Wire Wire Line
	8600 5650 8900 5650
Wire Wire Line
	8600 5750 8900 5750
Wire Wire Line
	8600 5850 8900 5850
Wire Wire Line
	8600 5950 8900 5950
Wire Wire Line
	8600 6050 8900 6050
Wire Wire Line
	8600 6150 8900 6150
Wire Wire Line
	8600 6250 8900 6250
Wire Wire Line
	8600 6350 8900 6350
Wire Bus Line
	2600 1200 2450 1200
Wire Bus Line
	2600 1200 2600 1550
Wire Bus Line
	2600 1550 2600 1750
Wire Bus Line
	2600 1750 2600 1950
Wire Bus Line
	2600 1950 2600 2050
Wire Bus Line
	2600 2050 2600 2250
Wire Bus Line
	2600 2250 2600 2450
Wire Bus Line
	2600 2450 2600 2650
Wire Bus Line
	2600 2650 2600 2750
Wire Bus Line
	2600 2750 2600 2950
Wire Bus Line
	2600 2950 2600 3150
Wire Bus Line
	2600 3150 2600 3350
Wire Bus Line
	2600 3350 2600 4250
Wire Bus Line
	2600 4250 2600 4450
Wire Bus Line
	2600 4450 2600 4650
Wire Bus Line
	2600 4650 2600 4750
Wire Bus Line
	2600 4750 2600 4950
Wire Bus Line
	2600 4950 2600 5150
Wire Bus Line
	2600 5150 2600 5250
Wire Bus Line
	2600 5250 2600 5450
Wire Bus Line
	2600 5450 2600 5650
Wire Bus Line
	2600 5650 2600 5850
Wire Bus Line
	2600 5850 2600 6050
Wire Bus Line
	2600 6050 2600 6700
Wire Bus Line
	4350 1650 4350 1850
Wire Bus Line
	4350 1850 4350 2050
Wire Bus Line
	4350 2050 4350 2250
Wire Bus Line
	4350 2250 4350 2450
Wire Bus Line
	4350 2450 4350 2550
Wire Bus Line
	4350 2550 4350 2750
Wire Bus Line
	4350 2750 4350 2950
Wire Bus Line
	4350 2950 4350 3150
Wire Bus Line
	4350 3150 4350 3700
Wire Bus Line
	4350 3700 4350 4350
Wire Bus Line
	4350 3700 5400 3700
Wire Bus Line
	4350 4350 4350 4450
Wire Bus Line
	4350 4450 4350 4650
Wire Bus Line
	4350 4650 4350 4850
Wire Bus Line
	4350 4850 4350 5050
Wire Bus Line
	4350 5050 4350 5250
Wire Bus Line
	4350 5250 4350 5450
Wire Bus Line
	4350 5450 4350 5550
Wire Bus Line
	4350 5550 4350 5750
Wire Bus Line
	5400 1850 5400 2050
Wire Bus Line
	5400 2050 5400 2150
Wire Bus Line
	5400 2150 5400 2350
Wire Bus Line
	5400 2350 5400 2550
Wire Bus Line
	5400 2550 5400 2650
Wire Bus Line
	5400 2650 5400 2850
Wire Bus Line
	5400 2850 5400 3050
Wire Bus Line
	5400 3050 5400 3250
Wire Bus Line
	5400 3250 5400 3700
Wire Bus Line
	5400 3700 6600 3700
Wire Bus Line
	6600 1900 6600 2000
Wire Bus Line
	6600 2000 6600 2300
Wire Bus Line
	6600 2300 6600 2600
Wire Bus Line
	6600 2600 6600 2900
Wire Bus Line
	6600 2900 6600 3700
Wire Bus Line
	6600 3700 6600 4350
Wire Bus Line
	6600 4350 6600 4650
Wire Bus Line
	6600 4650 6600 4950
Wire Bus Line
	6600 4950 6600 5250
Wire Bus Line
	8500 1200 8500 2000
Wire Bus Line
	8500 1200 9050 1200
Wire Bus Line
	8500 2000 8500 2600
Wire Bus Line
	8500 2600 8500 4250
Wire Bus Line
	8500 4250 8500 4850
Wire Bus Line
	8500 4850 8500 5550
Wire Bus Line
	8500 5550 8500 5750
Wire Bus Line
	8500 5750 8500 5950
Wire Bus Line
	8500 5950 8500 6150
Wire Bus Line
	8500 6150 8500 6250
Text Label 1350 3650 0    50   ~ 0
R11-A21
Text Label 1350 4050 0    50   ~ 0
R12-A21
Text Label 2400 3950 2    50   ~ 0
A21
Text Label 2600 1250 0    50   ~ 0
A[0..21]
Text Label 2650 3550 0    50   ~ 0
R11-A21
Text Label 2650 6350 0    50   ~ 0
R12-A21
Text Label 2800 1550 0    50   ~ 0
A1
Text Label 2800 1650 0    50   ~ 0
A2
Text Label 2800 1750 0    50   ~ 0
A3
Text Label 2800 1850 0    50   ~ 0
A4
Text Label 2800 1950 0    50   ~ 0
A5
Text Label 2800 2050 0    50   ~ 0
A6
Text Label 2800 2150 0    50   ~ 0
A7
Text Label 2800 2250 0    50   ~ 0
A8
Text Label 2800 2350 0    50   ~ 0
A9
Text Label 2800 2450 0    50   ~ 0
A10
Text Label 2800 2550 0    50   ~ 0
A11
Text Label 2800 2650 0    50   ~ 0
A12
Text Label 2800 2750 0    50   ~ 0
A13
Text Label 2800 2850 0    50   ~ 0
A14
Text Label 2800 2950 0    50   ~ 0
A15
Text Label 2800 3050 0    50   ~ 0
A16
Text Label 2800 3150 0    50   ~ 0
A17
Text Label 2800 3250 0    50   ~ 0
A18
Text Label 2800 3350 0    50   ~ 0
A19
Text Label 2800 3450 0    50   ~ 0
A20
Text Label 2800 4350 0    50   ~ 0
A1
Text Label 2800 4450 0    50   ~ 0
A2
Text Label 2800 4550 0    50   ~ 0
A3
Text Label 2800 4650 0    50   ~ 0
A4
Text Label 2800 4750 0    50   ~ 0
A5
Text Label 2800 4850 0    50   ~ 0
A6
Text Label 2800 4950 0    50   ~ 0
A7
Text Label 2800 5050 0    50   ~ 0
A8
Text Label 2800 5150 0    50   ~ 0
A9
Text Label 2800 5250 0    50   ~ 0
A10
Text Label 2800 5350 0    50   ~ 0
A11
Text Label 2800 5450 0    50   ~ 0
A12
Text Label 2800 5550 0    50   ~ 0
A13
Text Label 2800 5650 0    50   ~ 0
A14
Text Label 2800 5750 0    50   ~ 0
A15
Text Label 2800 5850 0    50   ~ 0
A16
Text Label 2800 5950 0    50   ~ 0
A17
Text Label 2800 6050 0    50   ~ 0
A18
Text Label 2800 6150 0    50   ~ 0
A19
Text Label 2800 6250 0    50   ~ 0
A20
Text Label 2800 6800 0    50   ~ 0
A0
Text Label 3950 1550 0    50   ~ 0
D0
Text Label 3950 1650 0    50   ~ 0
D1
Text Label 3950 1750 0    50   ~ 0
D2
Text Label 3950 1850 0    50   ~ 0
D3
Text Label 3950 1950 0    50   ~ 0
D4
Text Label 3950 2050 0    50   ~ 0
D5
Text Label 3950 2150 0    50   ~ 0
D6
Text Label 3950 2250 0    50   ~ 0
D7
Text Label 3950 2350 0    50   ~ 0
D8
Text Label 3950 2450 0    50   ~ 0
D9
Text Label 3950 2550 0    50   ~ 0
D10
Text Label 3950 2650 0    50   ~ 0
D11
Text Label 3950 2750 0    50   ~ 0
D12
Text Label 3950 2850 0    50   ~ 0
D13
Text Label 3950 2950 0    50   ~ 0
D14
Text Label 3950 3050 0    50   ~ 0
D15
Text Label 3950 4350 0    50   ~ 0
D0
Text Label 3950 4450 0    50   ~ 0
D1
Text Label 3950 4550 0    50   ~ 0
D2
Text Label 3950 4650 0    50   ~ 0
D3
Text Label 3950 4750 0    50   ~ 0
D4
Text Label 3950 4850 0    50   ~ 0
D5
Text Label 3950 4950 0    50   ~ 0
D6
Text Label 3950 5050 0    50   ~ 0
D7
Text Label 3950 5150 0    50   ~ 0
D8
Text Label 3950 5250 0    50   ~ 0
D9
Text Label 3950 5350 0    50   ~ 0
D10
Text Label 3950 5450 0    50   ~ 0
D11
Text Label 3950 5550 0    50   ~ 0
D12
Text Label 3950 5650 0    50   ~ 0
D13
Text Label 3950 5750 0    50   ~ 0
D14
Text Label 3950 5850 0    50   ~ 0
D15
Text Label 5550 1750 0    50   ~ 0
D0
Text Label 5550 1850 0    50   ~ 0
D1
Text Label 5550 1950 0    50   ~ 0
D2
Text Label 5550 2050 0    50   ~ 0
D3
Text Label 5550 2150 0    50   ~ 0
D4
Text Label 5550 2250 0    50   ~ 0
D5
Text Label 5550 2350 0    50   ~ 0
D6
Text Label 5550 2450 0    50   ~ 0
D7
Text Label 5550 2550 0    50   ~ 0
D8
Text Label 5550 2650 0    50   ~ 0
D9
Text Label 5550 2750 0    50   ~ 0
D10
Text Label 5550 2850 0    50   ~ 0
D11
Text Label 5550 2950 0    50   ~ 0
D12
Text Label 5550 3050 0    50   ~ 0
D13
Text Label 5550 3150 0    50   ~ 0
D14
Text Label 5550 3250 0    50   ~ 0
D15
Text Label 6750 3100 0    50   ~ 0
~OUT-E
Text Label 6750 5850 0    50   ~ 0
~OUT-E
Text Label 6800 1800 0    50   ~ 0
D15
Text Label 6800 1900 0    50   ~ 0
D7
Text Label 6800 2100 0    50   ~ 0
D14
Text Label 6800 2200 0    50   ~ 0
D6
Text Label 6800 2400 0    50   ~ 0
D13
Text Label 6800 2500 0    50   ~ 0
D5
Text Label 6800 2700 0    50   ~ 0
D12
Text Label 6800 2800 0    50   ~ 0
D4
Text Label 6800 3000 0    50   ~ 0
A0
Text Label 6800 4350 0    50   ~ 0
D11
Text Label 6800 4450 0    50   ~ 0
D3
Text Label 6800 4650 0    50   ~ 0
D10
Text Label 6800 4750 0    50   ~ 0
D2
Text Label 6800 4950 0    50   ~ 0
D9
Text Label 6800 5050 0    50   ~ 0
D1
Text Label 6800 5250 0    50   ~ 0
D8
Text Label 6800 5350 0    50   ~ 0
D0
Text Label 8150 1800 0    50   ~ 0
OUT7
Text Label 8150 2100 0    50   ~ 0
OUT6
Text Label 8150 2400 0    50   ~ 0
OUT5
Text Label 8150 2700 0    50   ~ 0
OUT4
Text Label 8150 4350 0    50   ~ 0
OUT3
Text Label 8150 4650 0    50   ~ 0
OUT2
Text Label 8150 4950 0    50   ~ 0
OUT1
Text Label 8150 5250 0    50   ~ 0
OUT0
Text Label 8650 5650 0    50   ~ 0
OUT0
Text Label 8650 5750 0    50   ~ 0
OUT1
Text Label 8650 5850 0    50   ~ 0
OUT2
Text Label 8650 5950 0    50   ~ 0
OUT3
Text Label 8650 6050 0    50   ~ 0
OUT4
Text Label 8650 6150 0    50   ~ 0
OUT5
Text Label 8650 6250 0    50   ~ 0
OUT6
Text Label 8650 6350 0    50   ~ 0
OUT7
Text HLabel 2450 1200 0    50   Input ~ 0
ADDR[0..21]
Text HLabel 4050 3300 2    50   Input ~ 0
~E11
Text HLabel 4050 6100 2    50   Input ~ 0
~E12
Text HLabel 5750 5850 0    50   Input ~ 0
ENABLE
Text HLabel 9050 1200 2    50   Output ~ 0
OUT[0..7]
$Comp
L power:VCC #PWR?
U 1 1 63DD2C32
P 850 6550
AR Path="/5E05893C/63DD2C32" Ref="#PWR?"  Part="1" 
AR Path="/62E08D9B/63DD2C32" Ref="#PWR0242"  Part="1" 
F 0 "#PWR0242" H 850 6400 50  0001 C CNN
F 1 "VCC" H 867 6723 50  0000 C CNN
F 2 "" H 850 6550 50  0001 C CNN
F 3 "" H 850 6550 50  0001 C CNN
	1    850  6550
	1    0    0    -1  
$EndComp
$Comp
L power:VCC #PWR0237
U 1 1 62E88338
P 2050 3550
F 0 "#PWR0237" H 2050 3400 50  0001 C CNN
F 1 "VCC" V 2050 3750 50  0000 C CNN
F 2 "" H 2050 3550 50  0001 C CNN
F 3 "" H 2050 3550 50  0001 C CNN
	1    2050 3550
	-1   0    0    -1  
$EndComp
$Comp
L power:VCC #PWR?
U 1 1 62E0A005
P 3450 1350
AR Path="/5E05893C/62E0A005" Ref="#PWR?"  Part="1" 
AR Path="/62E08D9B/62E0A005" Ref="#PWR0232"  Part="1" 
F 0 "#PWR0232" H 3450 1200 50  0001 C CNN
F 1 "VCC" H 3467 1523 50  0000 C CNN
F 2 "" H 3450 1350 50  0001 C CNN
F 3 "" H 3450 1350 50  0001 C CNN
	1    3450 1350
	1    0    0    -1  
$EndComp
$Comp
L power:VCC #PWR?
U 1 1 62E0A029
P 3450 4150
AR Path="/5E05893C/62E0A029" Ref="#PWR?"  Part="1" 
AR Path="/62E08D9B/62E0A029" Ref="#PWR0235"  Part="1" 
F 0 "#PWR0235" H 3450 4000 50  0001 C CNN
F 1 "VCC" H 3467 4323 50  0000 C CNN
F 2 "" H 3450 4150 50  0001 C CNN
F 3 "" H 3450 4150 50  0001 C CNN
	1    3450 4150
	1    0    0    -1  
$EndComp
$Comp
L power:VCC #PWR?
U 1 1 5E4F5C9B
P 6150 1750
AR Path="/5E05893C/5E4F5C9B" Ref="#PWR?"  Part="1" 
AR Path="/62E08D9B/5E4F5C9B" Ref="#PWR024"  Part="1" 
F 0 "#PWR024" H 6150 1600 50  0001 C CNN
F 1 "VCC" H 6167 1923 50  0000 C CNN
F 2 "" H 6150 1750 50  0001 C CNN
F 3 "" H 6150 1750 50  0001 C CNN
	1    6150 1750
	1    0    0    -1  
$EndComp
$Comp
L power:VCC #PWR?
U 1 1 5E4C8A2D
P 6150 2550
AR Path="/5E05893C/5E4C8A2D" Ref="#PWR?"  Part="1" 
AR Path="/62E08D9B/5E4C8A2D" Ref="#PWR025"  Part="1" 
F 0 "#PWR025" H 6150 2400 50  0001 C CNN
F 1 "VCC" H 6167 2723 50  0000 C CNN
F 2 "" H 6150 2550 50  0001 C CNN
F 3 "" H 6150 2550 50  0001 C CNN
	1    6150 2550
	1    0    0    -1  
$EndComp
$Comp
L power:VCC #PWR?
U 1 1 5E5D152B
P 6300 6350
AR Path="/5E05893C/5E5D152B" Ref="#PWR?"  Part="1" 
AR Path="/62E08D9B/5E5D152B" Ref="#PWR026"  Part="1" 
F 0 "#PWR026" H 6300 6200 50  0001 C CNN
F 1 "VCC" H 6317 6523 50  0000 C CNN
F 2 "" H 6300 6350 50  0001 C CNN
F 3 "" H 6300 6350 50  0001 C CNN
	1    6300 6350
	1    0    0    -1  
$EndComp
$Comp
L power:VCC #PWR?
U 1 1 63D07AD9
P 7600 1500
AR Path="/5E05893C/63D07AD9" Ref="#PWR?"  Part="1" 
AR Path="/62E08D9B/63D07AD9" Ref="#PWR0241"  Part="1" 
F 0 "#PWR0241" H 7600 1350 50  0001 C CNN
F 1 "VCC" H 7617 1673 50  0000 C CNN
F 2 "" H 7600 1500 50  0001 C CNN
F 3 "" H 7600 1500 50  0001 C CNN
	1    7600 1500
	1    0    0    -1  
$EndComp
$Comp
L power:VCC #PWR?
U 1 1 63D01A93
P 7600 4050
AR Path="/5E05893C/63D01A93" Ref="#PWR?"  Part="1" 
AR Path="/62E08D9B/63D01A93" Ref="#PWR0240"  Part="1" 
F 0 "#PWR0240" H 7600 3900 50  0001 C CNN
F 1 "VCC" H 7617 4223 50  0000 C CNN
F 2 "" H 7600 4050 50  0001 C CNN
F 3 "" H 7600 4050 50  0001 C CNN
	1    7600 4050
	1    0    0    -1  
$EndComp
$Comp
L power:VCC #PWR?
U 1 1 646BC533
P 9300 5650
AR Path="/5E05893C/646BC533" Ref="#PWR?"  Part="1" 
AR Path="/62E08D9B/646BC533" Ref="#PWR0247"  Part="1" 
F 0 "#PWR0247" H 9300 5500 50  0001 C CNN
F 1 "VCC" H 9317 5823 50  0000 C CNN
F 2 "" H 9300 5650 50  0001 C CNN
F 3 "" H 9300 5650 50  0001 C CNN
	1    9300 5650
	1    0    0    -1  
$EndComp
$Comp
L power:GND #PWR?
U 1 1 63DDA0B2
P 850 7550
AR Path="/5D957A6E/63DDA0B2" Ref="#PWR?"  Part="1" 
AR Path="/5E05893C/63DDA0B2" Ref="#PWR?"  Part="1" 
AR Path="/62E08D9B/63DDA0B2" Ref="#PWR0243"  Part="1" 
F 0 "#PWR0243" H 850 7300 50  0001 C CNN
F 1 "GND" H 855 7377 50  0001 C CNN
F 2 "" H 850 7550 50  0001 C CNN
F 3 "" H 850 7550 50  0001 C CNN
	1    850  7550
	1    0    0    -1  
$EndComp
$Comp
L power:GND #PWR?
U 1 1 6404B00A
P 1250 6550
AR Path="/5D957A6E/6404B00A" Ref="#PWR?"  Part="1" 
AR Path="/5E05893C/6404B00A" Ref="#PWR?"  Part="1" 
AR Path="/62E08D9B/6404B00A" Ref="#PWR0246"  Part="1" 
F 0 "#PWR0246" H 1250 6300 50  0001 C CNN
F 1 "GND" H 1255 6377 50  0001 C CNN
F 2 "" H 1250 6550 50  0001 C CNN
F 3 "" H 1250 6550 50  0001 C CNN
	1    1250 6550
	1    0    0    -1  
$EndComp
$Comp
L power:GND #PWR?
U 1 1 62E0A00C
P 3500 3750
AR Path="/5D957A6E/62E0A00C" Ref="#PWR?"  Part="1" 
AR Path="/5E05893C/62E0A00C" Ref="#PWR?"  Part="1" 
AR Path="/62E08D9B/62E0A00C" Ref="#PWR0233"  Part="1" 
F 0 "#PWR0233" H 3500 3500 50  0001 C CNN
F 1 "GND" H 3505 3577 50  0001 C CNN
F 2 "" H 3500 3750 50  0001 C CNN
F 3 "" H 3500 3750 50  0001 C CNN
	1    3500 3750
	1    0    0    -1  
$EndComp
$Comp
L power:GND #PWR?
U 1 1 62E0A030
P 3500 6550
AR Path="/5D957A6E/62E0A030" Ref="#PWR?"  Part="1" 
AR Path="/5E05893C/62E0A030" Ref="#PWR?"  Part="1" 
AR Path="/62E08D9B/62E0A030" Ref="#PWR0236"  Part="1" 
F 0 "#PWR0236" H 3500 6300 50  0001 C CNN
F 1 "GND" H 3505 6377 50  0001 C CNN
F 2 "" H 3500 6550 50  0001 C CNN
F 3 "" H 3500 6550 50  0001 C CNN
	1    3500 6550
	1    0    0    -1  
$EndComp
$Comp
L power:GND #PWR?
U 1 1 62E09FFE
P 3800 1350
AR Path="/5D957A6E/62E09FFE" Ref="#PWR?"  Part="1" 
AR Path="/5E05893C/62E09FFE" Ref="#PWR?"  Part="1" 
AR Path="/62E08D9B/62E09FFE" Ref="#PWR0231"  Part="1" 
F 0 "#PWR0231" H 3800 1100 50  0001 C CNN
F 1 "GND" H 3805 1177 50  0001 C CNN
F 2 "" H 3800 1350 50  0001 C CNN
F 3 "" H 3800 1350 50  0001 C CNN
	1    3800 1350
	1    0    0    -1  
$EndComp
$Comp
L power:GND #PWR?
U 1 1 62E0A022
P 3800 4150
AR Path="/5D957A6E/62E0A022" Ref="#PWR?"  Part="1" 
AR Path="/5E05893C/62E0A022" Ref="#PWR?"  Part="1" 
AR Path="/62E08D9B/62E0A022" Ref="#PWR0234"  Part="1" 
F 0 "#PWR0234" H 3800 3900 50  0001 C CNN
F 1 "GND" H 3805 3977 50  0001 C CNN
F 2 "" H 3800 4150 50  0001 C CNN
F 3 "" H 3800 4150 50  0001 C CNN
	1    3800 4150
	1    0    0    -1  
$EndComp
$Comp
L power:GND #PWR?
U 1 1 63CFBA34
P 7600 3400
AR Path="/5D957A6E/63CFBA34" Ref="#PWR?"  Part="1" 
AR Path="/5E05893C/63CFBA34" Ref="#PWR?"  Part="1" 
AR Path="/62E08D9B/63CFBA34" Ref="#PWR0239"  Part="1" 
F 0 "#PWR0239" H 7600 3150 50  0001 C CNN
F 1 "GND" H 7605 3227 50  0001 C CNN
F 2 "" H 7600 3400 50  0001 C CNN
F 3 "" H 7600 3400 50  0001 C CNN
	1    7600 3400
	1    0    0    -1  
$EndComp
$Comp
L power:GND #PWR?
U 1 1 63CFBA06
P 7600 5950
AR Path="/5D957A6E/63CFBA06" Ref="#PWR?"  Part="1" 
AR Path="/5E05893C/63CFBA06" Ref="#PWR?"  Part="1" 
AR Path="/62E08D9B/63CFBA06" Ref="#PWR0238"  Part="1" 
F 0 "#PWR0238" H 7600 5700 50  0001 C CNN
F 1 "GND" H 7605 5777 50  0001 C CNN
F 2 "" H 7600 5950 50  0001 C CNN
F 3 "" H 7600 5950 50  0001 C CNN
	1    7600 5950
	1    0    0    -1  
$EndComp
$Comp
L power:GND #PWR?
U 1 1 63DF0395
P 7950 1500
AR Path="/5D957A6E/63DF0395" Ref="#PWR?"  Part="1" 
AR Path="/5E05893C/63DF0395" Ref="#PWR?"  Part="1" 
AR Path="/62E08D9B/63DF0395" Ref="#PWR0244"  Part="1" 
F 0 "#PWR0244" H 7950 1250 50  0001 C CNN
F 1 "GND" H 7955 1327 50  0001 C CNN
F 2 "" H 7950 1500 50  0001 C CNN
F 3 "" H 7950 1500 50  0001 C CNN
	1    7950 1500
	1    0    0    -1  
$EndComp
$Comp
L power:GND #PWR?
U 1 1 63DF7C9A
P 7950 4050
AR Path="/5D957A6E/63DF7C9A" Ref="#PWR?"  Part="1" 
AR Path="/5E05893C/63DF7C9A" Ref="#PWR?"  Part="1" 
AR Path="/62E08D9B/63DF7C9A" Ref="#PWR0245"  Part="1" 
F 0 "#PWR0245" H 7950 3800 50  0001 C CNN
F 1 "GND" H 7955 3877 50  0001 C CNN
F 2 "" H 7950 4050 50  0001 C CNN
F 3 "" H 7950 4050 50  0001 C CNN
	1    7950 4050
	1    0    0    -1  
$EndComp
$Comp
L Device:R_Small R5
U 1 1 5E5D1336
P 6100 6350
F 0 "R5" V 6296 6350 50  0000 C CNN
F 1 "4.7k" V 6205 6350 50  0000 C CNN
F 2 "" H 6100 6350 50  0001 C CNN
F 3 "~" H 6100 6350 50  0001 C CNN
	1    6100 6350
	0    -1   -1   0   
$EndComp
$Comp
L Device:C_Small CX?
U 1 1 6404AFAF
P 1150 6550
AR Path="/5D957A6E/6404AFAF" Ref="CX?"  Part="1" 
AR Path="/5E05893C/6404AFAF" Ref="CX?"  Part="1" 
AR Path="/62E08D9B/6404AFAF" Ref="CX26"  Part="1" 
F 0 "CX26" V 921 6550 50  0001 C CNN
F 1 "0.1u" V 1012 6550 50  0000 C TNN
F 2 "" H 1150 6550 50  0001 C CNN
F 3 "~" H 1150 6550 50  0001 C CNN
	1    1150 6550
	0    1    1    0   
$EndComp
$Comp
L Device:C_Small CX?
U 1 1 62E09FF8
P 3700 1350
AR Path="/5D957A6E/62E09FF8" Ref="CX?"  Part="1" 
AR Path="/5E05893C/62E09FF8" Ref="CX?"  Part="1" 
AR Path="/62E08D9B/62E09FF8" Ref="CX27"  Part="1" 
F 0 "CX27" V 3471 1350 50  0001 C CNN
F 1 "0.1u" V 3562 1350 50  0000 C TNN
F 2 "" H 3700 1350 50  0001 C CNN
F 3 "~" H 3700 1350 50  0001 C CNN
	1    3700 1350
	0    1    1    0   
$EndComp
$Comp
L Device:C_Small CX?
U 1 1 62E0A01C
P 3700 4150
AR Path="/5D957A6E/62E0A01C" Ref="CX?"  Part="1" 
AR Path="/5E05893C/62E0A01C" Ref="CX?"  Part="1" 
AR Path="/62E08D9B/62E0A01C" Ref="CX28"  Part="1" 
F 0 "CX28" V 3471 4150 50  0001 C CNN
F 1 "0.1u" V 3562 4150 50  0000 C TNN
F 2 "" H 3700 4150 50  0001 C CNN
F 3 "~" H 3700 4150 50  0001 C CNN
	1    3700 4150
	0    1    1    0   
$EndComp
$Comp
L Device:C_Small CX?
U 1 1 63DF0376
P 7850 1500
AR Path="/5D957A6E/63DF0376" Ref="CX?"  Part="1" 
AR Path="/5E05893C/63DF0376" Ref="CX?"  Part="1" 
AR Path="/62E08D9B/63DF0376" Ref="CX29"  Part="1" 
F 0 "CX29" V 7621 1500 50  0001 C CNN
F 1 "0.1u" V 7712 1500 50  0000 C TNN
F 2 "" H 7850 1500 50  0001 C CNN
F 3 "~" H 7850 1500 50  0001 C CNN
	1    7850 1500
	0    1    1    0   
$EndComp
$Comp
L Device:C_Small CX?
U 1 1 63DF7C7B
P 7850 4050
AR Path="/5D957A6E/63DF7C7B" Ref="CX?"  Part="1" 
AR Path="/5E05893C/63DF7C7B" Ref="CX?"  Part="1" 
AR Path="/62E08D9B/63DF7C7B" Ref="CX30"  Part="1" 
F 0 "CX30" V 7621 4050 50  0001 C CNN
F 1 "0.1u" V 7712 4050 50  0000 C TNN
F 2 "" H 7850 4050 50  0001 C CNN
F 3 "~" H 7850 4050 50  0001 C CNN
	1    7850 4050
	0    1    1    0   
$EndComp
$Comp
L Jumper:SolderJumper_2_Open JP?
U 1 1 62E88323
P 1850 3550
AR Path="/5E05893C/62E88323" Ref="JP?"  Part="1" 
AR Path="/62E08D9B/62E88323" Ref="JP10"  Part="1" 
F 0 "JP10" H 1850 3450 50  0000 C CNN
F 1 "SolderJumper_2_Open" H 1850 3664 50  0001 C CNN
F 2 "" H 1850 3550 50  0001 C CNN
F 3 "~" H 1850 3550 50  0001 C CNN
	1    1850 3550
	-1   0    0    -1  
$EndComp
$Comp
L Jumper:SolderJumper_2_Bridged JP?
U 1 1 62E8831C
P 1850 3750
AR Path="/5E05893C/62E8831C" Ref="JP?"  Part="1" 
AR Path="/62E08D9B/62E8831C" Ref="JP11"  Part="1" 
F 0 "JP11" H 1850 3650 50  0000 C CNN
F 1 "SolderJumper_2_Bridged" H 1850 3864 50  0001 C CNN
F 2 "" H 1850 3750 50  0001 C CNN
F 3 "~" H 1850 3750 50  0001 C CNN
	1    1850 3750
	-1   0    0    -1  
$EndComp
$Comp
L Jumper:SolderJumper_2_Open JP?
U 1 1 62E88331
P 1850 3950
AR Path="/5E05893C/62E88331" Ref="JP?"  Part="1" 
AR Path="/62E08D9B/62E88331" Ref="JP12"  Part="1" 
F 0 "JP12" H 1850 3850 50  0000 C CNN
F 1 "SolderJumper_2_Open" H 1850 4064 50  0001 C CNN
F 2 "" H 1850 3950 50  0001 C CNN
F 3 "~" H 1850 3950 50  0001 C CNN
	1    1850 3950
	-1   0    0    -1  
$EndComp
$Comp
L Jumper:SolderJumper_2_Bridged JP?
U 1 1 62E8832A
P 1850 4150
AR Path="/5E05893C/62E8832A" Ref="JP?"  Part="1" 
AR Path="/62E08D9B/62E8832A" Ref="JP13"  Part="1" 
F 0 "JP13" H 1850 4050 50  0000 C CNN
F 1 "SolderJumper_2_Bridged" H 1850 4264 50  0001 C CNN
F 2 "" H 1850 4150 50  0001 C CNN
F 3 "~" H 1850 4150 50  0001 C CNN
	1    1850 4150
	-1   0    0    -1  
$EndComp
$Comp
L 74xx:74LS04 UC1
U 4 1 63C129A5
P 6400 5850
F 0 "UC1" H 6100 5750 50  0000 C CNN
F 1 "74LS04" H 6650 5750 50  0000 C CNN
F 2 "" H 6400 5850 50  0001 C CNN
F 3 "http://www.ti.com/lit/gpn/sn74LS04" H 6400 5850 50  0001 C CNN
	4    6400 5850
	1    0    0    -1  
$EndComp
$Comp
L Device:R_Network08 RA17
U 1 1 5E4F5C94
P 5950 2150
F 0 "RA17" V 5800 2400 50  0000 C CNN
F 1 "4.7k" V 5900 2400 50  0000 C CNN
F 2 "Resistor_THT:R_Array_SIP9" V 6425 2150 50  0001 C CNN
F 3 "http://www.vishay.com/docs/31509/csc.pdf" H 5950 2150 50  0001 C CNN
	1    5950 2150
	0    1    1    0   
$EndComp
$Comp
L Device:R_Network08 RA16
U 1 1 5E4C8A26
P 5950 2950
F 0 "RA16" V 5800 3200 50  0000 C CNN
F 1 "4.7k" V 5900 3200 50  0000 C CNN
F 2 "Resistor_THT:R_Array_SIP9" V 6425 2950 50  0001 C CNN
F 3 "http://www.vishay.com/docs/31509/csc.pdf" H 5950 2950 50  0001 C CNN
	1    5950 2950
	0    1    1    0   
$EndComp
$Comp
L Device:R_Network08 RA10
U 1 1 6466D0BC
P 9100 6050
F 0 "RA10" V 8483 6050 50  0000 C CNN
F 1 "4.7k" V 8574 6050 50  0000 C CNN
F 2 "Resistor_THT:R_Array_SIP9" V 9575 6050 50  0001 C CNN
F 3 "http://www.vishay.com/docs/31509/csc.pdf" H 9100 6050 50  0001 C CNN
	1    9100 6050
	0    1    1    0   
$EndComp
$Comp
L 74xx:74LS04 UC1
U 7 1 63C12B00
P 850 7050
F 0 "UC1" H 1080 7096 50  0000 L CNN
F 1 "74LS04" H 1080 7005 50  0000 L CNN
F 2 "" H 850 7050 50  0001 C CNN
F 3 "http://www.ti.com/lit/gpn/sn74LS04" H 850 7050 50  0001 C CNN
	7    850  7050
	1    0    0    -1  
$EndComp
$Comp
L 74xx:74LS257 UD1
U 1 1 63C05DC8
P 7600 2400
F 0 "UD1" H 7350 3150 50  0000 C CNN
F 1 "74LS257" H 7800 1550 50  0000 C CNN
F 2 "" H 7600 2400 50  0001 C CNN
F 3 "http://www.ti.com/lit/gpn/sn74LS257" H 7600 2400 50  0001 C CNN
	1    7600 2400
	1    0    0    -1  
$EndComp
$Comp
L 74xx:74LS257 UD2
U 1 1 63C05E7D
P 7600 4950
F 0 "UD2" H 7350 5700 50  0000 C CNN
F 1 "74LS257" H 7800 4100 50  0000 C CNN
F 2 "" H 7600 4950 50  0001 C CNN
F 3 "http://www.ti.com/lit/gpn/sn74LS257" H 7600 4950 50  0001 C CNN
	1    7600 4950
	1    0    0    -1  
$EndComp
$Comp
L CPS2-Custom:27C322 ROM?
U 1 1 62E09FF0
P 3450 2550
AR Path="/5E05893C/62E09FF0" Ref="ROM?"  Part="1" 
AR Path="/62E08D9B/62E09FF0" Ref="UE1-ROM11"  Part="1" 
F 0 "UE1-ROM11" H 3100 3700 50  0000 C CNN
F 1 "27C322" H 3700 1400 50  0000 C CNN
F 2 "Package_DIP:DIP-42_W15.24mm_Socket" H 3450 2550 50  0001 C CNN
F 3 "http://ww1.microchip.com/downloads/en/DeviceDoc/doc0015.pdf" H 3450 2650 50  0001 C CNN
	1    3450 2550
	1    0    0    -1  
$EndComp
$Comp
L CPS2-Custom:27C322 ROM?
U 1 1 62E0A014
P 3450 5350
AR Path="/5E05893C/62E0A014" Ref="ROM?"  Part="1" 
AR Path="/62E08D9B/62E0A014" Ref="UE2-ROM12"  Part="1" 
F 0 "UE2-ROM12" H 3100 6500 50  0000 C CNN
F 1 "27C322" H 3700 4200 50  0000 C CNN
F 2 "Package_DIP:DIP-42_W15.24mm_Socket" H 3450 5350 50  0001 C CNN
F 3 "http://ww1.microchip.com/downloads/en/DeviceDoc/doc0015.pdf" H 3450 5450 50  0001 C CNN
	1    3450 5350
	1    0    0    -1  
$EndComp
$EndSCHEMATC
