EESchema Schematic File Version 4
EELAYER 30 0
EELAYER END
$Descr A3 11693 16535 portrait
encoding utf-8
Sheet 38 69
Title ""
Date "2020-11-26"
Rev ""
Comp ""
Comment1 "Licence: CC-BY"
Comment2 "Author: Loïc *WydD* Petit"
Comment3 ""
Comment4 ""
$EndDescr
Connection ~ 7100 9300
Connection ~ 7150 9400
Connection ~ 7200 9500
Connection ~ 7250 9600
Connection ~ 7300 9700
Connection ~ 7350 9800
Connection ~ 7400 9900
Connection ~ 2850 9300
Connection ~ 2900 9400
Connection ~ 2950 9500
Connection ~ 3000 9600
Connection ~ 3050 9700
Connection ~ 3100 9800
Connection ~ 3150 9900
Connection ~ 9200 9700
Connection ~ 9200 2200
Connection ~ 7400 2400
Connection ~ 7350 2300
Connection ~ 7300 2200
Connection ~ 7250 2100
Connection ~ 7200 2000
Connection ~ 7150 1900
Connection ~ 7100 1800
Connection ~ 1150 5300
Connection ~ 1250 5200
Connection ~ 9200 4700
Connection ~ 7400 4900
Connection ~ 7350 4800
Connection ~ 7300 4700
Connection ~ 7250 4600
Connection ~ 7200 4500
Connection ~ 7150 4400
Connection ~ 7100 4300
Connection ~ 9200 7200
Connection ~ 7400 7400
Connection ~ 7350 7300
Connection ~ 7300 7200
Connection ~ 7250 7100
Connection ~ 7200 7000
Connection ~ 7150 6900
Connection ~ 7100 6800
Connection ~ 1150 7800
Connection ~ 1250 7700
Connection ~ 7600 5200
Connection ~ 7700 5300
Connection ~ 7800 5400
Connection ~ 7600 7700
Connection ~ 7700 7800
Connection ~ 7800 7900
Connection ~ 1150 10300
Connection ~ 1250 10200
Connection ~ 7600 10200
Connection ~ 7700 10300
Connection ~ 8000 5600
Connection ~ 8000 8100
Connection ~ 2800 13100
Connection ~ 1150 8500
Connection ~ 1250 8400
Connection ~ 1250 10500
Connection ~ 3250 10000
Connection ~ 3450 11600
Connection ~ 3550 12100
Connection ~ 2850 6800
Connection ~ 2900 6900
Connection ~ 2950 7000
Connection ~ 3000 7100
Connection ~ 3050 7200
Connection ~ 3100 7300
Connection ~ 3150 7400
Connection ~ 3250 7500
Connection ~ 3450 10200
Connection ~ 3550 10300
Connection ~ 3650 10400
Connection ~ 3750 10600
Connection ~ 1150 6000
Connection ~ 1250 5900
Connection ~ 2850 4300
Connection ~ 2900 4400
Connection ~ 2950 4500
Connection ~ 3000 4600
Connection ~ 3050 4700
Connection ~ 3100 4800
Connection ~ 3150 4900
Connection ~ 3450 7700
Connection ~ 3550 7800
Connection ~ 3650 7900
Connection ~ 3750 8100
Connection ~ 3250 5000
Connection ~ 1150 3500
Connection ~ 1250 3400
Connection ~ 2850 1800
Connection ~ 2900 1900
Connection ~ 2950 2000
Connection ~ 3000 2100
Connection ~ 3050 2200
Connection ~ 3100 2300
Connection ~ 3150 2400
Connection ~ 3450 5200
Connection ~ 3550 5300
Connection ~ 3650 5400
Connection ~ 3750 5600
Connection ~ 3250 2500
Connection ~ 3650 12600
Connection ~ 7800 10400
Connection ~ 8000 10600
Connection ~ 1150 11000
Entry Wire Line
	1650 11500 1750 11600
Entry Wire Line
	1650 12000 1750 12100
Entry Wire Line
	1650 12500 1750 12600
Entry Wire Line
	1650 13000 1750 13100
Wire Wire Line
	900  1800 1750 1800
Wire Wire Line
	900  4300 1750 4300
Wire Wire Line
	900  6800 1750 6800
Wire Wire Line
	900  9300 1750 9300
Wire Wire Line
	1150 2800 1150 3500
Wire Wire Line
	1150 3500 5500 3500
Wire Wire Line
	1150 5300 1150 3500
Wire Wire Line
	1150 5300 1150 6000
Wire Wire Line
	1150 6000 5500 6000
Wire Wire Line
	1150 7800 1150 6000
Wire Wire Line
	1150 7800 1150 8500
Wire Wire Line
	1150 8500 1150 10300
Wire Wire Line
	1150 8500 5500 8500
Wire Wire Line
	1150 10300 1150 11000
Wire Wire Line
	1150 11000 900  11000
Wire Wire Line
	1150 11000 5500 11000
Wire Wire Line
	1250 2700 1250 3400
Wire Wire Line
	1250 3400 1250 5200
Wire Wire Line
	1250 5200 1250 5900
Wire Wire Line
	1250 5900 1250 7700
Wire Wire Line
	1250 7700 1250 8400
Wire Wire Line
	1250 10200 1250 8400
Wire Wire Line
	1250 10200 1250 10500
Wire Wire Line
	1250 10500 900  10500
Wire Wire Line
	1250 10900 1250 10500
Wire Wire Line
	1350 1150 1350 2500
Wire Wire Line
	1350 2500 1750 2500
Wire Wire Line
	1350 3650 1350 5000
Wire Wire Line
	1350 5000 1750 5000
Wire Wire Line
	1350 6150 1350 7500
Wire Wire Line
	1350 7500 1750 7500
Wire Wire Line
	1350 8650 1350 10000
Wire Wire Line
	1350 10000 1750 10000
Wire Wire Line
	1400 1200 1400 2400
Wire Wire Line
	1400 2400 1750 2400
Wire Wire Line
	1400 3700 1400 4900
Wire Wire Line
	1400 4900 1750 4900
Wire Wire Line
	1400 6200 1400 7400
Wire Wire Line
	1400 7400 1750 7400
Wire Wire Line
	1400 8700 1400 9900
Wire Wire Line
	1400 9900 1750 9900
Wire Wire Line
	1450 1250 1450 2300
Wire Wire Line
	1450 2300 1750 2300
Wire Wire Line
	1450 3750 1450 4800
Wire Wire Line
	1450 3750 3050 3750
Wire Wire Line
	1450 4800 1750 4800
Wire Wire Line
	1450 6250 1450 7300
Wire Wire Line
	1450 7300 1750 7300
Wire Wire Line
	1450 8750 1450 9800
Wire Wire Line
	1450 9800 1750 9800
Wire Wire Line
	1500 1300 1500 2200
Wire Wire Line
	1500 2200 1750 2200
Wire Wire Line
	1500 3800 1500 4700
Wire Wire Line
	1500 4700 1750 4700
Wire Wire Line
	1500 6300 1500 7200
Wire Wire Line
	1500 7200 1750 7200
Wire Wire Line
	1500 8800 1500 9700
Wire Wire Line
	1500 9700 1750 9700
Wire Wire Line
	1550 1350 1550 2100
Wire Wire Line
	1550 2100 1750 2100
Wire Wire Line
	1550 3850 1550 4600
Wire Wire Line
	1550 4600 1750 4600
Wire Wire Line
	1550 6350 1550 7100
Wire Wire Line
	1550 7100 1750 7100
Wire Wire Line
	1550 8850 1550 9600
Wire Wire Line
	1550 9600 1750 9600
Wire Wire Line
	1600 1400 1600 2000
Wire Wire Line
	1600 2000 1750 2000
Wire Wire Line
	1600 3900 1600 4500
Wire Wire Line
	1600 4500 1750 4500
Wire Wire Line
	1600 6400 1600 7000
Wire Wire Line
	1600 7000 1750 7000
Wire Wire Line
	1600 8900 1600 9500
Wire Wire Line
	1600 9500 1750 9500
Wire Wire Line
	1650 1450 1650 1900
Wire Wire Line
	1650 1900 1750 1900
Wire Wire Line
	1650 3950 1650 4400
Wire Wire Line
	1650 4400 1750 4400
Wire Wire Line
	1650 6450 1650 6900
Wire Wire Line
	1650 6900 1750 6900
Wire Wire Line
	1650 8950 1650 9400
Wire Wire Line
	1650 9400 1750 9400
Wire Wire Line
	1750 2700 1250 2700
Wire Wire Line
	1750 2800 1150 2800
Wire Wire Line
	1750 5200 1250 5200
Wire Wire Line
	1750 5300 1150 5300
Wire Wire Line
	1750 7700 1250 7700
Wire Wire Line
	1750 7800 1150 7800
Wire Wire Line
	1750 10200 1250 10200
Wire Wire Line
	1750 10300 1150 10300
Wire Wire Line
	1750 11600 2800 11600
Wire Wire Line
	1750 12100 2800 12100
Wire Wire Line
	1750 12600 2800 12600
Wire Wire Line
	1750 13100 2800 13100
Wire Wire Line
	2750 1800 2850 1800
Wire Wire Line
	2750 1900 2900 1900
Wire Wire Line
	2750 2000 2950 2000
Wire Wire Line
	2750 2100 3000 2100
Wire Wire Line
	2750 2200 3050 2200
Wire Wire Line
	2750 2300 3100 2300
Wire Wire Line
	2750 2400 3150 2400
Wire Wire Line
	2750 2500 3250 2500
Wire Wire Line
	2750 4300 2850 4300
Wire Wire Line
	2750 4400 2900 4400
Wire Wire Line
	2750 4500 2950 4500
Wire Wire Line
	2750 4600 3000 4600
Wire Wire Line
	2750 4700 3050 4700
Wire Wire Line
	2750 4800 3100 4800
Wire Wire Line
	2750 4900 3150 4900
Wire Wire Line
	2750 5000 3250 5000
Wire Wire Line
	2750 6800 2850 6800
Wire Wire Line
	2750 6900 2900 6900
Wire Wire Line
	2750 7000 2950 7000
Wire Wire Line
	2750 7100 3000 7100
Wire Wire Line
	2750 7200 3050 7200
Wire Wire Line
	2750 7300 3100 7300
Wire Wire Line
	2750 7400 3150 7400
Wire Wire Line
	2750 7500 3250 7500
Wire Wire Line
	2750 9300 2850 9300
Wire Wire Line
	2750 9400 2900 9400
Wire Wire Line
	2750 9500 2950 9500
Wire Wire Line
	2750 9600 3000 9600
Wire Wire Line
	2750 9700 3050 9700
Wire Wire Line
	2750 9800 3100 9800
Wire Wire Line
	2750 9900 3150 9900
Wire Wire Line
	2750 10000 3250 10000
Wire Wire Line
	2800 13600 2800 13100
Wire Wire Line
	2850 1450 1650 1450
Wire Wire Line
	2850 1800 2850 1450
Wire Wire Line
	2850 1800 3850 1800
Wire Wire Line
	2850 3950 1650 3950
Wire Wire Line
	2850 4300 2850 3950
Wire Wire Line
	2850 4300 3850 4300
Wire Wire Line
	2850 6450 1650 6450
Wire Wire Line
	2850 6800 2850 6450
Wire Wire Line
	2850 6800 3850 6800
Wire Wire Line
	2850 8950 1650 8950
Wire Wire Line
	2850 9300 2850 8950
Wire Wire Line
	2850 9300 3850 9300
Wire Wire Line
	2900 1400 1600 1400
Wire Wire Line
	2900 1900 2900 1400
Wire Wire Line
	2900 1900 3850 1900
Wire Wire Line
	2900 3900 1600 3900
Wire Wire Line
	2900 4400 2900 3900
Wire Wire Line
	2900 4400 3850 4400
Wire Wire Line
	2900 6400 1600 6400
Wire Wire Line
	2900 6900 2900 6400
Wire Wire Line
	2900 6900 3850 6900
Wire Wire Line
	2900 8900 1600 8900
Wire Wire Line
	2900 9400 2900 8900
Wire Wire Line
	2900 9400 3850 9400
Wire Wire Line
	2950 1350 1550 1350
Wire Wire Line
	2950 2000 2950 1350
Wire Wire Line
	2950 2000 3850 2000
Wire Wire Line
	2950 3850 1550 3850
Wire Wire Line
	2950 3850 2950 4500
Wire Wire Line
	2950 4500 3850 4500
Wire Wire Line
	2950 6350 1550 6350
Wire Wire Line
	2950 7000 2950 6350
Wire Wire Line
	2950 7000 3850 7000
Wire Wire Line
	2950 8850 1550 8850
Wire Wire Line
	2950 9500 2950 8850
Wire Wire Line
	2950 9500 3850 9500
Wire Wire Line
	3000 1300 1500 1300
Wire Wire Line
	3000 2100 3000 1300
Wire Wire Line
	3000 2100 3850 2100
Wire Wire Line
	3000 3800 1500 3800
Wire Wire Line
	3000 4600 3000 3800
Wire Wire Line
	3000 4600 3850 4600
Wire Wire Line
	3000 6300 1500 6300
Wire Wire Line
	3000 7100 3000 6300
Wire Wire Line
	3000 7100 3850 7100
Wire Wire Line
	3000 8800 1500 8800
Wire Wire Line
	3000 9600 3000 8800
Wire Wire Line
	3000 9600 3850 9600
Wire Wire Line
	3050 1250 1450 1250
Wire Wire Line
	3050 2200 3050 1250
Wire Wire Line
	3050 2200 3850 2200
Wire Wire Line
	3050 4700 3050 3750
Wire Wire Line
	3050 4700 3850 4700
Wire Wire Line
	3050 6250 1450 6250
Wire Wire Line
	3050 7200 3050 6250
Wire Wire Line
	3050 7200 3850 7200
Wire Wire Line
	3050 8750 1450 8750
Wire Wire Line
	3050 9700 3050 8750
Wire Wire Line
	3050 9700 3850 9700
Wire Wire Line
	3100 1200 1400 1200
Wire Wire Line
	3100 2300 3100 1200
Wire Wire Line
	3100 2300 3850 2300
Wire Wire Line
	3100 3700 1400 3700
Wire Wire Line
	3100 4800 3100 3700
Wire Wire Line
	3100 4800 3850 4800
Wire Wire Line
	3100 6200 1400 6200
Wire Wire Line
	3100 7300 3100 6200
Wire Wire Line
	3100 7300 3850 7300
Wire Wire Line
	3100 8700 1400 8700
Wire Wire Line
	3100 9800 3100 8700
Wire Wire Line
	3100 9800 3850 9800
Wire Wire Line
	3150 1150 1350 1150
Wire Wire Line
	3150 2400 3150 1150
Wire Wire Line
	3150 2400 3850 2400
Wire Wire Line
	3150 3650 1350 3650
Wire Wire Line
	3150 3650 3150 4900
Wire Wire Line
	3150 4900 3850 4900
Wire Wire Line
	3150 6150 1350 6150
Wire Wire Line
	3150 6150 3150 7400
Wire Wire Line
	3150 7400 3850 7400
Wire Wire Line
	3150 8650 1350 8650
Wire Wire Line
	3150 9900 3150 8650
Wire Wire Line
	3150 9900 3850 9900
Wire Wire Line
	3250 2500 3250 3300
Wire Wire Line
	3250 2500 3850 2500
Wire Wire Line
	3250 3300 5150 3300
Wire Wire Line
	3250 5000 3250 5800
Wire Wire Line
	3250 5000 3850 5000
Wire Wire Line
	3250 5800 5150 5800
Wire Wire Line
	3250 7500 3250 8300
Wire Wire Line
	3250 7500 3850 7500
Wire Wire Line
	3250 8300 5150 8300
Wire Wire Line
	3250 10000 3250 10800
Wire Wire Line
	3250 10000 3850 10000
Wire Wire Line
	3250 10800 5150 10800
Wire Wire Line
	3400 11600 3450 11600
Wire Wire Line
	3400 12100 3550 12100
Wire Wire Line
	3400 12600 3650 12600
Wire Wire Line
	3400 13600 8000 13600
Wire Wire Line
	3450 2700 3850 2700
Wire Wire Line
	3450 5200 3450 2700
Wire Wire Line
	3450 5200 3850 5200
Wire Wire Line
	3450 7700 3450 5200
Wire Wire Line
	3450 7700 3850 7700
Wire Wire Line
	3450 10200 3450 7700
Wire Wire Line
	3450 10200 3450 11600
Wire Wire Line
	3450 10200 3850 10200
Wire Wire Line
	3450 11600 7600 11600
Wire Wire Line
	3550 2800 3550 5300
Wire Wire Line
	3550 2800 3850 2800
Wire Wire Line
	3550 5300 3550 7800
Wire Wire Line
	3550 5300 3850 5300
Wire Wire Line
	3550 7800 3550 10300
Wire Wire Line
	3550 7800 3850 7800
Wire Wire Line
	3550 10300 3550 12100
Wire Wire Line
	3550 10300 3850 10300
Wire Wire Line
	3550 12100 7700 12100
Wire Wire Line
	3650 2900 3850 2900
Wire Wire Line
	3650 5400 3650 2900
Wire Wire Line
	3650 5400 3850 5400
Wire Wire Line
	3650 7900 3650 5400
Wire Wire Line
	3650 7900 3850 7900
Wire Wire Line
	3650 10400 3650 7900
Wire Wire Line
	3650 10400 3850 10400
Wire Wire Line
	3650 12600 3650 10400
Wire Wire Line
	3650 12600 7800 12600
Wire Wire Line
	3750 3100 3750 5600
Wire Wire Line
	3750 3100 3850 3100
Wire Wire Line
	3750 5600 3750 8100
Wire Wire Line
	3750 5600 3850 5600
Wire Wire Line
	3750 8100 3750 10600
Wire Wire Line
	3750 8100 3850 8100
Wire Wire Line
	3750 10600 3750 13100
Wire Wire Line
	3750 10600 3850 10600
Wire Wire Line
	3750 13100 3400 13100
Wire Wire Line
	4850 2200 5050 2200
Wire Wire Line
	4850 4700 5050 4700
Wire Wire Line
	4850 7200 5050 7200
Wire Wire Line
	4850 9700 5050 9700
Wire Wire Line
	5050 1100 5050 2200
Wire Wire Line
	5050 1100 9200 1100
Wire Wire Line
	5050 3600 5050 4700
Wire Wire Line
	5050 3600 9200 3600
Wire Wire Line
	5050 6100 5050 7200
Wire Wire Line
	5050 6100 9200 6100
Wire Wire Line
	5050 8600 5050 9700
Wire Wire Line
	5050 8600 9200 8600
Wire Wire Line
	5150 1800 5150 3300
Wire Wire Line
	5150 1800 6000 1800
Wire Wire Line
	5150 4300 5150 5800
Wire Wire Line
	5150 4300 6000 4300
Wire Wire Line
	5150 6800 5150 8300
Wire Wire Line
	5150 6800 6000 6800
Wire Wire Line
	5150 9300 5150 10800
Wire Wire Line
	5150 9300 6000 9300
Wire Wire Line
	5400 2700 5400 3400
Wire Wire Line
	5400 2700 6000 2700
Wire Wire Line
	5400 3400 1250 3400
Wire Wire Line
	5400 5200 5400 5900
Wire Wire Line
	5400 5200 6000 5200
Wire Wire Line
	5400 5900 1250 5900
Wire Wire Line
	5400 7700 5400 8400
Wire Wire Line
	5400 7700 6000 7700
Wire Wire Line
	5400 8400 1250 8400
Wire Wire Line
	5400 10200 5400 10900
Wire Wire Line
	5400 10200 6000 10200
Wire Wire Line
	5400 10900 1250 10900
Wire Wire Line
	5500 2800 5500 3500
Wire Wire Line
	5500 2800 6000 2800
Wire Wire Line
	5500 5300 5500 6000
Wire Wire Line
	5500 5300 6000 5300
Wire Wire Line
	5500 7800 5500 8500
Wire Wire Line
	5500 7800 6000 7800
Wire Wire Line
	5500 10300 5500 11000
Wire Wire Line
	5500 10300 6000 10300
Wire Wire Line
	5600 1150 5600 2500
Wire Wire Line
	5600 2500 6000 2500
Wire Wire Line
	5600 3650 5600 5000
Wire Wire Line
	5600 5000 6000 5000
Wire Wire Line
	5600 6150 5600 7500
Wire Wire Line
	5600 7500 6000 7500
Wire Wire Line
	5600 8650 5600 10000
Wire Wire Line
	5600 10000 6000 10000
Wire Wire Line
	5650 1200 5650 2400
Wire Wire Line
	5650 2400 6000 2400
Wire Wire Line
	5650 3700 5650 4900
Wire Wire Line
	5650 4900 6000 4900
Wire Wire Line
	5650 6200 5650 7400
Wire Wire Line
	5650 7400 6000 7400
Wire Wire Line
	5650 8700 5650 9900
Wire Wire Line
	5650 9900 6000 9900
Wire Wire Line
	5700 1250 5700 2300
Wire Wire Line
	5700 2300 6000 2300
Wire Wire Line
	5700 3750 5700 4800
Wire Wire Line
	5700 4800 6000 4800
Wire Wire Line
	5700 6250 5700 7300
Wire Wire Line
	5700 7300 6000 7300
Wire Wire Line
	5700 8750 5700 9800
Wire Wire Line
	5700 9800 6000 9800
Wire Wire Line
	5750 1300 5750 2200
Wire Wire Line
	5750 2200 6000 2200
Wire Wire Line
	5750 3800 5750 4700
Wire Wire Line
	5750 4700 6000 4700
Wire Wire Line
	5750 6300 5750 7200
Wire Wire Line
	5750 7200 6000 7200
Wire Wire Line
	5750 8800 5750 9700
Wire Wire Line
	5750 9700 6000 9700
Wire Wire Line
	5800 1350 5800 2100
Wire Wire Line
	5800 2100 6000 2100
Wire Wire Line
	5800 3850 5800 4600
Wire Wire Line
	5800 4600 6000 4600
Wire Wire Line
	5800 6350 5800 7100
Wire Wire Line
	5800 7100 6000 7100
Wire Wire Line
	5800 8850 5800 9600
Wire Wire Line
	5800 9600 6000 9600
Wire Wire Line
	5850 1400 5850 2000
Wire Wire Line
	5850 2000 6000 2000
Wire Wire Line
	5850 3900 5850 4500
Wire Wire Line
	5850 4500 6000 4500
Wire Wire Line
	5850 6400 5850 7000
Wire Wire Line
	5850 7000 6000 7000
Wire Wire Line
	5850 8900 5850 9500
Wire Wire Line
	5850 9500 6000 9500
Wire Wire Line
	5900 1450 5900 1900
Wire Wire Line
	5900 1900 6000 1900
Wire Wire Line
	5900 3950 5900 4400
Wire Wire Line
	5900 4400 6000 4400
Wire Wire Line
	5900 6450 5900 6900
Wire Wire Line
	5900 6900 6000 6900
Wire Wire Line
	5900 8950 5900 9400
Wire Wire Line
	5900 9400 6000 9400
Wire Wire Line
	7000 1800 7100 1800
Wire Wire Line
	7000 1900 7150 1900
Wire Wire Line
	7000 2000 7200 2000
Wire Wire Line
	7000 2100 7250 2100
Wire Wire Line
	7000 2200 7300 2200
Wire Wire Line
	7000 2300 7350 2300
Wire Wire Line
	7000 2400 7400 2400
Wire Wire Line
	7000 2500 8100 2500
Wire Wire Line
	7000 4300 7100 4300
Wire Wire Line
	7000 4400 7150 4400
Wire Wire Line
	7000 4500 7200 4500
Wire Wire Line
	7000 4600 7250 4600
Wire Wire Line
	7000 4700 7300 4700
Wire Wire Line
	7000 4800 7350 4800
Wire Wire Line
	7000 4900 7400 4900
Wire Wire Line
	7000 5000 8100 5000
Wire Wire Line
	7000 6800 7100 6800
Wire Wire Line
	7000 6900 7150 6900
Wire Wire Line
	7000 7000 7200 7000
Wire Wire Line
	7000 7100 7250 7100
Wire Wire Line
	7000 7200 7300 7200
Wire Wire Line
	7000 7300 7350 7300
Wire Wire Line
	7000 7400 7400 7400
Wire Wire Line
	7000 7500 8100 7500
Wire Wire Line
	7000 9300 7100 9300
Wire Wire Line
	7000 9400 7150 9400
Wire Wire Line
	7000 9500 7200 9500
Wire Wire Line
	7000 9600 7250 9600
Wire Wire Line
	7000 9700 7300 9700
Wire Wire Line
	7000 9800 7350 9800
Wire Wire Line
	7000 9900 7400 9900
Wire Wire Line
	7000 10000 8100 10000
Wire Wire Line
	7100 1450 5900 1450
Wire Wire Line
	7100 1800 7100 1450
Wire Wire Line
	7100 1800 8100 1800
Wire Wire Line
	7100 3950 5900 3950
Wire Wire Line
	7100 4300 7100 3950
Wire Wire Line
	7100 4300 8100 4300
Wire Wire Line
	7100 6450 5900 6450
Wire Wire Line
	7100 6800 7100 6450
Wire Wire Line
	7100 6800 8100 6800
Wire Wire Line
	7100 8950 5900 8950
Wire Wire Line
	7100 9300 7100 8950
Wire Wire Line
	7100 9300 8100 9300
Wire Wire Line
	7150 1400 5850 1400
Wire Wire Line
	7150 1900 7150 1400
Wire Wire Line
	7150 1900 8100 1900
Wire Wire Line
	7150 3900 5850 3900
Wire Wire Line
	7150 4400 7150 3900
Wire Wire Line
	7150 4400 8100 4400
Wire Wire Line
	7150 6400 5850 6400
Wire Wire Line
	7150 6900 7150 6400
Wire Wire Line
	7150 6900 8100 6900
Wire Wire Line
	7150 8900 5850 8900
Wire Wire Line
	7150 9400 7150 8900
Wire Wire Line
	7150 9400 8100 9400
Wire Wire Line
	7200 1350 5800 1350
Wire Wire Line
	7200 2000 7200 1350
Wire Wire Line
	7200 2000 8100 2000
Wire Wire Line
	7200 3850 5800 3850
Wire Wire Line
	7200 4500 7200 3850
Wire Wire Line
	7200 4500 8100 4500
Wire Wire Line
	7200 6350 5800 6350
Wire Wire Line
	7200 7000 7200 6350
Wire Wire Line
	7200 7000 8100 7000
Wire Wire Line
	7200 8850 5800 8850
Wire Wire Line
	7200 9500 7200 8850
Wire Wire Line
	7200 9500 8100 9500
Wire Wire Line
	7250 1300 5750 1300
Wire Wire Line
	7250 2100 7250 1300
Wire Wire Line
	7250 2100 8100 2100
Wire Wire Line
	7250 3800 5750 3800
Wire Wire Line
	7250 4600 7250 3800
Wire Wire Line
	7250 4600 8100 4600
Wire Wire Line
	7250 6300 5750 6300
Wire Wire Line
	7250 7100 7250 6300
Wire Wire Line
	7250 7100 8100 7100
Wire Wire Line
	7250 8800 5750 8800
Wire Wire Line
	7250 9600 7250 8800
Wire Wire Line
	7250 9600 8100 9600
Wire Wire Line
	7300 1250 5700 1250
Wire Wire Line
	7300 2200 7300 1250
Wire Wire Line
	7300 2200 8100 2200
Wire Wire Line
	7300 3750 5700 3750
Wire Wire Line
	7300 4700 7300 3750
Wire Wire Line
	7300 4700 8100 4700
Wire Wire Line
	7300 6250 5700 6250
Wire Wire Line
	7300 7200 7300 6250
Wire Wire Line
	7300 7200 8100 7200
Wire Wire Line
	7300 8750 5700 8750
Wire Wire Line
	7300 9700 7300 8750
Wire Wire Line
	7300 9700 8100 9700
Wire Wire Line
	7350 1200 5650 1200
Wire Wire Line
	7350 2300 7350 1200
Wire Wire Line
	7350 2300 8100 2300
Wire Wire Line
	7350 3700 5650 3700
Wire Wire Line
	7350 4800 7350 3700
Wire Wire Line
	7350 4800 8100 4800
Wire Wire Line
	7350 6200 5650 6200
Wire Wire Line
	7350 7300 7350 6200
Wire Wire Line
	7350 7300 8100 7300
Wire Wire Line
	7350 8700 5650 8700
Wire Wire Line
	7350 9800 7350 8700
Wire Wire Line
	7350 9800 8100 9800
Wire Wire Line
	7400 1150 5600 1150
Wire Wire Line
	7400 2400 7400 1150
Wire Wire Line
	7400 2400 8100 2400
Wire Wire Line
	7400 3650 5600 3650
Wire Wire Line
	7400 4900 7400 3650
Wire Wire Line
	7400 4900 8100 4900
Wire Wire Line
	7400 6150 5600 6150
Wire Wire Line
	7400 7400 7400 6150
Wire Wire Line
	7400 7400 8100 7400
Wire Wire Line
	7400 8650 5600 8650
Wire Wire Line
	7400 9900 7400 8650
Wire Wire Line
	7400 9900 8100 9900
Wire Wire Line
	7600 2700 7600 5200
Wire Wire Line
	7600 5200 7600 7700
Wire Wire Line
	7600 7700 7600 10200
Wire Wire Line
	7600 10200 7600 11600
Wire Wire Line
	7700 2800 7700 5300
Wire Wire Line
	7700 5300 7700 7800
Wire Wire Line
	7700 7800 7700 10300
Wire Wire Line
	7700 10300 7700 12100
Wire Wire Line
	7800 2900 7800 5400
Wire Wire Line
	7800 5400 7800 7900
Wire Wire Line
	7800 7900 7800 10400
Wire Wire Line
	7800 10400 7800 12600
Wire Wire Line
	8000 3100 8000 5600
Wire Wire Line
	8000 3100 8100 3100
Wire Wire Line
	8000 5600 8000 8100
Wire Wire Line
	8000 5600 8100 5600
Wire Wire Line
	8000 8100 8000 10600
Wire Wire Line
	8000 8100 8100 8100
Wire Wire Line
	8000 10600 8000 13600
Wire Wire Line
	8000 10600 8100 10600
Wire Wire Line
	8100 2700 7600 2700
Wire Wire Line
	8100 2800 7700 2800
Wire Wire Line
	8100 2900 7800 2900
Wire Wire Line
	8100 5200 7600 5200
Wire Wire Line
	8100 5300 7700 5300
Wire Wire Line
	8100 5400 7800 5400
Wire Wire Line
	8100 7700 7600 7700
Wire Wire Line
	8100 7800 7700 7800
Wire Wire Line
	8100 7900 7800 7900
Wire Wire Line
	8100 10200 7600 10200
Wire Wire Line
	8100 10300 7700 10300
Wire Wire Line
	8100 10400 7800 10400
Wire Wire Line
	9200 1100 9200 2200
Wire Wire Line
	9200 2200 9100 2200
Wire Wire Line
	9200 2200 10750 2200
Wire Wire Line
	9200 3600 9200 4700
Wire Wire Line
	9200 4700 9100 4700
Wire Wire Line
	9200 4700 9750 4700
Wire Wire Line
	9200 6100 9200 7200
Wire Wire Line
	9200 7200 9100 7200
Wire Wire Line
	9200 7200 9850 7200
Wire Wire Line
	9200 8600 9200 9700
Wire Wire Line
	9200 9700 9100 9700
Wire Wire Line
	9200 9700 9950 9700
Wire Wire Line
	9750 2300 10750 2300
Wire Wire Line
	9750 4700 9750 2300
Wire Wire Line
	9850 2400 10750 2400
Wire Wire Line
	9850 7200 9850 2400
Wire Wire Line
	9950 2500 10750 2500
Wire Wire Line
	9950 9700 9950 2500
Wire Bus Line
	1650 11350 1550 11350
Text Label 1850 11600 0    50   ~ 0
XS0
Text Label 1850 12100 0    50   ~ 0
XS1
Text Label 1850 12600 0    50   ~ 0
XS2
Text Label 1850 13100 0    50   ~ 0
XS3
Text HLabel 900  1800 0    50   Input ~ 0
A
Text HLabel 900  4300 0    50   Input ~ 0
B
Text HLabel 900  6800 0    50   Input ~ 0
C
Text HLabel 900  9300 0    50   Input ~ 0
D
Text HLabel 900  10500 0    50   Input ~ 0
~CLK8M
Text HLabel 900  11000 0    50   Input ~ 0
~RESET
Text HLabel 1550 11350 0    50   Input ~ 0
XS[0..3]
Text HLabel 10750 2200 2    50   Output ~ 0
GFX-A
Text HLabel 10750 2300 2    50   Output ~ 0
GFX-B
Text HLabel 10750 2400 2    50   Output ~ 0
GFX-C
Text HLabel 10750 2500 2    50   Output ~ 0
GFX-D
$Comp
L A5C:BUF12 UAV?
U 1 1 5FB8850B
P 3100 11600
AR Path="/60BA673A/5FB8850B" Ref="UAV?"  Part="1" 
AR Path="/5FB6D140/5FB8850B" Ref="UAK90"  Part="1" 
AR Path="/5FBBD4DB/5FBBDC13/5FB8850B" Ref="UAK90"  Part="1" 
F 0 "UAK90" H 3100 11917 50  0000 C CNN
F 1 "BUF12" H 3100 11826 50  0000 C CNN
F 2 "" H 3100 11600 50  0001 C CNN
F 3 "" H 3100 11600 50  0001 C CNN
	1    3100 11600
	1    0    0    -1  
$EndComp
$Comp
L A5C:BUF12 UAV?
U 1 1 5FB88511
P 3100 12100
AR Path="/60BA673A/5FB88511" Ref="UAV?"  Part="1" 
AR Path="/5FB6D140/5FB88511" Ref="UAK94"  Part="1" 
AR Path="/5FBBD4DB/5FBBDC13/5FB88511" Ref="UAK94"  Part="1" 
F 0 "UAK94" H 3100 12417 50  0000 C CNN
F 1 "BUF12" H 3100 12326 50  0000 C CNN
F 2 "" H 3100 12100 50  0001 C CNN
F 3 "" H 3100 12100 50  0001 C CNN
	1    3100 12100
	1    0    0    -1  
$EndComp
$Comp
L A5C:BUF12 UAV?
U 1 1 5FB88517
P 3100 12600
AR Path="/60BA673A/5FB88517" Ref="UAV?"  Part="1" 
AR Path="/5FB6D140/5FB88517" Ref="UAK99"  Part="1" 
AR Path="/5FBBD4DB/5FBBDC13/5FB88517" Ref="UAK99"  Part="1" 
F 0 "UAK99" H 3100 12917 50  0000 C CNN
F 1 "BUF12" H 3100 12826 50  0000 C CNN
F 2 "" H 3100 12600 50  0001 C CNN
F 3 "" H 3100 12600 50  0001 C CNN
	1    3100 12600
	1    0    0    -1  
$EndComp
$Comp
L A5C:BUF12 UAV?
U 1 1 61A23D7B
P 3100 13100
AR Path="/60BA673A/61A23D7B" Ref="UAV?"  Part="1" 
AR Path="/5FB6D140/61A23D7B" Ref="UAK103"  Part="1" 
AR Path="/5FBBD4DB/5FBBDC13/61A23D7B" Ref="UAK103"  Part="1" 
F 0 "UAK103" H 3100 13417 50  0000 C CNN
F 1 "BUF12" H 3100 13326 50  0000 C CNN
F 2 "" H 3100 13100 50  0001 C CNN
F 3 "" H 3100 13100 50  0001 C CNN
	1    3100 13100
	1    0    0    -1  
$EndComp
$Comp
L A5C:NBUF02 UAK107
U 1 1 61BE6635
P 3100 13600
AR Path="/5FB6D140/61BE6635" Ref="UAK107"  Part="1" 
AR Path="/5FBBD4DB/5FBBDC13/61BE6635" Ref="UAK107"  Part="1" 
F 0 "UAK107" H 3100 13917 50  0000 C CNN
F 1 "NBUF02" H 3100 13826 50  0000 C CNN
F 2 "" H 3100 13400 50  0001 C CNN
F 3 "" H 3100 13400 50  0001 C CNN
	1    3100 13600
	1    0    0    -1  
$EndComp
$Comp
L A5C:M273C UAR?
U 1 1 5FB88565
P 2250 2300
AR Path="/60BA673A/5FB88565" Ref="UAR?"  Part="1" 
AR Path="/5FB6D140/5FB88565" Ref="UAR127"  Part="1" 
AR Path="/5FBBD4DB/5FBBDC13/5FB88565" Ref="UAR127"  Part="1" 
F 0 "UAR127" H 2250 3067 50  0000 C CNN
F 1 "M273C" H 2250 2976 50  0000 C CNN
F 2 "" H 2250 2300 50  0001 C CNN
F 3 "" H 2250 2300 50  0001 C CNN
	1    2250 2300
	1    0    0    -1  
$EndComp
$Comp
L A5C:M273C UAS?
U 1 1 5FB8856B
P 2250 4800
AR Path="/60BA673A/5FB8856B" Ref="UAS?"  Part="1" 
AR Path="/5FB6D140/5FB8856B" Ref="UAS166"  Part="1" 
AR Path="/5FBBD4DB/5FBBDC13/5FB8856B" Ref="UAS166"  Part="1" 
F 0 "UAS166" H 2250 5567 50  0000 C CNN
F 1 "M273C" H 2250 5476 50  0000 C CNN
F 2 "" H 2250 4800 50  0001 C CNN
F 3 "" H 2250 4800 50  0001 C CNN
	1    2250 4800
	1    0    0    -1  
$EndComp
$Comp
L A5C:M273C UAV?
U 1 1 5FB88571
P 2250 7300
AR Path="/60BA673A/5FB88571" Ref="UAV?"  Part="1" 
AR Path="/5FB6D140/5FB88571" Ref="UAV127"  Part="1" 
AR Path="/5FBBD4DB/5FBBDC13/5FB88571" Ref="UAV127"  Part="1" 
F 0 "UAV127" H 2250 8067 50  0000 C CNN
F 1 "M273C" H 2250 7976 50  0000 C CNN
F 2 "" H 2250 7300 50  0001 C CNN
F 3 "" H 2250 7300 50  0001 C CNN
	1    2250 7300
	1    0    0    -1  
$EndComp
$Comp
L A5C:M273C UAX?
U 1 1 5FB88577
P 2250 9800
AR Path="/60BA673A/5FB88577" Ref="UAX?"  Part="1" 
AR Path="/5FB6D140/5FB88577" Ref="UAX166"  Part="1" 
AR Path="/5FBBD4DB/5FBBDC13/5FB88577" Ref="UAX166"  Part="1" 
F 0 "UAX166" H 2250 10567 50  0000 C CNN
F 1 "M273C" H 2250 10476 50  0000 C CNN
F 2 "" H 2250 9800 50  0001 C CNN
F 3 "" H 2250 9800 50  0001 C CNN
	1    2250 9800
	1    0    0    -1  
$EndComp
$Comp
L A5C:M273C UAT?
U 1 1 5FB8857D
P 6500 2300
AR Path="/60BA673A/5FB8857D" Ref="UAT?"  Part="1" 
AR Path="/5FB6D140/5FB8857D" Ref="UAT127"  Part="1" 
AR Path="/5FBBD4DB/5FBBDC13/5FB8857D" Ref="UAT127"  Part="1" 
F 0 "UAT127" H 6500 3067 50  0000 C CNN
F 1 "M273C" H 6500 2976 50  0000 C CNN
F 2 "" H 6500 2300 50  0001 C CNN
F 3 "" H 6500 2300 50  0001 C CNN
	1    6500 2300
	1    0    0    -1  
$EndComp
$Comp
L A5C:M273C UAU?
U 1 1 5FB88583
P 6500 4800
AR Path="/60BA673A/5FB88583" Ref="UAU?"  Part="1" 
AR Path="/5FB6D140/5FB88583" Ref="UAU166"  Part="1" 
AR Path="/5FBBD4DB/5FBBDC13/5FB88583" Ref="UAU166"  Part="1" 
F 0 "UAU166" H 6500 5567 50  0000 C CNN
F 1 "M273C" H 6500 5476 50  0000 C CNN
F 2 "" H 6500 4800 50  0001 C CNN
F 3 "" H 6500 4800 50  0001 C CNN
	1    6500 4800
	1    0    0    -1  
$EndComp
$Comp
L A5C:M273C UAY?
U 1 1 5FB88589
P 6500 7300
AR Path="/60BA673A/5FB88589" Ref="UAY?"  Part="1" 
AR Path="/5FB6D140/5FB88589" Ref="UAY127"  Part="1" 
AR Path="/5FBBD4DB/5FBBDC13/5FB88589" Ref="UAY127"  Part="1" 
F 0 "UAY127" H 6500 8067 50  0000 C CNN
F 1 "M273C" H 6500 7976 50  0000 C CNN
F 2 "" H 6500 7300 50  0001 C CNN
F 3 "" H 6500 7300 50  0001 C CNN
	1    6500 7300
	1    0    0    -1  
$EndComp
$Comp
L A5C:M273C UAZ?
U 1 1 5FB8858F
P 6500 9800
AR Path="/60BA673A/5FB8858F" Ref="UAZ?"  Part="1" 
AR Path="/5FB6D140/5FB8858F" Ref="UAZ166"  Part="1" 
AR Path="/5FBBD4DB/5FBBDC13/5FB8858F" Ref="UAZ166"  Part="1" 
F 0 "UAZ166" H 6500 10567 50  0000 C CNN
F 1 "M273C" H 6500 10476 50  0000 C CNN
F 2 "" H 6500 9800 50  0001 C CNN
F 3 "" H 6500 9800 50  0001 C CNN
	1    6500 9800
	1    0    0    -1  
$EndComp
$Comp
L A5C:MUX8GLH UAV?
U 1 1 61AF24B8
P 4350 2400
AR Path="/60BA673A/61AF24B8" Ref="UAV?"  Part="1" 
AR Path="/5FB6D140/61AF24B8" Ref="UAS128"  Part="1" 
AR Path="/5FBBD4DB/5FBBDC13/61AF24B8" Ref="UAS128"  Part="1" 
F 0 "UAS128" H 4350 3267 50  0000 C CNN
F 1 "MUX8GLH" H 4350 3176 50  0000 C CNN
F 2 "" H 4350 2400 50  0001 C CNN
F 3 "" H 4350 2400 50  0001 C CNN
	1    4350 2400
	1    0    0    -1  
$EndComp
$Comp
L A5C:MUX8GLH UAV?
U 1 1 613B8DA3
P 4350 4900
AR Path="/60BA673A/613B8DA3" Ref="UAV?"  Part="1" 
AR Path="/5FB6D140/613B8DA3" Ref="UAR167"  Part="1" 
AR Path="/5FBBD4DB/5FBBDC13/613B8DA3" Ref="UAR167"  Part="1" 
F 0 "UAR167" H 4350 5767 50  0000 C CNN
F 1 "MUX8GLH" H 4350 5676 50  0000 C CNN
F 2 "" H 4350 4900 50  0001 C CNN
F 3 "" H 4350 4900 50  0001 C CNN
	1    4350 4900
	1    0    0    -1  
$EndComp
$Comp
L A5C:MUX8GLH UAV?
U 1 1 60FA5BC2
P 4350 7400
AR Path="/60BA673A/60FA5BC2" Ref="UAV?"  Part="1" 
AR Path="/5FB6D140/60FA5BC2" Ref="UAX128"  Part="1" 
AR Path="/5FBBD4DB/5FBBDC13/60FA5BC2" Ref="UAX128"  Part="1" 
F 0 "UAX128" H 4350 8267 50  0000 C CNN
F 1 "MUX8GLH" H 4350 8176 50  0000 C CNN
F 2 "" H 4350 7400 50  0001 C CNN
F 3 "" H 4350 7400 50  0001 C CNN
	1    4350 7400
	1    0    0    -1  
$EndComp
$Comp
L A5C:MUX8GLH UAZ?
U 1 1 60425327
P 4350 9900
AR Path="/60BA673A/60425327" Ref="UAZ?"  Part="1" 
AR Path="/5FB6D140/60425327" Ref="UAV167"  Part="1" 
AR Path="/5FBBD4DB/5FBBDC13/60425327" Ref="UAV167"  Part="1" 
F 0 "UAV167" H 4350 10767 50  0000 C CNN
F 1 "MUX8GLH" H 4350 10676 50  0000 C CNN
F 2 "" H 4350 9900 50  0001 C CNN
F 3 "" H 4350 9900 50  0001 C CNN
	1    4350 9900
	1    0    0    -1  
$EndComp
$Comp
L A5C:MUX8GLH UAU?
U 1 1 5FB885AD
P 8600 2400
AR Path="/60BA673A/5FB885AD" Ref="UAU?"  Part="1" 
AR Path="/5FB6D140/5FB885AD" Ref="UAU128"  Part="1" 
AR Path="/5FBBD4DB/5FBBDC13/5FB885AD" Ref="UAU128"  Part="1" 
F 0 "UAU128" H 8600 3267 50  0000 C CNN
F 1 "MUX8GLH" H 8600 3176 50  0000 C CNN
F 2 "" H 8600 2400 50  0001 C CNN
F 3 "" H 8600 2400 50  0001 C CNN
	1    8600 2400
	1    0    0    -1  
$EndComp
$Comp
L A5C:MUX8GLH UAT?
U 1 1 5FB885B3
P 8600 4900
AR Path="/60BA673A/5FB885B3" Ref="UAT?"  Part="1" 
AR Path="/5FB6D140/5FB885B3" Ref="UAT167"  Part="1" 
AR Path="/5FBBD4DB/5FBBDC13/5FB885B3" Ref="UAT167"  Part="1" 
F 0 "UAT167" H 8600 5767 50  0000 C CNN
F 1 "MUX8GLH" H 8600 5676 50  0000 C CNN
F 2 "" H 8600 4900 50  0001 C CNN
F 3 "" H 8600 4900 50  0001 C CNN
	1    8600 4900
	1    0    0    -1  
$EndComp
$Comp
L A5C:MUX8GLH UAZ?
U 1 1 5FB885B9
P 8600 7400
AR Path="/60BA673A/5FB885B9" Ref="UAZ?"  Part="1" 
AR Path="/5FB6D140/5FB885B9" Ref="UAZ129"  Part="1" 
AR Path="/5FBBD4DB/5FBBDC13/5FB885B9" Ref="UAZ129"  Part="1" 
F 0 "UAZ129" H 8600 8267 50  0000 C CNN
F 1 "MUX8GLH" H 8600 8176 50  0000 C CNN
F 2 "" H 8600 7400 50  0001 C CNN
F 3 "" H 8600 7400 50  0001 C CNN
	1    8600 7400
	1    0    0    -1  
$EndComp
$Comp
L A5C:MUX8GLH UAY?
U 1 1 5FB885BF
P 8600 9900
AR Path="/60BA673A/5FB885BF" Ref="UAY?"  Part="1" 
AR Path="/5FB6D140/5FB885BF" Ref="UAY167"  Part="1" 
AR Path="/5FBBD4DB/5FBBDC13/5FB885BF" Ref="UAY167"  Part="1" 
F 0 "UAY167" H 8600 10767 50  0000 C CNN
F 1 "MUX8GLH" H 8600 10676 50  0000 C CNN
F 2 "" H 8600 9900 50  0001 C CNN
F 3 "" H 8600 9900 50  0001 C CNN
	1    8600 9900
	1    0    0    -1  
$EndComp
NoConn ~ 4850 2100
NoConn ~ 4850 4600
NoConn ~ 4850 7100
NoConn ~ 4850 9600
NoConn ~ 9100 9600
NoConn ~ 9100 7100
NoConn ~ 9100 4600
NoConn ~ 9100 2100
Wire Bus Line
	1650 11350 1650 13000
$EndSCHEMATC
