EESchema Schematic File Version 4
EELAYER 30 0
EELAYER END
$Descr A4 11693 8268
encoding utf-8
Sheet 15 83
Title "CPS Reverse Engineering: DL-0311"
Date "2021-09-12"
Rev ""
Comp ""
Comment1 ""
Comment2 ""
Comment3 "Licence: CC-BY"
Comment4 "Author: Loïc *WydD* Petit"
$EndDescr
Connection ~ 9750 1850
Connection ~ 9750 4050
Connection ~ 9750 3600
Connection ~ 5350 1850
Connection ~ 5350 2300
Connection ~ 5350 7100
Connection ~ 5350 6650
Connection ~ 5350 5350
Connection ~ 5350 4900
Connection ~ 5350 3600
Connection ~ 4250 2150
Connection ~ 4250 3900
Connection ~ 5350 3150
Connection ~ 8650 2150
Connection ~ 8650 3900
Connection ~ 4250 5650
Connection ~ 4250 7400
Connection ~ 8650 4050
Connection ~ 8650 2300
Connection ~ 5350 5800
Connection ~ 5350 4050
Connection ~ 6000 4600
Connection ~ 10400 4600
Connection ~ 4250 2300
Entry Wire Line
	1100 3400 1200 3500
Entry Wire Line
	1100 3500 1200 3600
Entry Wire Line
	1100 3600 1200 3700
Entry Wire Line
	1100 3700 1200 3800
Entry Wire Line
	1100 3800 1200 3900
Entry Wire Line
	1100 3900 1200 4000
Entry Wire Line
	1100 4000 1200 4100
Entry Wire Line
	1100 4100 1200 4200
Entry Wire Line
	1100 4200 1200 4300
Entry Wire Line
	1100 4300 1200 4400
Entry Wire Line
	1900 3400 2000 3500
Entry Wire Line
	1900 3500 2000 3600
Entry Wire Line
	1900 3600 2000 3700
Entry Wire Line
	1900 3700 2000 3800
Entry Wire Line
	1900 3800 2000 3900
Entry Wire Line
	1900 3900 2000 4000
Entry Wire Line
	3500 800  3600 900 
Entry Wire Line
	3500 900  3600 1000
Entry Wire Line
	5900 1300 6000 1400
Entry Wire Line
	5900 1750 6000 1850
Entry Wire Line
	5900 3050 6000 3150
Entry Wire Line
	5900 3500 6000 3600
Entry Wire Line
	5900 4800 6000 4700
Entry Wire Line
	5900 5250 6000 5150
Entry Wire Line
	5900 6550 6000 6450
Entry Wire Line
	5900 7000 6000 6900
Entry Wire Line
	10300 1300 10400 1400
Entry Wire Line
	10300 1750 10400 1850
Entry Wire Line
	10300 3050 10400 3150
Entry Wire Line
	10300 3500 10400 3600
Entry Wire Line
	10300 4400 10400 4500
Wire Wire Line
	1200 3500 1450 3500
Wire Wire Line
	1200 3600 1450 3600
Wire Wire Line
	1200 3700 1450 3700
Wire Wire Line
	1200 3800 1450 3800
Wire Wire Line
	1200 3900 1450 3900
Wire Wire Line
	1200 4000 1450 4000
Wire Wire Line
	1200 4100 1450 4100
Wire Wire Line
	1200 4200 1450 4200
Wire Wire Line
	1200 4300 1450 4300
Wire Wire Line
	1200 4400 1450 4400
Wire Wire Line
	2000 3500 2250 3500
Wire Wire Line
	2000 3600 2250 3600
Wire Wire Line
	2000 3700 2250 3700
Wire Wire Line
	2000 3800 2250 3800
Wire Wire Line
	2000 3900 2250 3900
Wire Wire Line
	2000 4000 2250 4000
Wire Wire Line
	2250 2400 2800 2400
Wire Wire Line
	2800 2200 2150 2200
Wire Wire Line
	2800 2300 2150 2300
Wire Wire Line
	3850 1250 4250 1250
Wire Wire Line
	4250 900  3600 900 
Wire Wire Line
	4250 1000 3600 1000
Wire Wire Line
	4250 2150 4250 2050
Wire Wire Line
	4250 2150 4250 2300
Wire Wire Line
	4250 2300 4000 2300
Wire Wire Line
	4250 2300 5350 2300
Wire Wire Line
	4250 2650 3600 2650
Wire Wire Line
	4250 2750 3600 2750
Wire Wire Line
	4250 3900 4250 3800
Wire Wire Line
	4250 3900 4250 4050
Wire Wire Line
	4250 4050 5350 4050
Wire Wire Line
	4250 4400 3600 4400
Wire Wire Line
	4250 4500 3600 4500
Wire Wire Line
	4250 5550 4250 5650
Wire Wire Line
	4250 5650 4250 5800
Wire Wire Line
	4250 5800 5350 5800
Wire Wire Line
	4250 6150 3600 6150
Wire Wire Line
	4250 6250 3600 6250
Wire Wire Line
	4250 7300 4250 7400
Wire Wire Line
	4250 7400 4250 7550
Wire Wire Line
	4250 7550 5350 7550
Wire Wire Line
	5150 1400 5350 1400
Wire Wire Line
	5150 5350 5350 5350
Wire Wire Line
	5150 7100 5350 7100
Wire Wire Line
	5250 1300 5900 1300
Wire Wire Line
	5250 1750 5900 1750
Wire Wire Line
	5250 3050 5900 3050
Wire Wire Line
	5250 3500 5900 3500
Wire Wire Line
	5250 4800 5900 4800
Wire Wire Line
	5250 5250 5900 5250
Wire Wire Line
	5250 6550 5900 6550
Wire Wire Line
	5250 7000 5900 7000
Wire Wire Line
	5350 1400 5350 1850
Wire Wire Line
	5350 1850 5150 1850
Wire Wire Line
	5350 1850 5350 2300
Wire Wire Line
	5350 2300 5350 3150
Wire Wire Line
	5350 3150 5150 3150
Wire Wire Line
	5350 3150 5350 3600
Wire Wire Line
	5350 3600 5150 3600
Wire Wire Line
	5350 3600 5350 4050
Wire Wire Line
	5350 4050 5350 4900
Wire Wire Line
	5350 4900 5150 4900
Wire Wire Line
	5350 5350 5350 4900
Wire Wire Line
	5350 5350 5350 5800
Wire Wire Line
	5350 5800 5350 6650
Wire Wire Line
	5350 6650 5150 6650
Wire Wire Line
	5350 7100 5350 6650
Wire Wire Line
	5350 7100 5350 7550
Wire Wire Line
	7950 4400 9250 4400
Wire Wire Line
	8300 2900 8650 2900
Wire Wire Line
	8300 3350 8650 3350
Wire Wire Line
	8650 900  8000 900 
Wire Wire Line
	8650 1000 8000 1000
Wire Wire Line
	8650 2050 8650 2150
Wire Wire Line
	8650 2300 5350 2300
Wire Wire Line
	8650 2300 8650 2150
Wire Wire Line
	8650 2650 8000 2650
Wire Wire Line
	8650 2750 8000 2750
Wire Wire Line
	8650 3550 8650 3650
Wire Wire Line
	8650 3800 8650 3900
Wire Wire Line
	8650 4050 7950 4050
Wire Wire Line
	8650 4050 8650 3900
Wire Wire Line
	9550 1850 9750 1850
Wire Wire Line
	9550 3600 9750 3600
Wire Wire Line
	9550 4500 9750 4500
Wire Wire Line
	9650 1300 10300 1300
Wire Wire Line
	9650 1750 10300 1750
Wire Wire Line
	9650 3050 10300 3050
Wire Wire Line
	9650 3500 10300 3500
Wire Wire Line
	9650 4400 10300 4400
Wire Wire Line
	9750 1400 9550 1400
Wire Wire Line
	9750 1850 9750 1400
Wire Wire Line
	9750 1850 9750 2300
Wire Wire Line
	9750 2300 8650 2300
Wire Wire Line
	9750 3150 9550 3150
Wire Wire Line
	9750 3600 9750 3150
Wire Wire Line
	9750 3600 9750 4050
Wire Wire Line
	9750 4050 8650 4050
Wire Wire Line
	9750 4500 9750 4050
Wire Bus Line
	1100 3300 1000 3300
Wire Bus Line
	1900 3300 1800 3300
Wire Bus Line
	3350 650  3500 650 
Wire Bus Line
	10400 4600 6000 4600
Wire Bus Line
	10400 4600 10550 4600
Text Notes 7850 6300 0    50   ~ 0
ROWSCROLL\nY0\nY1\nY2\nY3\nY4\nY5\nY6\nY7\nY8\nY9\nxx\nxx\nxx
Text Notes 8400 6300 0    50   ~ 0
SCROLL1\nCNT0\nY0\nY1\nY2\nY3\nY4\nX0\nX1\nX2\nX3\nX4\nX5\nY5
Text Notes 9050 6300 0    50   ~ 0
SCROLL2\nCNT0\nY0\nY1\nY2\nY3\nX0\nX1\nX2\nX3\nX4\nX5\nY4\nY5
Text Notes 9650 6300 0    50   ~ 0
SCROLL3\nCNT0\nY0\nY1\nY2\nX0\nX1\nX2\nX3\nX4\nX5\nY3\nY4\nY5
Text Label 1250 3500 0    50   ~ 0
Y0
Text Label 1250 3600 0    50   ~ 0
Y1
Text Label 1250 3700 0    50   ~ 0
Y2
Text Label 1250 3800 0    50   ~ 0
Y3
Text Label 1250 3900 0    50   ~ 0
Y4
Text Label 1250 4000 0    50   ~ 0
Y5
Text Label 1250 4100 0    50   ~ 0
Y6
Text Label 1250 4200 0    50   ~ 0
Y7
Text Label 1250 4300 0    50   ~ 0
Y8
Text Label 1250 4400 0    50   ~ 0
Y9
Text Label 2050 3500 0    50   ~ 0
X0
Text Label 2050 3600 0    50   ~ 0
X1
Text Label 2050 3700 0    50   ~ 0
X2
Text Label 2050 3800 0    50   ~ 0
X3
Text Label 2050 3900 0    50   ~ 0
X4
Text Label 2050 4000 0    50   ~ 0
X5
Text Label 2800 2200 2    50   ~ 0
SCROLL-TYPE0
Text Label 2800 2300 2    50   ~ 0
SCROLL-TYPE1
Text Label 4250 900  2    50   ~ 0
SCROLL-TYPE0
Text Label 4250 1000 2    50   ~ 0
SCROLL-TYPE1
Text Label 4250 1150 2    50   ~ 0
Y0
Text Label 4250 1250 2    50   ~ 0
CNT0
Text Label 4250 1350 2    50   ~ 0
CNT0
Text Label 4250 1450 2    50   ~ 0
CNT0
Text Label 4250 1600 2    50   ~ 0
Y1
Text Label 4250 1700 2    50   ~ 0
Y0
Text Label 4250 1800 2    50   ~ 0
Y0
Text Label 4250 1900 2    50   ~ 0
Y0
Text Label 4250 2650 2    50   ~ 0
SCROLL-TYPE0
Text Label 4250 2750 2    50   ~ 0
SCROLL-TYPE1
Text Label 4250 2900 2    50   ~ 0
Y2
Text Label 4250 3000 2    50   ~ 0
Y1
Text Label 4250 3100 2    50   ~ 0
Y1
Text Label 4250 3200 2    50   ~ 0
Y1
Text Label 4250 3350 2    50   ~ 0
Y3
Text Label 4250 3450 2    50   ~ 0
Y2
Text Label 4250 3550 2    50   ~ 0
Y2
Text Label 4250 3650 2    50   ~ 0
Y2
Text Label 4250 4400 2    50   ~ 0
SCROLL-TYPE0
Text Label 4250 4500 2    50   ~ 0
SCROLL-TYPE1
Text Label 4250 4650 2    50   ~ 0
Y4
Text Label 4250 4750 2    50   ~ 0
Y3
Text Label 4250 4850 2    50   ~ 0
Y3
Text Label 4250 4950 2    50   ~ 0
X0
Text Label 4250 5100 2    50   ~ 0
Y5
Text Label 4250 5200 2    50   ~ 0
Y4
Text Label 4250 5300 2    50   ~ 0
X0
Text Label 4250 5400 2    50   ~ 0
X1
Text Label 4250 6150 2    50   ~ 0
SCROLL-TYPE0
Text Label 4250 6250 2    50   ~ 0
SCROLL-TYPE1
Text Label 4250 6400 2    50   ~ 0
Y6
Text Label 4250 6500 2    50   ~ 0
X0
Text Label 4250 6600 2    50   ~ 0
X1
Text Label 4250 6700 2    50   ~ 0
X2
Text Label 4250 6850 2    50   ~ 0
Y7
Text Label 4250 6950 2    50   ~ 0
X1
Text Label 4250 7050 2    50   ~ 0
X2
Text Label 4250 7150 2    50   ~ 0
X3
Text Label 5800 1300 2    50   ~ 0
ADDR1
Text Label 5800 1750 2    50   ~ 0
ADDR2
Text Label 5800 3050 2    50   ~ 0
ADDR3
Text Label 5800 3500 2    50   ~ 0
ADDR4
Text Label 5800 4800 2    50   ~ 0
ADDR5
Text Label 5800 5250 2    50   ~ 0
ADDR6
Text Label 5800 6550 2    50   ~ 0
ADDR7
Text Label 5800 7000 2    50   ~ 0
ADDR8
Text Label 8650 900  2    50   ~ 0
SCROLL-TYPE0
Text Label 8650 1000 2    50   ~ 0
SCROLL-TYPE1
Text Label 8650 1150 2    50   ~ 0
Y8
Text Label 8650 1250 2    50   ~ 0
X2
Text Label 8650 1350 2    50   ~ 0
X3
Text Label 8650 1450 2    50   ~ 0
X4
Text Label 8650 1600 2    50   ~ 0
Y9
Text Label 8650 1700 2    50   ~ 0
X3
Text Label 8650 1800 2    50   ~ 0
X4
Text Label 8650 1900 2    50   ~ 0
X5
Text Label 8650 2650 2    50   ~ 0
SCROLL-TYPE0
Text Label 8650 2750 2    50   ~ 0
SCROLL-TYPE1
Text Label 8650 3000 2    50   ~ 0
X4
Text Label 8650 3100 2    50   ~ 0
X5
Text Label 8650 3200 2    50   ~ 0
Y3
Text Label 8650 3450 2    50   ~ 0
X5
Text Label 8650 3550 2    50   ~ 0
Y4
Text Label 8650 3650 2    50   ~ 0
Y4
Text Label 9250 4400 2    50   ~ 0
Y5
Text Label 10200 1300 2    50   ~ 0
ADDR9
Text Label 10200 1750 2    50   ~ 0
ADDR10
Text Label 10200 3050 2    50   ~ 0
ADDR11
Text Label 10200 3500 2    50   ~ 0
ADDR12
Text Label 10200 4400 2    50   ~ 0
ADDR13
Text HLabel 1000 3300 0    50   Input ~ 0
Y[0..9]
Text HLabel 1650 2400 0    50   Input ~ 0
~ROWSCROLL-READY
Text HLabel 1800 3300 0    50   Input ~ 0
X[0..5]
Text HLabel 3350 650  0    50   Input ~ 0
SCROLL-TYPE[0..1]
Text HLabel 3850 1250 0    50   Input ~ 0
CNT0
Text HLabel 7950 4050 0    50   Input ~ 0
~ADDR-HI
Text HLabel 10550 4600 2    50   3State ~ 0
ADDR[1..13]
$Comp
L power:GND #PWR0184
U 1 1 61A9461E
P 8300 2900
F 0 "#PWR0184" H 8300 2650 50  0001 C CNN
F 1 "GND" H 8305 2727 50  0001 C CNN
F 2 "" H 8300 2900 50  0001 C CNN
F 3 "" H 8300 2900 50  0001 C CNN
	1    8300 2900
	1    0    0    -1  
$EndComp
$Comp
L power:GND #PWR0153
U 1 1 64F59101
P 8300 3350
F 0 "#PWR0153" H 8300 3100 50  0001 C CNN
F 1 "GND" H 8305 3177 50  0001 C CNN
F 2 "" H 8300 3350 50  0001 C CNN
F 3 "" H 8300 3350 50  0001 C CNN
	1    8300 3350
	1    0    0    -1  
$EndComp
$Comp
L A5C:M125C UEA263
U 1 1 628FECD2
P 5050 1300
F 0 "UEA263" H 5050 1565 50  0000 C CNN
F 1 "M125C" H 5050 1474 50  0000 C CNN
F 2 "" H 4550 1250 50  0001 C CNN
F 3 "" H 4550 1250 50  0001 C CNN
	1    5050 1300
	1    0    0    -1  
$EndComp
$Comp
L A5C:M125C UBF95
U 1 1 628FECD8
P 5050 1750
F 0 "UBF95" H 5050 2015 50  0000 C CNN
F 1 "M125C" H 5050 1924 50  0000 C CNN
F 2 "" H 4550 1700 50  0001 C CNN
F 3 "" H 4550 1700 50  0001 C CNN
	1    5050 1750
	1    0    0    -1  
$EndComp
$Comp
L A5C:M125C UBF152
U 1 1 64F5BAB4
P 5050 3050
F 0 "UBF152" H 5050 3315 50  0000 C CNN
F 1 "M125C" H 5050 3224 50  0000 C CNN
F 2 "" H 4550 3000 50  0001 C CNN
F 3 "" H 4550 3000 50  0001 C CNN
	1    5050 3050
	1    0    0    -1  
$EndComp
$Comp
L A5C:M125C UBI133
U 1 1 64F5EE99
P 5050 3500
F 0 "UBI133" H 5050 3765 50  0000 C CNN
F 1 "M125C" H 5050 3674 50  0000 C CNN
F 2 "" H 4550 3450 50  0001 C CNN
F 3 "" H 4550 3450 50  0001 C CNN
	1    5050 3500
	1    0    0    -1  
$EndComp
$Comp
L A5C:M125C UCA482
U 1 1 64F5F2AC
P 5050 4800
F 0 "UCA482" H 5050 5065 50  0000 C CNN
F 1 "M125C" H 5050 4974 50  0000 C CNN
F 2 "" H 4550 4750 50  0001 C CNN
F 3 "" H 4550 4750 50  0001 C CNN
	1    5050 4800
	1    0    0    -1  
$EndComp
$Comp
L A5C:M125C UCB486
U 1 1 6506D90A
P 5050 5250
F 0 "UCB486" H 5050 5515 50  0000 C CNN
F 1 "M125C" H 5050 5424 50  0000 C CNN
F 2 "" H 4550 5200 50  0001 C CNN
F 3 "" H 4550 5200 50  0001 C CNN
	1    5050 5250
	1    0    0    -1  
$EndComp
$Comp
L A5C:M125C UBI103
U 1 1 6830DA09
P 5050 6550
F 0 "UBI103" H 5050 6815 50  0000 C CNN
F 1 "M125C" H 5050 6724 50  0000 C CNN
F 2 "" H 4550 6500 50  0001 C CNN
F 3 "" H 4550 6500 50  0001 C CNN
	1    5050 6550
	1    0    0    -1  
$EndComp
$Comp
L A5C:M125C UBJ116
U 1 1 6830DA0F
P 5050 7000
F 0 "UBJ116" H 5050 7265 50  0000 C CNN
F 1 "M125C" H 5050 7174 50  0000 C CNN
F 2 "" H 4550 6950 50  0001 C CNN
F 3 "" H 4550 6950 50  0001 C CNN
	1    5050 7000
	1    0    0    -1  
$EndComp
$Comp
L A5C:M125C UCB467
U 1 1 63A9D730
P 9450 1300
F 0 "UCB467" H 9450 1565 50  0000 C CNN
F 1 "M125C" H 9450 1474 50  0000 C CNN
F 2 "" H 8950 1250 50  0001 C CNN
F 3 "" H 8950 1250 50  0001 C CNN
	1    9450 1300
	1    0    0    -1  
$EndComp
$Comp
L A5C:M125C UCA462
U 1 1 63A9D736
P 9450 1750
F 0 "UCA462" H 9450 2015 50  0000 C CNN
F 1 "M125C" H 9450 1924 50  0000 C CNN
F 2 "" H 8950 1700 50  0001 C CNN
F 3 "" H 8950 1700 50  0001 C CNN
	1    9450 1750
	1    0    0    -1  
$EndComp
$Comp
L A5C:M125C UCA418
U 1 1 681F48CB
P 9450 3050
F 0 "UCA418" H 9450 3315 50  0000 C CNN
F 1 "M125C" H 9450 3224 50  0000 C CNN
F 2 "" H 8950 3000 50  0001 C CNN
F 3 "" H 8950 3000 50  0001 C CNN
	1    9450 3050
	1    0    0    -1  
$EndComp
$Comp
L A5C:M125C UCA415
U 1 1 681F48D1
P 9450 3500
F 0 "UCA415" H 9450 3765 50  0000 C CNN
F 1 "M125C" H 9450 3674 50  0000 C CNN
F 2 "" H 8950 3450 50  0001 C CNN
F 3 "" H 8950 3450 50  0001 C CNN
	1    9450 3500
	1    0    0    -1  
$EndComp
$Comp
L A5C:M125C UCA424
U 1 1 6102B350
P 9450 4400
F 0 "UCA424" H 9450 4665 50  0000 C CNN
F 1 "M125C" H 9450 4574 50  0000 C CNN
F 2 "" H 8950 4350 50  0001 C CNN
F 3 "" H 8950 4350 50  0001 C CNN
	1    9450 4400
	1    0    0    -1  
$EndComp
$Comp
L A5C:INV01 UBG108
U 1 1 61118F2D
P 1950 2400
F 0 "UBG108" H 1950 2717 50  0000 C CNN
F 1 "INV01" H 1950 2626 50  0000 C CNN
F 2 "" H 1950 2200 50  0001 C CNN
F 3 "" H 1950 2200 50  0001 C CNN
	1    1950 2400
	1    0    0    -1  
$EndComp
$Comp
L A5C:NOR03 UBG105
U 1 1 63A844E5
P 3100 2300
F 0 "UBG105" H 3100 2617 50  0000 C CNN
F 1 "NOR03" H 3100 2526 50  0000 C CNN
F 2 "" H 3100 2300 50  0001 C CNN
F 3 "" H 3100 2300 50  0001 C CNN
	1    3100 2300
	1    0    0    -1  
$EndComp
$Comp
L A5C:BUF12 UBE111
U 1 1 60E1472F
P 3700 2300
F 0 "UBE111" H 3700 2617 50  0000 C CNN
F 1 "BUF12" H 3700 2526 50  0000 C CNN
F 2 "" H 3700 2300 50  0001 C CNN
F 3 "" H 3700 2300 50  0001 C CNN
	1    3700 2300
	1    0    0    -1  
$EndComp
$Comp
L A5C:MUX42H UEB254
U 1 1 64D39E32
P 4550 1450
F 0 "UEB254" H 4550 2265 50  0000 C CNN
F 1 "MUX42H" H 4550 2174 50  0000 C CNN
F 2 "" H 4600 1500 50  0001 C CNN
F 3 "" H 4600 1500 50  0001 C CNN
	1    4550 1450
	1    0    0    -1  
$EndComp
$Comp
L A5C:MUX42H UCB470
U 1 1 62D37A0E
P 4550 3200
F 0 "UCB470" H 4550 4015 50  0000 C CNN
F 1 "MUX42H" H 4550 3924 50  0000 C CNN
F 2 "" H 4600 3250 50  0001 C CNN
F 3 "" H 4600 3250 50  0001 C CNN
	1    4550 3200
	1    0    0    -1  
$EndComp
$Comp
L A5C:MUX42H UCA466
U 1 1 62E39408
P 4550 4950
F 0 "UCA466" H 4550 5765 50  0000 C CNN
F 1 "MUX42H" H 4550 5674 50  0000 C CNN
F 2 "" H 4600 5000 50  0001 C CNN
F 3 "" H 4600 5000 50  0001 C CNN
	1    4550 4950
	1    0    0    -1  
$EndComp
$Comp
L A5C:MUX42H UCA447
U 1 1 64F598ED
P 4550 6700
F 0 "UCA447" H 4550 7515 50  0000 C CNN
F 1 "MUX42H" H 4550 7424 50  0000 C CNN
F 2 "" H 4600 6750 50  0001 C CNN
F 3 "" H 4600 6750 50  0001 C CNN
	1    4550 6700
	1    0    0    -1  
$EndComp
$Comp
L A5C:MUX42H UCB442
U 1 1 609980A8
P 8950 1450
F 0 "UCB442" H 8950 2265 50  0000 C CNN
F 1 "MUX42H" H 8950 2174 50  0000 C CNN
F 2 "" H 9000 1500 50  0001 C CNN
F 3 "" H 9000 1500 50  0001 C CNN
	1    8950 1450
	1    0    0    -1  
$EndComp
$Comp
L A5C:MUX42H UCB404
U 1 1 67062BFC
P 8950 3200
F 0 "UCB404" H 8950 4015 50  0000 C CNN
F 1 "MUX42H" H 8950 3924 50  0000 C CNN
F 2 "" H 9000 3250 50  0001 C CNN
F 3 "" H 9000 3250 50  0001 C CNN
	1    8950 3200
	1    0    0    -1  
$EndComp
Wire Bus Line
	3500 650  3500 900 
Wire Bus Line
	6000 1400 6000 4600
Wire Bus Line
	6000 4600 6000 6900
Wire Bus Line
	10400 1400 10400 4600
Wire Bus Line
	1900 3300 1900 3900
Wire Bus Line
	1100 3300 1100 4300
$EndSCHEMATC
