EESchema Schematic File Version 4
EELAYER 30 0
EELAYER END
$Descr A4 11693 8268
encoding utf-8
Sheet 64 83
Title "CPS Reverse Engineering: DL-0311"
Date "2021-09-12"
Rev ""
Comp ""
Comment1 ""
Comment2 ""
Comment3 "Licence: CC-BY"
Comment4 "Author: Loïc *WydD* Petit"
$EndDescr
Connection ~ 3850 2100
Connection ~ 3750 1900
Connection ~ 3100 1900
Connection ~ 3700 3650
Connection ~ 4150 1000
NoConn ~ 6750 5950
Entry Wire Line
	2500 900  2600 1000
Entry Wire Line
	2500 1800 2600 1900
Entry Wire Line
	2750 2100 2850 2200
Entry Wire Line
	2750 2200 2850 2300
Entry Wire Line
	2750 2550 2850 2650
Entry Wire Line
	3800 3000 3900 3100
Entry Wire Line
	3800 3450 3900 3550
Entry Wire Line
	3800 3950 3900 4050
Entry Wire Line
	3800 4050 3900 4150
Entry Wire Line
	3800 4150 3900 4250
Entry Wire Line
	3800 4250 3900 4350
Entry Wire Line
	3800 5050 3900 5150
Entry Wire Line
	7400 2950 7500 2850
Entry Wire Line
	7400 3050 7500 2950
Entry Wire Line
	7400 3150 7500 3050
Entry Wire Line
	7400 3250 7500 3150
Entry Wire Line
	7400 4050 7500 3950
Entry Wire Line
	7400 4150 7500 4050
Entry Wire Line
	7400 4250 7500 4150
Entry Wire Line
	7400 4350 7500 4250
Wire Wire Line
	2600 1000 4150 1000
Wire Wire Line
	2600 1900 3100 1900
Wire Wire Line
	2850 2200 4050 2200
Wire Wire Line
	2850 2300 4050 2300
Wire Wire Line
	3100 2100 3100 1900
Wire Wire Line
	3100 2650 2850 2650
Wire Wire Line
	3700 1900 3750 1900
Wire Wire Line
	3700 2650 4150 2650
Wire Wire Line
	3700 3200 4450 3200
Wire Wire Line
	3700 3650 3700 3200
Wire Wire Line
	3700 3650 4450 3650
Wire Wire Line
	3750 1900 3750 2550
Wire Wire Line
	3750 2550 4150 2550
Wire Wire Line
	3850 2100 3100 2100
Wire Wire Line
	3850 2100 3850 2750
Wire Wire Line
	3900 5150 6250 5150
Wire Wire Line
	4050 2000 4150 2000
Wire Wire Line
	4050 2200 4050 2000
Wire Wire Line
	4050 2450 4050 2300
Wire Wire Line
	4150 1000 4150 1400
Wire Wire Line
	4150 1800 4000 1800
Wire Wire Line
	4150 1900 3750 1900
Wire Wire Line
	4150 2100 3850 2100
Wire Wire Line
	4150 2450 4050 2450
Wire Wire Line
	4150 2750 3850 2750
Wire Wire Line
	4250 1400 4150 1400
Wire Wire Line
	4450 3100 3900 3100
Wire Wire Line
	4450 3550 3900 3550
Wire Wire Line
	5000 1950 5100 1950
Wire Wire Line
	5000 3150 6250 3150
Wire Wire Line
	5000 3600 5100 3600
Wire Wire Line
	5100 2400 5100 1950
Wire Wire Line
	5100 3250 6250 3250
Wire Wire Line
	5100 3600 5100 3250
Wire Wire Line
	5200 1400 4850 1400
Wire Wire Line
	5200 1400 5200 2500
Wire Wire Line
	5200 2500 5400 2500
Wire Wire Line
	5300 1000 4150 1000
Wire Wire Line
	5300 1000 5300 2700
Wire Wire Line
	5300 2700 5400 2700
Wire Wire Line
	5400 2400 5100 2400
Wire Wire Line
	5400 2600 5000 2600
Wire Wire Line
	6250 2950 6250 2550
Wire Wire Line
	6250 3750 6100 3750
Wire Wire Line
	6250 3750 6250 3550
Wire Wire Line
	6250 4050 3900 4050
Wire Wire Line
	6250 4150 3900 4150
Wire Wire Line
	6250 4250 3900 4250
Wire Wire Line
	6250 4350 3900 4350
Wire Wire Line
	6250 4850 6100 4850
Wire Wire Line
	6250 4850 6250 4650
Wire Wire Line
	6250 5850 6100 5850
Wire Wire Line
	7050 2950 7400 2950
Wire Wire Line
	7050 3050 7400 3050
Wire Wire Line
	7050 3150 7400 3150
Wire Wire Line
	7050 3250 7400 3250
Wire Wire Line
	7050 4050 7400 4050
Wire Wire Line
	7050 4150 7400 4150
Wire Wire Line
	7050 4250 7400 4250
Wire Wire Line
	7050 4350 7400 4350
Wire Bus Line
	2500 750  2400 750 
Wire Bus Line
	2750 2000 2600 2000
Wire Bus Line
	3800 2900 3100 2900
Wire Bus Line
	7500 2700 7650 2700
Text Notes 8650 3900 0    50   ~ 0
SCROLL1\nLINE3\n0\nCNT6\nCNT5\nCNT4\nCNT3\nCNT2\nCNT1
Text Notes 9150 3900 0    50   ~ 0
SCROLL2\nLINE4\n1\nCNT6\nCNT5\nCNT4\nCNT3\nCNT2\nCNT1
Text Notes 9650 3900 0    50   ~ 0
SCROLL3\n~LINE5~\n1\n1\n1\nCNT4\nCNT3\nCNT2\nCNT1
Text Label 2600 1000 0    50   ~ 0
BUS-STATE1
Text Label 2600 1900 0    50   ~ 0
BUS-STATE0
Text Label 3100 2200 2    50   ~ 0
LINE3
Text Label 3100 2300 2    50   ~ 0
LINE4
Text Label 3100 2650 2    50   ~ 0
LINE5
Text Label 4450 3100 2    50   ~ 0
SCROLL-CNT6
Text Label 4450 3550 2    50   ~ 0
SCROLL-CNT5
Text Label 4500 4050 2    50   ~ 0
SCROLL-CNT4
Text Label 4500 4150 2    50   ~ 0
SCROLL-CNT3
Text Label 4500 4250 2    50   ~ 0
SCROLL-CNT2
Text Label 4500 4350 2    50   ~ 0
SCROLL-CNT1
Text Label 4500 5150 2    50   ~ 0
SCROLL-CNT0
Text Label 7100 2950 0    50   ~ 0
ADDR7
Text Label 7100 3050 0    50   ~ 0
ADDR6
Text Label 7100 3150 0    50   ~ 0
ADDR5
Text Label 7100 3250 0    50   ~ 0
ADDR4
Text Label 7100 4050 0    50   ~ 0
ADDR3
Text Label 7100 4150 0    50   ~ 0
ADDR2
Text Label 7100 4250 0    50   ~ 0
ADDR1
Text Label 7100 4350 0    50   ~ 0
ADDR0
Text HLabel 2400 750  0    50   Input ~ 0
BUS-STATE[0..1]
Text HLabel 2600 2000 0    50   Input ~ 0
LINE[3..5]
Text HLabel 3100 2900 0    50   Input ~ 0
SCROLL-CNT[0..6]
Text HLabel 3100 3650 0    50   Input ~ 0
~BUS-SCROLL3
Text HLabel 5550 5750 0    50   Input ~ 0
~BUS-SCROLL1
Text HLabel 5550 5850 0    50   Input ~ 0
~BUS-SCROLL2
Text HLabel 5550 5950 0    50   Input ~ 0
~BUS-SCROLL3
Text HLabel 6250 3050 0    50   Input ~ 0
~BUS-SCROLL1
Text HLabel 6250 3450 0    50   Input ~ 0
~CLK4M
Text HLabel 6250 4550 0    50   Input ~ 0
~CLK4M
Text HLabel 6250 5350 0    50   Input ~ 0
~CLK4M
Text HLabel 6250 6050 0    50   Input ~ 0
~CLK4M
Text HLabel 6750 5150 2    50   Output ~ 0
WR-ATTR
Text HLabel 6750 5250 2    50   Output ~ 0
WR-TILE
Text HLabel 6750 5850 2    50   Output ~ 0
WR
Text HLabel 7650 2700 2    50   Output ~ 0
ADDR[0..7]
$Comp
L power:VCC #PWR0140
U 1 1 7E13B5CA
P 6100 3750
F 0 "#PWR0140" H 6100 3600 50  0001 C CNN
F 1 "VCC" H 6115 3923 50  0000 C CNN
F 2 "" H 6100 3750 50  0001 C CNN
F 3 "" H 6100 3750 50  0001 C CNN
	1    6100 3750
	1    0    0    -1  
$EndComp
$Comp
L power:VCC #PWR0141
U 1 1 7D505597
P 6100 4850
F 0 "#PWR0141" H 6100 4700 50  0001 C CNN
F 1 "VCC" H 6115 5023 50  0000 C CNN
F 2 "" H 6100 4850 50  0001 C CNN
F 3 "" H 6100 4850 50  0001 C CNN
	1    6100 4850
	1    0    0    -1  
$EndComp
$Comp
L power:GND #PWR0168
U 1 1 62A1F6EA
P 4000 1800
F 0 "#PWR0168" H 4000 1550 50  0001 C CNN
F 1 "GND" H 4005 1627 50  0001 C CNN
F 2 "" H 4000 1800 50  0001 C CNN
F 3 "" H 4000 1800 50  0001 C CNN
	1    4000 1800
	1    0    0    -1  
$EndComp
$Comp
L A5C:OR02 UCA409
U 1 1 6F0097AA
P 4700 3150
AR Path="/61116467/6112B680/6F0097AA" Ref="UCA409"  Part="1" 
AR Path="/6112ED44/6F0097AA" Ref="UCA409"  Part="1" 
AR Path="/612E497E/612E4DCB/6F0097AA" Ref="UCA409"  Part="1" 
F 0 "UCA409" H 4725 3417 50  0000 C CNN
F 1 "OR02" H 4725 3326 50  0000 C CNN
F 2 "" H 4750 3150 50  0001 C CNN
F 3 "" H 4750 3150 50  0001 C CNN
	1    4700 3150
	1    0    0    -1  
$EndComp
$Comp
L A5C:OR02 UCA404
U 1 1 717B3F5E
P 4700 3600
AR Path="/61116467/6112B680/717B3F5E" Ref="UCA404"  Part="1" 
AR Path="/6112ED44/717B3F5E" Ref="UCA404"  Part="1" 
AR Path="/612E497E/612E4DCB/717B3F5E" Ref="UCA404"  Part="1" 
F 0 "UCA404" H 4725 3867 50  0000 C CNN
F 1 "OR02" H 4725 3776 50  0000 C CNN
F 2 "" H 4750 3600 50  0001 C CNN
F 3 "" H 4750 3600 50  0001 C CNN
	1    4700 3600
	1    0    0    -1  
$EndComp
$Comp
L A5C:NAND03 UAC?
U 1 1 6181C2C0
P 5800 5850
AR Path="/61116467/61117C32/6181C2C0" Ref="UAC?"  Part="1" 
AR Path="/6112ED27/6181C2C0" Ref="UAC?"  Part="1" 
AR Path="/6181C2C0" Ref="UAC?"  Part="1" 
AR Path="/6112ED44/6181C2C0" Ref="UAC209"  Part="1" 
AR Path="/612E497E/612E4DCB/6181C2C0" Ref="UAC209"  Part="1" 
F 0 "UAC209" H 5825 6142 50  0000 C CNN
F 1 "NAND03" H 5825 6051 50  0000 C CNN
F 2 "" H 5800 5850 50  0001 C CNN
F 3 "" H 5800 5850 50  0001 C CNN
	1    5800 5850
	1    0    0    -1  
$EndComp
$Comp
L A5C:INV01 UBF71
U 1 1 6173B746
P 3400 1900
AR Path="/61116467/6112B680/6173B746" Ref="UBF71"  Part="1" 
AR Path="/6112ED44/6173B746" Ref="UBF71"  Part="1" 
AR Path="/612E497E/612E4DCB/6173B746" Ref="UBF71"  Part="1" 
F 0 "UBF71" H 3400 2217 50  0000 C CNN
F 1 "INV01" H 3400 2126 50  0000 C CNN
F 2 "" H 3400 1700 50  0001 C CNN
F 3 "" H 3400 1700 50  0001 C CNN
	1    3400 1900
	1    0    0    -1  
$EndComp
$Comp
L A5C:INV01 UBH35
U 1 1 6519310D
P 3400 2650
AR Path="/61116467/6112B680/6519310D" Ref="UBH35"  Part="1" 
AR Path="/6112ED44/6519310D" Ref="UBH35"  Part="1" 
AR Path="/612E497E/612E4DCB/6519310D" Ref="UBH35"  Part="1" 
F 0 "UBH35" H 3400 2967 50  0000 C CNN
F 1 "INV01" H 3400 2876 50  0000 C CNN
F 2 "" H 3400 2450 50  0001 C CNN
F 3 "" H 3400 2450 50  0001 C CNN
	1    3400 2650
	1    0    0    -1  
$EndComp
$Comp
L A5C:INV01 UCA407
U 1 1 672E5E68
P 3400 3650
AR Path="/61116467/6112B680/672E5E68" Ref="UCA407"  Part="1" 
AR Path="/6112ED44/672E5E68" Ref="UCA407"  Part="1" 
AR Path="/612E497E/612E4DCB/672E5E68" Ref="UCA407"  Part="1" 
F 0 "UCA407" H 3400 3967 50  0000 C CNN
F 1 "INV01" H 3400 3876 50  0000 C CNN
F 2 "" H 3400 3450 50  0001 C CNN
F 3 "" H 3400 3450 50  0001 C CNN
	1    3400 3650
	1    0    0    -1  
$EndComp
$Comp
L A5C:INV01 UBG8
U 1 1 6C450AD1
P 4550 1400
AR Path="/61116467/6112B680/6C450AD1" Ref="UBG8"  Part="1" 
AR Path="/6112ED44/6C450AD1" Ref="UBG8"  Part="1" 
AR Path="/612E497E/612E4DCB/6C450AD1" Ref="UBG8"  Part="1" 
F 0 "UBG8" H 4550 1717 50  0000 C CNN
F 1 "INV01" H 4550 1626 50  0000 C CNN
F 2 "" H 4550 1200 50  0001 C CNN
F 3 "" H 4550 1200 50  0001 C CNN
	1    4550 1400
	1    0    0    -1  
$EndComp
$Comp
L A5C:DFFCOO UAD?
U 1 1 6182A1C1
P 6500 5250
AR Path="/61116467/61117C32/6182A1C1" Ref="UAD?"  Part="1" 
AR Path="/6112ED27/6182A1C1" Ref="UAD?"  Part="1" 
AR Path="/6112ED44/6182A1C1" Ref="UAD248"  Part="1" 
AR Path="/612E497E/612E4DCB/6182A1C1" Ref="UAD248"  Part="1" 
F 0 "UAD248" H 6500 5615 50  0000 C CNN
F 1 "DFFCOO" H 6500 5524 50  0000 C CNN
F 2 "" H 6500 5250 50  0001 C CNN
F 3 "" H 6500 5250 50  0001 C CNN
	1    6500 5250
	1    0    0    -1  
$EndComp
$Comp
L A5C:DFFCOO UAC?
U 1 1 61848048
P 6500 5950
AR Path="/61116467/61117C32/61848048" Ref="UAC?"  Part="1" 
AR Path="/6112ED27/61848048" Ref="UAC?"  Part="1" 
AR Path="/6112ED44/61848048" Ref="UAC211"  Part="1" 
AR Path="/612E497E/612E4DCB/61848048" Ref="UAC211"  Part="1" 
F 0 "UAC211" H 6500 6315 50  0000 C CNN
F 1 "DFFCOO" H 6500 6224 50  0000 C CNN
F 2 "" H 6500 5950 50  0001 C CNN
F 3 "" H 6500 5950 50  0001 C CNN
	1    6500 5950
	1    0    0    -1  
$EndComp
$Comp
L A5C:AOI22 UBG10
U 1 1 68B2BCE3
P 4550 1900
AR Path="/61116467/6112B680/68B2BCE3" Ref="UBG10"  Part="1" 
AR Path="/6112ED44/68B2BCE3" Ref="UBG10"  Part="1" 
AR Path="/612E497E/612E4DCB/68B2BCE3" Ref="UBG10"  Part="1" 
F 0 "UBG10" H 4575 2217 50  0000 C CNN
F 1 "AOI22" H 4575 2126 50  0000 C CNN
F 2 "" H 4700 1900 50  0001 C CNN
F 3 "" H 4700 1900 50  0001 C CNN
	1    4550 1900
	1    0    0    -1  
$EndComp
$Comp
L A5C:AOI22 UBG0
U 1 1 68B2D7BD
P 4550 2550
AR Path="/61116467/6112B680/68B2D7BD" Ref="UBG0"  Part="1" 
AR Path="/6112ED44/68B2D7BD" Ref="UBG0"  Part="1" 
AR Path="/612E497E/612E4DCB/68B2D7BD" Ref="UBG0"  Part="1" 
F 0 "UBG0" H 4575 2867 50  0000 C CNN
F 1 "AOI22" H 4575 2776 50  0000 C CNN
F 2 "" H 4700 2550 50  0001 C CNN
F 3 "" H 4700 2550 50  0001 C CNN
	1    4550 2550
	1    0    0    -1  
$EndComp
$Comp
L A5C:AOI22 UBG5
U 1 1 6B8703B3
P 5800 2500
AR Path="/61116467/6112B680/6B8703B3" Ref="UBG5"  Part="1" 
AR Path="/6112ED44/6B8703B3" Ref="UBG5"  Part="1" 
AR Path="/612E497E/612E4DCB/6B8703B3" Ref="UBG5"  Part="1" 
F 0 "UBG5" H 5825 2817 50  0000 C CNN
F 1 "AOI22" H 5825 2726 50  0000 C CNN
F 2 "" H 5950 2500 50  0001 C CNN
F 3 "" H 5950 2500 50  0001 C CNN
	1    5800 2500
	1    0    0    -1  
$EndComp
$Comp
L A5C:M175C UCA190
U 1 1 61EF86D9
P 6650 3250
AR Path="/61116467/6112B680/61EF86D9" Ref="UCA190"  Part="1" 
AR Path="/6112ED44/61EF86D9" Ref="UCA190"  Part="1" 
AR Path="/612E497E/612E4DCB/61EF86D9" Ref="UCA190"  Part="1" 
F 0 "UCA190" H 6650 3815 50  0000 C CNN
F 1 "M175C" H 6650 3724 50  0000 C CNN
F 2 "" H 6650 3050 50  0001 C CNN
F 3 "" H 6650 3050 50  0001 C CNN
	1    6650 3250
	1    0    0    -1  
$EndComp
$Comp
L A5C:M175C UCC280
U 1 1 7366DA48
P 6650 4350
AR Path="/61116467/6112B680/7366DA48" Ref="UCC280"  Part="1" 
AR Path="/6112ED44/7366DA48" Ref="UCC280"  Part="1" 
AR Path="/612E497E/612E4DCB/7366DA48" Ref="UCC280"  Part="1" 
F 0 "UCC280" H 6650 4915 50  0000 C CNN
F 1 "M175C" H 6650 4824 50  0000 C CNN
F 2 "" H 6650 4150 50  0001 C CNN
F 3 "" H 6650 4150 50  0001 C CNN
	1    6650 4350
	1    0    0    -1  
$EndComp
Wire Bus Line
	2500 750  2500 1800
Wire Bus Line
	2750 2000 2750 2550
Wire Bus Line
	3800 2900 3800 5050
Wire Bus Line
	7500 2700 7500 4250
$EndSCHEMATC
