EESchema Schematic File Version 4
EELAYER 30 0
EELAYER END
$Descr A4 11693 8268
encoding utf-8
Sheet 1 1
Title ""
Date ""
Rev ""
Comp ""
Comment1 ""
Comment2 ""
Comment3 ""
Comment4 ""
$EndDescr
Wire Wire Line
	3950 7300 4050 7300
Connection ~ 4050 7300
Wire Wire Line
	4050 7300 4150 7300
Wire Wire Line
	4050 7300 4050 7400
$Comp
L power:+3.3V #PWR0101
U 1 1 600B33EA
P 3650 5200
F 0 "#PWR0101" H 3650 5050 50  0001 C CNN
F 1 "+3.3V" H 3665 5373 50  0000 C CNN
F 2 "" H 3650 5200 50  0001 C CNN
F 3 "" H 3650 5200 50  0001 C CNN
	1    3650 5200
	1    0    0    -1  
$EndComp
$Comp
L power:GND #PWR0102
U 1 1 600B41D0
P 4050 7400
F 0 "#PWR0102" H 4050 7150 50  0001 C CNN
F 1 "GND" H 4055 7227 50  0000 C CNN
F 2 "" H 4050 7400 50  0001 C CNN
F 3 "" H 4050 7400 50  0001 C CNN
	1    4050 7400
	1    0    0    -1  
$EndComp
$Comp
L Connector_Generic:Conn_01x05 JTAG1
U 1 1 600B53C9
P 7250 5900
F 0 "JTAG1" H 7168 5567 50  0000 C CNN
F 1 "Conn_01x05" H 7168 5566 50  0001 C CNN
F 2 "Connector_PinSocket_2.54mm:PinSocket_1x05_P2.54mm_Vertical" H 7250 5900 50  0001 C CNN
F 3 "~" H 7250 5900 50  0001 C CNN
	1    7250 5900
	1    0    0    1   
$EndComp
$Comp
L Device:R_Small R5
U 1 1 600B653B
P 6350 5900
F 0 "R5" H 6409 5946 50  0000 L CNN
F 1 "10k" H 6409 5855 50  0000 L CNN
F 2 "Resistor_SMD:R_0201_0603Metric" H 6350 5900 50  0001 C CNN
F 3 "~" H 6350 5900 50  0001 C CNN
	1    6350 5900
	1    0    0    -1  
$EndComp
Wire Wire Line
	7050 6000 6350 6000
Wire Wire Line
	5100 6100 7050 6100
Wire Wire Line
	6350 6000 5100 6000
Connection ~ 6350 6000
Wire Wire Line
	5100 5900 6150 5900
Wire Wire Line
	6150 5900 6150 5700
Wire Wire Line
	6150 5700 6700 5700
Wire Wire Line
	6700 5700 6700 5900
Wire Wire Line
	6700 5900 7050 5900
Wire Wire Line
	7050 5700 7050 5600
Wire Wire Line
	6050 5600 6050 5800
Wire Wire Line
	6050 5800 5100 5800
Wire Wire Line
	6050 5600 7050 5600
$Comp
L Connector_Generic:Conn_01x10 J1
U 1 1 600BE278
P 3700 3750
F 0 "J1" H 3780 3696 50  0000 L CNN
F 1 "Conn_01x10" H 3780 3651 50  0001 L CNN
F 2 "Connector_PinHeader_2.54mm:PinHeader_1x10_P2.54mm_Vertical" H 3700 3750 50  0001 C CNN
F 3 "~" H 3700 3750 50  0001 C CNN
	1    3700 3750
	1    0    0    1   
$EndComp
$Comp
L Connector_Generic:Conn_01x10 J2
U 1 1 600C0EC2
P 4300 3750
F 0 "J2" H 4380 3696 50  0000 L CNN
F 1 "Conn_01x10" H 4380 3651 50  0001 L CNN
F 2 "Connector_PinHeader_2.54mm:PinHeader_1x10_P2.54mm_Vertical" H 4300 3750 50  0001 C CNN
F 3 "~" H 4300 3750 50  0001 C CNN
	1    4300 3750
	-1   0    0    1   
$EndComp
Wire Wire Line
	3500 3250 3400 3250
Wire Wire Line
	3400 3250 3400 3100
Wire Wire Line
	3400 3100 4000 3100
Wire Wire Line
	4600 3100 4600 3250
Wire Wire Line
	4600 3250 4500 3250
Wire Wire Line
	4500 3350 4700 3350
Wire Wire Line
	4700 3350 4700 3000
Wire Wire Line
	3300 3000 3300 3450
Wire Wire Line
	3300 3450 3500 3450
Wire Wire Line
	3300 3450 3300 3650
Wire Wire Line
	3300 3650 3500 3650
Connection ~ 3300 3450
Wire Wire Line
	3300 3850 3500 3850
Connection ~ 3300 3650
Wire Wire Line
	3500 3950 3300 3950
Wire Wire Line
	3300 3650 3300 3850
Connection ~ 3300 3850
Wire Wire Line
	3300 3850 3300 3950
Wire Wire Line
	3300 3950 3300 4050
Wire Wire Line
	3300 4050 3500 4050
Connection ~ 3300 3950
Wire Wire Line
	3500 4150 3300 4150
Wire Wire Line
	3300 4150 3300 4050
Connection ~ 3300 4050
Wire Wire Line
	4500 4050 4700 4050
Wire Wire Line
	4700 4050 4700 3950
Connection ~ 4700 3350
Wire Wire Line
	4500 3950 4700 3950
Connection ~ 4700 3950
Wire Wire Line
	4700 3950 4700 3850
Wire Wire Line
	4500 3850 4700 3850
Connection ~ 4700 3850
Wire Wire Line
	4700 3850 4700 3350
Wire Wire Line
	4500 3750 4500 3650
$Comp
L power:+5V #PWR0103
U 1 1 600CEE6D
P 4000 3000
F 0 "#PWR0103" H 4000 2850 50  0001 C CNN
F 1 "+5V" H 4015 3173 50  0000 C CNN
F 2 "" H 4000 3000 50  0001 C CNN
F 3 "" H 4000 3000 50  0001 C CNN
	1    4000 3000
	1    0    0    -1  
$EndComp
Connection ~ 4000 3000
Wire Wire Line
	4000 3000 3300 3000
Connection ~ 4000 3100
Wire Wire Line
	4000 3100 4600 3100
Wire Wire Line
	4000 3000 4700 3000
Wire Wire Line
	4500 3650 4800 3650
Connection ~ 4500 3650
Wire Wire Line
	4500 3450 4800 3450
$Comp
L power:+5V #PWR0111
U 1 1 600FB06A
P 2500 3150
F 0 "#PWR0111" H 2500 3000 50  0001 C CNN
F 1 "+5V" H 2515 3323 50  0000 C CNN
F 2 "" H 2500 3150 50  0001 C CNN
F 3 "" H 2500 3150 50  0001 C CNN
	1    2500 3150
	1    0    0    -1  
$EndComp
Text Label 6400 2700 2    50   ~ 0
CLK
Text Label 6400 2900 2    50   ~ 0
DATA
Text Label 6500 4150 2    50   ~ 0
SELECT
Text Label 1600 3550 0    50   ~ 0
OUT
$Comp
L power:+5V #PWR0113
U 1 1 6014E1B7
P 1400 1100
F 0 "#PWR0113" H 1400 950 50  0001 C CNN
F 1 "+5V" H 1415 1273 50  0000 C CNN
F 2 "" H 1400 1100 50  0001 C CNN
F 3 "" H 1400 1100 50  0001 C CNN
	1    1400 1100
	1    0    0    -1  
$EndComp
$Comp
L Regulator_Linear:MIC5504-3.3YM5 U1
U 1 1 6014EA61
P 2500 1200
F 0 "U1" H 2500 1567 50  0000 C CNN
F 1 "MIC5504-3.3YM5" H 2500 1476 50  0000 C CNN
F 2 "Package_TO_SOT_SMD:SOT-23-5" H 2500 800 50  0001 C CNN
F 3 "http://ww1.microchip.com/downloads/en/DeviceDoc/MIC550X.pdf" H 2250 1450 50  0001 C CNN
	1    2500 1200
	1    0    0    -1  
$EndComp
Wire Wire Line
	2100 1300 2100 1100
Connection ~ 2100 1100
Wire Wire Line
	2900 1100 3150 1100
$Comp
L power:GND #PWR0114
U 1 1 6015D4CC
P 2500 1500
F 0 "#PWR0114" H 2500 1250 50  0001 C CNN
F 1 "GND" H 2505 1327 50  0000 C CNN
F 2 "" H 2500 1500 50  0001 C CNN
F 3 "" H 2500 1500 50  0001 C CNN
	1    2500 1500
	1    0    0    -1  
$EndComp
Connection ~ 2500 1500
$Comp
L Device:C C1
U 1 1 6016316C
P 1400 1250
F 0 "C1" H 1515 1296 50  0000 L CNN
F 1 "1u" H 1515 1205 50  0000 L CNN
F 2 "Capacitor_SMD:C_0201_0603Metric" H 1438 1100 50  0001 C CNN
F 3 "~" H 1400 1250 50  0001 C CNN
	1    1400 1250
	1    0    0    -1  
$EndComp
Connection ~ 1400 1100
Wire Wire Line
	1400 1100 1750 1100
Wire Wire Line
	1400 1400 1400 1500
Wire Wire Line
	1400 1500 1750 1500
$Comp
L Device:C C4
U 1 1 6016AF67
P 3600 1250
F 0 "C4" H 3715 1296 50  0000 L CNN
F 1 "1uF" H 3715 1205 50  0000 L CNN
F 2 "Capacitor_SMD:C_0201_0603Metric" H 3638 1100 50  0001 C CNN
F 3 "~" H 3600 1250 50  0001 C CNN
	1    3600 1250
	1    0    0    -1  
$EndComp
Wire Wire Line
	3600 1400 3600 1500
Wire Wire Line
	3600 1500 3150 1500
$Comp
L Device:C C2
U 1 1 6016DFE7
P 1750 1250
F 0 "C2" H 1865 1296 50  0000 L CNN
F 1 "100n" H 1865 1205 50  0000 L CNN
F 2 "Capacitor_SMD:C_0201_0603Metric" H 1788 1100 50  0001 C CNN
F 3 "~" H 1750 1250 50  0001 C CNN
	1    1750 1250
	1    0    0    -1  
$EndComp
Connection ~ 1750 1100
Wire Wire Line
	1750 1100 2100 1100
Wire Wire Line
	1750 1400 1750 1500
Connection ~ 1750 1500
Wire Wire Line
	1750 1500 2500 1500
$Comp
L Device:C C3
U 1 1 60173441
P 3150 1250
F 0 "C3" H 3265 1296 50  0000 L CNN
F 1 "100n" H 3265 1205 50  0000 L CNN
F 2 "Capacitor_SMD:C_0201_0603Metric" H 3188 1100 50  0001 C CNN
F 3 "~" H 3150 1250 50  0001 C CNN
	1    3150 1250
	1    0    0    -1  
$EndComp
Connection ~ 3150 1100
Wire Wire Line
	3150 1100 3600 1100
Wire Wire Line
	3150 1400 3150 1500
Connection ~ 3150 1500
Wire Wire Line
	3150 1500 2500 1500
Connection ~ 3600 1100
Wire Wire Line
	3000 6200 2600 6200
Wire Wire Line
	3000 5800 2600 5800
Text Label 2600 5800 0    50   ~ 0
CLK
Text Label 2600 6200 0    50   ~ 0
DATA
$Comp
L Switch:SW_DIP_x06 SW1
U 1 1 6019D311
P 2000 6500
F 0 "SW1" H 2000 7067 50  0000 C CNN
F 1 "SW_DIP_x06" H 2000 6976 50  0000 C CNN
F 2 "Package_DIP:DIP-12_W7.62mm_SMDSocket_SmallPads" H 2000 6500 50  0001 C CNN
F 3 "~" H 2000 6500 50  0001 C CNN
	1    2000 6500
	1    0    0    1   
$EndComp
Wire Wire Line
	2300 6300 3000 6300
Wire Wire Line
	4250 5200 4350 5200
Connection ~ 4250 5200
Wire Wire Line
	3650 5200 3750 5200
Connection ~ 3750 5200
Wire Wire Line
	3750 5200 3850 5200
Connection ~ 3850 5200
Connection ~ 3650 5200
Wire Wire Line
	3850 5200 3950 5200
Connection ~ 3950 5200
Wire Wire Line
	3950 5200 4050 5200
Connection ~ 4050 5200
Wire Wire Line
	4150 5200 4250 5200
Wire Wire Line
	4050 5200 4150 5200
Connection ~ 4150 5200
$Comp
L MachXO2:MachXO2-1200-QFN32 U2
U 1 1 600B228C
P 4050 6250
F 0 "U2" H 4800 7200 60  0000 C CNN
F 1 "MachXO2-1200-QFN32" H 4750 5300 60  0000 C CNN
F 2 "Package_DFN_QFN:QFN-32-1EP_5x5mm_P0.5mm_EP3.1x3.1mm_ThermalVias" H 3000 6700 50  0001 C CNN
F 3 "" H 3000 6700 50  0001 C CNN
	1    4050 6250
	1    0    0    -1  
$EndComp
Wire Wire Line
	2300 6700 3000 6700
Wire Wire Line
	2300 6400 3000 6400
Wire Wire Line
	2300 6500 3000 6500
Wire Wire Line
	2300 6600 3000 6600
Wire Wire Line
	2300 6800 3000 6800
Wire Wire Line
	1700 6800 1700 6700
Connection ~ 1700 6700
Wire Wire Line
	1700 6700 1700 6600
Connection ~ 1700 6600
Wire Wire Line
	1700 6600 1700 6500
Connection ~ 1700 6500
Wire Wire Line
	1700 6500 1700 6400
Connection ~ 1700 6400
Wire Wire Line
	1700 6400 1700 6300
$Comp
L power:+3.3V #PWR0115
U 1 1 601E517E
P 1500 6800
F 0 "#PWR0115" H 1500 6650 50  0001 C CNN
F 1 "+3.3V" H 1515 6973 50  0000 C CNN
F 2 "" H 1500 6800 50  0001 C CNN
F 3 "" H 1500 6800 50  0001 C CNN
	1    1500 6800
	1    0    0    1   
$EndComp
Wire Wire Line
	1500 6800 1700 6800
Connection ~ 1700 6800
NoConn ~ 3000 6000
NoConn ~ 3500 3750
NoConn ~ 3500 3350
NoConn ~ 4500 4150
$Comp
L Device:C_Small C6
U 1 1 60247314
P 4750 1300
F 0 "C6" H 4842 1346 50  0000 L CNN
F 1 "100n" H 4842 1255 50  0000 L CNN
F 2 "Capacitor_SMD:C_0201_0603Metric" H 4750 1300 50  0001 C CNN
F 3 "~" H 4750 1300 50  0001 C CNN
	1    4750 1300
	1    0    0    -1  
$EndComp
$Comp
L Device:C_Small C7
U 1 1 6024786F
P 5150 1300
F 0 "C7" H 5242 1346 50  0000 L CNN
F 1 "10n" H 5242 1255 50  0000 L CNN
F 2 "Capacitor_SMD:C_0201_0603Metric" H 5150 1300 50  0001 C CNN
F 3 "~" H 5150 1300 50  0001 C CNN
	1    5150 1300
	1    0    0    -1  
$EndComp
$Comp
L Device:C_Small C8
U 1 1 6024855A
P 5500 1300
F 0 "C8" H 5592 1346 50  0000 L CNN
F 1 "100n" H 5592 1255 50  0000 L CNN
F 2 "Capacitor_SMD:C_0201_0603Metric" H 5500 1300 50  0001 C CNN
F 3 "~" H 5500 1300 50  0001 C CNN
	1    5500 1300
	1    0    0    -1  
$EndComp
$Comp
L Device:C_Small C9
U 1 1 60248560
P 5900 1300
F 0 "C9" H 5992 1346 50  0000 L CNN
F 1 "10n" H 5992 1255 50  0000 L CNN
F 2 "Capacitor_SMD:C_0201_0603Metric" H 5900 1300 50  0001 C CNN
F 3 "~" H 5900 1300 50  0001 C CNN
	1    5900 1300
	1    0    0    -1  
$EndComp
$Comp
L Device:C_Small C10
U 1 1 6024BABF
P 6250 1300
F 0 "C10" H 6342 1346 50  0000 L CNN
F 1 "100n" H 6342 1255 50  0000 L CNN
F 2 "Capacitor_SMD:C_0201_0603Metric" H 6250 1300 50  0001 C CNN
F 3 "~" H 6250 1300 50  0001 C CNN
	1    6250 1300
	1    0    0    -1  
$EndComp
$Comp
L Device:C_Small C11
U 1 1 6024BAC5
P 6650 1300
F 0 "C11" H 6742 1346 50  0000 L CNN
F 1 "10n" H 6742 1255 50  0000 L CNN
F 2 "Capacitor_SMD:C_0201_0603Metric" H 6650 1300 50  0001 C CNN
F 3 "~" H 6650 1300 50  0001 C CNN
	1    6650 1300
	1    0    0    -1  
$EndComp
$Comp
L Device:C C5
U 1 1 6024EDFA
P 4050 1250
F 0 "C5" H 4165 1296 50  0000 L CNN
F 1 "10uF" H 4165 1205 50  0000 L CNN
F 2 "Capacitor_SMD:C_0201_0603Metric" H 4088 1100 50  0001 C CNN
F 3 "~" H 4050 1250 50  0001 C CNN
	1    4050 1250
	1    0    0    -1  
$EndComp
Wire Wire Line
	4050 1400 4050 1500
Connection ~ 3600 1500
Wire Wire Line
	3600 1100 4050 1100
$Comp
L power:+3.3V #PWR0116
U 1 1 60259C9B
P 7400 1100
F 0 "#PWR0116" H 7400 950 50  0001 C CNN
F 1 "+3.3V" H 7415 1273 50  0000 C CNN
F 2 "" H 7400 1100 50  0001 C CNN
F 3 "" H 7400 1100 50  0001 C CNN
	1    7400 1100
	1    0    0    -1  
$EndComp
$Comp
L Device:Ferrite_Bead_Small FB1
U 1 1 6025DF83
P 4450 1100
F 0 "FB1" V 4305 1100 50  0000 C CNN
F 1 "Ferrite_Bead_Small" V 4304 1100 50  0001 C CNN
F 2 "Capacitor_SMD:C_0201_0603Metric" V 4380 1100 50  0001 C CNN
F 3 "~" H 4450 1100 50  0001 C CNN
	1    4450 1100
	0    1    1    0   
$EndComp
$Comp
L Device:C_Small C12
U 1 1 60265E89
P 7000 1300
F 0 "C12" H 7092 1346 50  0000 L CNN
F 1 "100n" H 7092 1255 50  0000 L CNN
F 2 "Capacitor_SMD:C_0201_0603Metric" H 7000 1300 50  0001 C CNN
F 3 "~" H 7000 1300 50  0001 C CNN
	1    7000 1300
	1    0    0    -1  
$EndComp
$Comp
L Device:C_Small C13
U 1 1 60265E8F
P 7400 1300
F 0 "C13" H 7492 1346 50  0000 L CNN
F 1 "10n" H 7492 1255 50  0000 L CNN
F 2 "Capacitor_SMD:C_0201_0603Metric" H 7400 1300 50  0001 C CNN
F 3 "~" H 7400 1300 50  0001 C CNN
	1    7400 1300
	1    0    0    -1  
$EndComp
Wire Wire Line
	3600 1500 4050 1500
Connection ~ 4050 1500
Wire Wire Line
	4750 1100 5150 1100
Wire Wire Line
	4050 1500 4750 1500
Wire Wire Line
	4350 1100 4050 1100
Connection ~ 4050 1100
Wire Wire Line
	4550 1100 4750 1100
Wire Wire Line
	4750 1100 4750 1200
Connection ~ 4750 1100
Wire Wire Line
	5150 1200 5150 1100
Connection ~ 5150 1100
Wire Wire Line
	5150 1100 5500 1100
Wire Wire Line
	5500 1200 5500 1100
Connection ~ 5500 1100
Wire Wire Line
	5500 1100 5900 1100
Wire Wire Line
	5900 1200 5900 1100
Connection ~ 5900 1100
Wire Wire Line
	5900 1100 6250 1100
Wire Wire Line
	6250 1200 6250 1100
Connection ~ 6250 1100
Wire Wire Line
	6250 1100 6650 1100
Wire Wire Line
	6650 1200 6650 1100
Connection ~ 6650 1100
Wire Wire Line
	6650 1100 7000 1100
Wire Wire Line
	7000 1200 7000 1100
Connection ~ 7000 1100
Wire Wire Line
	7000 1100 7400 1100
Wire Wire Line
	7400 1200 7400 1100
Connection ~ 7400 1100
Wire Wire Line
	4750 1400 4750 1500
Wire Wire Line
	5150 1500 5150 1400
Wire Wire Line
	5500 1500 5500 1400
Wire Wire Line
	5900 1500 5900 1400
Wire Wire Line
	6250 1500 6250 1400
Wire Wire Line
	6650 1500 6650 1400
Wire Wire Line
	7000 1500 7000 1400
Wire Wire Line
	7400 1500 7400 1400
Connection ~ 4750 1500
Wire Wire Line
	4750 1500 5150 1500
Connection ~ 5150 1500
Wire Wire Line
	5150 1500 5500 1500
Connection ~ 5500 1500
Wire Wire Line
	5500 1500 5900 1500
Connection ~ 5900 1500
Wire Wire Line
	5900 1500 6250 1500
Connection ~ 6250 1500
Wire Wire Line
	6250 1500 6650 1500
Connection ~ 6650 1500
Wire Wire Line
	6650 1500 7000 1500
Connection ~ 7000 1500
Wire Wire Line
	7000 1500 7400 1500
$Comp
L power:PWR_FLAG #FLG0101
U 1 1 60326B0A
P 3300 3000
F 0 "#FLG0101" H 3300 3075 50  0001 C CNN
F 1 "PWR_FLAG" H 3300 3173 50  0001 C CNN
F 2 "" H 3300 3000 50  0001 C CNN
F 3 "~" H 3300 3000 50  0001 C CNN
	1    3300 3000
	1    0    0    -1  
$EndComp
Connection ~ 3300 3000
$Comp
L power:PWR_FLAG #FLG0102
U 1 1 6032744B
P 4600 3100
F 0 "#FLG0102" H 4600 3175 50  0001 C CNN
F 1 "PWR_FLAG" H 4600 3273 50  0001 C CNN
F 2 "" H 4600 3100 50  0001 C CNN
F 3 "~" H 4600 3100 50  0001 C CNN
	1    4600 3100
	1    0    0    -1  
$EndComp
Connection ~ 4600 3100
$Comp
L power:PWR_FLAG #FLG0103
U 1 1 6032816E
P 7000 1100
F 0 "#FLG0103" H 7000 1175 50  0001 C CNN
F 1 "PWR_FLAG" H 7000 1273 50  0001 C CNN
F 2 "" H 7000 1100 50  0001 C CNN
F 3 "~" H 7000 1100 50  0001 C CNN
	1    7000 1100
	1    0    0    -1  
$EndComp
Wire Wire Line
	4500 3550 4900 3550
Wire Wire Line
	4800 4150 5200 4150
$Comp
L power:GND #PWR0105
U 1 1 60136478
P 6950 6200
F 0 "#PWR0105" H 6950 5950 50  0001 C CNN
F 1 "GND" H 6955 6027 50  0000 C CNN
F 2 "" H 6950 6200 50  0001 C CNN
F 3 "" H 6950 6200 50  0001 C CNN
	1    6950 6200
	1    0    0    -1  
$EndComp
Wire Wire Line
	6950 6200 6950 5800
Connection ~ 6950 5800
Wire Wire Line
	6950 5800 7050 5800
Wire Wire Line
	6350 5800 6950 5800
$Comp
L power:GND #PWR0107
U 1 1 601570CA
P 5600 3300
F 0 "#PWR0107" H 5600 3050 50  0001 C CNN
F 1 "GND" H 5605 3127 50  0000 C CNN
F 2 "" H 5600 3300 50  0001 C CNN
F 3 "" H 5600 3300 50  0001 C CNN
	1    5600 3300
	1    0    0    -1  
$EndComp
Wire Wire Line
	6000 2700 6400 2700
Wire Wire Line
	6000 2900 6400 2900
$Comp
L power:+3.3V #PWR0110
U 1 1 601A1B08
P 2300 3150
F 0 "#PWR0110" H 2300 3000 50  0001 C CNN
F 1 "+3.3V" H 2315 3323 50  0000 C CNN
F 2 "" H 2300 3150 50  0001 C CNN
F 3 "" H 2300 3150 50  0001 C CNN
	1    2300 3150
	1    0    0    -1  
$EndComp
$Comp
L Logic_LevelTranslator:SN74LVC1T45DBV U4
U 1 1 60151A6E
P 5600 4150
F 0 "U4" H 5800 4550 50  0000 L CNN
F 1 "SN74LVC1T45DBV" H 4750 4550 50  0000 L CNN
F 2 "Package_TO_SOT_SMD:SOT-23-6" H 5600 3700 50  0001 C CNN
F 3 "http://www.ti.com/lit/ds/symlink/sn74lvc1t45.pdf" H 4700 3500 50  0001 C CNN
	1    5600 4150
	-1   0    0    -1  
$EndComp
$Comp
L Logic_LevelTranslator:SN74LVC2T45DCUR U3
U 1 1 60153037
P 5600 2800
F 0 "U3" H 5900 3300 50  0000 C CNN
F 1 "SN74LVC2T45DCUR" H 5050 3300 50  0000 C CNN
F 2 "Package_SO:VSSOP-8_2.4x2.1mm_P0.5mm" H 5650 2250 50  0001 C CNN
F 3 "http://www.ti.com/lit/ds/symlink/sn74lvc2t45.pdf" H 4700 2250 50  0001 C CNN
	1    5600 2800
	-1   0    0    -1  
$EndComp
$Comp
L Logic_LevelTranslator:SN74LVC1T45DBV U5
U 1 1 60154949
P 2400 3550
F 0 "U5" H 2650 3950 50  0000 L CNN
F 1 "SN74LVC1T45DBV" H 1600 3950 50  0000 L CNN
F 2 "Package_TO_SOT_SMD:SOT-23-6" H 2400 3100 50  0001 C CNN
F 3 "http://www.ti.com/lit/ds/symlink/sn74lvc1t45.pdf" H 1500 2900 50  0001 C CNN
	1    2400 3550
	-1   0    0    -1  
$EndComp
$Comp
L power:GND #PWR0104
U 1 1 600D0919
P 4000 3100
F 0 "#PWR0104" H 4000 2850 50  0001 C CNN
F 1 "GND" H 4005 2927 50  0000 C CNN
F 2 "" H 4000 3100 50  0001 C CNN
F 3 "" H 4000 3100 50  0001 C CNN
	1    4000 3100
	1    0    0    -1  
$EndComp
$Comp
L power:GND #PWR0108
U 1 1 601718F7
P 2400 3950
F 0 "#PWR0108" H 2400 3700 50  0001 C CNN
F 1 "GND" H 2405 3777 50  0000 C CNN
F 2 "" H 2400 3950 50  0001 C CNN
F 3 "" H 2400 3950 50  0001 C CNN
	1    2400 3950
	1    0    0    -1  
$EndComp
Wire Wire Line
	1600 3550 2000 3550
Wire Wire Line
	5600 3300 6000 3300
Wire Wire Line
	6000 3300 6000 3100
Wire Wire Line
	2800 3750 2800 3950
Wire Wire Line
	2800 3950 2400 3950
Connection ~ 2400 3950
Wire Wire Line
	2800 3550 3500 3550
Wire Wire Line
	5200 2700 4800 2700
Connection ~ 5600 3300
Wire Wire Line
	6000 4150 6500 4150
$Comp
L power:+5V #PWR0109
U 1 1 60271AA2
P 5500 2300
F 0 "#PWR0109" H 5500 2150 50  0001 C CNN
F 1 "+5V" H 5515 2473 50  0000 C CNN
F 2 "" H 5500 2300 50  0001 C CNN
F 3 "" H 5500 2300 50  0001 C CNN
	1    5500 2300
	1    0    0    -1  
$EndComp
$Comp
L power:+3.3V #PWR0112
U 1 1 60271AA8
P 5700 2300
F 0 "#PWR0112" H 5700 2150 50  0001 C CNN
F 1 "+3.3V" H 5715 2473 50  0000 C CNN
F 2 "" H 5700 2300 50  0001 C CNN
F 3 "" H 5700 2300 50  0001 C CNN
	1    5700 2300
	1    0    0    -1  
$EndComp
$Comp
L power:+5V #PWR0117
U 1 1 60288B00
P 5500 3750
F 0 "#PWR0117" H 5500 3600 50  0001 C CNN
F 1 "+5V" H 5515 3923 50  0000 C CNN
F 2 "" H 5500 3750 50  0001 C CNN
F 3 "" H 5500 3750 50  0001 C CNN
	1    5500 3750
	1    0    0    -1  
$EndComp
$Comp
L power:+3.3V #PWR0118
U 1 1 60288B06
P 5700 3750
F 0 "#PWR0118" H 5700 3600 50  0001 C CNN
F 1 "+3.3V" H 5715 3923 50  0000 C CNN
F 2 "" H 5700 3750 50  0001 C CNN
F 3 "" H 5700 3750 50  0001 C CNN
	1    5700 3750
	1    0    0    -1  
$EndComp
Wire Wire Line
	6000 4350 6000 4550
Wire Wire Line
	6000 4550 5600 4550
$Comp
L power:GND #PWR0119
U 1 1 602A51B9
P 5600 4550
F 0 "#PWR0119" H 5600 4300 50  0001 C CNN
F 1 "GND" H 5605 4377 50  0000 C CNN
F 2 "" H 5600 4550 50  0001 C CNN
F 3 "" H 5600 4550 50  0001 C CNN
	1    5600 4550
	1    0    0    -1  
$EndComp
Connection ~ 5600 4550
Wire Wire Line
	4800 3650 4800 4150
Wire Wire Line
	4800 2700 4800 3450
Wire Wire Line
	4900 3550 4900 2900
Wire Wire Line
	4900 2900 5200 2900
NoConn ~ 5100 6200
NoConn ~ 5100 6300
NoConn ~ 5100 6400
NoConn ~ 5100 6500
NoConn ~ 5100 6600
NoConn ~ 5100 6700
NoConn ~ 5100 6800
Text Label 2600 5900 0    50   ~ 0
OUT
Wire Wire Line
	3000 5900 2600 5900
Text Label 2600 6100 0    50   ~ 0
SELECT
Wire Wire Line
	3000 6100 2600 6100
$EndSCHEMATC
