999
dxfrw 0.5.10
0
SECTION
2
HEADER
9
$ACADVER
1
AC1021
9
$HANDSEED
5
20000
9
$DWGCODEPAGE
3
ANSI_1252
9
$INSBASE
10
0
20
0
30
0
9
$EXTMIN
10
2
20
2
30
0
9
$EXTMAX
10
372.000027
20
346.000053
30
0
9
$LIMMIN
10
0
20
0
9
$LIMMAX
10
420
20
297
9
$ORTHOMODE
70
0
9
$LTSCALE
40
1
9
$TEXTSTYLE
7
STANDARD
9
$CLAYER
8
0
9
$DIMASZ
40
2.5
9
$DIMLFAC
40
1
9
$DIMSCALE
40
1
9
$DIMEXO
40
0.625
9
$DIMEXE
40
1.25
9
$DIMTXT
40
2.5
9
$DIMTSZ
40
0
9
$DIMAUNIT
70
0
9
$DIMADEC
70
0
9
$DIMLUNIT
70
2
9
$DIMSTYLE
2
Standard
9
$DIMGAP
40
0.625
9
$DIMTIH
70
0
9
$LUNITS
70
2
9
$LUPREC
70
4
9
$AUNITS
70
0
9
$AUPREC
70
2
9
$SPLINESEGS
70
8
9
$GRIDMODE
70
1
9
$SNAPSTYLE
70
0
9
$PINSBASE
10
0
20
0
30
0
9
$PLIMMIN
10
0
20
0
9
$PLIMMAX
10
210
20
297
9
$INSUNITS
70
4
9
$PSVPSCALE
40
1
0
ENDSEC
0
SECTION
2
CLASSES
0
ENDSEC
0
SECTION
2
TABLES
0
TABLE
2
VPORT
5
8
330
0
100
AcDbSymbolTable
70
1
0
VPORT
5
31
330
2
100
AcDbSymbolTableRecord
100
AcDbViewportTableRecord
2
*ACTIVE
70
0
10
0
20
0
11
1
21
1
12
251.625213593
22
175.367859187
13
0
23
0
14
10
24
10
15
10
25
10
16
0
26
0
36
1
17
0
27
0
37
0
40
353.622432105
41
1.78775510204
42
50
43
0
44
0
50
0
51
0
71
0
72
100
73
1
74
3
75
0
76
1
77
0
78
0
281
0
65
1
110
0
120
0
130
0
111
1
121
0
131
0
112
0
122
1
132
0
79
0
146
0
348
10020
60
7
61
5
292
1
282
1
141
0
142
0
63
250
421
3358443
0
ENDTAB
0
TABLE
2
LTYPE
5
5
330
0
100
AcDbSymbolTable
70
4
0
LTYPE
5
14
330
5
100
AcDbSymbolTableRecord
100
AcDbLinetypeTableRecord
2
ByBlock
70
0
3

72
65
73
0
40
0
0
LTYPE
5
15
330
5
100
AcDbSymbolTableRecord
100
AcDbLinetypeTableRecord
2
ByLayer
70
0
3

72
65
73
0
40
0
0
LTYPE
5
16
330
5
100
AcDbSymbolTableRecord
100
AcDbLinetypeTableRecord
2
Continuous
70
0
3
Solid line
72
65
73
0
40
0
0
LTYPE
5
32
330
5
100
AcDbSymbolTableRecord
100
AcDbLinetypeTableRecord
2
DOT
70
0
3
Dot . . . . . . . . . . . . . . . . . . . . . .
72
65
73
2
40
6.35
49
0
74
0
49
-6.35
74
0
0
LTYPE
5
33
330
5
100
AcDbSymbolTableRecord
100
AcDbLinetypeTableRecord
2
DOT2
70
0
3
Dot (.5x) .....................................
72
65
73
2
40
3.175
49
0
74
0
49
-3.175
74
0
0
LTYPE
5
34
330
5
100
AcDbSymbolTableRecord
100
AcDbLinetypeTableRecord
2
DOTX2
70
0
3
Dot (2x) .  .  .  .  .  .  .  .  .  .  .  .  .
72
65
73
2
40
12.7
49
0
74
0
49
-12.7
74
0
0
LTYPE
5
35
330
5
100
AcDbSymbolTableRecord
100
AcDbLinetypeTableRecord
2
DASHED
70
0
3
Dot . . . . . . . . . . . . . . . . . . . . . .
72
65
73
2
40
19.05
49
12.7
74
0
49
-6.35
74
0
0
LTYPE
5
36
330
5
100
AcDbSymbolTableRecord
100
AcDbLinetypeTableRecord
2
DASHED2
70
0
3
Dashed (.5x) _ _ _ _ _ _ _ _ _ _ _ _ _ _ _ _ _
72
65
73
2
40
9.525
49
6.35
74
0
49
-3.175
74
0
0
LTYPE
5
37
330
5
100
AcDbSymbolTableRecord
100
AcDbLinetypeTableRecord
2
DASHEDX2
70
0
3
Dashed (2x) ____  ____  ____  ____  ____  ___
72
65
73
2
40
38.1
49
25.4
74
0
49
-12.7
74
0
0
LTYPE
5
38
330
5
100
AcDbSymbolTableRecord
100
AcDbLinetypeTableRecord
2
DASHDOT
70
0
3
Dash dot __ . __ . __ . __ . __ . __ . __ . __
72
65
73
4
40
25.4
49
12.7
74
0
49
-6.35
74
0
49
0
74
0
49
-6.35
74
0
0
LTYPE
5
39
330
5
100
AcDbSymbolTableRecord
100
AcDbLinetypeTableRecord
2
DASHDOT2
70
0
3
Dash dot (.5x) _._._._._._._._._._._._._._._.
72
65
73
4
40
12.7
49
6.35
74
0
49
-3.175
74
0
49
0
74
0
49
-3.175
74
0
0
LTYPE
5
3A
330
5
100
AcDbSymbolTableRecord
100
AcDbLinetypeTableRecord
2
DASHDOTX2
70
0
3
Dash dot (2x) ____  .  ____  .  ____  .  ___
72
65
73
4
40
50.8
49
25.4
74
0
49
-12.7
74
0
49
0
74
0
49
-12.7
74
0
0
LTYPE
5
3B
330
5
100
AcDbSymbolTableRecord
100
AcDbLinetypeTableRecord
2
DIVIDE
70
0
3
Divide ____ . . ____ . . ____ . . ____ . . ____
72
65
73
6
40
31.75
49
12.7
74
0
49
-6.35
74
0
49
0
74
0
49
-6.35
74
0
49
0
74
0
49
-6.35
74
0
0
LTYPE
5
3C
330
5
100
AcDbSymbolTableRecord
100
AcDbLinetypeTableRecord
2
DIVIDE2
70
0
3
Divide (.5x) __..__..__..__..__..__..__..__.._
72
65
73
6
40
15.875
49
6.35
74
0
49
-3.175
74
0
49
0
74
0
49
-3.175
74
0
49
0
74
0
49
-3.175
74
0
0
LTYPE
5
3D
330
5
100
AcDbSymbolTableRecord
100
AcDbLinetypeTableRecord
2
DIVIDEX2
70
0
3
Divide (2x) ________  .  .  ________  .  .  _
72
65
73
6
40
63.5
49
25.4
74
0
49
-12.7
74
0
49
0
74
0
49
-12.7
74
0
49
0
74
0
49
-12.7
74
0
0
LTYPE
5
3E
330
5
100
AcDbSymbolTableRecord
100
AcDbLinetypeTableRecord
2
BORDER
70
0
3
Border __ __ . __ __ . __ __ . __ __ . __ __ .
72
65
73
6
40
44.45
49
12.7
74
0
49
-6.35
74
0
49
12.7
74
0
49
-6.35
74
0
49
0
74
0
49
-6.35
74
0
0
LTYPE
5
3F
330
5
100
AcDbSymbolTableRecord
100
AcDbLinetypeTableRecord
2
BORDER2
70
0
3
Border (.5x) __.__.__.__.__.__.__.__.__.__.__.
72
65
73
6
40
22.225
49
6.35
74
0
49
-3.175
74
0
49
6.35
74
0
49
-3.175
74
0
49
0
74
0
49
-3.175
74
0
0
LTYPE
5
40
330
5
100
AcDbSymbolTableRecord
100
AcDbLinetypeTableRecord
2
BORDERX2
70
0
3
Border (2x) ____  ____  .  ____  ____  .  ___
72
65
73
6
40
88.9
49
25.4
74
0
49
-12.7
74
0
49
25.4
74
0
49
-12.7
74
0
49
0
74
0
49
-12.7
74
0
0
LTYPE
5
41
330
5
100
AcDbSymbolTableRecord
100
AcDbLinetypeTableRecord
2
CENTER
70
0
3
Center ____ _ ____ _ ____ _ ____ _ ____ _ ____
72
65
73
4
40
50.8
49
31.75
74
0
49
-6.35
74
0
49
6.35
74
0
49
-6.35
74
0
0
LTYPE
5
42
330
5
100
AcDbSymbolTableRecord
100
AcDbLinetypeTableRecord
2
CENTER2
70
0
3
Center (.5x) ___ _ ___ _ ___ _ ___ _ ___ _ ___
72
65
73
4
40
28.575
49
19.05
74
0
49
-3.175
74
0
49
3.175
74
0
49
-3.175
74
0
0
LTYPE
5
43
330
5
100
AcDbSymbolTableRecord
100
AcDbLinetypeTableRecord
2
CENTERX2
70
0
3
Center (2x) ________  __  ________  __  _____
72
65
73
4
40
101.6
49
63.5
74
0
49
-12.7
74
0
49
12.7
74
0
49
-12.7
74
0
0
ENDTAB
0
TABLE
2
LAYER
5
2
330
0
100
AcDbSymbolTable
70
1
0
LAYER
5
10
330
2
100
AcDbSymbolTableRecord
100
AcDbLayerTableRecord
2
0
70
0
62
7
6
CONTINUOUS
370
0
390
F
0
LAYER
5
44
330
2
100
AcDbSymbolTableRecord
100
AcDbLayerTableRecord
2
PRINCIPAL
70
0
62
7
6
CONTINUOUS
370
-3
390
F
0
ENDTAB
0
TABLE
2
STYLE
5
3
330
0
100
AcDbSymbolTable
70
3
0
STYLE
5
45
330
2
100
AcDbSymbolTableRecord
100
AcDbTextStyleTableRecord
2
Standard
70
0
40
0
41
1
50
0
71
0
42
1
3
txt
4

0
ENDTAB
0
TABLE
2
VIEW
5
6
330
0
100
AcDbSymbolTable
70
0
0
ENDTAB
0
TABLE
2
UCS
5
7
330
0
100
AcDbSymbolTable
70
0
0
ENDTAB
0
TABLE
2
APPID
5
9
330
0
100
AcDbSymbolTable
70
1
0
APPID
5
12
330
9
100
AcDbSymbolTableRecord
100
AcDbRegAppTableRecord
2
ACAD
70
0
0
ENDTAB
0
TABLE
2
DIMSTYLE
5
A
330
0
100
AcDbSymbolTable
70
1
100
AcDbDimStyleTable
71
1
0
DIMSTYLE
105
46
330
A
100
AcDbSymbolTableRecord
100
AcDbDimStyleTableRecord
2
Standard
70
0
40
1
41
2.5
42
0.625
43
0.38
44
1.25
45
0
46
0
47
0
48
0
140
2.5
141
0.09
142
0
143
25.4
144
1
145
0
146
1
147
0.625
148
0
71
0
72
0
73
0
74
1
75
0
76
0
77
0
78
0
79
0
170
0
171
2
172
0
173
0
174
0
175
0
176
0
177
0
178
0
179
0
271
4
272
4
273
2
274
2
275
0
276
0
277
2
278
46
279
0
280
0
281
0
282
0
283
1
284
0
285
0
286
0
288
0
289
3
340
Standard
341

371
-2
372
-2
0
ENDTAB
0
TABLE
2
BLOCK_RECORD
5
1
330
0
100
AcDbSymbolTable
70
2
0
BLOCK_RECORD
5
1F
330
1
100
AcDbSymbolTableRecord
100
AcDbBlockTableRecord
2
*Model_Space
70
0
280
1
281
0
0
BLOCK_RECORD
5
1E
330
1
100
AcDbSymbolTableRecord
100
AcDbBlockTableRecord
2
*Paper_Space
70
0
280
1
281
0
0
ENDTAB
0
ENDSEC
0
SECTION
2
BLOCKS
0
BLOCK
5
20
330
1F
100
AcDbEntity
8
0
100
AcDbBlockBegin
2
*Model_Space
70
0
10
0
20
0
30
0
3
*Model_Space
1

0
ENDBLK
5
21
330
1F
100
AcDbEntity
8
0
100
AcDbBlockEnd
0
BLOCK
5
1C
330
1B
100
AcDbEntity
8
0
100
AcDbBlockBegin
2
*Paper_Space
70
0
10
0
20
0
30
0
3
*Paper_Space
1

0
ENDBLK
5
1D
330
1F
100
AcDbEntity
8
0
100
AcDbBlockEnd
0
ENDSEC
0
SECTION
2
ENTITIES
0
ARC
5
47
100
AcDbEntity
8
PRINCIPAL
6
CONTINUOUS
62
256
370
-1
100
AcDbCircle
10
41.466026
20
8.499998
40
0.5
100
AcDbArc
50
210
51
270
0
ARC
5
48
100
AcDbEntity
8
PRINCIPAL
6
CONTINUOUS
62
256
370
-1
100
AcDbCircle
10
40.600001
20
7.999998
40
0.5
100
AcDbArc
50
30
51
239.999802
0
ARC
5
49
100
AcDbEntity
8
PRINCIPAL
6
CONTINUOUS
62
256
370
-1
100
AcDbCircle
10
40.099998
20
7.133975
40
0.5
100
AcDbArc
50
0
51
59.999802
0
LINE
5
4A
100
AcDbEntity
8
PRINCIPAL
6
CONTINUOUS
62
256
370
-1
100
AcDbLine
10
40.599998
20
7.133975
11
40.599998
21
5.499946
0
ARC
5
4B
100
AcDbEntity
8
PRINCIPAL
6
CONTINUOUS
62
256
370
-1
100
AcDbCircle
10
40.099998
20
5.499946
40
0.5
100
AcDbArc
50
270
51
0
0
LINE
5
4C
100
AcDbEntity
8
PRINCIPAL
6
CONTINUOUS
62
256
370
-1
100
AcDbLine
10
40.099998
20
4.999946
11
35.100001
21
4.999946
0
ARC
5
4D
100
AcDbEntity
8
PRINCIPAL
6
CONTINUOUS
62
256
370
-1
100
AcDbCircle
10
35.100001
20
5.499946
40
0.5
100
AcDbArc
50
180
51
270
0
LINE
5
4E
100
AcDbEntity
8
PRINCIPAL
6
CONTINUOUS
62
256
370
-1
100
AcDbLine
10
34.600001
20
5.499946
11
34.600004
21
7.133973
0
ARC
5
4F
100
AcDbEntity
8
PRINCIPAL
6
CONTINUOUS
62
256
370
-1
100
AcDbCircle
10
35.100004
20
7.133973
40
0.5
100
AcDbArc
50
120
51
180
0
ARC
5
50
100
AcDbEntity
8
PRINCIPAL
6
CONTINUOUS
62
256
370
-1
100
AcDbCircle
10
34.600004
20
7.999998
40
0.5
100
AcDbArc
50
300
51
149.999802
0
ARC
5
51
100
AcDbEntity
8
PRINCIPAL
6
CONTINUOUS
62
256
370
-1
100
AcDbCircle
10
33.73398
20
8.500001
40
0.5
100
AcDbArc
50
270
51
329.999802
0
LINE
5
52
100
AcDbEntity
8
PRINCIPAL
6
CONTINUOUS
62
256
370
-1
100
AcDbLine
10
33.73398
20
8.000001
11
28.600015
21
7.999998
0
LINE
5
53
100
AcDbEntity
8
PRINCIPAL
6
CONTINUOUS
62
256
370
-1
100
AcDbLine
10
28.600015
20
7.999998
11
28.600015
21
10.99997
0
LINE
5
54
100
AcDbEntity
8
PRINCIPAL
6
CONTINUOUS
62
256
370
-1
100
AcDbLine
10
28.600015
20
10.99997
11
29.875009
21
10.99997
0
LINE
5
55
100
AcDbEntity
8
PRINCIPAL
6
CONTINUOUS
62
256
370
-1
100
AcDbLine
10
29.875009
20
10.99997
11
29.875009
21
14.999998
0
LINE
5
56
100
AcDbEntity
8
PRINCIPAL
6
CONTINUOUS
62
256
370
-1
100
AcDbLine
10
29.875009
20
14.999998
11
28.600015
21
14.999998
0
LINE
5
57
100
AcDbEntity
8
PRINCIPAL
6
CONTINUOUS
62
256
370
-1
100
AcDbLine
10
28.600015
20
14.999998
11
28.600015
21
17.999998
0
LINE
5
58
100
AcDbEntity
8
PRINCIPAL
6
CONTINUOUS
62
256
370
-1
100
AcDbLine
10
28.600015
20
17.999998
11
25.400004
21
17.999998
0
LINE
5
59
100
AcDbEntity
8
PRINCIPAL
6
CONTINUOUS
62
256
370
-1
100
AcDbLine
10
25.400004
20
17.999998
11
25.400004
21
14.999998
0
LINE
5
5A
100
AcDbEntity
8
PRINCIPAL
6
CONTINUOUS
62
256
370
-1
100
AcDbLine
10
25.400004
20
14.999998
11
24.125009
21
14.999998
0
LINE
5
5B
100
AcDbEntity
8
PRINCIPAL
6
CONTINUOUS
62
256
370
-1
100
AcDbLine
10
24.125009
20
14.999998
11
24.125009
21
10.99997
0
LINE
5
5C
100
AcDbEntity
8
PRINCIPAL
6
CONTINUOUS
62
256
370
-1
100
AcDbLine
10
24.125009
20
10.99997
11
25.400004
21
10.99997
0
LINE
5
5D
100
AcDbEntity
8
PRINCIPAL
6
CONTINUOUS
62
256
370
-1
100
AcDbLine
10
25.400004
20
10.99997
11
25.400004
21
7.999998
0
LINE
5
5E
100
AcDbEntity
8
PRINCIPAL
6
CONTINUOUS
62
256
370
-1
100
AcDbLine
10
25.400004
20
7.999998
11
20.26601
21
7.999998
0
ARC
5
5F
100
AcDbEntity
8
PRINCIPAL
6
CONTINUOUS
62
256
370
-1
100
AcDbCircle
10
20.26601
20
8.499998
40
0.5
100
AcDbArc
50
210
51
270
0
ARC
5
60
100
AcDbEntity
8
PRINCIPAL
6
CONTINUOUS
62
256
370
-1
100
AcDbCircle
10
19.399985
20
7.999998
40
0.5
100
AcDbArc
50
30
51
239.999802
0
ARC
5
61
100
AcDbEntity
8
PRINCIPAL
6
CONTINUOUS
62
256
370
-1
100
AcDbCircle
10
18.899982
20
7.133975
40
0.5
100
AcDbArc
50
0
51
59.999802
0
LINE
5
62
100
AcDbEntity
8
PRINCIPAL
6
CONTINUOUS
62
256
370
-1
100
AcDbLine
10
19.399982
20
7.133975
11
19.399982
21
5.499946
0
ARC
5
63
100
AcDbEntity
8
PRINCIPAL
6
CONTINUOUS
62
256
370
-1
100
AcDbCircle
10
18.899982
20
5.499946
40
0.5
100
AcDbArc
50
270
51
0
0
LINE
5
64
100
AcDbEntity
8
PRINCIPAL
6
CONTINUOUS
62
256
370
-1
100
AcDbLine
10
18.899982
20
4.999946
11
13.899984
21
4.999946
0
ARC
5
65
100
AcDbEntity
8
PRINCIPAL
6
CONTINUOUS
62
256
370
-1
100
AcDbCircle
10
13.899984
20
5.499946
40
0.5
100
AcDbArc
50
180
51
270
0
LINE
5
66
100
AcDbEntity
8
PRINCIPAL
6
CONTINUOUS
62
256
370
-1
100
AcDbLine
10
13.399984
20
5.499946
11
13.399987
21
7.133973
0
ARC
5
67
100
AcDbEntity
8
PRINCIPAL
6
CONTINUOUS
62
256
370
-1
100
AcDbCircle
10
13.899987
20
7.133973
40
0.5
100
AcDbArc
50
120
51
180
0
ARC
5
68
100
AcDbEntity
8
PRINCIPAL
6
CONTINUOUS
62
256
370
-1
100
AcDbCircle
10
13.399987
20
7.999998
40
0.5
100
AcDbArc
50
300
51
149.999802
0
ARC
5
69
100
AcDbEntity
8
PRINCIPAL
6
CONTINUOUS
62
256
370
-1
100
AcDbCircle
10
12.533964
20
8.500001
40
0.5
100
AcDbArc
50
269.999997
51
329.999802
0
LINE
5
6A
100
AcDbEntity
8
PRINCIPAL
6
CONTINUOUS
62
256
370
-1
100
AcDbLine
10
12.533964
20
8.000001
11
2
21
8
0
LINE
5
6B
100
AcDbEntity
8
PRINCIPAL
6
CONTINUOUS
62
256
370
-1
100
AcDbLine
10
4
20
132.99997
11
12.533964
21
132.999967
0
ARC
5
6C
100
AcDbEntity
8
PRINCIPAL
6
CONTINUOUS
62
256
370
-1
100
AcDbCircle
10
12.533964
20
132.499967
40
0.5
100
AcDbArc
50
30.000198
51
90
0
ARC
5
6D
100
AcDbEntity
8
PRINCIPAL
6
CONTINUOUS
62
256
370
-1
100
AcDbCircle
10
13.399987
20
132.99997
40
0.5
100
AcDbArc
50
210.000198
51
60
0
ARC
5
6E
100
AcDbEntity
8
PRINCIPAL
6
CONTINUOUS
62
256
370
-1
100
AcDbCircle
10
13.899987
20
133.865996
40
0.5
100
AcDbArc
50
180
51
240
0
LINE
5
6F
100
AcDbEntity
8
PRINCIPAL
6
CONTINUOUS
62
256
370
-1
100
AcDbLine
10
13.399987
20
133.865996
11
13.399984
21
345.500053
0
ARC
5
70
100
AcDbEntity
8
PRINCIPAL
6
CONTINUOUS
62
256
370
-1
100
AcDbCircle
10
13.899984
20
345.500053
40
0.5
100
AcDbArc
50
90
51
180
0
LINE
5
71
100
AcDbEntity
8
PRINCIPAL
6
CONTINUOUS
62
256
370
-1
100
AcDbLine
10
13.899984
20
346.000053
11
18.899982
21
346.000053
0
ARC
5
72
100
AcDbEntity
8
PRINCIPAL
6
CONTINUOUS
62
256
370
-1
100
AcDbCircle
10
18.899982
20
345.500053
40
0.5
100
AcDbArc
50
0
51
90
0
LINE
5
73
100
AcDbEntity
8
PRINCIPAL
6
CONTINUOUS
62
256
370
-1
100
AcDbLine
10
19.399982
20
345.500053
11
19.399982
21
343.866025
0
ARC
5
74
100
AcDbEntity
8
PRINCIPAL
6
CONTINUOUS
62
256
370
-1
100
AcDbCircle
10
18.899982
20
343.866025
40
0.5
100
AcDbArc
50
300.000198
51
0
0
ARC
5
75
100
AcDbEntity
8
PRINCIPAL
6
CONTINUOUS
62
256
370
-1
100
AcDbCircle
10
19.399985
20
343.000001
40
0.5
100
AcDbArc
50
120.000199
51
330
0
ARC
5
76
100
AcDbEntity
8
PRINCIPAL
6
CONTINUOUS
62
256
370
-1
100
AcDbCircle
10
20.26601
20
342.500001
40
0.5
100
AcDbArc
50
90
51
150
0
LINE
5
77
100
AcDbEntity
8
PRINCIPAL
6
CONTINUOUS
62
256
370
-1
100
AcDbLine
10
20.26601
20
343.000001
11
25.400004
21
343.000001
0
LINE
5
78
100
AcDbEntity
8
PRINCIPAL
6
CONTINUOUS
62
256
370
-1
100
AcDbLine
10
25.400004
20
343.000001
11
25.400004
21
340.000029
0
LINE
5
79
100
AcDbEntity
8
PRINCIPAL
6
CONTINUOUS
62
256
370
-1
100
AcDbLine
10
25.400004
20
340.000029
11
24.125009
21
340.000029
0
LINE
5
7A
100
AcDbEntity
8
PRINCIPAL
6
CONTINUOUS
62
256
370
-1
100
AcDbLine
10
24.125009
20
340.000029
11
24.125009
21
336.000001
0
LINE
5
7B
100
AcDbEntity
8
PRINCIPAL
6
CONTINUOUS
62
256
370
-1
100
AcDbLine
10
24.125009
20
336.000001
11
25.400004
21
336.000001
0
LINE
5
7C
100
AcDbEntity
8
PRINCIPAL
6
CONTINUOUS
62
256
370
-1
100
AcDbLine
10
25.400004
20
336.000001
11
25.400004
21
333.000001
0
LINE
5
7D
100
AcDbEntity
8
PRINCIPAL
6
CONTINUOUS
62
256
370
-1
100
AcDbLine
10
25.400004
20
333.000001
11
28.600015
21
333.000001
0
LINE
5
7E
100
AcDbEntity
8
PRINCIPAL
6
CONTINUOUS
62
256
370
-1
100
AcDbLine
10
28.600015
20
333.000001
11
28.600015
21
336.000001
0
LINE
5
7F
100
AcDbEntity
8
PRINCIPAL
6
CONTINUOUS
62
256
370
-1
100
AcDbLine
10
28.600015
20
336.000001
11
29.875009
21
336.000001
0
LINE
5
80
100
AcDbEntity
8
PRINCIPAL
6
CONTINUOUS
62
256
370
-1
100
AcDbLine
10
29.875009
20
336.000001
11
29.875009
21
340.000029
0
LINE
5
81
100
AcDbEntity
8
PRINCIPAL
6
CONTINUOUS
62
256
370
-1
100
AcDbLine
10
29.875009
20
340.000029
11
28.600015
21
340.000029
0
LINE
5
82
100
AcDbEntity
8
PRINCIPAL
6
CONTINUOUS
62
256
370
-1
100
AcDbLine
10
28.600015
20
340.000029
11
28.600015
21
343.000001
0
LINE
5
83
100
AcDbEntity
8
PRINCIPAL
6
CONTINUOUS
62
256
370
-1
100
AcDbLine
10
28.600015
20
343.000001
11
33.73398
21
342.999998
0
ARC
5
84
100
AcDbEntity
8
PRINCIPAL
6
CONTINUOUS
62
256
370
-1
100
AcDbCircle
10
33.73398
20
342.499998
40
0.5
100
AcDbArc
50
30.000198
51
90
0
ARC
5
85
100
AcDbEntity
8
PRINCIPAL
6
CONTINUOUS
62
256
370
-1
100
AcDbCircle
10
34.600004
20
343.000001
40
0.5
100
AcDbArc
50
210.000198
51
60
0
ARC
5
86
100
AcDbEntity
8
PRINCIPAL
6
CONTINUOUS
62
256
370
-1
100
AcDbCircle
10
35.100004
20
343.866027
40
0.5
100
AcDbArc
50
180
51
240
0
LINE
5
87
100
AcDbEntity
8
PRINCIPAL
6
CONTINUOUS
62
256
370
-1
100
AcDbLine
10
34.600004
20
343.866027
11
34.600001
21
345.500053
0
ARC
5
88
100
AcDbEntity
8
PRINCIPAL
6
CONTINUOUS
62
256
370
-1
100
AcDbCircle
10
35.100001
20
345.500053
40
0.5
100
AcDbArc
50
90
51
180
0
LINE
5
89
100
AcDbEntity
8
PRINCIPAL
6
CONTINUOUS
62
256
370
-1
100
AcDbLine
10
35.100001
20
346.000053
11
40.099998
21
346.000053
0
ARC
5
8A
100
AcDbEntity
8
PRINCIPAL
6
CONTINUOUS
62
256
370
-1
100
AcDbCircle
10
40.099998
20
345.500053
40
0.5
100
AcDbArc
50
0
51
90
0
LINE
5
8B
100
AcDbEntity
8
PRINCIPAL
6
CONTINUOUS
62
256
370
-1
100
AcDbLine
10
40.599998
20
345.500053
11
40.599998
21
133.865994
0
ARC
5
8C
100
AcDbEntity
8
PRINCIPAL
6
CONTINUOUS
62
256
370
-1
100
AcDbCircle
10
40.099998
20
133.865994
40
0.5
100
AcDbArc
50
300.000198
51
0
0
ARC
5
8D
100
AcDbEntity
8
PRINCIPAL
6
CONTINUOUS
62
256
370
-1
100
AcDbCircle
10
40.600001
20
132.99997
40
0.5
100
AcDbArc
50
120.000198
51
330
0
ARC
5
8E
100
AcDbEntity
8
PRINCIPAL
6
CONTINUOUS
62
256
370
-1
100
AcDbCircle
10
41.466026
20
132.49997
40
0.5
100
AcDbArc
50
90
51
150
0
LINE
5
8F
100
AcDbEntity
8
PRINCIPAL
6
CONTINUOUS
62
256
370
-1
100
AcDbLine
10
41.466026
20
132.99997
11
52.533964
21
132.999967
0
ARC
5
90
100
AcDbEntity
8
PRINCIPAL
6
CONTINUOUS
62
256
370
-1
100
AcDbCircle
10
52.533964
20
132.499967
40
0.5
100
AcDbArc
50
30.000198
51
90
0
ARC
5
91
100
AcDbEntity
8
PRINCIPAL
6
CONTINUOUS
62
256
370
-1
100
AcDbCircle
10
53.399987
20
132.99997
40
0.5
100
AcDbArc
50
210.000198
51
60
0
ARC
5
92
100
AcDbEntity
8
PRINCIPAL
6
CONTINUOUS
62
256
370
-1
100
AcDbCircle
10
53.899987
20
133.865996
40
0.5
100
AcDbArc
50
180
51
240
0
LINE
5
93
100
AcDbEntity
8
PRINCIPAL
6
CONTINUOUS
62
256
370
-1
100
AcDbLine
10
53.399987
20
133.865996
11
53.399984
21
135.500022
0
ARC
5
94
100
AcDbEntity
8
PRINCIPAL
6
CONTINUOUS
62
256
370
-1
100
AcDbCircle
10
53.899984
20
135.500022
40
0.5
100
AcDbArc
50
90
51
180
0
LINE
5
95
100
AcDbEntity
8
PRINCIPAL
6
CONTINUOUS
62
256
370
-1
100
AcDbLine
10
53.899984
20
136.000022
11
58.899982
21
136.000022
0
ARC
5
96
100
AcDbEntity
8
PRINCIPAL
6
CONTINUOUS
62
256
370
-1
100
AcDbCircle
10
58.899982
20
135.500022
40
0.5
100
AcDbArc
50
0
51
90
0
LINE
5
97
100
AcDbEntity
8
PRINCIPAL
6
CONTINUOUS
62
256
370
-1
100
AcDbLine
10
59.399982
20
135.500022
11
59.399982
21
133.865994
0
ARC
5
98
100
AcDbEntity
8
PRINCIPAL
6
CONTINUOUS
62
256
370
-1
100
AcDbCircle
10
58.899982
20
133.865994
40
0.5
100
AcDbArc
50
300.000198
51
0
0
ARC
5
99
100
AcDbEntity
8
PRINCIPAL
6
CONTINUOUS
62
256
370
-1
100
AcDbCircle
10
59.399985
20
132.99997
40
0.5
100
AcDbArc
50
120.000198
51
330
0
ARC
5
9A
100
AcDbEntity
8
PRINCIPAL
6
CONTINUOUS
62
256
370
-1
100
AcDbCircle
10
60.26601
20
132.49997
40
0.5
100
AcDbArc
50
90
51
150
0
LINE
5
9B
100
AcDbEntity
8
PRINCIPAL
6
CONTINUOUS
62
256
370
-1
100
AcDbLine
10
60.26601
20
132.99997
11
65.400004
21
132.99997
0
LINE
5
9C
100
AcDbEntity
8
PRINCIPAL
6
CONTINUOUS
62
256
370
-1
100
AcDbLine
10
65.400004
20
132.99997
11
65.400004
21
129.999998
0
LINE
5
9D
100
AcDbEntity
8
PRINCIPAL
6
CONTINUOUS
62
256
370
-1
100
AcDbLine
10
65.400004
20
129.999998
11
64.125009
21
129.999998
0
LINE
5
9E
100
AcDbEntity
8
PRINCIPAL
6
CONTINUOUS
62
256
370
-1
100
AcDbLine
10
64.125009
20
129.999998
11
64.125009
21
125.99997
0
LINE
5
9F
100
AcDbEntity
8
PRINCIPAL
6
CONTINUOUS
62
256
370
-1
100
AcDbLine
10
64.125009
20
125.99997
11
65.400004
21
125.99997
0
LINE
5
A0
100
AcDbEntity
8
PRINCIPAL
6
CONTINUOUS
62
256
370
-1
100
AcDbLine
10
65.400004
20
125.99997
11
65.400004
21
122.99997
0
LINE
5
A1
100
AcDbEntity
8
PRINCIPAL
6
CONTINUOUS
62
256
370
-1
100
AcDbLine
10
65.400004
20
122.99997
11
68.600015
21
122.99997
0
LINE
5
A2
100
AcDbEntity
8
PRINCIPAL
6
CONTINUOUS
62
256
370
-1
100
AcDbLine
10
68.600015
20
122.99997
11
68.600015
21
125.99997
0
LINE
5
A3
100
AcDbEntity
8
PRINCIPAL
6
CONTINUOUS
62
256
370
-1
100
AcDbLine
10
68.600015
20
125.99997
11
69.875009
21
125.99997
0
LINE
5
A4
100
AcDbEntity
8
PRINCIPAL
6
CONTINUOUS
62
256
370
-1
100
AcDbLine
10
69.875009
20
125.99997
11
69.875009
21
129.999998
0
LINE
5
A5
100
AcDbEntity
8
PRINCIPAL
6
CONTINUOUS
62
256
370
-1
100
AcDbLine
10
69.875009
20
129.999998
11
68.600015
21
129.999998
0
LINE
5
A6
100
AcDbEntity
8
PRINCIPAL
6
CONTINUOUS
62
256
370
-1
100
AcDbLine
10
68.600015
20
129.999998
11
68.600015
21
132.99997
0
LINE
5
A7
100
AcDbEntity
8
PRINCIPAL
6
CONTINUOUS
62
256
370
-1
100
AcDbLine
10
68.600015
20
132.99997
11
73.73398
21
132.999967
0
ARC
5
A8
100
AcDbEntity
8
PRINCIPAL
6
CONTINUOUS
62
256
370
-1
100
AcDbCircle
10
73.73398
20
132.499967
40
0.5
100
AcDbArc
50
30.000198
51
90
0
ARC
5
A9
100
AcDbEntity
8
PRINCIPAL
6
CONTINUOUS
62
256
370
-1
100
AcDbCircle
10
74.600004
20
132.99997
40
0.5
100
AcDbArc
50
210.000198
51
60
0
ARC
5
AA
100
AcDbEntity
8
PRINCIPAL
6
CONTINUOUS
62
256
370
-1
100
AcDbCircle
10
75.100004
20
133.865996
40
0.5
100
AcDbArc
50
180
51
240
0
LINE
5
AB
100
AcDbEntity
8
PRINCIPAL
6
CONTINUOUS
62
256
370
-1
100
AcDbLine
10
74.600004
20
133.865996
11
74.600001
21
135.500022
0
ARC
5
AC
100
AcDbEntity
8
PRINCIPAL
6
CONTINUOUS
62
256
370
-1
100
AcDbCircle
10
75.100001
20
135.500022
40
0.5
100
AcDbArc
50
90
51
180
0
LINE
5
AD
100
AcDbEntity
8
PRINCIPAL
6
CONTINUOUS
62
256
370
-1
100
AcDbLine
10
75.100001
20
136.000022
11
80.099998
21
136.000022
0
ARC
5
AE
100
AcDbEntity
8
PRINCIPAL
6
CONTINUOUS
62
256
370
-1
100
AcDbCircle
10
80.099998
20
135.500022
40
0.5
100
AcDbArc
50
0
51
90
0
LINE
5
AF
100
AcDbEntity
8
PRINCIPAL
6
CONTINUOUS
62
256
370
-1
100
AcDbLine
10
80.599998
20
135.500022
11
80.599998
21
133.865994
0
ARC
5
B0
100
AcDbEntity
8
PRINCIPAL
6
CONTINUOUS
62
256
370
-1
100
AcDbCircle
10
80.099998
20
133.865994
40
0.5
100
AcDbArc
50
300.000198
51
0
0
ARC
5
B1
100
AcDbEntity
8
PRINCIPAL
6
CONTINUOUS
62
256
370
-1
100
AcDbCircle
10
80.600001
20
132.99997
40
0.5
100
AcDbArc
50
120.000198
51
330
0
ARC
5
B2
100
AcDbEntity
8
PRINCIPAL
6
CONTINUOUS
62
256
370
-1
100
AcDbCircle
10
81.466026
20
132.49997
40
0.5
100
AcDbArc
50
90
51
150
0
ARC
5
B3
100
AcDbEntity
8
PRINCIPAL
6
CONTINUOUS
62
256
370
-1
100
AcDbCircle
10
172.533968
20
132.499967
40
0.5
100
AcDbArc
50
30.000198
51
90
0
ARC
5
B4
100
AcDbEntity
8
PRINCIPAL
6
CONTINUOUS
62
256
370
-1
100
AcDbCircle
10
173.399991
20
132.99997
40
0.5
100
AcDbArc
50
210.000198
51
60
0
ARC
5
B5
100
AcDbEntity
8
PRINCIPAL
6
CONTINUOUS
62
256
370
-1
100
AcDbCircle
10
173.899991
20
133.865996
40
0.5
100
AcDbArc
50
180
51
240
0
LINE
5
B6
100
AcDbEntity
8
PRINCIPAL
6
CONTINUOUS
62
256
370
-1
100
AcDbLine
10
173.399991
20
133.865996
11
173.399988
21
135.500022
0
ARC
5
B7
100
AcDbEntity
8
PRINCIPAL
6
CONTINUOUS
62
256
370
-1
100
AcDbCircle
10
173.899988
20
135.500022
40
0.5
100
AcDbArc
50
90
51
180
0
LINE
5
B8
100
AcDbEntity
8
PRINCIPAL
6
CONTINUOUS
62
256
370
-1
100
AcDbLine
10
173.899988
20
136.000022
11
178.899986
21
136.000022
0
ARC
5
B9
100
AcDbEntity
8
PRINCIPAL
6
CONTINUOUS
62
256
370
-1
100
AcDbCircle
10
178.899986
20
135.500022
40
0.5
100
AcDbArc
50
0
51
90
0
LINE
5
BA
100
AcDbEntity
8
PRINCIPAL
6
CONTINUOUS
62
256
370
-1
100
AcDbLine
10
179.399986
20
135.500022
11
179.399986
21
133.865994
0
ARC
5
BB
100
AcDbEntity
8
PRINCIPAL
6
CONTINUOUS
62
256
370
-1
100
AcDbCircle
10
178.899986
20
133.865994
40
0.5
100
AcDbArc
50
300.000198
51
0
0
ARC
5
BC
100
AcDbEntity
8
PRINCIPAL
6
CONTINUOUS
62
256
370
-1
100
AcDbCircle
10
179.399989
20
132.99997
40
0.5
100
AcDbArc
50
120.000198
51
330
0
ARC
5
BD
100
AcDbEntity
8
PRINCIPAL
6
CONTINUOUS
62
256
370
-1
100
AcDbCircle
10
180.266014
20
132.49997
40
0.5
100
AcDbArc
50
90
51
150
0
LINE
5
BE
100
AcDbEntity
8
PRINCIPAL
6
CONTINUOUS
62
256
370
-1
100
AcDbLine
10
180.266014
20
132.99997
11
185.400008
21
132.99997
0
LINE
5
BF
100
AcDbEntity
8
PRINCIPAL
6
CONTINUOUS
62
256
370
-1
100
AcDbLine
10
185.400008
20
132.99997
11
185.400008
21
129.999998
0
LINE
5
C0
100
AcDbEntity
8
PRINCIPAL
6
CONTINUOUS
62
256
370
-1
100
AcDbLine
10
185.400008
20
129.999998
11
184.125013
21
129.999998
0
LINE
5
C1
100
AcDbEntity
8
PRINCIPAL
6
CONTINUOUS
62
256
370
-1
100
AcDbLine
10
184.125013
20
129.999998
11
184.125013
21
125.99997
0
LINE
5
C2
100
AcDbEntity
8
PRINCIPAL
6
CONTINUOUS
62
256
370
-1
100
AcDbLine
10
184.125013
20
125.99997
11
185.400008
21
125.99997
0
LINE
5
C3
100
AcDbEntity
8
PRINCIPAL
6
CONTINUOUS
62
256
370
-1
100
AcDbLine
10
185.400008
20
125.99997
11
185.400008
21
122.99997
0
LINE
5
C4
100
AcDbEntity
8
PRINCIPAL
6
CONTINUOUS
62
256
370
-1
100
AcDbLine
10
185.400008
20
122.99997
11
188.600019
21
122.99997
0
LINE
5
C5
100
AcDbEntity
8
PRINCIPAL
6
CONTINUOUS
62
256
370
-1
100
AcDbLine
10
188.600019
20
122.99997
11
188.600019
21
125.99997
0
LINE
5
C6
100
AcDbEntity
8
PRINCIPAL
6
CONTINUOUS
62
256
370
-1
100
AcDbLine
10
188.600019
20
125.99997
11
189.875013
21
125.99997
0
LINE
5
C7
100
AcDbEntity
8
PRINCIPAL
6
CONTINUOUS
62
256
370
-1
100
AcDbLine
10
189.875013
20
125.99997
11
189.875013
21
129.999998
0
LINE
5
C8
100
AcDbEntity
8
PRINCIPAL
6
CONTINUOUS
62
256
370
-1
100
AcDbLine
10
189.875013
20
129.999998
11
188.600019
21
129.999998
0
LINE
5
C9
100
AcDbEntity
8
PRINCIPAL
6
CONTINUOUS
62
256
370
-1
100
AcDbLine
10
188.600019
20
129.999998
11
188.600019
21
132.99997
0
LINE
5
CA
100
AcDbEntity
8
PRINCIPAL
6
CONTINUOUS
62
256
370
-1
100
AcDbLine
10
188.600019
20
132.99997
11
193.733984
21
132.999967
0
ARC
5
CB
100
AcDbEntity
8
PRINCIPAL
6
CONTINUOUS
62
256
370
-1
100
AcDbCircle
10
193.733984
20
132.499967
40
0.5
100
AcDbArc
50
30.000198
51
90
0
ARC
5
CC
100
AcDbEntity
8
PRINCIPAL
6
CONTINUOUS
62
256
370
-1
100
AcDbCircle
10
194.600007
20
132.99997
40
0.5
100
AcDbArc
50
210.000198
51
60
0
ARC
5
CD
100
AcDbEntity
8
PRINCIPAL
6
CONTINUOUS
62
256
370
-1
100
AcDbCircle
10
195.100007
20
133.865996
40
0.5
100
AcDbArc
50
180
51
240
0
LINE
5
CE
100
AcDbEntity
8
PRINCIPAL
6
CONTINUOUS
62
256
370
-1
100
AcDbLine
10
194.600007
20
133.865996
11
194.600004
21
135.500022
0
ARC
5
CF
100
AcDbEntity
8
PRINCIPAL
6
CONTINUOUS
62
256
370
-1
100
AcDbCircle
10
195.100004
20
135.500022
40
0.5
100
AcDbArc
50
90
51
180
0
LINE
5
D0
100
AcDbEntity
8
PRINCIPAL
6
CONTINUOUS
62
256
370
-1
100
AcDbLine
10
195.100004
20
136.000022
11
200.100002
21
136.000022
0
ARC
5
D1
100
AcDbEntity
8
PRINCIPAL
6
CONTINUOUS
62
256
370
-1
100
AcDbCircle
10
200.100002
20
135.500022
40
0.5
100
AcDbArc
50
0
51
90
0
LINE
5
D2
100
AcDbEntity
8
PRINCIPAL
6
CONTINUOUS
62
256
370
-1
100
AcDbLine
10
200.600002
20
135.500022
11
200.600002
21
133.865994
0
ARC
5
D3
100
AcDbEntity
8
PRINCIPAL
6
CONTINUOUS
62
256
370
-1
100
AcDbCircle
10
200.100002
20
133.865994
40
0.5
100
AcDbArc
50
300.000198
51
0
0
ARC
5
D4
100
AcDbEntity
8
PRINCIPAL
6
CONTINUOUS
62
256
370
-1
100
AcDbCircle
10
200.600005
20
132.99997
40
0.5
100
AcDbArc
50
120.000198
51
330
0
ARC
5
D5
100
AcDbEntity
8
PRINCIPAL
6
CONTINUOUS
62
256
370
-1
100
AcDbCircle
10
201.46603
20
132.49997
40
0.5
100
AcDbArc
50
90
51
150
0
ARC
5
D6
100
AcDbEntity
8
PRINCIPAL
6
CONTINUOUS
62
256
370
-1
100
AcDbCircle
10
332.533964
20
132.499967
40
0.5
100
AcDbArc
50
30.000198
51
90
0
ARC
5
D7
100
AcDbEntity
8
PRINCIPAL
6
CONTINUOUS
62
256
370
-1
100
AcDbCircle
10
333.399988
20
132.99997
40
0.5
100
AcDbArc
50
210.000198
51
60
0
ARC
5
D8
100
AcDbEntity
8
PRINCIPAL
6
CONTINUOUS
62
256
370
-1
100
AcDbCircle
10
333.899988
20
133.865996
40
0.5
100
AcDbArc
50
180
51
240
0
LINE
5
D9
100
AcDbEntity
8
PRINCIPAL
6
CONTINUOUS
62
256
370
-1
100
AcDbLine
10
333.399988
20
133.865996
11
333.399985
21
135.500022
0
ARC
5
DA
100
AcDbEntity
8
PRINCIPAL
6
CONTINUOUS
62
256
370
-1
100
AcDbCircle
10
333.899985
20
135.500022
40
0.5
100
AcDbArc
50
90
51
180
0
LINE
5
DB
100
AcDbEntity
8
PRINCIPAL
6
CONTINUOUS
62
256
370
-1
100
AcDbLine
10
333.899985
20
136.000022
11
338.899982
21
136.000022
0
ARC
5
DC
100
AcDbEntity
8
PRINCIPAL
6
CONTINUOUS
62
256
370
-1
100
AcDbCircle
10
338.899982
20
135.500022
40
0.5
100
AcDbArc
50
0
51
90
0
LINE
5
DD
100
AcDbEntity
8
PRINCIPAL
6
CONTINUOUS
62
256
370
-1
100
AcDbLine
10
339.399982
20
135.500022
11
339.399982
21
133.865994
0
ARC
5
DE
100
AcDbEntity
8
PRINCIPAL
6
CONTINUOUS
62
256
370
-1
100
AcDbCircle
10
338.899982
20
133.865994
40
0.5
100
AcDbArc
50
300.000198
51
0
0
ARC
5
DF
100
AcDbEntity
8
PRINCIPAL
6
CONTINUOUS
62
256
370
-1
100
AcDbCircle
10
339.399985
20
132.99997
40
0.5
100
AcDbArc
50
120.000198
51
330
0
ARC
5
E0
100
AcDbEntity
8
PRINCIPAL
6
CONTINUOUS
62
256
370
-1
100
AcDbCircle
10
340.26601
20
132.49997
40
0.5
100
AcDbArc
50
90
51
150
0
LINE
5
E1
100
AcDbEntity
8
PRINCIPAL
6
CONTINUOUS
62
256
370
-1
100
AcDbLine
10
340.26601
20
132.99997
11
345.400004
21
132.99997
0
LINE
5
E2
100
AcDbEntity
8
PRINCIPAL
6
CONTINUOUS
62
256
370
-1
100
AcDbLine
10
345.400004
20
132.99997
11
345.400004
21
129.999998
0
LINE
5
E3
100
AcDbEntity
8
PRINCIPAL
6
CONTINUOUS
62
256
370
-1
100
AcDbLine
10
345.400004
20
129.999998
11
344.12501
21
129.999998
0
LINE
5
E4
100
AcDbEntity
8
PRINCIPAL
6
CONTINUOUS
62
256
370
-1
100
AcDbLine
10
344.12501
20
129.999998
11
344.12501
21
125.99997
0
LINE
5
E5
100
AcDbEntity
8
PRINCIPAL
6
CONTINUOUS
62
256
370
-1
100
AcDbLine
10
344.12501
20
125.99997
11
345.400004
21
125.99997
0
LINE
5
E6
100
AcDbEntity
8
PRINCIPAL
6
CONTINUOUS
62
256
370
-1
100
AcDbLine
10
345.400004
20
125.99997
11
345.400004
21
122.99997
0
LINE
5
E7
100
AcDbEntity
8
PRINCIPAL
6
CONTINUOUS
62
256
370
-1
100
AcDbLine
10
345.400004
20
122.99997
11
348.600015
21
122.99997
0
LINE
5
E8
100
AcDbEntity
8
PRINCIPAL
6
CONTINUOUS
62
256
370
-1
100
AcDbLine
10
348.600015
20
122.99997
11
348.600015
21
125.99997
0
LINE
5
E9
100
AcDbEntity
8
PRINCIPAL
6
CONTINUOUS
62
256
370
-1
100
AcDbLine
10
348.600015
20
125.99997
11
349.87501
21
125.99997
0
LINE
5
EA
100
AcDbEntity
8
PRINCIPAL
6
CONTINUOUS
62
256
370
-1
100
AcDbLine
10
349.87501
20
125.99997
11
349.87501
21
129.999998
0
LINE
5
EB
100
AcDbEntity
8
PRINCIPAL
6
CONTINUOUS
62
256
370
-1
100
AcDbLine
10
349.87501
20
129.999998
11
348.600015
21
129.999998
0
LINE
5
EC
100
AcDbEntity
8
PRINCIPAL
6
CONTINUOUS
62
256
370
-1
100
AcDbLine
10
348.600015
20
129.999998
11
348.600015
21
132.99997
0
LINE
5
ED
100
AcDbEntity
8
PRINCIPAL
6
CONTINUOUS
62
256
370
-1
100
AcDbLine
10
348.600015
20
132.99997
11
353.73398
21
132.999967
0
ARC
5
EE
100
AcDbEntity
8
PRINCIPAL
6
CONTINUOUS
62
256
370
-1
100
AcDbCircle
10
353.73398
20
132.499967
40
0.5
100
AcDbArc
50
30.000198
51
90
0
ARC
5
EF
100
AcDbEntity
8
PRINCIPAL
6
CONTINUOUS
62
256
370
-1
100
AcDbCircle
10
354.600004
20
132.99997
40
0.5
100
AcDbArc
50
210.000198
51
60
0
ARC
5
F0
100
AcDbEntity
8
PRINCIPAL
6
CONTINUOUS
62
256
370
-1
100
AcDbCircle
10
355.100004
20
133.865996
40
0.5
100
AcDbArc
50
180
51
240
0
LINE
5
F1
100
AcDbEntity
8
PRINCIPAL
6
CONTINUOUS
62
256
370
-1
100
AcDbLine
10
354.600004
20
133.865996
11
354.600001
21
135.500022
0
ARC
5
F2
100
AcDbEntity
8
PRINCIPAL
6
CONTINUOUS
62
256
370
-1
100
AcDbCircle
10
355.100001
20
135.500022
40
0.5
100
AcDbArc
50
90
51
180
0
LINE
5
F3
100
AcDbEntity
8
PRINCIPAL
6
CONTINUOUS
62
256
370
-1
100
AcDbLine
10
355.100001
20
136.000022
11
360.099998
21
136.000022
0
ARC
5
F4
100
AcDbEntity
8
PRINCIPAL
6
CONTINUOUS
62
256
370
-1
100
AcDbCircle
10
360.099998
20
135.500022
40
0.5
100
AcDbArc
50
0
51
90
0
LINE
5
F5
100
AcDbEntity
8
PRINCIPAL
6
CONTINUOUS
62
256
370
-1
100
AcDbLine
10
360.599998
20
135.500022
11
360.599998
21
133.865994
0
ARC
5
F6
100
AcDbEntity
8
PRINCIPAL
6
CONTINUOUS
62
256
370
-1
100
AcDbCircle
10
360.099998
20
133.865994
40
0.5
100
AcDbArc
50
300.000198
51
0
0
ARC
5
F7
100
AcDbEntity
8
PRINCIPAL
6
CONTINUOUS
62
256
370
-1
100
AcDbCircle
10
360.600001
20
132.99997
40
0.5
100
AcDbArc
50
120.000198
51
330
0
ARC
5
F8
100
AcDbEntity
8
PRINCIPAL
6
CONTINUOUS
62
256
370
-1
100
AcDbCircle
10
361.466027
20
132.49997
40
0.5
100
AcDbArc
50
90
51
150
0
LINE
5
F9
100
AcDbEntity
8
PRINCIPAL
6
CONTINUOUS
62
256
370
-1
100
AcDbLine
10
361.466027
20
132.99997
11
372.000027
21
132.99997
0
LINE
5
FA
100
AcDbEntity
8
PRINCIPAL
6
CONTINUOUS
62
256
370
-1
100
AcDbLine
10
372.000027
20
132.99997
11
372.000027
21
122.349971
0
LINE
5
FB
100
AcDbEntity
8
PRINCIPAL
6
CONTINUOUS
62
256
370
-1
100
AcDbLine
10
372.000027
20
122.349971
11
369.76598
21
122.349971
0
ARC
5
FC
100
AcDbEntity
8
PRINCIPAL
6
CONTINUOUS
62
256
370
-1
100
AcDbCircle
10
369.76598
20
122.849971
40
0.5
100
AcDbArc
50
210
51
270
0
ARC
5
FD
100
AcDbEntity
8
PRINCIPAL
6
CONTINUOUS
62
256
370
-1
100
AcDbCircle
10
368.899955
20
122.349971
40
0.5
100
AcDbArc
50
30
51
239.999801
0
ARC
5
FE
100
AcDbEntity
8
PRINCIPAL
6
CONTINUOUS
62
256
370
-1
100
AcDbCircle
10
368.399952
20
121.483947
40
0.5
100
AcDbArc
50
0
51
59.999802
0
LINE
5
FF
100
AcDbEntity
8
PRINCIPAL
6
CONTINUOUS
62
256
370
-1
100
AcDbLine
10
368.899952
20
121.483947
11
368.899955
21
113.949976
0
LINE
5
100
100
AcDbEntity
8
PRINCIPAL
6
CONTINUOUS
62
256
370
-1
100
AcDbLine
10
368.899955
20
113.949976
11
365.899983
21
113.949976
0
LINE
5
101
100
AcDbEntity
8
PRINCIPAL
6
CONTINUOUS
62
256
370
-1
100
AcDbLine
10
365.899983
20
113.949976
11
365.899983
21
115.224971
0
LINE
5
102
100
AcDbEntity
8
PRINCIPAL
6
CONTINUOUS
62
256
370
-1
100
AcDbLine
10
365.899983
20
115.224971
11
361.899955
21
115.224971
0
LINE
5
103
100
AcDbEntity
8
PRINCIPAL
6
CONTINUOUS
62
256
370
-1
100
AcDbLine
10
361.899955
20
115.224971
11
361.899955
21
113.949976
0
LINE
5
104
100
AcDbEntity
8
PRINCIPAL
6
CONTINUOUS
62
256
370
-1
100
AcDbLine
10
361.899955
20
113.949976
11
358.899955
21
113.949976
0
LINE
5
105
100
AcDbEntity
8
PRINCIPAL
6
CONTINUOUS
62
256
370
-1
100
AcDbLine
10
358.899955
20
113.949976
11
358.899955
21
110.749965
0
LINE
5
106
100
AcDbEntity
8
PRINCIPAL
6
CONTINUOUS
62
256
370
-1
100
AcDbLine
10
358.899955
20
110.749965
11
361.899955
21
110.749965
0
LINE
5
107
100
AcDbEntity
8
PRINCIPAL
6
CONTINUOUS
62
256
370
-1
100
AcDbLine
10
361.899955
20
110.749965
11
361.899955
21
109.474971
0
LINE
5
108
100
AcDbEntity
8
PRINCIPAL
6
CONTINUOUS
62
256
370
-1
100
AcDbLine
10
361.899955
20
109.474971
11
365.899983
21
109.474971
0
LINE
5
109
100
AcDbEntity
8
PRINCIPAL
6
CONTINUOUS
62
256
370
-1
100
AcDbLine
10
365.899983
20
109.474971
11
365.899983
21
110.749965
0
LINE
5
10A
100
AcDbEntity
8
PRINCIPAL
6
CONTINUOUS
62
256
370
-1
100
AcDbLine
10
365.899983
20
110.749965
11
368.899955
21
110.749965
0
LINE
5
10B
100
AcDbEntity
8
PRINCIPAL
6
CONTINUOUS
62
256
370
-1
100
AcDbLine
10
46.450448
20
7.999998
11
41.466026
21
7.999998
0
ARC
5
10C
100
AcDbEntity
8
PRINCIPAL
6
CONTINUOUS
62
256
370
-1
100
AcDbCircle
10
14
20
117.99997
40
4
100
AcDbArc
50
4.9999988748e-06
51
179.999995
0
ARC
5
10D
100
AcDbEntity
8
PRINCIPAL
6
CONTINUOUS
62
256
370
-1
100
AcDbCircle
10
14
20
69.99997
40
4
100
AcDbArc
50
180.000001
51
359.999999
0
LINE
5
10E
100
AcDbEntity
8
PRINCIPAL
6
CONTINUOUS
62
256
370
-1
100
AcDbLine
10
10
20
37.999971
11
10
21
29.99997
0
ARC
5
10F
100
AcDbEntity
8
PRINCIPAL
6
CONTINUOUS
62
256
370
-1
100
AcDbCircle
10
14
20
29.99997
40
4
100
AcDbArc
50
180.000001
51
359.999999
0
LINE
5
110
100
AcDbEntity
8
PRINCIPAL
6
CONTINUOUS
62
256
370
-1
100
AcDbLine
10
18
20
29.99997
11
18
21
37.999971
0
ARC
5
111
100
AcDbEntity
8
PRINCIPAL
6
CONTINUOUS
62
256
370
-1
100
AcDbCircle
10
14
20
37.99997
40
4
100
AcDbArc
50
4.999999689e-06
51
179.999995
0
ARC
5
112
100
AcDbEntity
8
PRINCIPAL
6
CONTINUOUS
62
256
370
-1
100
AcDbCircle
10
26.2160765
20
202.999922318
40
0.5
100
AcDbArc
50
90
51
150
0
ARC
5
113
100
AcDbEntity
8
PRINCIPAL
6
CONTINUOUS
62
256
370
-1
100
AcDbCircle
10
25.3500505
20
203.499922318
40
0.5
100
AcDbArc
50
120.000198
51
330
0
ARC
5
114
100
AcDbEntity
8
PRINCIPAL
6
CONTINUOUS
62
256
370
-1
100
AcDbCircle
10
24.8500475
20
204.365946318
40
0.5
100
AcDbArc
50
300.000198
51
0
0
LINE
5
115
100
AcDbEntity
8
PRINCIPAL
6
CONTINUOUS
62
256
370
-1
100
AcDbLine
10
25.3500475
20
204.365946318
11
25.3500475
21
208.833895318
0
ARC
5
116
100
AcDbEntity
8
PRINCIPAL
6
CONTINUOUS
62
256
370
-1
100
AcDbCircle
10
24.8500475
20
208.833895318
40
0.5
100
AcDbArc
50
0
51
60
0
ARC
5
117
100
AcDbEntity
8
PRINCIPAL
6
CONTINUOUS
62
256
370
-1
100
AcDbCircle
10
25.3500475
20
209.699921318
40
0.5
100
AcDbArc
50
30.000198
51
240
0
ARC
5
118
100
AcDbEntity
8
PRINCIPAL
6
CONTINUOUS
62
256
370
-1
100
AcDbCircle
10
26.2160715
20
210.199924318
40
0.5
100
AcDbArc
50
210.000198
51
270
0
LINE
5
119
100
AcDbEntity
8
PRINCIPAL
6
CONTINUOUS
62
256
370
-1
100
AcDbLine
10
26.2160715
20
209.699924318
11
27.7839415
21
209.699921318
0
ARC
5
11A
100
AcDbEntity
8
PRINCIPAL
6
CONTINUOUS
62
256
370
-1
100
AcDbCircle
10
27.7839415
20
210.199921318
40
0.5
100
AcDbArc
50
270
51
330
0
ARC
5
11B
100
AcDbEntity
8
PRINCIPAL
6
CONTINUOUS
62
256
370
-1
100
AcDbCircle
10
28.6499675
20
209.699921318
40
0.5
100
AcDbArc
50
300.000198
51
150
0
ARC
5
11C
100
AcDbEntity
8
PRINCIPAL
6
CONTINUOUS
62
256
370
-1
100
AcDbCircle
10
29.1499705
20
208.833897318
40
0.5
100
AcDbArc
50
120.000198
51
180
0
LINE
5
11D
100
AcDbEntity
8
PRINCIPAL
6
CONTINUOUS
62
256
370
-1
100
AcDbLine
10
28.6499705
20
208.833897318
11
28.6499675
21
204.365947318
0
ARC
5
11E
100
AcDbEntity
8
PRINCIPAL
6
CONTINUOUS
62
256
370
-1
100
AcDbCircle
10
29.1499675
20
204.365947318
40
0.5
100
AcDbArc
50
180
51
240
0
ARC
5
11F
100
AcDbEntity
8
PRINCIPAL
6
CONTINUOUS
62
256
370
-1
100
AcDbCircle
10
28.6499675
20
203.499922318
40
0.5
100
AcDbArc
50
210.000198
51
60
0
ARC
5
120
100
AcDbEntity
8
PRINCIPAL
6
CONTINUOUS
62
256
370
-1
100
AcDbCircle
10
27.7839435
20
202.999919318
40
0.5
100
AcDbArc
50
30.000198
51
90
0
LINE
5
121
100
AcDbEntity
8
PRINCIPAL
6
CONTINUOUS
62
256
370
-1
100
AcDbLine
10
27.7839435
20
203.499919318
11
26.2160765
21
203.499922318
0
ARC
5
122
100
AcDbEntity
8
PRINCIPAL
6
CONTINUOUS
62
256
370
-1
100
AcDbCircle
10
26.2160765
20
181.799923318
40
0.5
100
AcDbArc
50
90
51
150
0
ARC
5
123
100
AcDbEntity
8
PRINCIPAL
6
CONTINUOUS
62
256
370
-1
100
AcDbCircle
10
25.3500505
20
182.299923318
40
0.5
100
AcDbArc
50
120.000198
51
330
0
ARC
5
124
100
AcDbEntity
8
PRINCIPAL
6
CONTINUOUS
62
256
370
-1
100
AcDbCircle
10
24.8500475
20
183.165946318
40
0.5
100
AcDbArc
50
300.000198
51
0
0
LINE
5
125
100
AcDbEntity
8
PRINCIPAL
6
CONTINUOUS
62
256
370
-1
100
AcDbLine
10
25.3500475
20
183.165946318
11
25.3500475
21
187.633896318
0
ARC
5
126
100
AcDbEntity
8
PRINCIPAL
6
CONTINUOUS
62
256
370
-1
100
AcDbCircle
10
24.8500475
20
187.633896318
40
0.5
100
AcDbArc
50
0
51
60
0
ARC
5
127
100
AcDbEntity
8
PRINCIPAL
6
CONTINUOUS
62
256
370
-1
100
AcDbCircle
10
25.3500475
20
188.499921318
40
0.5
100
AcDbArc
50
30.000198
51
240
0
ARC
5
128
100
AcDbEntity
8
PRINCIPAL
6
CONTINUOUS
62
256
370
-1
100
AcDbCircle
10
26.2160715
20
188.999924318
40
0.5
100
AcDbArc
50
210.000198
51
270
0
LINE
5
129
100
AcDbEntity
8
PRINCIPAL
6
CONTINUOUS
62
256
370
-1
100
AcDbLine
10
26.2160715
20
188.499924318
11
27.7839415
21
188.499921318
0
ARC
5
12A
100
AcDbEntity
8
PRINCIPAL
6
CONTINUOUS
62
256
370
-1
100
AcDbCircle
10
27.7839415
20
188.999921318
40
0.5
100
AcDbArc
50
270
51
330
0
ARC
5
12B
100
AcDbEntity
8
PRINCIPAL
6
CONTINUOUS
62
256
370
-1
100
AcDbCircle
10
28.6499675
20
188.499921318
40
0.5
100
AcDbArc
50
300.000198
51
150
0
ARC
5
12C
100
AcDbEntity
8
PRINCIPAL
6
CONTINUOUS
62
256
370
-1
100
AcDbCircle
10
29.1499705
20
187.633898318
40
0.5
100
AcDbArc
50
120.000199
51
180
0
LINE
5
12D
100
AcDbEntity
8
PRINCIPAL
6
CONTINUOUS
62
256
370
-1
100
AcDbLine
10
28.6499705
20
187.633898318
11
28.6499675
21
183.165948318
0
ARC
5
12E
100
AcDbEntity
8
PRINCIPAL
6
CONTINUOUS
62
256
370
-1
100
AcDbCircle
10
29.1499675
20
183.165948318
40
0.5
100
AcDbArc
50
180
51
240
0
ARC
5
12F
100
AcDbEntity
8
PRINCIPAL
6
CONTINUOUS
62
256
370
-1
100
AcDbCircle
10
28.6499675
20
182.299923318
40
0.5
100
AcDbArc
50
210.000198
51
60
0
ARC
5
130
100
AcDbEntity
8
PRINCIPAL
6
CONTINUOUS
62
256
370
-1
100
AcDbCircle
10
27.7839435
20
181.799920318
40
0.5
100
AcDbArc
50
30.000198
51
90
0
LINE
5
131
100
AcDbEntity
8
PRINCIPAL
6
CONTINUOUS
62
256
370
-1
100
AcDbLine
10
27.7839435
20
182.299920318
11
26.2160765
21
182.299923318
0
CIRCLE
5
132
100
AcDbEntity
8
PRINCIPAL
6
CONTINUOUS
62
256
370
-1
100
AcDbCircle
10
27.0000095
20
195.999922318
40
1.6
0
CIRCLE
5
133
100
AcDbEntity
8
PRINCIPAL
6
CONTINUOUS
62
256
370
-1
100
AcDbCircle
10
17.7067295189
20
329.246873293
40
1.55
0
CIRCLE
5
134
100
AcDbEntity
8
PRINCIPAL
6
CONTINUOUS
62
256
370
-1
100
AcDbCircle
10
17.7067295189
20
149.246873293
40
1.55
0
CIRCLE
5
135
100
AcDbEntity
8
PRINCIPAL
6
CONTINUOUS
62
256
370
-1
100
AcDbCircle
10
17.7067295189
20
269.246873293
40
1.55
0
CIRCLE
5
136
100
AcDbEntity
8
PRINCIPAL
6
CONTINUOUS
62
256
370
-1
100
AcDbCircle
10
17.7067295189
20
209.246873293
40
1.55
0
ARC
5
137
100
AcDbEntity
8
PRINCIPAL
6
CONTINUOUS
62
256
370
-1
100
AcDbCircle
10
26.2161212527
20
290.000036644
40
0.5
100
AcDbArc
50
90
51
150
0
ARC
5
138
100
AcDbEntity
8
PRINCIPAL
6
CONTINUOUS
62
256
370
-1
100
AcDbCircle
10
25.3500952527
20
290.500036644
40
0.5
100
AcDbArc
50
120.000198
51
330
0
ARC
5
139
100
AcDbEntity
8
PRINCIPAL
6
CONTINUOUS
62
256
370
-1
100
AcDbCircle
10
24.8500922527
20
291.366060644
40
0.5
100
AcDbArc
50
300.000198
51
0
0
LINE
5
13A
100
AcDbEntity
8
PRINCIPAL
6
CONTINUOUS
62
256
370
-1
100
AcDbLine
10
25.3500922527
20
291.366060644
11
25.3500922527
21
295.834009644
0
ARC
5
13B
100
AcDbEntity
8
PRINCIPAL
6
CONTINUOUS
62
256
370
-1
100
AcDbCircle
10
24.8500922527
20
295.834009644
40
0.5
100
AcDbArc
50
0
51
60
0
ARC
5
13C
100
AcDbEntity
8
PRINCIPAL
6
CONTINUOUS
62
256
370
-1
100
AcDbCircle
10
25.3500922527
20
296.700035644
40
0.5
100
AcDbArc
50
30.000198
51
240
0
ARC
5
13D
100
AcDbEntity
8
PRINCIPAL
6
CONTINUOUS
62
256
370
-1
100
AcDbCircle
10
26.2161162527
20
297.200038644
40
0.5
100
AcDbArc
50
210.000198
51
270
0
LINE
5
13E
100
AcDbEntity
8
PRINCIPAL
6
CONTINUOUS
62
256
370
-1
100
AcDbLine
10
26.2161162527
20
296.700038644
11
27.7839862527
21
296.700035644
0
ARC
5
13F
100
AcDbEntity
8
PRINCIPAL
6
CONTINUOUS
62
256
370
-1
100
AcDbCircle
10
27.7839862527
20
297.200035644
40
0.5
100
AcDbArc
50
270
51
330
0
ARC
5
140
100
AcDbEntity
8
PRINCIPAL
6
CONTINUOUS
62
256
370
-1
100
AcDbCircle
10
28.6500122527
20
296.700035644
40
0.5
100
AcDbArc
50
300.000198
51
150
0
ARC
5
141
100
AcDbEntity
8
PRINCIPAL
6
CONTINUOUS
62
256
370
-1
100
AcDbCircle
10
29.1500152527
20
295.834011644
40
0.5
100
AcDbArc
50
120.000198
51
180
0
LINE
5
142
100
AcDbEntity
8
PRINCIPAL
6
CONTINUOUS
62
256
370
-1
100
AcDbLine
10
28.6500152527
20
295.834011644
11
28.6500122527
21
291.366061644
0
ARC
5
143
100
AcDbEntity
8
PRINCIPAL
6
CONTINUOUS
62
256
370
-1
100
AcDbCircle
10
29.1500122527
20
291.366061644
40
0.5
100
AcDbArc
50
180
51
240
0
ARC
5
144
100
AcDbEntity
8
PRINCIPAL
6
CONTINUOUS
62
256
370
-1
100
AcDbCircle
10
28.6500122527
20
290.500036644
40
0.5
100
AcDbArc
50
210.000198
51
60
0
ARC
5
145
100
AcDbEntity
8
PRINCIPAL
6
CONTINUOUS
62
256
370
-1
100
AcDbCircle
10
27.7839882527
20
290.000033644
40
0.5
100
AcDbArc
50
30.000198
51
90
0
LINE
5
146
100
AcDbEntity
8
PRINCIPAL
6
CONTINUOUS
62
256
370
-1
100
AcDbLine
10
27.7839882527
20
290.500033644
11
26.2161212527
21
290.500036644
0
ARC
5
147
100
AcDbEntity
8
PRINCIPAL
6
CONTINUOUS
62
256
370
-1
100
AcDbCircle
10
26.2161212527
20
268.800037644
40
0.5
100
AcDbArc
50
90
51
150
0
ARC
5
148
100
AcDbEntity
8
PRINCIPAL
6
CONTINUOUS
62
256
370
-1
100
AcDbCircle
10
25.3500952527
20
269.300037644
40
0.5
100
AcDbArc
50
120.000198
51
330
0
ARC
5
149
100
AcDbEntity
8
PRINCIPAL
6
CONTINUOUS
62
256
370
-1
100
AcDbCircle
10
24.8500922527
20
270.166060644
40
0.5
100
AcDbArc
50
300.000198
51
0
0
LINE
5
14A
100
AcDbEntity
8
PRINCIPAL
6
CONTINUOUS
62
256
370
-1
100
AcDbLine
10
25.3500922527
20
270.166060644
11
25.3500922527
21
274.634010644
0
ARC
5
14B
100
AcDbEntity
8
PRINCIPAL
6
CONTINUOUS
62
256
370
-1
100
AcDbCircle
10
24.8500922527
20
274.634010644
40
0.5
100
AcDbArc
50
0
51
60
0
ARC
5
14C
100
AcDbEntity
8
PRINCIPAL
6
CONTINUOUS
62
256
370
-1
100
AcDbCircle
10
25.3500922527
20
275.500035644
40
0.5
100
AcDbArc
50
30.000198
51
240
0
ARC
5
14D
100
AcDbEntity
8
PRINCIPAL
6
CONTINUOUS
62
256
370
-1
100
AcDbCircle
10
26.2161162527
20
276.000038644
40
0.5
100
AcDbArc
50
210.000198
51
270
0
LINE
5
14E
100
AcDbEntity
8
PRINCIPAL
6
CONTINUOUS
62
256
370
-1
100
AcDbLine
10
26.2161162527
20
275.500038644
11
27.7839862527
21
275.500035644
0
ARC
5
14F
100
AcDbEntity
8
PRINCIPAL
6
CONTINUOUS
62
256
370
-1
100
AcDbCircle
10
27.7839862527
20
276.000035644
40
0.5
100
AcDbArc
50
270
51
330
0
ARC
5
150
100
AcDbEntity
8
PRINCIPAL
6
CONTINUOUS
62
256
370
-1
100
AcDbCircle
10
28.6500122527
20
275.500035644
40
0.5
100
AcDbArc
50
300.000198
51
150
0
ARC
5
151
100
AcDbEntity
8
PRINCIPAL
6
CONTINUOUS
62
256
370
-1
100
AcDbCircle
10
29.1500152527
20
274.634012644
40
0.5
100
AcDbArc
50
120.000199
51
180
0
LINE
5
152
100
AcDbEntity
8
PRINCIPAL
6
CONTINUOUS
62
256
370
-1
100
AcDbLine
10
28.6500152527
20
274.634012644
11
28.6500122527
21
270.166062644
0
ARC
5
153
100
AcDbEntity
8
PRINCIPAL
6
CONTINUOUS
62
256
370
-1
100
AcDbCircle
10
29.1500122527
20
270.166062644
40
0.5
100
AcDbArc
50
180
51
240
0
ARC
5
154
100
AcDbEntity
8
PRINCIPAL
6
CONTINUOUS
62
256
370
-1
100
AcDbCircle
10
28.6500122527
20
269.300037644
40
0.5
100
AcDbArc
50
210.000198
51
60
0
ARC
5
155
100
AcDbEntity
8
PRINCIPAL
6
CONTINUOUS
62
256
370
-1
100
AcDbCircle
10
27.7839882527
20
268.800034644
40
0.5
100
AcDbArc
50
30.000198
51
90
0
LINE
5
156
100
AcDbEntity
8
PRINCIPAL
6
CONTINUOUS
62
256
370
-1
100
AcDbLine
10
27.7839882527
20
269.300034644
11
26.2161212527
21
269.300037644
0
CIRCLE
5
157
100
AcDbEntity
8
PRINCIPAL
6
CONTINUOUS
62
256
370
-1
100
AcDbCircle
10
27.0000542527
20
283.000036644
40
1.6
0
ARC
5
158
100
AcDbEntity
8
PRINCIPAL
6
CONTINUOUS
62
256
370
-1
100
AcDbCircle
10
26.2160860605
20
75.0000648699
40
0.5
100
AcDbArc
50
90
51
150
0
ARC
5
159
100
AcDbEntity
8
PRINCIPAL
6
CONTINUOUS
62
256
370
-1
100
AcDbCircle
10
25.3500600605
20
75.5000648699
40
0.5
100
AcDbArc
50
120.000198
51
330
0
ARC
5
15A
100
AcDbEntity
8
PRINCIPAL
6
CONTINUOUS
62
256
370
-1
100
AcDbCircle
10
24.8500570605
20
76.3660888699
40
0.5
100
AcDbArc
50
300.000198
51
0
0
LINE
5
15B
100
AcDbEntity
8
PRINCIPAL
6
CONTINUOUS
62
256
370
-1
100
AcDbLine
10
25.3500570605
20
76.3660888699
11
25.3500570605
21
80.8340378699
0
ARC
5
15C
100
AcDbEntity
8
PRINCIPAL
6
CONTINUOUS
62
256
370
-1
100
AcDbCircle
10
24.8500570605
20
80.8340378699
40
0.5
100
AcDbArc
50
0
51
60
0
ARC
5
15D
100
AcDbEntity
8
PRINCIPAL
6
CONTINUOUS
62
256
370
-1
100
AcDbCircle
10
25.3500570605
20
81.7000638699
40
0.5
100
AcDbArc
50
30.000198
51
240
0
ARC
5
15E
100
AcDbEntity
8
PRINCIPAL
6
CONTINUOUS
62
256
370
-1
100
AcDbCircle
10
26.2160810605
20
82.2000668699
40
0.5
100
AcDbArc
50
210.000198
51
270
0
LINE
5
15F
100
AcDbEntity
8
PRINCIPAL
6
CONTINUOUS
62
256
370
-1
100
AcDbLine
10
26.2160810605
20
81.7000668699
11
27.7839510605
21
81.7000638699
0
ARC
5
160
100
AcDbEntity
8
PRINCIPAL
6
CONTINUOUS
62
256
370
-1
100
AcDbCircle
10
27.7839510605
20
82.2000638699
40
0.5
100
AcDbArc
50
270
51
330
0
ARC
5
161
100
AcDbEntity
8
PRINCIPAL
6
CONTINUOUS
62
256
370
-1
100
AcDbCircle
10
28.6499770605
20
81.7000638699
40
0.5
100
AcDbArc
50
300.000198
51
150
0
ARC
5
162
100
AcDbEntity
8
PRINCIPAL
6
CONTINUOUS
62
256
370
-1
100
AcDbCircle
10
29.1499800605
20
80.8340398699
40
0.5
100
AcDbArc
50
120.000198
51
180
0
LINE
5
163
100
AcDbEntity
8
PRINCIPAL
6
CONTINUOUS
62
256
370
-1
100
AcDbLine
10
28.6499800605
20
80.8340398699
11
28.6499770605
21
76.3660898699
0
ARC
5
164
100
AcDbEntity
8
PRINCIPAL
6
CONTINUOUS
62
256
370
-1
100
AcDbCircle
10
29.1499770605
20
76.3660898699
40
0.5
100
AcDbArc
50
180
51
240
0
ARC
5
165
100
AcDbEntity
8
PRINCIPAL
6
CONTINUOUS
62
256
370
-1
100
AcDbCircle
10
28.6499770605
20
75.5000648699
40
0.5
100
AcDbArc
50
210.000198
51
60
0
ARC
5
166
100
AcDbEntity
8
PRINCIPAL
6
CONTINUOUS
62
256
370
-1
100
AcDbCircle
10
27.7839530605
20
75.0000618699
40
0.5
100
AcDbArc
50
30.000198
51
90
0
LINE
5
167
100
AcDbEntity
8
PRINCIPAL
6
CONTINUOUS
62
256
370
-1
100
AcDbLine
10
27.7839530605
20
75.5000618699
11
26.2160860605
21
75.5000648699
0
ARC
5
168
100
AcDbEntity
8
PRINCIPAL
6
CONTINUOUS
62
256
370
-1
100
AcDbCircle
10
26.2160860605
20
53.8000658699
40
0.5
100
AcDbArc
50
90
51
150
0
ARC
5
169
100
AcDbEntity
8
PRINCIPAL
6
CONTINUOUS
62
256
370
-1
100
AcDbCircle
10
25.3500600605
20
54.3000658699
40
0.5
100
AcDbArc
50
120.000198
51
330
0
ARC
5
16A
100
AcDbEntity
8
PRINCIPAL
6
CONTINUOUS
62
256
370
-1
100
AcDbCircle
10
24.8500570605
20
55.1660888699
40
0.5
100
AcDbArc
50
300.000198
51
0
0
LINE
5
16B
100
AcDbEntity
8
PRINCIPAL
6
CONTINUOUS
62
256
370
-1
100
AcDbLine
10
25.3500570605
20
55.1660888699
11
25.3500570605
21
59.6340388699
0
ARC
5
16C
100
AcDbEntity
8
PRINCIPAL
6
CONTINUOUS
62
256
370
-1
100
AcDbCircle
10
24.8500570605
20
59.6340388699
40
0.5
100
AcDbArc
50
0
51
60
0
ARC
5
16D
100
AcDbEntity
8
PRINCIPAL
6
CONTINUOUS
62
256
370
-1
100
AcDbCircle
10
25.3500570605
20
60.5000638699
40
0.5
100
AcDbArc
50
30.000198
51
240
0
ARC
5
16E
100
AcDbEntity
8
PRINCIPAL
6
CONTINUOUS
62
256
370
-1
100
AcDbCircle
10
26.2160810605
20
61.0000668699
40
0.5
100
AcDbArc
50
210.000198
51
270
0
LINE
5
16F
100
AcDbEntity
8
PRINCIPAL
6
CONTINUOUS
62
256
370
-1
100
AcDbLine
10
26.2160810605
20
60.5000668699
11
27.7839510605
21
60.5000638699
0
ARC
5
170
100
AcDbEntity
8
PRINCIPAL
6
CONTINUOUS
62
256
370
-1
100
AcDbCircle
10
27.7839510605
20
61.0000638699
40
0.5
100
AcDbArc
50
270
51
330
0
ARC
5
171
100
AcDbEntity
8
PRINCIPAL
6
CONTINUOUS
62
256
370
-1
100
AcDbCircle
10
28.6499770605
20
60.5000638699
40
0.5
100
AcDbArc
50
300.000198
51
150
0
ARC
5
172
100
AcDbEntity
8
PRINCIPAL
6
CONTINUOUS
62
256
370
-1
100
AcDbCircle
10
29.1499800605
20
59.6340408699
40
0.5
100
AcDbArc
50
120.000199
51
180
0
LINE
5
173
100
AcDbEntity
8
PRINCIPAL
6
CONTINUOUS
62
256
370
-1
100
AcDbLine
10
28.6499800605
20
59.6340408699
11
28.6499770605
21
55.1660908699
0
ARC
5
174
100
AcDbEntity
8
PRINCIPAL
6
CONTINUOUS
62
256
370
-1
100
AcDbCircle
10
29.1499770605
20
55.1660908699
40
0.5
100
AcDbArc
50
180
51
240
0
ARC
5
175
100
AcDbEntity
8
PRINCIPAL
6
CONTINUOUS
62
256
370
-1
100
AcDbCircle
10
28.6499770605
20
54.3000658699
40
0.5
100
AcDbArc
50
210.000198
51
60
0
ARC
5
176
100
AcDbEntity
8
PRINCIPAL
6
CONTINUOUS
62
256
370
-1
100
AcDbCircle
10
27.7839530605
20
53.8000628699
40
0.5
100
AcDbArc
50
30.000198
51
90
0
LINE
5
177
100
AcDbEntity
8
PRINCIPAL
6
CONTINUOUS
62
256
370
-1
100
AcDbLine
10
27.7839530605
20
54.3000628699
11
26.2160860605
21
54.3000658699
0
CIRCLE
5
178
100
AcDbEntity
8
PRINCIPAL
6
CONTINUOUS
62
256
370
-1
100
AcDbCircle
10
27.0000190605
20
68.0000648699
40
1.6
0
LINE
5
179
100
AcDbEntity
8
PRINCIPAL
6
CONTINUOUS
62
256
370
-1
100
AcDbLine
10
371.999729519
20
8.00000329335
11
371.999729519
21
18.6500022934
0
LINE
5
17A
100
AcDbEntity
8
PRINCIPAL
6
CONTINUOUS
62
256
370
-1
100
AcDbLine
10
371.999729519
20
18.6500022934
11
369.765682519
21
18.6500022934
0
ARC
5
17B
100
AcDbEntity
8
PRINCIPAL
6
CONTINUOUS
62
256
370
-1
100
AcDbCircle
10
369.765682519
20
18.1500022934
40
0.5
100
AcDbArc
50
90
51
150
0
ARC
5
17C
100
AcDbEntity
8
PRINCIPAL
6
CONTINUOUS
62
256
370
-1
100
AcDbCircle
10
368.899657519
20
18.6500022934
40
0.5
100
AcDbArc
50
120.000199
51
330
0
ARC
5
17D
100
AcDbEntity
8
PRINCIPAL
6
CONTINUOUS
62
256
370
-1
100
AcDbCircle
10
368.399654519
20
19.5160262934
40
0.5
100
AcDbArc
50
300.000198
51
0
0
LINE
5
17E
100
AcDbEntity
8
PRINCIPAL
6
CONTINUOUS
62
256
370
-1
100
AcDbLine
10
368.899654519
20
19.5160262934
11
368.899657519
21
27.0499972934
0
LINE
5
17F
100
AcDbEntity
8
PRINCIPAL
6
CONTINUOUS
62
256
370
-1
100
AcDbLine
10
368.899657519
20
27.0499972934
11
365.899685519
21
27.0499972934
0
LINE
5
180
100
AcDbEntity
8
PRINCIPAL
6
CONTINUOUS
62
256
370
-1
100
AcDbLine
10
365.899685519
20
27.0499972934
11
365.899685519
21
25.7750022934
0
LINE
5
181
100
AcDbEntity
8
PRINCIPAL
6
CONTINUOUS
62
256
370
-1
100
AcDbLine
10
365.899685519
20
25.7750022934
11
361.899657519
21
25.7750022934
0
LINE
5
182
100
AcDbEntity
8
PRINCIPAL
6
CONTINUOUS
62
256
370
-1
100
AcDbLine
10
361.899657519
20
25.7750022934
11
361.899657519
21
27.0499972934
0
LINE
5
183
100
AcDbEntity
8
PRINCIPAL
6
CONTINUOUS
62
256
370
-1
100
AcDbLine
10
361.899657519
20
27.0499972934
11
358.899657519
21
27.0499972934
0
LINE
5
184
100
AcDbEntity
8
PRINCIPAL
6
CONTINUOUS
62
256
370
-1
100
AcDbLine
10
358.899657519
20
27.0499972934
11
358.899657519
21
30.2500082934
0
LINE
5
185
100
AcDbEntity
8
PRINCIPAL
6
CONTINUOUS
62
256
370
-1
100
AcDbLine
10
358.899657519
20
30.2500082934
11
361.899657519
21
30.2500082934
0
LINE
5
186
100
AcDbEntity
8
PRINCIPAL
6
CONTINUOUS
62
256
370
-1
100
AcDbLine
10
361.899657519
20
30.2500082934
11
361.899657519
21
31.5250022934
0
LINE
5
187
100
AcDbEntity
8
PRINCIPAL
6
CONTINUOUS
62
256
370
-1
100
AcDbLine
10
361.899657519
20
31.5250022934
11
365.899685519
21
31.5250022934
0
LINE
5
188
100
AcDbEntity
8
PRINCIPAL
6
CONTINUOUS
62
256
370
-1
100
AcDbLine
10
365.899685519
20
31.5250022934
11
365.899685519
21
30.2500082934
0
LINE
5
189
100
AcDbEntity
8
PRINCIPAL
6
CONTINUOUS
62
256
370
-1
100
AcDbLine
10
365.899685519
20
30.2500082934
11
368.899657519
21
30.2500082934
0
LINE
5
18A
100
AcDbEntity
8
PRINCIPAL
6
ByLayer
62
256
370
-1
100
AcDbLine
10
368.899955
20
110.749965
11
368.899657519
21
30.2500082934
0
LINE
5
18B
100
AcDbEntity
8
PRINCIPAL
6
ByLayer
62
256
370
-1
100
AcDbLine
10
372
20
8
11
362
21
8
0
ARC
5
18C
100
AcDbEntity
8
PRINCIPAL
6
ByLayer
62
256
370
-1
100
AcDbCircle
10
321.2154
20
2
40
6
100
AcDbArc
50
30
51
90
0
ARC
5
18D
100
AcDbEntity
8
PRINCIPAL
6
ByLayer
62
256
370
-1
100
AcDbCircle
10
331.6077
20
8
40
6
100
AcDbArc
50
210
51
270
0
ARC
5
18E
100
AcDbEntity
8
PRINCIPAL
6
ByLayer
62
256
370
-1
100
AcDbCircle
10
362
20
2
40
6
100
AcDbArc
50
90
51
150
0
ARC
5
18F
100
AcDbEntity
8
PRINCIPAL
6
ByLayer
62
256
370
-1
100
AcDbCircle
10
351.6077
20
8
40
6
100
AcDbArc
50
270
51
330
0
LINE
5
190
100
AcDbEntity
8
PRINCIPAL
6
ByLayer
62
256
370
-1
100
AcDbLine
10
46.450448
20
7.999998
11
321.2154
21
8
0
ARC
5
191
100
AcDbEntity
8
PRINCIPAL
6
CONTINUOUS
62
256
370
-1
100
AcDbCircle
10
41.216067
20
40
40
0.5
100
AcDbArc
50
90
51
150
0
ARC
5
192
100
AcDbEntity
8
PRINCIPAL
6
CONTINUOUS
62
256
370
-1
100
AcDbCircle
10
40.350041
20
40.5
40
0.5
100
AcDbArc
50
120.000198
51
330
0
ARC
5
193
100
AcDbEntity
8
PRINCIPAL
6
CONTINUOUS
62
256
370
-1
100
AcDbCircle
10
39.850038
20
41.366024
40
0.5
100
AcDbArc
50
300.000198
51
0
0
LINE
5
194
100
AcDbEntity
8
PRINCIPAL
6
CONTINUOUS
62
256
370
-1
100
AcDbLine
10
40.350038
20
41.366024
11
40.350038
21
45.833973
0
ARC
5
195
100
AcDbEntity
8
PRINCIPAL
6
CONTINUOUS
62
256
370
-1
100
AcDbCircle
10
39.850038
20
45.833973
40
0.5
100
AcDbArc
50
0
51
60
0
ARC
5
196
100
AcDbEntity
8
PRINCIPAL
6
CONTINUOUS
62
256
370
-1
100
AcDbCircle
10
40.350038
20
46.699999
40
0.5
100
AcDbArc
50
30.000198
51
240
0
ARC
5
197
100
AcDbEntity
8
PRINCIPAL
6
CONTINUOUS
62
256
370
-1
100
AcDbCircle
10
41.216062
20
47.200002
40
0.5
100
AcDbArc
50
210.000198
51
270
0
LINE
5
198
100
AcDbEntity
8
PRINCIPAL
6
CONTINUOUS
62
256
370
-1
100
AcDbLine
10
41.216062
20
46.700002
11
42.783932
21
46.699999
0
ARC
5
199
100
AcDbEntity
8
PRINCIPAL
6
CONTINUOUS
62
256
370
-1
100
AcDbCircle
10
42.783932
20
47.199999
40
0.5
100
AcDbArc
50
270
51
330
0
ARC
5
19A
100
AcDbEntity
8
PRINCIPAL
6
CONTINUOUS
62
256
370
-1
100
AcDbCircle
10
43.649958
20
46.699999
40
0.5
100
AcDbArc
50
300.000198
51
150
0
ARC
5
19B
100
AcDbEntity
8
PRINCIPAL
6
CONTINUOUS
62
256
370
-1
100
AcDbCircle
10
44.149961
20
45.833975
40
0.5
100
AcDbArc
50
120.000198
51
180
0
LINE
5
19C
100
AcDbEntity
8
PRINCIPAL
6
CONTINUOUS
62
256
370
-1
100
AcDbLine
10
43.649961
20
45.833975
11
43.649958
21
41.366025
0
ARC
5
19D
100
AcDbEntity
8
PRINCIPAL
6
CONTINUOUS
62
256
370
-1
100
AcDbCircle
10
44.149958
20
41.366025
40
0.5
100
AcDbArc
50
180
51
240
0
ARC
5
19E
100
AcDbEntity
8
PRINCIPAL
6
CONTINUOUS
62
256
370
-1
100
AcDbCircle
10
43.649958
20
40.5
40
0.5
100
AcDbArc
50
210.000198
51
60
0
ARC
5
19F
100
AcDbEntity
8
PRINCIPAL
6
CONTINUOUS
62
256
370
-1
100
AcDbCircle
10
42.783934
20
39.999997
40
0.5
100
AcDbArc
50
30.000198
51
90
0
LINE
5
1A0
100
AcDbEntity
8
PRINCIPAL
6
CONTINUOUS
62
256
370
-1
100
AcDbLine
10
42.783934
20
40.499997
11
41.216067
21
40.5
0
ARC
5
1A1
100
AcDbEntity
8
PRINCIPAL
6
CONTINUOUS
62
256
370
-1
100
AcDbCircle
10
41.216067
20
18.800001
40
0.5
100
AcDbArc
50
90
51
150
0
ARC
5
1A2
100
AcDbEntity
8
PRINCIPAL
6
CONTINUOUS
62
256
370
-1
100
AcDbCircle
10
40.350041
20
19.300001
40
0.5
100
AcDbArc
50
120.000198
51
330
0
ARC
5
1A3
100
AcDbEntity
8
PRINCIPAL
6
CONTINUOUS
62
256
370
-1
100
AcDbCircle
10
39.850038
20
20.166024
40
0.5
100
AcDbArc
50
300.000198
51
0
0
LINE
5
1A4
100
AcDbEntity
8
PRINCIPAL
6
CONTINUOUS
62
256
370
-1
100
AcDbLine
10
40.350038
20
20.166024
11
40.350038
21
24.633974
0
ARC
5
1A5
100
AcDbEntity
8
PRINCIPAL
6
CONTINUOUS
62
256
370
-1
100
AcDbCircle
10
39.850038
20
24.633974
40
0.5
100
AcDbArc
50
0
51
60
0
ARC
5
1A6
100
AcDbEntity
8
PRINCIPAL
6
CONTINUOUS
62
256
370
-1
100
AcDbCircle
10
40.350038
20
25.499999
40
0.5
100
AcDbArc
50
30.000198
51
240
0
ARC
5
1A7
100
AcDbEntity
8
PRINCIPAL
6
CONTINUOUS
62
256
370
-1
100
AcDbCircle
10
41.216062
20
26.000002
40
0.5
100
AcDbArc
50
210.000198
51
270
0
LINE
5
1A8
100
AcDbEntity
8
PRINCIPAL
6
CONTINUOUS
62
256
370
-1
100
AcDbLine
10
41.216062
20
25.500002
11
42.783932
21
25.499999
0
ARC
5
1A9
100
AcDbEntity
8
PRINCIPAL
6
CONTINUOUS
62
256
370
-1
100
AcDbCircle
10
42.783932
20
25.999999
40
0.5
100
AcDbArc
50
270
51
330
0
ARC
5
1AA
100
AcDbEntity
8
PRINCIPAL
6
CONTINUOUS
62
256
370
-1
100
AcDbCircle
10
43.649958
20
25.499999
40
0.5
100
AcDbArc
50
300.000198
51
150
0
ARC
5
1AB
100
AcDbEntity
8
PRINCIPAL
6
CONTINUOUS
62
256
370
-1
100
AcDbCircle
10
44.149961
20
24.633976
40
0.5
100
AcDbArc
50
120.000199
51
180
0
LINE
5
1AC
100
AcDbEntity
8
PRINCIPAL
6
CONTINUOUS
62
256
370
-1
100
AcDbLine
10
43.649961
20
24.633976
11
43.649958
21
20.166026
0
ARC
5
1AD
100
AcDbEntity
8
PRINCIPAL
6
CONTINUOUS
62
256
370
-1
100
AcDbCircle
10
44.149958
20
20.166026
40
0.5
100
AcDbArc
50
180
51
240
0
ARC
5
1AE
100
AcDbEntity
8
PRINCIPAL
6
CONTINUOUS
62
256
370
-1
100
AcDbCircle
10
43.649958
20
19.300001
40
0.5
100
AcDbArc
50
210.000198
51
60
0
ARC
5
1AF
100
AcDbEntity
8
PRINCIPAL
6
CONTINUOUS
62
256
370
-1
100
AcDbCircle
10
42.783934
20
18.799998
40
0.5
100
AcDbArc
50
30.000198
51
90
0
LINE
5
1B0
100
AcDbEntity
8
PRINCIPAL
6
CONTINUOUS
62
256
370
-1
100
AcDbLine
10
42.783934
20
19.299998
11
41.216067
21
19.300001
0
CIRCLE
5
1B1
100
AcDbEntity
8
PRINCIPAL
6
CONTINUOUS
62
256
370
-1
100
AcDbCircle
10
42
20
33
40
1.6
0
ARC
5
1B2
100
AcDbEntity
8
PRINCIPAL
6
ByLayer
62
256
370
-1
100
AcDbCircle
10
339.879
20
6.121
40
1
100
AcDbArc
50
270
51
315
0
LINE
5
1B3
100
AcDbEntity
8
PRINCIPAL
6
ByLayer
62
256
370
-1
100
AcDbLine
10
334.879
20
5.121
11
339.879
21
5.121
0
ARC
5
1B4
100
AcDbEntity
8
PRINCIPAL
6
ByLayer
62
256
370
-1
100
AcDbCircle
10
334.879
20
8.621
40
3.5
100
AcDbArc
50
90
51
270
0
LINE
5
1B5
100
AcDbEntity
8
PRINCIPAL
6
ByLayer
62
256
370
-1
100
AcDbLine
10
334.879
20
12.121
11
346.379
21
12.121
0
ARC
5
1B6
100
AcDbEntity
8
PRINCIPAL
6
ByLayer
62
256
370
-1
100
AcDbCircle
10
346.379
20
8.621
40
3.5
100
AcDbArc
50
0
51
90
0
ARC
5
1B7
100
AcDbEntity
8
PRINCIPAL
6
ByLayer
62
256
370
-1
100
AcDbCircle
10
342
20
4
40
2
100
AcDbArc
50
270
51
135
0
LINE
5
1B8
100
AcDbEntity
8
PRINCIPAL
6
ByLayer
62
256
370
-1
100
AcDbLine
10
331.6077
20
2
11
342
21
2
0
LINE
5
1B9
100
AcDbEntity
8
PRINCIPAL
6
ByLayer
62
256
370
-1
100
AcDbLine
10
349.879
20
8.621
11
349.982058742
21
2.98172786601
0
LINE
5
1BA
100
AcDbEntity
8
PRINCIPAL
6
ByLayer
62
256
370
-1
100
AcDbLine
10
350.981891792
20
2
11
351.6077
21
2
0
ARC
5
1BB
100
AcDbEntity
8
PRINCIPAL
6
ByLayer
62
256
370
-1
100
AcDbCircle
10
350.981891792
20
3
40
1
100
AcDbArc
50
181.046974425
51
270
0
LINE
5
1BC
100
AcDbEntity
8
PRINCIPAL
6
ByLayer
62
256
370
-1
100
AcDbLine
10
210.5
20
131
11
213.5
21
131
0
LINE
5
1BD
100
AcDbEntity
8
PRINCIPAL
6
ByLayer
62
256
370
-1
100
AcDbLine
10
162.5
20
131
11
165.5
21
131
0
LINE
5
1BE
100
AcDbEntity
8
PRINCIPAL
6
ByLayer
62
256
370
-1
100
AcDbLine
10
86.5
20
131
11
89.5
21
131
0
LINE
5
1BF
100
AcDbEntity
8
PRINCIPAL
6
ByLayer
62
256
370
-1
100
AcDbLine
10
265.5
20
131
11
268.5
21
131
0
CIRCLE
5
1C0
100
AcDbEntity
8
PRINCIPAL
6
ByLayer
62
256
370
-1
100
AcDbCircle
10
212
20
126
40
1.55
0
CIRCLE
5
1C1
100
AcDbEntity
8
PRINCIPAL
6
ByLayer
62
256
370
-1
100
AcDbCircle
10
164
20
126
40
1.55
0
CIRCLE
5
1C2
100
AcDbEntity
8
PRINCIPAL
6
ByLayer
62
256
370
-1
100
AcDbCircle
10
88
20
126
40
1.55
0
CIRCLE
5
1C3
100
AcDbEntity
8
PRINCIPAL
6
ByLayer
62
256
370
-1
100
AcDbCircle
10
267
20
126
40
1.55
0
LINE
5
1C4
100
AcDbEntity
8
PRINCIPAL
6
ByLayer
62
256
370
-1
100
AcDbLine
10
323
20
131
11
326
21
131
0
CIRCLE
5
1C5
100
AcDbEntity
8
PRINCIPAL
6
ByLayer
62
256
370
-1
100
AcDbCircle
10
324.5
20
123
40
1.55
0
CIRCLE
5
1C6
100
AcDbEntity
8
PRINCIPAL
6
ByLayer
62
256
370
-1
100
AcDbCircle
10
324.5
20
113
40
1.55
0
CIRCLE
5
1C7
100
AcDbEntity
8
PRINCIPAL
6
ByLayer
62
256
370
-1
100
AcDbCircle
10
324.5
20
18
40
1.55
0
ARC
5
1C8
100
AcDbEntity
8
PRINCIPAL
6
CONTINUOUS
62
256
370
-1
100
AcDbCircle
10
335
20
122
40
4
100
AcDbArc
50
4.9999988748e-06
51
179.999995
0
LINE
5
1C9
100
AcDbEntity
8
PRINCIPAL
6
ByLayer
62
256
370
-1
100
AcDbLine
10
10
20
117.999970349
11
10
21
69.9999699302
0
LINE
5
1CA
100
AcDbEntity
8
PRINCIPAL
6
ByLayer
62
256
370
-1
100
AcDbLine
10
18
20
69.9999699302
11
18
21
117.999970349
0
ARC
5
1CB
100
AcDbEntity
8
PRINCIPAL
6
CONTINUOUS
62
256
370
-1
100
AcDbCircle
10
335
20
102
40
4
100
AcDbArc
50
180.000001
51
359.999999
0
LINE
5
1CC
100
AcDbEntity
8
PRINCIPAL
6
ByLayer
62
256
370
-1
100
AcDbLine
10
331
20
122.000000349
11
331
21
101.99999993
0
LINE
5
1CD
100
AcDbEntity
8
PRINCIPAL
6
ByLayer
62
256
370
-1
100
AcDbLine
10
339
20
101.99999993
11
339
21
122.000000349
0
LINE
5
1CE
100
AcDbEntity
8
PRINCIPAL
6
CONTINUOUS
62
256
370
-1
100
AcDbLine
10
2
20
8
11
2
21
28.1715420468
0
ARC
5
1CF
100
AcDbEntity
8
PRINCIPAL
6
ByLayer
62
256
370
-1
100
AcDbCircle
10
4
20
28.1715420468
40
2
100
AcDbArc
50
135.000057296
51
180
0
LINE
5
1D0
100
AcDbEntity
8
PRINCIPAL
6
CONTINUOUS
62
256
370
-1
100
AcDbLine
10
2.58578502342
20
29.585754195
11
3.41421497658
21
30.414185805
0
LINE
5
1D1
100
AcDbEntity
8
PRINCIPAL
6
CONTINUOUS
62
256
370
-1
100
AcDbLine
10
4
20
31.8283979532
11
4
21
132.99997
0
ARC
5
1D2
100
AcDbEntity
8
PRINCIPAL
6
ByLayer
62
256
370
-1
100
AcDbCircle
10
2
20
31.8283979532
40
2
100
AcDbArc
50
315.000057296
51
0
0
CIRCLE
5
1D3
100
AcDbEntity
8
PRINCIPAL
6
ByLayer
62
256
370
-1
100
AcDbCircle
10
60
20
70
40
1.55
0
CIRCLE
5
1D4
100
AcDbEntity
8
PRINCIPAL
6
ByLayer
62
256
370
-1
100
AcDbCircle
10
60
20
60
40
1.55
0
CIRCLE
5
1D5
100
AcDbEntity
8
PRINCIPAL
6
ByLayer
62
256
370
-1
100
AcDbCircle
10
60
20
40
40
1.55
0
CIRCLE
5
1D6
100
AcDbEntity
8
PRINCIPAL
6
ByLayer
62
256
370
-1
100
AcDbCircle
10
60
20
30
40
1.55
0
CIRCLE
5
1D7
100
AcDbEntity
8
PRINCIPAL
6
ByLayer
62
256
370
-1
100
AcDbCircle
10
60
20
100
40
1.55
0
CIRCLE
5
1D8
100
AcDbEntity
8
PRINCIPAL
6
ByLayer
62
256
370
-1
100
AcDbCircle
10
60
20
90
40
1.55
0
LINE
5
1D9
100
AcDbEntity
8
PRINCIPAL
6
ByLayer
62
256
370
-1
100
AcDbLine
10
81.466026
20
132.99997
11
86
21
132.99999702
0
LINE
5
1DA
100
AcDbEntity
8
PRINCIPAL
6
ByLayer
62
256
370
-1
100
AcDbLine
10
86.5
20
132.5
11
86.5
21
131
0
LINE
5
1DB
100
AcDbEntity
8
PRINCIPAL
6
ByLayer
62
256
370
-1
100
AcDbLine
10
86
20
132.99999702
11
86.5
21
132.5
0
LINE
5
1DC
100
AcDbEntity
8
PRINCIPAL
6
ByLayer
62
256
370
-1
100
AcDbLine
10
89.5
20
131
11
89.5
21
132.5
0
LINE
5
1DD
100
AcDbEntity
8
PRINCIPAL
6
ByLayer
62
256
370
-1
100
AcDbLine
10
90
20
133
11
89.5
21
132.5
0
LINE
5
1DE
100
AcDbEntity
8
PRINCIPAL
6
ByLayer
62
256
370
-1
100
AcDbLine
10
90
20
133
11
162
21
133
0
LINE
5
1DF
100
AcDbEntity
8
PRINCIPAL
6
ByLayer
62
256
370
-1
100
AcDbLine
10
162.5
20
132.5
11
162.5
21
131
0
LINE
5
1E0
100
AcDbEntity
8
PRINCIPAL
6
ByLayer
62
256
370
-1
100
AcDbLine
10
162
20
133
11
162.5
21
132.5
0
LINE
5
1E1
100
AcDbEntity
8
PRINCIPAL
6
ByLayer
62
256
370
-1
100
AcDbLine
10
166
20
132.999997654
11
172.533968
21
132.999967
0
LINE
5
1E2
100
AcDbEntity
8
PRINCIPAL
6
ByLayer
62
256
370
-1
100
AcDbLine
10
165.5
20
131
11
165.5
21
132.5
0
LINE
5
1E3
100
AcDbEntity
8
PRINCIPAL
6
ByLayer
62
256
370
-1
100
AcDbLine
10
166
20
132.999997654
11
165.5
21
132.5
0
LINE
5
1E4
100
AcDbEntity
8
PRINCIPAL
6
ByLayer
62
256
370
-1
100
AcDbLine
10
201.46603
20
132.99997
11
210
21
132.99999834
0
LINE
5
1E5
100
AcDbEntity
8
PRINCIPAL
6
ByLayer
62
256
370
-1
100
AcDbLine
10
210.5
20
132.5
11
210.5
21
131
0
LINE
5
1E6
100
AcDbEntity
8
PRINCIPAL
6
ByLayer
62
256
370
-1
100
AcDbLine
10
210
20
132.99999834
11
210.5
21
132.5
0
LINE
5
1E7
100
AcDbEntity
8
PRINCIPAL
6
ByLayer
62
256
370
-1
100
AcDbLine
10
213.5
20
131
11
213.5
21
132.5
0
LINE
5
1E8
100
AcDbEntity
8
PRINCIPAL
6
ByLayer
62
256
370
-1
100
AcDbLine
10
214
20
133
11
213.5
21
132.5
0
LINE
5
1E9
100
AcDbEntity
8
PRINCIPAL
6
ByLayer
62
256
370
-1
100
AcDbLine
10
214
20
133
11
265
21
133
0
LINE
5
1EA
100
AcDbEntity
8
PRINCIPAL
6
ByLayer
62
256
370
-1
100
AcDbLine
10
265.5
20
132.5
11
265.5
21
131
0
LINE
5
1EB
100
AcDbEntity
8
PRINCIPAL
6
ByLayer
62
256
370
-1
100
AcDbLine
10
265
20
133
11
265.5
21
132.5
0
LINE
5
1EC
100
AcDbEntity
8
PRINCIPAL
6
ByLayer
62
256
370
-1
100
AcDbLine
10
268.5
20
131
11
268.5
21
132.5
0
LINE
5
1ED
100
AcDbEntity
8
PRINCIPAL
6
ByLayer
62
256
370
-1
100
AcDbLine
10
269
20
133
11
268.5
21
132.5
0
LINE
5
1EE
100
AcDbEntity
8
PRINCIPAL
6
ByLayer
62
256
370
-1
100
AcDbLine
10
269
20
133
11
322.5
21
133
0
LINE
5
1EF
100
AcDbEntity
8
PRINCIPAL
6
ByLayer
62
256
370
-1
100
AcDbLine
10
323
20
132.5
11
323
21
131
0
LINE
5
1F0
100
AcDbEntity
8
PRINCIPAL
6
ByLayer
62
256
370
-1
100
AcDbLine
10
322.5
20
133
11
323
21
132.5
0
LINE
5
1F1
100
AcDbEntity
8
PRINCIPAL
6
ByLayer
62
256
370
-1
100
AcDbLine
10
326.5
20
132.999997475
11
332.533964
21
132.999967
0
LINE
5
1F2
100
AcDbEntity
8
PRINCIPAL
6
ByLayer
62
256
370
-1
100
AcDbLine
10
326
20
131
11
326
21
132.5
0
LINE
5
1F3
100
AcDbEntity
8
PRINCIPAL
6
ByLayer
62
256
370
-1
100
AcDbLine
10
326.5
20
132.999997475
11
326
21
132.5
0
CIRCLE
5
1F4
100
AcDbEntity
8
PRINCIPAL
6
ByLayer
62
256
370
-1
100
AcDbCircle
10
325
20
70
40
1.55
0
CIRCLE
5
1F5
100
AcDbEntity
8
PRINCIPAL
6
ByLayer
62
256
370
-1
100
AcDbCircle
10
325
20
60
40
1.55
0
CIRCLE
5
1F6
100
AcDbEntity
8
PRINCIPAL
6
ByLayer
62
256
370
-1
100
AcDbCircle
10
325
20
40
40
1.55
0
CIRCLE
5
1F7
100
AcDbEntity
8
PRINCIPAL
6
ByLayer
62
256
370
-1
100
AcDbCircle
10
325
20
30
40
1.55
0
CIRCLE
5
1F8
100
AcDbEntity
8
PRINCIPAL
6
ByLayer
62
256
370
-1
100
AcDbCircle
10
325
20
100
40
1.55
0
CIRCLE
5
1F9
100
AcDbEntity
8
PRINCIPAL
6
ByLayer
62
256
370
-1
100
AcDbCircle
10
325
20
90
40
1.55
0
ARC
5
1FA
100
AcDbEntity
8
PRINCIPAL
6
ByLayer
62
256
370
-1
100
AcDbCircle
10
315
20
40
40
2.2
100
AcDbArc
50
270
51
90
0
ARC
5
1FB
100
AcDbEntity
8
PRINCIPAL
6
ByLayer
62
256
370
-1
100
AcDbCircle
10
75
20
40
40
2.2
100
AcDbArc
50
90
51
270
0
LINE
5
1FC
100
AcDbEntity
8
PRINCIPAL
6
ByLayer
62
256
370
-1
100
AcDbLine
10
165
20
37.8
11
75
21
37.8
0
LINE
5
1FD
100
AcDbEntity
8
PRINCIPAL
6
ByLayer
62
256
370
-1
100
AcDbLine
10
165
20
42.2
11
75
21
42.2
0
LINE
5
1FE
100
AcDbEntity
8
PRINCIPAL
6
ByLayer
62
256
370
-1
100
AcDbLine
10
315
20
37.8
11
225
21
37.8
0
LINE
5
1FF
100
AcDbEntity
8
PRINCIPAL
6
ByLayer
62
256
370
-1
100
AcDbLine
10
315
20
42.2
11
225
21
42.2
0
ARC
5
200
100
AcDbEntity
8
PRINCIPAL
6
ByLayer
62
256
370
-1
100
AcDbCircle
10
225
20
40
40
2.2
100
AcDbArc
50
90
51
270
0
ARC
5
201
100
AcDbEntity
8
PRINCIPAL
6
ByLayer
62
256
370
-1
100
AcDbCircle
10
165
20
40
40
2.2
100
AcDbArc
50
270
51
90
0
ARC
5
202
100
AcDbEntity
8
PRINCIPAL
6
ByLayer
62
256
370
-1
100
AcDbCircle
10
315
20
90
40
2.2
100
AcDbArc
50
270
51
90
0
ARC
5
203
100
AcDbEntity
8
PRINCIPAL
6
ByLayer
62
256
370
-1
100
AcDbCircle
10
75
20
90
40
2.2
100
AcDbArc
50
90
51
270
0
LINE
5
204
100
AcDbEntity
8
PRINCIPAL
6
ByLayer
62
256
370
-1
100
AcDbLine
10
165
20
87.8
11
75
21
87.8
0
LINE
5
205
100
AcDbEntity
8
PRINCIPAL
6
ByLayer
62
256
370
-1
100
AcDbLine
10
165
20
92.2
11
75
21
92.2
0
LINE
5
206
100
AcDbEntity
8
PRINCIPAL
6
ByLayer
62
256
370
-1
100
AcDbLine
10
315
20
87.8
11
225
21
87.8
0
LINE
5
207
100
AcDbEntity
8
PRINCIPAL
6
ByLayer
62
256
370
-1
100
AcDbLine
10
315
20
92.2
11
225
21
92.2
0
ARC
5
208
100
AcDbEntity
8
PRINCIPAL
6
ByLayer
62
256
370
-1
100
AcDbCircle
10
225
20
90
40
2.2
100
AcDbArc
50
90
51
270
0
ARC
5
209
100
AcDbEntity
8
PRINCIPAL
6
ByLayer
62
256
370
-1
100
AcDbCircle
10
165
20
90
40
2.2
100
AcDbArc
50
270
51
90
0
CIRCLE
5
20A
100
AcDbEntity
8
PRINCIPAL
6
ByLayer
62
256
370
-1
100
AcDbCircle
10
343.9
20
25
40
1.6
0
ENDSEC
0
SECTION
2
OBJECTS
0
DICTIONARY
5
C
330
0
100
AcDbDictionary
281
1
3
ACAD_GROUP
350
D
0
DICTIONARY
5
D
330
C
100
AcDbDictionary
281
1
0
ENDSEC
0
EOF
