999
dxfrw 0.5.10
0
SECTION
2
HEADER
9
$ACADVER
1
AC1021
9
$HANDSEED
5
20000
9
$DWGCODEPAGE
3
ANSI_1252
9
$INSBASE
10
0
20
0
30
0
9
$EXTMIN
10
5.0028223777
20
5.00124447962
30
0
9
$EXTMAX
10
395.003594388
20
175.871
30
0
9
$LIMMIN
10
0
20
0
9
$LIMMAX
10
783.905288
20
486.837384
9
$ORTHOMODE
70
0
9
$LTSCALE
40
1
9
$TEXTSTYLE
7
Standard
9
$CLAYER
8
PRINCIPAL
9
$DIMASZ
40
0.18
9
$DIMLFAC
40
1
9
$DIMSCALE
40
1
9
$DIMEXO
40
0.0625
9
$DIMEXE
40
0.18
9
$DIMTXT
40
3
9
$DIMTSZ
40
0
9
$DIMAUNIT
70
0
9
$DIMADEC
70
0
9
$DIMLUNIT
70
2
9
$DIMSTYLE
2
Standard
9
$DIMGAP
40
0.09
9
$DIMTIH
70
1
9
$LUNITS
70
2
9
$LUPREC
70
4
9
$AUNITS
70
0
9
$AUPREC
70
0
9
$SPLINESEGS
70
8
9
$GRIDMODE
70
1
9
$SNAPSTYLE
70
0
9
$GRIDUNIT
10
0
20
0
9
$PINSBASE
10
0
20
0
30
0
9
$PLIMMIN
10
0
20
0
9
$PLIMMAX
10
0
20
0
9
$INSUNITS
70
4
9
$PSVPSCALE
40
0
0
ENDSEC
0
SECTION
2
CLASSES
0
ENDSEC
0
SECTION
2
TABLES
0
TABLE
2
VPORT
5
8
330
0
100
AcDbSymbolTable
70
1
0
VPORT
5
31
330
2
100
AcDbSymbolTableRecord
100
AcDbViewportTableRecord
2
*ACTIVE
70
0
10
0
20
0
11
1
21
1
12
212.695060507
22
125.727270581
13
0
23
0
14
10
24
10
15
10
25
10
16
0
26
0
36
1
17
0
27
0
37
0
40
271.123531345
41
1.89046941679
42
50
43
0
44
0
50
0
51
0
71
0
72
100
73
1
74
3
75
0
76
1
77
0
78
0
281
0
65
1
110
0
120
0
130
0
111
1
121
0
131
0
112
0
122
1
132
0
79
0
146
0
348
10020
60
7
61
5
292
1
282
1
141
0
142
0
63
250
421
3358443
0
ENDTAB
0
TABLE
2
LTYPE
5
5
330
0
100
AcDbSymbolTable
70
4
0
LTYPE
5
14
330
5
100
AcDbSymbolTableRecord
100
AcDbLinetypeTableRecord
2
ByBlock
70
0
3

72
65
73
0
40
0
0
LTYPE
5
15
330
5
100
AcDbSymbolTableRecord
100
AcDbLinetypeTableRecord
2
ByLayer
70
0
3

72
65
73
0
40
0
0
LTYPE
5
16
330
5
100
AcDbSymbolTableRecord
100
AcDbLinetypeTableRecord
2
Continuous
70
0
3
Solid line
72
65
73
0
40
0
0
LTYPE
5
32
330
5
100
AcDbSymbolTableRecord
100
AcDbLinetypeTableRecord
2
DOT
70
0
3
Dot . . . . . . . . . . . . . . . . . . . . . .
72
65
73
2
40
6.35
49
0
74
0
49
-6.35
74
0
0
LTYPE
5
33
330
5
100
AcDbSymbolTableRecord
100
AcDbLinetypeTableRecord
2
DOT2
70
0
3
Dot (.5x) .....................................
72
65
73
2
40
3.175
49
0
74
0
49
-3.175
74
0
0
LTYPE
5
34
330
5
100
AcDbSymbolTableRecord
100
AcDbLinetypeTableRecord
2
DOTX2
70
0
3
Dot (2x) .  .  .  .  .  .  .  .  .  .  .  .  .
72
65
73
2
40
12.7
49
0
74
0
49
-12.7
74
0
0
LTYPE
5
35
330
5
100
AcDbSymbolTableRecord
100
AcDbLinetypeTableRecord
2
DASHED
70
0
3
Dot . . . . . . . . . . . . . . . . . . . . . .
72
65
73
2
40
19.05
49
12.7
74
0
49
-6.35
74
0
0
LTYPE
5
36
330
5
100
AcDbSymbolTableRecord
100
AcDbLinetypeTableRecord
2
DASHED2
70
0
3
Dashed (.5x) _ _ _ _ _ _ _ _ _ _ _ _ _ _ _ _ _
72
65
73
2
40
9.525
49
6.35
74
0
49
-3.175
74
0
0
LTYPE
5
37
330
5
100
AcDbSymbolTableRecord
100
AcDbLinetypeTableRecord
2
DASHEDX2
70
0
3
Dashed (2x) ____  ____  ____  ____  ____  ___
72
65
73
2
40
38.1
49
25.4
74
0
49
-12.7
74
0
0
LTYPE
5
38
330
5
100
AcDbSymbolTableRecord
100
AcDbLinetypeTableRecord
2
DASHDOT
70
0
3
Dash dot __ . __ . __ . __ . __ . __ . __ . __
72
65
73
4
40
25.4
49
12.7
74
0
49
-6.35
74
0
49
0
74
0
49
-6.35
74
0
0
LTYPE
5
39
330
5
100
AcDbSymbolTableRecord
100
AcDbLinetypeTableRecord
2
DASHDOT2
70
0
3
Dash dot (.5x) _._._._._._._._._._._._._._._.
72
65
73
4
40
12.7
49
6.35
74
0
49
-3.175
74
0
49
0
74
0
49
-3.175
74
0
0
LTYPE
5
3A
330
5
100
AcDbSymbolTableRecord
100
AcDbLinetypeTableRecord
2
DASHDOTX2
70
0
3
Dash dot (2x) ____  .  ____  .  ____  .  ___
72
65
73
4
40
50.8
49
25.4
74
0
49
-12.7
74
0
49
0
74
0
49
-12.7
74
0
0
LTYPE
5
3B
330
5
100
AcDbSymbolTableRecord
100
AcDbLinetypeTableRecord
2
DIVIDE
70
0
3
Divide ____ . . ____ . . ____ . . ____ . . ____
72
65
73
6
40
31.75
49
12.7
74
0
49
-6.35
74
0
49
0
74
0
49
-6.35
74
0
49
0
74
0
49
-6.35
74
0
0
LTYPE
5
3C
330
5
100
AcDbSymbolTableRecord
100
AcDbLinetypeTableRecord
2
DIVIDE2
70
0
3
Divide (.5x) __..__..__..__..__..__..__..__.._
72
65
73
6
40
15.875
49
6.35
74
0
49
-3.175
74
0
49
0
74
0
49
-3.175
74
0
49
0
74
0
49
-3.175
74
0
0
LTYPE
5
3D
330
5
100
AcDbSymbolTableRecord
100
AcDbLinetypeTableRecord
2
DIVIDEX2
70
0
3
Divide (2x) ________  .  .  ________  .  .  _
72
65
73
6
40
63.5
49
25.4
74
0
49
-12.7
74
0
49
0
74
0
49
-12.7
74
0
49
0
74
0
49
-12.7
74
0
0
LTYPE
5
3E
330
5
100
AcDbSymbolTableRecord
100
AcDbLinetypeTableRecord
2
BORDER
70
0
3
Border __ __ . __ __ . __ __ . __ __ . __ __ .
72
65
73
6
40
44.45
49
12.7
74
0
49
-6.35
74
0
49
12.7
74
0
49
-6.35
74
0
49
0
74
0
49
-6.35
74
0
0
LTYPE
5
3F
330
5
100
AcDbSymbolTableRecord
100
AcDbLinetypeTableRecord
2
BORDER2
70
0
3
Border (.5x) __.__.__.__.__.__.__.__.__.__.__.
72
65
73
6
40
22.225
49
6.35
74
0
49
-3.175
74
0
49
6.35
74
0
49
-3.175
74
0
49
0
74
0
49
-3.175
74
0
0
LTYPE
5
40
330
5
100
AcDbSymbolTableRecord
100
AcDbLinetypeTableRecord
2
BORDERX2
70
0
3
Border (2x) ____  ____  .  ____  ____  .  ___
72
65
73
6
40
88.9
49
25.4
74
0
49
-12.7
74
0
49
25.4
74
0
49
-12.7
74
0
49
0
74
0
49
-12.7
74
0
0
LTYPE
5
41
330
5
100
AcDbSymbolTableRecord
100
AcDbLinetypeTableRecord
2
CENTER
70
0
3
Center ____ _ ____ _ ____ _ ____ _ ____ _ ____
72
65
73
4
40
50.8
49
31.75
74
0
49
-6.35
74
0
49
6.35
74
0
49
-6.35
74
0
0
LTYPE
5
42
330
5
100
AcDbSymbolTableRecord
100
AcDbLinetypeTableRecord
2
CENTER2
70
0
3
Center (.5x) ___ _ ___ _ ___ _ ___ _ ___ _ ___
72
65
73
4
40
28.575
49
19.05
74
0
49
-3.175
74
0
49
3.175
74
0
49
-3.175
74
0
0
LTYPE
5
43
330
5
100
AcDbSymbolTableRecord
100
AcDbLinetypeTableRecord
2
CENTERX2
70
0
3
Center (2x) ________  __  ________  __  _____
72
65
73
4
40
101.6
49
63.5
74
0
49
-12.7
74
0
49
12.7
74
0
49
-12.7
74
0
0
ENDTAB
0
TABLE
2
LAYER
5
2
330
0
100
AcDbSymbolTable
70
1
0
LAYER
5
10
330
2
100
AcDbSymbolTableRecord
100
AcDbLayerTableRecord
2
0
70
0
62
7
6
CONTINUOUS
370
-3
390
F
0
LAYER
5
44
330
2
100
AcDbSymbolTableRecord
100
AcDbLayerTableRecord
2
PRINCIPAL
70
0
62
7
6
CONTINUOUS
370
-3
390
F
0
ENDTAB
0
TABLE
2
STYLE
5
3
330
0
100
AcDbSymbolTable
70
3
0
STYLE
5
45
330
2
100
AcDbSymbolTableRecord
100
AcDbTextStyleTableRecord
2
Standard
70
0
40
0
41
1
50
0
71
0
42
1
3
txt
4

0
ENDTAB
0
TABLE
2
VIEW
5
6
330
0
100
AcDbSymbolTable
70
0
0
ENDTAB
0
TABLE
2
UCS
5
7
330
0
100
AcDbSymbolTable
70
0
0
ENDTAB
0
TABLE
2
APPID
5
9
330
0
100
AcDbSymbolTable
70
1
0
APPID
5
12
330
9
100
AcDbSymbolTableRecord
100
AcDbRegAppTableRecord
2
ACAD
70
0
0
ENDTAB
0
TABLE
2
DIMSTYLE
5
A
330
0
100
AcDbSymbolTable
70
1
100
AcDbDimStyleTable
71
1
0
DIMSTYLE
105
46
330
A
100
AcDbSymbolTableRecord
100
AcDbDimStyleTableRecord
2
Standard
70
0
40
1
41
0.18
42
0.0625
43
0.38
44
0.18
45
0
46
0
47
0
48
0
140
3
141
0.09
142
0
143
25.4
144
1
145
0
146
1
147
0.09
148
0
71
0
72
0
73
0
74
1
75
0
76
0
77
0
78
0
79
0
170
0
171
2
172
0
173
0
174
0
175
0
176
0
177
0
178
0
179
0
271
4
272
4
273
2
274
2
275
0
276
0
277
2
278
46
279
0
280
0
281
0
282
0
283
1
284
0
285
0
286
0
288
0
289
3
340
Standard
341

371
-2
372
-2
0
ENDTAB
0
TABLE
2
BLOCK_RECORD
5
1
330
0
100
AcDbSymbolTable
70
2
0
BLOCK_RECORD
5
1F
330
1
100
AcDbSymbolTableRecord
100
AcDbBlockTableRecord
2
*Model_Space
70
0
280
1
281
0
0
BLOCK_RECORD
5
1E
330
1
100
AcDbSymbolTableRecord
100
AcDbBlockTableRecord
2
*Paper_Space
70
0
280
1
281
0
0
BLOCK_RECORD
5
47
330
1
100
AcDbSymbolTableRecord
100
AcDbBlockTableRecord
2
DIM1
70
0
280
1
281
0
0
BLOCK_RECORD
5
4A
330
1
100
AcDbSymbolTableRecord
100
AcDbBlockTableRecord
2
VDDIM_DEFAULT
70
0
280
1
281
0
0
BLOCK_RECORD
5
4D
330
1
100
AcDbSymbolTableRecord
100
AcDbBlockTableRecord
2
Varilla Mesa
70
0
280
1
281
0
0
BLOCK_RECORD
5
50
330
1
100
AcDbSymbolTableRecord
100
AcDbBlockTableRecord
2
A$C8085
70
0
280
1
281
0
0
BLOCK_RECORD
5
53
330
1
100
AcDbSymbolTableRecord
100
AcDbBlockTableRecord
2
A$C7964
70
0
280
1
281
0
0
BLOCK_RECORD
5
56
330
1
100
AcDbSymbolTableRecord
100
AcDbBlockTableRecord
2
A$C7980
70
0
280
1
281
0
0
BLOCK_RECORD
5
59
330
1
100
AcDbSymbolTableRecord
100
AcDbBlockTableRecord
2
A$C7774
70
0
280
1
281
0
0
BLOCK_RECORD
5
5C
330
1
100
AcDbSymbolTableRecord
100
AcDbBlockTableRecord
2
A$C7813
70
0
280
1
281
0
0
BLOCK_RECORD
5
5F
330
1
100
AcDbSymbolTableRecord
100
AcDbBlockTableRecord
2
A$C7911
70
0
280
1
281
0
0
BLOCK_RECORD
5
62
330
1
100
AcDbSymbolTableRecord
100
AcDbBlockTableRecord
2
A$C7764
70
0
280
1
281
0
0
ENDTAB
0
ENDSEC
0
SECTION
2
BLOCKS
0
BLOCK
5
20
330
1F
100
AcDbEntity
8
0
100
AcDbBlockBegin
2
*Model_Space
70
0
10
0
20
0
30
0
3
*Model_Space
1

0
ENDBLK
5
21
330
1F
100
AcDbEntity
8
0
100
AcDbBlockEnd
0
BLOCK
5
1C
330
1B
100
AcDbEntity
8
0
100
AcDbBlockBegin
2
*Paper_Space
70
0
10
0
20
0
30
0
3
*Paper_Space
1

0
ENDBLK
5
1D
330
1F
100
AcDbEntity
8
0
100
AcDbBlockEnd
0
BLOCK
5
48
330
47
100
AcDbEntity
8
0
100
AcDbBlockBegin
2
DIM1
70
0
10
0
20
0
3
DIM1
1

0
ENDBLK
5
49
330
47
100
AcDbEntity
8
0
100
AcDbBlockEnd
0
BLOCK
5
4B
330
4A
100
AcDbEntity
8
0
100
AcDbBlockBegin
2
VDDIM_DEFAULT
70
0
10
0
20
0
3
VDDIM_DEFAULT
1

0
LWPOLYLINE
5
65
100
AcDbEntity
8
0
6
CONTINUOUS
62
0
370
-1
100
AcDbPolyline
90
4
70
0
43
0
10
0
20
0
10
-1
20
-0.1665
10
-1
20
0.1665
10
0
20
0
0
ENDBLK
5
4C
330
4A
100
AcDbEntity
8
0
100
AcDbBlockEnd
0
BLOCK
5
4E
330
4D
100
AcDbEntity
8
0
100
AcDbBlockBegin
2
Varilla Mesa
70
0
10
0
20
0
3
Varilla Mesa
1

0
ARC
5
66
100
AcDbEntity
8
PRINCIPAL
6
CONTINUOUS
62
256
370
-1
100
AcDbCircle
10
-10
20
104.5
40
4.949747
100
AcDbArc
50
5.20000023378e-05
51
179.999948
0
ARC
5
67
100
AcDbEntity
8
PRINCIPAL
6
CONTINUOUS
62
256
370
-1
100
AcDbCircle
10
-10
20
-104.5
40
4.949747
100
AcDbArc
50
180.000052
51
359.999948
0
CIRCLE
5
68
100
AcDbEntity
8
PRINCIPAL
6
CONTINUOUS
62
256
370
-1
100
AcDbCircle
10
-10
20
-104.5
40
1.6
0
CIRCLE
5
69
100
AcDbEntity
8
PRINCIPAL
6
CONTINUOUS
62
256
370
-1
100
AcDbCircle
10
-10
20
104.5
40
1.6
0
ARC
5
6A
100
AcDbEntity
8
PRINCIPAL
6
CONTINUOUS
62
256
370
-1
100
AcDbCircle
10
0
20
0
40
4.949747
100
AcDbArc
50
270.000052
51
89.999948
0
CIRCLE
5
6B
100
AcDbEntity
8
PRINCIPAL
6
CONTINUOUS
62
256
370
-1
100
AcDbCircle
10
0
20
0
40
1.6
0
LINE
5
6C
100
AcDbEntity
8
PRINCIPAL
6
CONTINUOUS
62
256
370
-1
100
AcDbLine
10
-5.05025484103
20
-8.94974709229
11
-5.0502532388
21
-104.50000495
0
LINE
5
6D
100
AcDbEntity
8
PRINCIPAL
6
CONTINUOUS
62
256
370
-1
100
AcDbLine
10
4.4922480811e-06
20
-4.949747
11
-1.05025493709
21
-4.94974702522
0
LINE
5
6E
100
AcDbEntity
8
PRINCIPAL
6
CONTINUOUS
62
256
370
-1
100
AcDbLine
10
-1.05024943238
20
4.94974691822
11
4.4922483085e-06
21
4.949747
0
LINE
5
6F
100
AcDbEntity
8
PRINCIPAL
6
CONTINUOUS
62
256
370
-1
100
AcDbLine
10
-5.05025253169
20
104.500004243
11
-5.05024974385
21
8.94974680151
0
LINE
5
70
100
AcDbEntity
8
PRINCIPAL
6
CONTINUOUS
62
256
370
-1
100
AcDbLine
10
-14.949747
20
-104.500004492
11
-14.9497460541
21
104.500004243
0
ARC
5
71
100
AcDbEntity
8
PRINCIPAL
6
CONTINUOUS
62
256
370
-1
100
AcDbCircle
10
-1.05024974385
20
8.94974691822
40
4
100
AcDbArc
50
180.000001672
51
270.000004461
0
ARC
5
72
100
AcDbEntity
8
PRINCIPAL
6
CONTINUOUS
62
256
370
-1
100
AcDbCircle
10
-1.05025484103
20
-8.94974702522
40
4
100
AcDbArc
50
90.000001376
51
180.000000961
0
ENDBLK
5
4F
330
4D
100
AcDbEntity
8
0
100
AcDbBlockEnd
0
BLOCK
5
51
330
50
100
AcDbEntity
8
0
100
AcDbBlockBegin
2
A$C8085
70
0
10
0
20
0
3
A$C8085
1

0
LINE
5
73
100
AcDbEntity
8
PRINCIPAL
6
CONTINUOUS
62
256
370
-1
100
AcDbLine
10
12.008774
20
1.725006
11
8.008746
21
1.725006
0
LINE
5
74
100
AcDbEntity
8
PRINCIPAL
6
CONTINUOUS
62
256
370
-1
100
AcDbLine
10
8.008746
20
1.725006
11
8.008746
21
3
0
LINE
5
75
100
AcDbEntity
8
PRINCIPAL
6
CONTINUOUS
62
256
370
-1
100
AcDbLine
10
8.008746
20
3
11
5.008746
21
3
0
LINE
5
76
100
AcDbEntity
8
PRINCIPAL
6
CONTINUOUS
62
256
370
-1
100
AcDbLine
10
5.008746
20
3
11
5.008746
21
6.200012
0
LINE
5
77
100
AcDbEntity
8
PRINCIPAL
6
CONTINUOUS
62
256
370
-1
100
AcDbLine
10
5.008746
20
6.200012
11
8.008746
21
6.200012
0
LINE
5
78
100
AcDbEntity
8
PRINCIPAL
6
CONTINUOUS
62
256
370
-1
100
AcDbLine
10
8.008746
20
6.200012
11
8.008746
21
7.475006
0
LINE
5
79
100
AcDbEntity
8
PRINCIPAL
6
CONTINUOUS
62
256
370
-1
100
AcDbLine
10
8.008746
20
7.475006
11
12.008774
21
7.475006
0
LINE
5
7A
100
AcDbEntity
8
PRINCIPAL
6
CONTINUOUS
62
256
370
-1
100
AcDbLine
10
12.008774
20
7.475006
11
12.008774
21
6.200012
0
LINE
5
7B
100
AcDbEntity
8
PRINCIPAL
6
CONTINUOUS
62
256
370
-1
100
AcDbLine
10
12.008774
20
6.200012
11
15.008746
21
6.200012
0
LINE
5
7C
100
AcDbEntity
8
PRINCIPAL
6
CONTINUOUS
62
256
370
-1
100
AcDbLine
10
15.008746
20
6.200012
11
15.008746
21
12.100006
0
LINE
5
7D
100
AcDbEntity
8
PRINCIPAL
6
CONTINUOUS
62
256
370
-1
100
AcDbLine
10
15.008746
20
12.100006
11
9.909727
21
12.100006
0
ARC
5
7E
100
AcDbEntity
8
PRINCIPAL
6
CONTINUOUS
62
256
370
-1
100
AcDbCircle
10
9.909727
20
19.600006
40
7.5
100
AcDbArc
50
90
51
270
0
LINE
5
7F
100
AcDbEntity
8
PRINCIPAL
6
CONTINUOUS
62
256
370
-1
100
AcDbLine
10
9.909727
20
27.100006
11
15.008746
21
27.100006
0
LINE
5
80
100
AcDbEntity
8
PRINCIPAL
6
CONTINUOUS
62
256
370
-1
100
AcDbLine
10
15.008746
20
27.100006
11
15.008746
21
33
0
LINE
5
81
100
AcDbEntity
8
PRINCIPAL
6
CONTINUOUS
62
256
370
-1
100
AcDbLine
10
15.008746
20
33
11
12.008774
21
33
0
LINE
5
82
100
AcDbEntity
8
PRINCIPAL
6
CONTINUOUS
62
256
370
-1
100
AcDbLine
10
12.008774
20
33
11
12.008774
21
31.725006
0
LINE
5
83
100
AcDbEntity
8
PRINCIPAL
6
CONTINUOUS
62
256
370
-1
100
AcDbLine
10
12.008774
20
31.725006
11
8.008746
21
31.725006
0
LINE
5
84
100
AcDbEntity
8
PRINCIPAL
6
CONTINUOUS
62
256
370
-1
100
AcDbLine
10
8.008746
20
31.725006
11
8.008746
21
33
0
LINE
5
85
100
AcDbEntity
8
PRINCIPAL
6
CONTINUOUS
62
256
370
-1
100
AcDbLine
10
8.008746
20
33
11
5.008746
21
33
0
LINE
5
86
100
AcDbEntity
8
PRINCIPAL
6
CONTINUOUS
62
256
370
-1
100
AcDbLine
10
5.008746
20
33
11
5.008746
21
36.200012
0
LINE
5
87
100
AcDbEntity
8
PRINCIPAL
6
CONTINUOUS
62
256
370
-1
100
AcDbLine
10
5.008746
20
36.200012
11
8.008746
21
36.200012
0
LINE
5
88
100
AcDbEntity
8
PRINCIPAL
6
CONTINUOUS
62
256
370
-1
100
AcDbLine
10
8.008746
20
36.200012
11
8.008746
21
37.475006
0
LINE
5
89
100
AcDbEntity
8
PRINCIPAL
6
CONTINUOUS
62
256
370
-1
100
AcDbLine
10
8.008746
20
37.475006
11
12.008774
21
37.475006
0
LINE
5
8A
100
AcDbEntity
8
PRINCIPAL
6
CONTINUOUS
62
256
370
-1
100
AcDbLine
10
12.008774
20
37.475006
11
12.008774
21
36.200012
0
LINE
5
8B
100
AcDbEntity
8
PRINCIPAL
6
CONTINUOUS
62
256
370
-1
100
AcDbLine
10
12.008774
20
36.200012
11
15.008746
21
36.200012
0
LINE
5
8C
100
AcDbEntity
8
PRINCIPAL
6
CONTINUOUS
62
256
370
-1
100
AcDbLine
10
15.008746
20
36.200012
11
15.008746
21
39.200012
0
LINE
5
8D
100
AcDbEntity
8
PRINCIPAL
6
CONTINUOUS
62
256
370
-1
100
AcDbLine
10
15.008746
20
39.200012
11
3
21
39.200012
0
ARC
5
8E
100
AcDbEntity
8
PRINCIPAL
6
CONTINUOUS
62
256
370
-1
100
AcDbCircle
10
3
20
36.200012
40
3
100
AcDbArc
50
90
51
180
0
LINE
5
8F
100
AcDbEntity
8
PRINCIPAL
6
CONTINUOUS
62
256
370
-1
100
AcDbLine
10
0
20
36.200012
11
0
21
3
0
ARC
5
90
100
AcDbEntity
8
PRINCIPAL
6
CONTINUOUS
62
256
370
-1
100
AcDbCircle
10
3
20
3
40
3
100
AcDbArc
50
180
51
270
0
LINE
5
91
100
AcDbEntity
8
PRINCIPAL
6
CONTINUOUS
62
256
370
-1
100
AcDbLine
10
3
20
0
11
15.008746
21
0
0
LINE
5
92
100
AcDbEntity
8
PRINCIPAL
6
CONTINUOUS
62
256
370
-1
100
AcDbLine
10
15.008746
20
0
11
15.008746
21
3
0
LINE
5
93
100
AcDbEntity
8
PRINCIPAL
6
CONTINUOUS
62
256
370
-1
100
AcDbLine
10
15.008746
20
3
11
12.008774
21
3
0
LINE
5
94
100
AcDbEntity
8
PRINCIPAL
6
CONTINUOUS
62
256
370
-1
100
AcDbLine
10
12.008774
20
3
11
12.008774
21
1.725006
0
ENDBLK
5
52
330
50
100
AcDbEntity
8
0
100
AcDbBlockEnd
0
BLOCK
5
54
330
53
100
AcDbEntity
8
0
100
AcDbBlockBegin
2
A$C7964
70
0
10
0
20
0
3
A$C7964
1

0
LINE
5
95
100
AcDbEntity
8
PRINCIPAL
6
CONTINUOUS
62
256
370
-1
100
AcDbLine
10
12.008774
20
1.725006
11
8.008746
21
1.725006
0
LINE
5
96
100
AcDbEntity
8
PRINCIPAL
6
CONTINUOUS
62
256
370
-1
100
AcDbLine
10
8.008746
20
1.725006
11
8.008746
21
3
0
LINE
5
97
100
AcDbEntity
8
PRINCIPAL
6
CONTINUOUS
62
256
370
-1
100
AcDbLine
10
8.008746
20
3
11
5.008746
21
3
0
LINE
5
98
100
AcDbEntity
8
PRINCIPAL
6
CONTINUOUS
62
256
370
-1
100
AcDbLine
10
5.008746
20
3
11
5.008746
21
6.200012
0
LINE
5
99
100
AcDbEntity
8
PRINCIPAL
6
CONTINUOUS
62
256
370
-1
100
AcDbLine
10
5.008746
20
6.200012
11
8.008746
21
6.200012
0
LINE
5
9A
100
AcDbEntity
8
PRINCIPAL
6
CONTINUOUS
62
256
370
-1
100
AcDbLine
10
8.008746
20
6.200012
11
8.008746
21
7.475006
0
LINE
5
9B
100
AcDbEntity
8
PRINCIPAL
6
CONTINUOUS
62
256
370
-1
100
AcDbLine
10
8.008746
20
7.475006
11
12.008774
21
7.475006
0
LINE
5
9C
100
AcDbEntity
8
PRINCIPAL
6
CONTINUOUS
62
256
370
-1
100
AcDbLine
10
12.008774
20
7.475006
11
12.008774
21
6.200012
0
LINE
5
9D
100
AcDbEntity
8
PRINCIPAL
6
CONTINUOUS
62
256
370
-1
100
AcDbLine
10
12.008774
20
6.200012
11
15.008746
21
6.200012
0
LINE
5
9E
100
AcDbEntity
8
PRINCIPAL
6
CONTINUOUS
62
256
370
-1
100
AcDbLine
10
15.008746
20
6.200012
11
15.008746
21
12.100006
0
LINE
5
9F
100
AcDbEntity
8
PRINCIPAL
6
CONTINUOUS
62
256
370
-1
100
AcDbLine
10
15.008746
20
12.100006
11
12.009733
21
12.100006
0
LINE
5
A0
100
AcDbEntity
8
PRINCIPAL
6
CONTINUOUS
62
256
370
-1
100
AcDbLine
10
12.009733
20
12.100006
11
12.009733
21
21.099964
0
LINE
5
A1
100
AcDbEntity
8
PRINCIPAL
6
CONTINUOUS
62
256
370
-1
100
AcDbLine
10
12.009733
20
21.099964
11
15.008746
21
21.099964
0
LINE
5
A2
100
AcDbEntity
8
PRINCIPAL
6
CONTINUOUS
62
256
370
-1
100
AcDbLine
10
15.008746
20
21.099964
11
15.008746
21
26.999958
0
LINE
5
A3
100
AcDbEntity
8
PRINCIPAL
6
CONTINUOUS
62
256
370
-1
100
AcDbLine
10
15.008746
20
26.999958
11
12.008774
21
26.999958
0
LINE
5
A4
100
AcDbEntity
8
PRINCIPAL
6
CONTINUOUS
62
256
370
-1
100
AcDbLine
10
12.008774
20
26.999958
11
12.008774
21
25.724964
0
LINE
5
A5
100
AcDbEntity
8
PRINCIPAL
6
CONTINUOUS
62
256
370
-1
100
AcDbLine
10
12.008774
20
25.724964
11
8.008746
21
25.724964
0
LINE
5
A6
100
AcDbEntity
8
PRINCIPAL
6
CONTINUOUS
62
256
370
-1
100
AcDbLine
10
8.008746
20
25.724964
11
8.008746
21
26.999958
0
LINE
5
A7
100
AcDbEntity
8
PRINCIPAL
6
CONTINUOUS
62
256
370
-1
100
AcDbLine
10
8.008746
20
26.999958
11
5.008746
21
26.999958
0
LINE
5
A8
100
AcDbEntity
8
PRINCIPAL
6
CONTINUOUS
62
256
370
-1
100
AcDbLine
10
5.008746
20
26.999958
11
5.008746
21
30.199969
0
LINE
5
A9
100
AcDbEntity
8
PRINCIPAL
6
CONTINUOUS
62
256
370
-1
100
AcDbLine
10
5.008746
20
30.199969
11
8.008746
21
30.199969
0
LINE
5
AA
100
AcDbEntity
8
PRINCIPAL
6
CONTINUOUS
62
256
370
-1
100
AcDbLine
10
8.008746
20
30.199969
11
8.008746
21
31.474964
0
LINE
5
AB
100
AcDbEntity
8
PRINCIPAL
6
CONTINUOUS
62
256
370
-1
100
AcDbLine
10
8.008746
20
31.474964
11
12.008774
21
31.474964
0
LINE
5
AC
100
AcDbEntity
8
PRINCIPAL
6
CONTINUOUS
62
256
370
-1
100
AcDbLine
10
12.008774
20
31.474964
11
12.008774
21
30.199969
0
LINE
5
AD
100
AcDbEntity
8
PRINCIPAL
6
CONTINUOUS
62
256
370
-1
100
AcDbLine
10
12.008774
20
30.199969
11
15.008746
21
30.199969
0
LINE
5
AE
100
AcDbEntity
8
PRINCIPAL
6
CONTINUOUS
62
256
370
-1
100
AcDbLine
10
15.008746
20
30.199969
11
15.008746
21
33.199969
0
LINE
5
AF
100
AcDbEntity
8
PRINCIPAL
6
CONTINUOUS
62
256
370
-1
100
AcDbLine
10
15.008746
20
33.199969
11
3
21
33.199969
0
ARC
5
B0
100
AcDbEntity
8
PRINCIPAL
6
CONTINUOUS
62
256
370
-1
100
AcDbCircle
10
3
20
30.199969
40
3
100
AcDbArc
50
90
51
180
0
LINE
5
B1
100
AcDbEntity
8
PRINCIPAL
6
CONTINUOUS
62
256
370
-1
100
AcDbLine
10
0
20
30.199969
11
0
21
3
0
ARC
5
B2
100
AcDbEntity
8
PRINCIPAL
6
CONTINUOUS
62
256
370
-1
100
AcDbCircle
10
3
20
3
40
3
100
AcDbArc
50
180
51
270
0
LINE
5
B3
100
AcDbEntity
8
PRINCIPAL
6
CONTINUOUS
62
256
370
-1
100
AcDbLine
10
3
20
0
11
15.008746
21
0
0
LINE
5
B4
100
AcDbEntity
8
PRINCIPAL
6
CONTINUOUS
62
256
370
-1
100
AcDbLine
10
15.008746
20
0
11
15.008746
21
3
0
LINE
5
B5
100
AcDbEntity
8
PRINCIPAL
6
CONTINUOUS
62
256
370
-1
100
AcDbLine
10
15.008746
20
3
11
12.008774
21
3
0
LINE
5
B6
100
AcDbEntity
8
PRINCIPAL
6
CONTINUOUS
62
256
370
-1
100
AcDbLine
10
12.008774
20
3
11
12.008774
21
1.725006
0
ENDBLK
5
55
330
53
100
AcDbEntity
8
0
100
AcDbBlockEnd
0
BLOCK
5
57
330
56
100
AcDbEntity
8
0
100
AcDbBlockBegin
2
A$C7980
70
0
10
0
20
0
3
A$C7980
1

0
ENDBLK
5
58
330
56
100
AcDbEntity
8
0
100
AcDbBlockEnd
0
BLOCK
5
5A
330
59
100
AcDbEntity
8
0
100
AcDbBlockBegin
2
A$C7774
70
0
10
0
20
0
3
A$C7774
1

0
LINE
5
B7
100
AcDbEntity
8
PRINCIPAL
6
CONTINUOUS
62
256
370
-1
100
AcDbLine
10
48
20
48
11
47.999997
21
37.466021
0
ARC
5
B8
100
AcDbEntity
8
PRINCIPAL
6
CONTINUOUS
62
256
370
-1
100
AcDbCircle
10
47.499997
20
37.466021
40
0.5
100
AcDbArc
50
300.000198
51
0
0
ARC
5
B9
100
AcDbEntity
8
PRINCIPAL
6
CONTINUOUS
62
256
370
-1
100
AcDbCircle
10
8
20
47.313709
40
8
100
AcDbArc
50
180
51
224.999997
0
LINE
5
BA
100
AcDbEntity
8
PRINCIPAL
6
CONTINUOUS
62
256
370
-1
100
AcDbLine
10
0
20
47.313709
11
0
21
48
0
LINE
5
BB
100
AcDbEntity
8
PRINCIPAL
6
CONTINUOUS
62
256
370
-1
100
AcDbLine
10
0
20
48
11
8.533976
21
47.999997
0
ARC
5
BC
100
AcDbEntity
8
PRINCIPAL
6
CONTINUOUS
62
256
370
-1
100
AcDbCircle
10
8.533976
20
47.499997
40
0.5
100
AcDbArc
50
30.000198
51
90
0
ARC
5
BD
100
AcDbEntity
8
PRINCIPAL
6
CONTINUOUS
62
256
370
-1
100
AcDbCircle
10
9.4
20
48
40
0.5
100
AcDbArc
50
210.000198
51
60
0
ARC
5
BE
100
AcDbEntity
8
PRINCIPAL
6
CONTINUOUS
62
256
370
-1
100
AcDbCircle
10
9.9
20
48.866026
40
0.5
100
AcDbArc
50
180
51
240
0
LINE
5
BF
100
AcDbEntity
8
PRINCIPAL
6
CONTINUOUS
62
256
370
-1
100
AcDbLine
10
9.4
20
48.866026
11
9.399997
21
50.500052
0
ARC
5
C0
100
AcDbEntity
8
PRINCIPAL
6
CONTINUOUS
62
256
370
-1
100
AcDbCircle
10
9.899997
20
50.500052
40
0.5
100
AcDbArc
50
90
51
180
0
LINE
5
C1
100
AcDbEntity
8
PRINCIPAL
6
CONTINUOUS
62
256
370
-1
100
AcDbLine
10
9.899997
20
51.000052
11
14.899994
21
51.000052
0
ARC
5
C2
100
AcDbEntity
8
PRINCIPAL
6
CONTINUOUS
62
256
370
-1
100
AcDbCircle
10
14.899994
20
50.500052
40
0.5
100
AcDbArc
50
0
51
90
0
LINE
5
C3
100
AcDbEntity
8
PRINCIPAL
6
CONTINUOUS
62
256
370
-1
100
AcDbLine
10
15.399994
20
50.500052
11
15.399994
21
48.866024
0
ARC
5
C4
100
AcDbEntity
8
PRINCIPAL
6
CONTINUOUS
62
256
370
-1
100
AcDbCircle
10
14.899994
20
48.866024
40
0.5
100
AcDbArc
50
300.000198
51
0
0
ARC
5
C5
100
AcDbEntity
8
PRINCIPAL
6
CONTINUOUS
62
256
370
-1
100
AcDbCircle
10
15.399997
20
48
40
0.5
100
AcDbArc
50
120.000198
51
330
0
ARC
5
C6
100
AcDbEntity
8
PRINCIPAL
6
CONTINUOUS
62
256
370
-1
100
AcDbCircle
10
16.266022
20
47.5
40
0.5
100
AcDbArc
50
90
51
150
0
LINE
5
C7
100
AcDbEntity
8
PRINCIPAL
6
CONTINUOUS
62
256
370
-1
100
AcDbLine
10
16.266022
20
48
11
21.399994
21
48
0
LINE
5
C8
100
AcDbEntity
8
PRINCIPAL
6
CONTINUOUS
62
256
370
-1
100
AcDbLine
10
21.399994
20
48
11
21.399994
21
45.000028
0
LINE
5
C9
100
AcDbEntity
8
PRINCIPAL
6
CONTINUOUS
62
256
370
-1
100
AcDbLine
10
21.399994
20
45.000028
11
20.125
21
45.000028
0
LINE
5
CA
100
AcDbEntity
8
PRINCIPAL
6
CONTINUOUS
62
256
370
-1
100
AcDbLine
10
20.125
20
45.000028
11
20.125
21
41
0
LINE
5
CB
100
AcDbEntity
8
PRINCIPAL
6
CONTINUOUS
62
256
370
-1
100
AcDbLine
10
20.125
20
41
11
21.399994
21
41
0
LINE
5
CC
100
AcDbEntity
8
PRINCIPAL
6
CONTINUOUS
62
256
370
-1
100
AcDbLine
10
21.399994
20
41
11
21.399994
21
38
0
LINE
5
CD
100
AcDbEntity
8
PRINCIPAL
6
CONTINUOUS
62
256
370
-1
100
AcDbLine
10
21.399994
20
38
11
24.600006
21
38
0
LINE
5
CE
100
AcDbEntity
8
PRINCIPAL
6
CONTINUOUS
62
256
370
-1
100
AcDbLine
10
24.600006
20
38
11
24.600006
21
41
0
LINE
5
CF
100
AcDbEntity
8
PRINCIPAL
6
CONTINUOUS
62
256
370
-1
100
AcDbLine
10
24.600006
20
41
11
25.875
21
41
0
LINE
5
D0
100
AcDbEntity
8
PRINCIPAL
6
CONTINUOUS
62
256
370
-1
100
AcDbLine
10
25.875
20
41
11
25.875
21
45.000028
0
LINE
5
D1
100
AcDbEntity
8
PRINCIPAL
6
CONTINUOUS
62
256
370
-1
100
AcDbLine
10
25.875
20
45.000028
11
24.600006
21
45.000028
0
LINE
5
D2
100
AcDbEntity
8
PRINCIPAL
6
CONTINUOUS
62
256
370
-1
100
AcDbLine
10
24.600006
20
45.000028
11
24.600006
21
48
0
LINE
5
D3
100
AcDbEntity
8
PRINCIPAL
6
CONTINUOUS
62
256
370
-1
100
AcDbLine
10
24.600006
20
48
11
29.733976
21
47.999997
0
ARC
5
D4
100
AcDbEntity
8
PRINCIPAL
6
CONTINUOUS
62
256
370
-1
100
AcDbCircle
10
29.733976
20
47.499997
40
0.5
100
AcDbArc
50
30.000198
51
90
0
ARC
5
D5
100
AcDbEntity
8
PRINCIPAL
6
CONTINUOUS
62
256
370
-1
100
AcDbCircle
10
30.6
20
48
40
0.5
100
AcDbArc
50
210.000198
51
60
0
ARC
5
D6
100
AcDbEntity
8
PRINCIPAL
6
CONTINUOUS
62
256
370
-1
100
AcDbCircle
10
31.1
20
48.866026
40
0.5
100
AcDbArc
50
180
51
240
0
LINE
5
D7
100
AcDbEntity
8
PRINCIPAL
6
CONTINUOUS
62
256
370
-1
100
AcDbLine
10
30.6
20
48.866026
11
30.599997
21
50.500052
0
ARC
5
D8
100
AcDbEntity
8
PRINCIPAL
6
CONTINUOUS
62
256
370
-1
100
AcDbCircle
10
31.099997
20
50.500052
40
0.5
100
AcDbArc
50
90
51
180
0
LINE
5
D9
100
AcDbEntity
8
PRINCIPAL
6
CONTINUOUS
62
256
370
-1
100
AcDbLine
10
31.099997
20
51.000052
11
36.099994
21
51.000052
0
ARC
5
DA
100
AcDbEntity
8
PRINCIPAL
6
CONTINUOUS
62
256
370
-1
100
AcDbCircle
10
36.099994
20
50.500052
40
0.5
100
AcDbArc
50
0
51
90
0
LINE
5
DB
100
AcDbEntity
8
PRINCIPAL
6
CONTINUOUS
62
256
370
-1
100
AcDbLine
10
36.599994
20
50.500052
11
36.599994
21
48.866024
0
ARC
5
DC
100
AcDbEntity
8
PRINCIPAL
6
CONTINUOUS
62
256
370
-1
100
AcDbCircle
10
36.099994
20
48.866024
40
0.5
100
AcDbArc
50
300.000198
51
0
0
ARC
5
DD
100
AcDbEntity
8
PRINCIPAL
6
CONTINUOUS
62
256
370
-1
100
AcDbCircle
10
36.599997
20
48
40
0.5
100
AcDbArc
50
120.000198
51
330
0
ARC
5
DE
100
AcDbEntity
8
PRINCIPAL
6
CONTINUOUS
62
256
370
-1
100
AcDbCircle
10
37.466023
20
47.5
40
0.5
100
AcDbArc
50
90
51
150
0
LINE
5
DF
100
AcDbEntity
8
PRINCIPAL
6
CONTINUOUS
62
256
370
-1
100
AcDbLine
10
37.466023
20
48
11
48
21
48
0
ARC
5
E0
100
AcDbEntity
8
PRINCIPAL
6
CONTINUOUS
62
256
370
-1
100
AcDbCircle
10
48
20
36.599998
40
0.5
100
AcDbArc
50
120.000198
51
330
0
ARC
5
E1
100
AcDbEntity
8
PRINCIPAL
6
CONTINUOUS
62
256
370
-1
100
AcDbCircle
10
48.866026
20
36.099998
40
0.5
100
AcDbArc
50
90
51
150
0
LINE
5
E2
100
AcDbEntity
8
PRINCIPAL
6
CONTINUOUS
62
256
370
-1
100
AcDbLine
10
48.866026
20
36.599998
11
50.500052
21
36.600001
0
ARC
5
E3
100
AcDbEntity
8
PRINCIPAL
6
CONTINUOUS
62
256
370
-1
100
AcDbCircle
10
50.500052
20
36.100001
40
0.5
100
AcDbArc
50
0
51
90
0
LINE
5
E4
100
AcDbEntity
8
PRINCIPAL
6
CONTINUOUS
62
256
370
-1
100
AcDbLine
10
51.000052
20
36.100001
11
51.000052
21
31.100003
0
ARC
5
E5
100
AcDbEntity
8
PRINCIPAL
6
CONTINUOUS
62
256
370
-1
100
AcDbCircle
10
50.500052
20
31.100003
40
0.5
100
AcDbArc
50
270
51
0
0
LINE
5
E6
100
AcDbEntity
8
PRINCIPAL
6
CONTINUOUS
62
256
370
-1
100
AcDbLine
10
50.500052
20
30.600003
11
48.866024
21
30.600003
0
ARC
5
E7
100
AcDbEntity
8
PRINCIPAL
6
CONTINUOUS
62
256
370
-1
100
AcDbCircle
10
48.866024
20
31.100003
40
0.5
100
AcDbArc
50
210.000198
51
270
0
ARC
5
E8
100
AcDbEntity
8
PRINCIPAL
6
CONTINUOUS
62
256
370
-1
100
AcDbCircle
10
48
20
30.6
40
0.5
100
AcDbArc
50
30.000198
51
240
0
ARC
5
E9
100
AcDbEntity
8
PRINCIPAL
6
CONTINUOUS
62
256
370
-1
100
AcDbCircle
10
47.5
20
29.733975
40
0.5
100
AcDbArc
50
0
51
60
0
LINE
5
EA
100
AcDbEntity
8
PRINCIPAL
6
CONTINUOUS
62
256
370
-1
100
AcDbLine
10
48
20
29.733975
11
48
21
24.600005
0
LINE
5
EB
100
AcDbEntity
8
PRINCIPAL
6
CONTINUOUS
62
256
370
-1
100
AcDbLine
10
48
20
24.600005
11
45.000028
21
24.600005
0
LINE
5
EC
100
AcDbEntity
8
PRINCIPAL
6
CONTINUOUS
62
256
370
-1
100
AcDbLine
10
45.000028
20
24.600005
11
45.000028
21
25.874999
0
LINE
5
ED
100
AcDbEntity
8
PRINCIPAL
6
CONTINUOUS
62
256
370
-1
100
AcDbLine
10
45.000028
20
25.874999
11
41
21
25.874999
0
LINE
5
EE
100
AcDbEntity
8
PRINCIPAL
6
CONTINUOUS
62
256
370
-1
100
AcDbLine
10
41
20
25.874999
11
41
21
24.600005
0
LINE
5
EF
100
AcDbEntity
8
PRINCIPAL
6
CONTINUOUS
62
256
370
-1
100
AcDbLine
10
41
20
24.600005
11
38
21
24.600005
0
LINE
5
F0
100
AcDbEntity
8
PRINCIPAL
6
CONTINUOUS
62
256
370
-1
100
AcDbLine
10
38
20
24.600005
11
38
21
21.399994
0
LINE
5
F1
100
AcDbEntity
8
PRINCIPAL
6
CONTINUOUS
62
256
370
-1
100
AcDbLine
10
38
20
21.399994
11
41
21
21.399994
0
LINE
5
F2
100
AcDbEntity
8
PRINCIPAL
6
CONTINUOUS
62
256
370
-1
100
AcDbLine
10
41
20
21.399994
11
41
21
20.124999
0
LINE
5
F3
100
AcDbEntity
8
PRINCIPAL
6
CONTINUOUS
62
256
370
-1
100
AcDbLine
10
41
20
20.124999
11
45.000028
21
20.124999
0
LINE
5
F4
100
AcDbEntity
8
PRINCIPAL
6
CONTINUOUS
62
256
370
-1
100
AcDbLine
10
45.000028
20
20.124999
11
45.000028
21
21.399994
0
LINE
5
F5
100
AcDbEntity
8
PRINCIPAL
6
CONTINUOUS
62
256
370
-1
100
AcDbLine
10
45.000028
20
21.399994
11
48
21
21.399994
0
LINE
5
F6
100
AcDbEntity
8
PRINCIPAL
6
CONTINUOUS
62
256
370
-1
100
AcDbLine
10
48
20
21.399994
11
47.999997
21
16.266022
0
ARC
5
F7
100
AcDbEntity
8
PRINCIPAL
6
CONTINUOUS
62
256
370
-1
100
AcDbCircle
10
47.499997
20
16.266022
40
0.5
100
AcDbArc
50
300.000198
51
0
0
ARC
5
F8
100
AcDbEntity
8
PRINCIPAL
6
CONTINUOUS
62
256
370
-1
100
AcDbCircle
10
48
20
15.399998
40
0.5
100
AcDbArc
50
120.000198
51
330
0
ARC
5
F9
100
AcDbEntity
8
PRINCIPAL
6
CONTINUOUS
62
256
370
-1
100
AcDbCircle
10
48.866026
20
14.899998
40
0.5
100
AcDbArc
50
90
51
150
0
LINE
5
FA
100
AcDbEntity
8
PRINCIPAL
6
CONTINUOUS
62
256
370
-1
100
AcDbLine
10
48.866026
20
15.399998
11
50.500052
21
15.400001
0
ARC
5
FB
100
AcDbEntity
8
PRINCIPAL
6
CONTINUOUS
62
256
370
-1
100
AcDbCircle
10
50.500052
20
14.900001
40
0.5
100
AcDbArc
50
0
51
90
0
LINE
5
FC
100
AcDbEntity
8
PRINCIPAL
6
CONTINUOUS
62
256
370
-1
100
AcDbLine
10
51.000052
20
14.900001
11
51.000052
21
9.900004
0
ARC
5
FD
100
AcDbEntity
8
PRINCIPAL
6
CONTINUOUS
62
256
370
-1
100
AcDbCircle
10
50.500052
20
9.900004
40
0.5
100
AcDbArc
50
270
51
0
0
LINE
5
FE
100
AcDbEntity
8
PRINCIPAL
6
CONTINUOUS
62
256
370
-1
100
AcDbLine
10
50.500052
20
9.400004
11
48.866024
21
9.400004
0
ARC
5
FF
100
AcDbEntity
8
PRINCIPAL
6
CONTINUOUS
62
256
370
-1
100
AcDbCircle
10
48.866024
20
9.900004
40
0.5
100
AcDbArc
50
210.000198
51
270
0
ARC
5
100
100
AcDbEntity
8
PRINCIPAL
6
CONTINUOUS
62
256
370
-1
100
AcDbCircle
10
48
20
9.400001
40
0.5
100
AcDbArc
50
30.000198
51
240
0
ARC
5
101
100
AcDbEntity
8
PRINCIPAL
6
CONTINUOUS
62
256
370
-1
100
AcDbCircle
10
47.5
20
8.533976
40
0.5
100
AcDbArc
50
0
51
60
0
LINE
5
102
100
AcDbEntity
8
PRINCIPAL
6
CONTINUOUS
62
256
370
-1
100
AcDbLine
10
48
20
8.533976
11
48
21
0
0
LINE
5
103
100
AcDbEntity
8
PRINCIPAL
6
CONTINUOUS
62
256
370
-1
100
AcDbLine
10
48
20
0
11
47.313709
21
0
0
ARC
5
104
100
AcDbEntity
8
PRINCIPAL
6
CONTINUOUS
62
256
370
-1
100
AcDbCircle
10
47.313708
20
8
40
8
100
AcDbArc
50
225.000013
51
270.000002
0
LINE
5
105
100
AcDbEntity
8
PRINCIPAL
6
CONTINUOUS
62
256
370
-1
100
AcDbLine
10
41.656855
20
2.343144
11
2.343146
21
41.656855
0
ENDBLK
5
5B
330
59
100
AcDbEntity
8
0
100
AcDbBlockEnd
0
BLOCK
5
5D
330
5C
100
AcDbEntity
8
0
100
AcDbBlockBegin
2
A$C7813
70
0
10
0
20
0
3
A$C7813
1

0
LINE
5
106
100
AcDbEntity
8
PRINCIPAL
6
CONTINUOUS
62
256
370
-1
100
AcDbLine
10
48
20
48
11
47.999997
21
37.466021
0
ARC
5
107
100
AcDbEntity
8
PRINCIPAL
6
CONTINUOUS
62
256
370
-1
100
AcDbCircle
10
47.499997
20
37.466021
40
0.5
100
AcDbArc
50
300.000198
51
0
0
ARC
5
108
100
AcDbEntity
8
PRINCIPAL
6
CONTINUOUS
62
256
370
-1
100
AcDbCircle
10
8
20
47.313709
40
8
100
AcDbArc
50
180
51
224.999997
0
LINE
5
109
100
AcDbEntity
8
PRINCIPAL
6
CONTINUOUS
62
256
370
-1
100
AcDbLine
10
0
20
47.313709
11
0
21
48
0
LINE
5
10A
100
AcDbEntity
8
PRINCIPAL
6
CONTINUOUS
62
256
370
-1
100
AcDbLine
10
0
20
48
11
8.533976
21
47.999997
0
ARC
5
10B
100
AcDbEntity
8
PRINCIPAL
6
CONTINUOUS
62
256
370
-1
100
AcDbCircle
10
8.533976
20
47.499997
40
0.5
100
AcDbArc
50
30.000198
51
90
0
ARC
5
10C
100
AcDbEntity
8
PRINCIPAL
6
CONTINUOUS
62
256
370
-1
100
AcDbCircle
10
9.4
20
48
40
0.5
100
AcDbArc
50
210.000198
51
60
0
ARC
5
10D
100
AcDbEntity
8
PRINCIPAL
6
CONTINUOUS
62
256
370
-1
100
AcDbCircle
10
9.9
20
48.866026
40
0.5
100
AcDbArc
50
180
51
240
0
LINE
5
10E
100
AcDbEntity
8
PRINCIPAL
6
CONTINUOUS
62
256
370
-1
100
AcDbLine
10
9.4
20
48.866026
11
9.399997
21
50.500052
0
ARC
5
10F
100
AcDbEntity
8
PRINCIPAL
6
CONTINUOUS
62
256
370
-1
100
AcDbCircle
10
9.899997
20
50.500052
40
0.5
100
AcDbArc
50
90
51
180
0
LINE
5
110
100
AcDbEntity
8
PRINCIPAL
6
CONTINUOUS
62
256
370
-1
100
AcDbLine
10
9.899997
20
51.000052
11
14.899994
21
51.000052
0
ARC
5
111
100
AcDbEntity
8
PRINCIPAL
6
CONTINUOUS
62
256
370
-1
100
AcDbCircle
10
14.899994
20
50.500052
40
0.5
100
AcDbArc
50
0
51
90
0
LINE
5
112
100
AcDbEntity
8
PRINCIPAL
6
CONTINUOUS
62
256
370
-1
100
AcDbLine
10
15.399994
20
50.500052
11
15.399994
21
48.866024
0
ARC
5
113
100
AcDbEntity
8
PRINCIPAL
6
CONTINUOUS
62
256
370
-1
100
AcDbCircle
10
14.899994
20
48.866024
40
0.5
100
AcDbArc
50
300.000198
51
0
0
ARC
5
114
100
AcDbEntity
8
PRINCIPAL
6
CONTINUOUS
62
256
370
-1
100
AcDbCircle
10
15.399997
20
48
40
0.5
100
AcDbArc
50
120.000198
51
330
0
ARC
5
115
100
AcDbEntity
8
PRINCIPAL
6
CONTINUOUS
62
256
370
-1
100
AcDbCircle
10
16.266022
20
47.5
40
0.5
100
AcDbArc
50
90
51
150
0
LINE
5
116
100
AcDbEntity
8
PRINCIPAL
6
CONTINUOUS
62
256
370
-1
100
AcDbLine
10
16.266022
20
48
11
21.399994
21
48
0
LINE
5
117
100
AcDbEntity
8
PRINCIPAL
6
CONTINUOUS
62
256
370
-1
100
AcDbLine
10
21.399994
20
48
11
21.399994
21
45.000028
0
LINE
5
118
100
AcDbEntity
8
PRINCIPAL
6
CONTINUOUS
62
256
370
-1
100
AcDbLine
10
21.399994
20
45.000028
11
20.125
21
45.000028
0
LINE
5
119
100
AcDbEntity
8
PRINCIPAL
6
CONTINUOUS
62
256
370
-1
100
AcDbLine
10
20.125
20
45.000028
11
20.125
21
41
0
LINE
5
11A
100
AcDbEntity
8
PRINCIPAL
6
CONTINUOUS
62
256
370
-1
100
AcDbLine
10
20.125
20
41
11
21.399994
21
41
0
LINE
5
11B
100
AcDbEntity
8
PRINCIPAL
6
CONTINUOUS
62
256
370
-1
100
AcDbLine
10
21.399994
20
41
11
21.399994
21
38
0
LINE
5
11C
100
AcDbEntity
8
PRINCIPAL
6
CONTINUOUS
62
256
370
-1
100
AcDbLine
10
21.399994
20
38
11
24.600006
21
38
0
LINE
5
11D
100
AcDbEntity
8
PRINCIPAL
6
CONTINUOUS
62
256
370
-1
100
AcDbLine
10
24.600006
20
38
11
24.600006
21
41
0
LINE
5
11E
100
AcDbEntity
8
PRINCIPAL
6
CONTINUOUS
62
256
370
-1
100
AcDbLine
10
24.600006
20
41
11
25.875
21
41
0
LINE
5
11F
100
AcDbEntity
8
PRINCIPAL
6
CONTINUOUS
62
256
370
-1
100
AcDbLine
10
25.875
20
41
11
25.875
21
45.000028
0
LINE
5
120
100
AcDbEntity
8
PRINCIPAL
6
CONTINUOUS
62
256
370
-1
100
AcDbLine
10
25.875
20
45.000028
11
24.600006
21
45.000028
0
LINE
5
121
100
AcDbEntity
8
PRINCIPAL
6
CONTINUOUS
62
256
370
-1
100
AcDbLine
10
24.600006
20
45.000028
11
24.600006
21
48
0
LINE
5
122
100
AcDbEntity
8
PRINCIPAL
6
CONTINUOUS
62
256
370
-1
100
AcDbLine
10
24.600006
20
48
11
29.733976
21
47.999997
0
ARC
5
123
100
AcDbEntity
8
PRINCIPAL
6
CONTINUOUS
62
256
370
-1
100
AcDbCircle
10
29.733976
20
47.499997
40
0.5
100
AcDbArc
50
30.000198
51
90
0
ARC
5
124
100
AcDbEntity
8
PRINCIPAL
6
CONTINUOUS
62
256
370
-1
100
AcDbCircle
10
30.6
20
48
40
0.5
100
AcDbArc
50
210.000198
51
60
0
ARC
5
125
100
AcDbEntity
8
PRINCIPAL
6
CONTINUOUS
62
256
370
-1
100
AcDbCircle
10
31.1
20
48.866026
40
0.5
100
AcDbArc
50
180
51
240
0
LINE
5
126
100
AcDbEntity
8
PRINCIPAL
6
CONTINUOUS
62
256
370
-1
100
AcDbLine
10
30.6
20
48.866026
11
30.599997
21
50.500052
0
ARC
5
127
100
AcDbEntity
8
PRINCIPAL
6
CONTINUOUS
62
256
370
-1
100
AcDbCircle
10
31.099997
20
50.500052
40
0.5
100
AcDbArc
50
90
51
180
0
LINE
5
128
100
AcDbEntity
8
PRINCIPAL
6
CONTINUOUS
62
256
370
-1
100
AcDbLine
10
31.099997
20
51.000052
11
36.099994
21
51.000052
0
ARC
5
129
100
AcDbEntity
8
PRINCIPAL
6
CONTINUOUS
62
256
370
-1
100
AcDbCircle
10
36.099994
20
50.500052
40
0.5
100
AcDbArc
50
0
51
90
0
LINE
5
12A
100
AcDbEntity
8
PRINCIPAL
6
CONTINUOUS
62
256
370
-1
100
AcDbLine
10
36.599994
20
50.500052
11
36.599994
21
48.866024
0
ARC
5
12B
100
AcDbEntity
8
PRINCIPAL
6
CONTINUOUS
62
256
370
-1
100
AcDbCircle
10
36.099994
20
48.866024
40
0.5
100
AcDbArc
50
300.000198
51
0
0
ARC
5
12C
100
AcDbEntity
8
PRINCIPAL
6
CONTINUOUS
62
256
370
-1
100
AcDbCircle
10
36.599997
20
48
40
0.5
100
AcDbArc
50
120.000198
51
330
0
ARC
5
12D
100
AcDbEntity
8
PRINCIPAL
6
CONTINUOUS
62
256
370
-1
100
AcDbCircle
10
37.466023
20
47.5
40
0.5
100
AcDbArc
50
90
51
150
0
LINE
5
12E
100
AcDbEntity
8
PRINCIPAL
6
CONTINUOUS
62
256
370
-1
100
AcDbLine
10
37.466023
20
48
11
48
21
48
0
ARC
5
12F
100
AcDbEntity
8
PRINCIPAL
6
CONTINUOUS
62
256
370
-1
100
AcDbCircle
10
48
20
36.599998
40
0.5
100
AcDbArc
50
120.000198
51
330
0
ARC
5
130
100
AcDbEntity
8
PRINCIPAL
6
CONTINUOUS
62
256
370
-1
100
AcDbCircle
10
48.866026
20
36.099998
40
0.5
100
AcDbArc
50
90
51
150
0
LINE
5
131
100
AcDbEntity
8
PRINCIPAL
6
CONTINUOUS
62
256
370
-1
100
AcDbLine
10
48.866026
20
36.599998
11
50.500052
21
36.600001
0
ARC
5
132
100
AcDbEntity
8
PRINCIPAL
6
CONTINUOUS
62
256
370
-1
100
AcDbCircle
10
50.500052
20
36.100001
40
0.5
100
AcDbArc
50
0
51
90
0
LINE
5
133
100
AcDbEntity
8
PRINCIPAL
6
CONTINUOUS
62
256
370
-1
100
AcDbLine
10
51.000052
20
36.100001
11
51.000052
21
31.100003
0
ARC
5
134
100
AcDbEntity
8
PRINCIPAL
6
CONTINUOUS
62
256
370
-1
100
AcDbCircle
10
50.500052
20
31.100003
40
0.5
100
AcDbArc
50
270
51
0
0
LINE
5
135
100
AcDbEntity
8
PRINCIPAL
6
CONTINUOUS
62
256
370
-1
100
AcDbLine
10
50.500052
20
30.600003
11
48.866024
21
30.600003
0
ARC
5
136
100
AcDbEntity
8
PRINCIPAL
6
CONTINUOUS
62
256
370
-1
100
AcDbCircle
10
48.866024
20
31.100003
40
0.5
100
AcDbArc
50
210.000198
51
270
0
ARC
5
137
100
AcDbEntity
8
PRINCIPAL
6
CONTINUOUS
62
256
370
-1
100
AcDbCircle
10
48
20
30.6
40
0.5
100
AcDbArc
50
30.000198
51
240
0
ARC
5
138
100
AcDbEntity
8
PRINCIPAL
6
CONTINUOUS
62
256
370
-1
100
AcDbCircle
10
47.5
20
29.733975
40
0.5
100
AcDbArc
50
0
51
60
0
LINE
5
139
100
AcDbEntity
8
PRINCIPAL
6
CONTINUOUS
62
256
370
-1
100
AcDbLine
10
48
20
29.733975
11
48
21
24.600005
0
LINE
5
13A
100
AcDbEntity
8
PRINCIPAL
6
CONTINUOUS
62
256
370
-1
100
AcDbLine
10
48
20
24.600005
11
45.000028
21
24.600005
0
LINE
5
13B
100
AcDbEntity
8
PRINCIPAL
6
CONTINUOUS
62
256
370
-1
100
AcDbLine
10
45.000028
20
24.600005
11
45.000028
21
25.874999
0
LINE
5
13C
100
AcDbEntity
8
PRINCIPAL
6
CONTINUOUS
62
256
370
-1
100
AcDbLine
10
45.000028
20
25.874999
11
41
21
25.874999
0
LINE
5
13D
100
AcDbEntity
8
PRINCIPAL
6
CONTINUOUS
62
256
370
-1
100
AcDbLine
10
41
20
25.874999
11
41
21
24.600005
0
LINE
5
13E
100
AcDbEntity
8
PRINCIPAL
6
CONTINUOUS
62
256
370
-1
100
AcDbLine
10
41
20
24.600005
11
38
21
24.600005
0
LINE
5
13F
100
AcDbEntity
8
PRINCIPAL
6
CONTINUOUS
62
256
370
-1
100
AcDbLine
10
38
20
24.600005
11
38
21
21.399994
0
LINE
5
140
100
AcDbEntity
8
PRINCIPAL
6
CONTINUOUS
62
256
370
-1
100
AcDbLine
10
38
20
21.399994
11
41
21
21.399994
0
LINE
5
141
100
AcDbEntity
8
PRINCIPAL
6
CONTINUOUS
62
256
370
-1
100
AcDbLine
10
41
20
21.399994
11
41
21
20.124999
0
LINE
5
142
100
AcDbEntity
8
PRINCIPAL
6
CONTINUOUS
62
256
370
-1
100
AcDbLine
10
41
20
20.124999
11
45.000028
21
20.124999
0
LINE
5
143
100
AcDbEntity
8
PRINCIPAL
6
CONTINUOUS
62
256
370
-1
100
AcDbLine
10
45.000028
20
20.124999
11
45.000028
21
21.399994
0
LINE
5
144
100
AcDbEntity
8
PRINCIPAL
6
CONTINUOUS
62
256
370
-1
100
AcDbLine
10
45.000028
20
21.399994
11
48
21
21.399994
0
LINE
5
145
100
AcDbEntity
8
PRINCIPAL
6
CONTINUOUS
62
256
370
-1
100
AcDbLine
10
48
20
21.399994
11
47.999997
21
16.266022
0
ARC
5
146
100
AcDbEntity
8
PRINCIPAL
6
CONTINUOUS
62
256
370
-1
100
AcDbCircle
10
47.499997
20
16.266022
40
0.5
100
AcDbArc
50
300.000198
51
0
0
ARC
5
147
100
AcDbEntity
8
PRINCIPAL
6
CONTINUOUS
62
256
370
-1
100
AcDbCircle
10
48
20
15.399998
40
0.5
100
AcDbArc
50
120.000198
51
330
0
ARC
5
148
100
AcDbEntity
8
PRINCIPAL
6
CONTINUOUS
62
256
370
-1
100
AcDbCircle
10
48.866026
20
14.899998
40
0.5
100
AcDbArc
50
90
51
150
0
LINE
5
149
100
AcDbEntity
8
PRINCIPAL
6
CONTINUOUS
62
256
370
-1
100
AcDbLine
10
48.866026
20
15.399998
11
50.500052
21
15.400001
0
ARC
5
14A
100
AcDbEntity
8
PRINCIPAL
6
CONTINUOUS
62
256
370
-1
100
AcDbCircle
10
50.500052
20
14.900001
40
0.5
100
AcDbArc
50
0
51
90
0
LINE
5
14B
100
AcDbEntity
8
PRINCIPAL
6
CONTINUOUS
62
256
370
-1
100
AcDbLine
10
51.000052
20
14.900001
11
51.000052
21
9.900004
0
ARC
5
14C
100
AcDbEntity
8
PRINCIPAL
6
CONTINUOUS
62
256
370
-1
100
AcDbCircle
10
50.500052
20
9.900004
40
0.5
100
AcDbArc
50
270
51
0
0
LINE
5
14D
100
AcDbEntity
8
PRINCIPAL
6
CONTINUOUS
62
256
370
-1
100
AcDbLine
10
50.500052
20
9.400004
11
48.866024
21
9.400004
0
ARC
5
14E
100
AcDbEntity
8
PRINCIPAL
6
CONTINUOUS
62
256
370
-1
100
AcDbCircle
10
48.866024
20
9.900004
40
0.5
100
AcDbArc
50
210.000198
51
270
0
ARC
5
14F
100
AcDbEntity
8
PRINCIPAL
6
CONTINUOUS
62
256
370
-1
100
AcDbCircle
10
48
20
9.400001
40
0.5
100
AcDbArc
50
30.000198
51
240
0
ARC
5
150
100
AcDbEntity
8
PRINCIPAL
6
CONTINUOUS
62
256
370
-1
100
AcDbCircle
10
47.5
20
8.533976
40
0.5
100
AcDbArc
50
0
51
60
0
LINE
5
151
100
AcDbEntity
8
PRINCIPAL
6
CONTINUOUS
62
256
370
-1
100
AcDbLine
10
48
20
8.533976
11
48
21
0
0
LINE
5
152
100
AcDbEntity
8
PRINCIPAL
6
CONTINUOUS
62
256
370
-1
100
AcDbLine
10
48
20
0
11
47.313709
21
0
0
ARC
5
153
100
AcDbEntity
8
PRINCIPAL
6
CONTINUOUS
62
256
370
-1
100
AcDbCircle
10
47.313708
20
8
40
8
100
AcDbArc
50
225.000013
51
270.000002
0
LINE
5
154
100
AcDbEntity
8
PRINCIPAL
6
CONTINUOUS
62
256
370
-1
100
AcDbLine
10
41.656855
20
2.343144
11
2.343146
21
41.656855
0
ENDBLK
5
5E
330
5C
100
AcDbEntity
8
0
100
AcDbBlockEnd
0
BLOCK
5
60
330
5F
100
AcDbEntity
8
0
100
AcDbBlockBegin
2
A$C7911
70
0
10
0
20
0
3
A$C7911
1

0
LINE
5
155
100
AcDbEntity
8
PRINCIPAL
6
CONTINUOUS
62
256
370
-1
100
AcDbLine
10
3.000052
20
3.000052
11
3.000055
21
13.534031
0
ARC
5
156
100
AcDbEntity
8
PRINCIPAL
6
CONTINUOUS
62
256
370
-1
100
AcDbCircle
10
3.500055
20
13.534031
40
0.5
100
AcDbArc
50
120.000198
51
180
0
ARC
5
157
100
AcDbEntity
8
PRINCIPAL
6
CONTINUOUS
62
256
370
-1
100
AcDbCircle
10
3.000052
20
14.400054
40
0.5
100
AcDbArc
50
300.000198
51
150
0
ARC
5
158
100
AcDbEntity
8
PRINCIPAL
6
CONTINUOUS
62
256
370
-1
100
AcDbCircle
10
2.134027
20
14.900054
40
0.5
100
AcDbArc
50
270
51
330
0
LINE
5
159
100
AcDbEntity
8
PRINCIPAL
6
CONTINUOUS
62
256
370
-1
100
AcDbLine
10
2.134027
20
14.400054
11
0.5
21
14.400051
0
LINE
5
15A
100
AcDbEntity
8
PRINCIPAL
6
CONTINUOUS
62
256
370
-1
100
AcDbLine
10
0.5
20
20.400049
11
2.134029
21
20.400049
0
ARC
5
15B
100
AcDbEntity
8
PRINCIPAL
6
CONTINUOUS
62
256
370
-1
100
AcDbCircle
10
2.134029
20
19.900049
40
0.5
100
AcDbArc
50
30.000198
51
90
0
ARC
5
15C
100
AcDbEntity
8
PRINCIPAL
6
CONTINUOUS
62
256
370
-1
100
AcDbCircle
10
3.000052
20
20.400052
40
0.5
100
AcDbArc
50
210.000198
51
60
0
ARC
5
15D
100
AcDbEntity
8
PRINCIPAL
6
CONTINUOUS
62
256
370
-1
100
AcDbCircle
10
3.500052
20
21.266077
40
0.5
100
AcDbArc
50
180
51
240
0
LINE
5
15E
100
AcDbEntity
8
PRINCIPAL
6
CONTINUOUS
62
256
370
-1
100
AcDbLine
10
3.000052
20
21.266077
11
3.000052
21
26.400047
0
LINE
5
15F
100
AcDbEntity
8
PRINCIPAL
6
CONTINUOUS
62
256
370
-1
100
AcDbLine
10
3.000052
20
26.400047
11
6.000024
21
26.400047
0
LINE
5
160
100
AcDbEntity
8
PRINCIPAL
6
CONTINUOUS
62
256
370
-1
100
AcDbLine
10
6.000024
20
26.400047
11
6.000024
21
25.125053
0
LINE
5
161
100
AcDbEntity
8
PRINCIPAL
6
CONTINUOUS
62
256
370
-1
100
AcDbLine
10
6.000024
20
25.125053
11
10.000052
21
25.125053
0
LINE
5
162
100
AcDbEntity
8
PRINCIPAL
6
CONTINUOUS
62
256
370
-1
100
AcDbLine
10
10.000052
20
25.125053
11
10.000052
21
26.400047
0
LINE
5
163
100
AcDbEntity
8
PRINCIPAL
6
CONTINUOUS
62
256
370
-1
100
AcDbLine
10
10.000052
20
26.400047
11
13.000052
21
26.400047
0
LINE
5
164
100
AcDbEntity
8
PRINCIPAL
6
CONTINUOUS
62
256
370
-1
100
AcDbLine
10
13.000052
20
26.400047
11
13.000052
21
29.600058
0
LINE
5
165
100
AcDbEntity
8
PRINCIPAL
6
CONTINUOUS
62
256
370
-1
100
AcDbLine
10
13.000052
20
29.600058
11
10.000052
21
29.600058
0
LINE
5
166
100
AcDbEntity
8
PRINCIPAL
6
CONTINUOUS
62
256
370
-1
100
AcDbLine
10
10.000052
20
29.600058
11
10.000052
21
30.875053
0
LINE
5
167
100
AcDbEntity
8
PRINCIPAL
6
CONTINUOUS
62
256
370
-1
100
AcDbLine
10
10.000052
20
30.875053
11
6.000024
21
30.875053
0
LINE
5
168
100
AcDbEntity
8
PRINCIPAL
6
CONTINUOUS
62
256
370
-1
100
AcDbLine
10
6.000024
20
30.875053
11
6.000024
21
29.600058
0
LINE
5
169
100
AcDbEntity
8
PRINCIPAL
6
CONTINUOUS
62
256
370
-1
100
AcDbLine
10
6.000024
20
29.600058
11
3.000052
21
29.600058
0
LINE
5
16A
100
AcDbEntity
8
PRINCIPAL
6
CONTINUOUS
62
256
370
-1
100
AcDbLine
10
3.000052
20
29.600058
11
3.000055
21
34.73403
0
ARC
5
16B
100
AcDbEntity
8
PRINCIPAL
6
CONTINUOUS
62
256
370
-1
100
AcDbCircle
10
3.500055
20
34.73403
40
0.5
100
AcDbArc
50
120.000198
51
180
0
ARC
5
16C
100
AcDbEntity
8
PRINCIPAL
6
CONTINUOUS
62
256
370
-1
100
AcDbCircle
10
3.000052
20
35.600054
40
0.5
100
AcDbArc
50
300.000198
51
150
0
ARC
5
16D
100
AcDbEntity
8
PRINCIPAL
6
CONTINUOUS
62
256
370
-1
100
AcDbCircle
10
2.134027
20
36.100054
40
0.5
100
AcDbArc
50
270
51
330
0
LINE
5
16E
100
AcDbEntity
8
PRINCIPAL
6
CONTINUOUS
62
256
370
-1
100
AcDbLine
10
2.134027
20
35.600054
11
0.5
21
35.600051
0
LINE
5
16F
100
AcDbEntity
8
PRINCIPAL
6
CONTINUOUS
62
256
370
-1
100
AcDbLine
10
0.5
20
41.600048
11
2.134029
21
41.600048
0
ARC
5
170
100
AcDbEntity
8
PRINCIPAL
6
CONTINUOUS
62
256
370
-1
100
AcDbCircle
10
2.134029
20
41.100048
40
0.5
100
AcDbArc
50
30.000198
51
90
0
ARC
5
171
100
AcDbEntity
8
PRINCIPAL
6
CONTINUOUS
62
256
370
-1
100
AcDbCircle
10
3.000052
20
41.600051
40
0.5
100
AcDbArc
50
210.000198
51
60
0
ARC
5
172
100
AcDbEntity
8
PRINCIPAL
6
CONTINUOUS
62
256
370
-1
100
AcDbCircle
10
3.500052
20
42.466076
40
0.5
100
AcDbArc
50
180
51
240
0
LINE
5
173
100
AcDbEntity
8
PRINCIPAL
6
CONTINUOUS
62
256
370
-1
100
AcDbLine
10
3.000052
20
42.466076
11
3.000052
21
51.000052
0
LINE
5
174
100
AcDbEntity
8
PRINCIPAL
6
CONTINUOUS
62
256
370
-1
100
AcDbLine
10
3.000052
20
51.000052
11
3.686344
21
51.000052
0
ARC
5
175
100
AcDbEntity
8
PRINCIPAL
6
CONTINUOUS
62
256
370
-1
100
AcDbCircle
10
3.686344
20
43.000052
40
8
100
AcDbArc
50
45.000013
51
90.000002
0
ARC
5
176
100
AcDbEntity
8
PRINCIPAL
6
CONTINUOUS
62
256
370
-1
100
AcDbCircle
10
21.266076
20
3.500055
40
0.5
100
AcDbArc
50
210.000198
51
270
0
ARC
5
177
100
AcDbEntity
8
PRINCIPAL
6
CONTINUOUS
62
256
370
-1
100
AcDbCircle
10
20.400053
20
3.000052
40
0.5
100
AcDbArc
50
30.000198
51
240
0
ARC
5
178
100
AcDbEntity
8
PRINCIPAL
6
CONTINUOUS
62
256
370
-1
100
AcDbCircle
10
19.900053
20
2.134027
40
0.5
100
AcDbArc
50
0
51
60
0
LINE
5
179
100
AcDbEntity
8
PRINCIPAL
6
CONTINUOUS
62
256
370
-1
100
AcDbLine
10
20.400053
20
2.134027
11
20.400056
21
0.5
0
ARC
5
17A
100
AcDbEntity
8
PRINCIPAL
6
CONTINUOUS
62
256
370
-1
100
AcDbCircle
10
19.900056
20
0.5
40
0.5
100
AcDbArc
50
270
51
0
0
LINE
5
17B
100
AcDbEntity
8
PRINCIPAL
6
CONTINUOUS
62
256
370
-1
100
AcDbLine
10
19.900056
20
0
11
14.900058
21
0
0
ARC
5
17C
100
AcDbEntity
8
PRINCIPAL
6
CONTINUOUS
62
256
370
-1
100
AcDbCircle
10
14.900058
20
0.5
40
0.5
100
AcDbArc
50
180
51
270
0
LINE
5
17D
100
AcDbEntity
8
PRINCIPAL
6
CONTINUOUS
62
256
370
-1
100
AcDbLine
10
14.400058
20
0.5
11
14.400058
21
2.134028
0
ARC
5
17E
100
AcDbEntity
8
PRINCIPAL
6
CONTINUOUS
62
256
370
-1
100
AcDbCircle
10
14.900058
20
2.134028
40
0.5
100
AcDbArc
50
120.000198
51
180
0
ARC
5
17F
100
AcDbEntity
8
PRINCIPAL
6
CONTINUOUS
62
256
370
-1
100
AcDbCircle
10
14.400055
20
3.000052
40
0.5
100
AcDbArc
50
300.000198
51
150
0
ARC
5
180
100
AcDbEntity
8
PRINCIPAL
6
CONTINUOUS
62
256
370
-1
100
AcDbCircle
10
13.53403
20
3.500052
40
0.5
100
AcDbArc
50
270
51
330
0
LINE
5
181
100
AcDbEntity
8
PRINCIPAL
6
CONTINUOUS
62
256
370
-1
100
AcDbLine
10
13.53403
20
3.000052
11
3.000052
21
3.000052
0
ARC
5
182
100
AcDbEntity
8
PRINCIPAL
6
CONTINUOUS
62
256
370
-1
100
AcDbCircle
10
0.5
20
14.900051
40
0.5
100
AcDbArc
50
180
51
270
0
LINE
5
183
100
AcDbEntity
8
PRINCIPAL
6
CONTINUOUS
62
256
370
-1
100
AcDbLine
10
0
20
14.900051
11
0
21
19.900049
0
ARC
5
184
100
AcDbEntity
8
PRINCIPAL
6
CONTINUOUS
62
256
370
-1
100
AcDbCircle
10
0.5
20
19.900049
40
0.5
100
AcDbArc
50
90
51
180
0
ARC
5
185
100
AcDbEntity
8
PRINCIPAL
6
CONTINUOUS
62
256
370
-1
100
AcDbCircle
10
0.5
20
36.100051
40
0.5
100
AcDbArc
50
180
51
270
0
LINE
5
186
100
AcDbEntity
8
PRINCIPAL
6
CONTINUOUS
62
256
370
-1
100
AcDbLine
10
0
20
36.100051
11
0
21
41.100048
0
ARC
5
187
100
AcDbEntity
8
PRINCIPAL
6
CONTINUOUS
62
256
370
-1
100
AcDbCircle
10
0.5
20
41.100048
40
0.5
100
AcDbArc
50
90
51
180
0
ARC
5
188
100
AcDbEntity
8
PRINCIPAL
6
CONTINUOUS
62
256
370
-1
100
AcDbCircle
10
43.000053
20
3.686343
40
8
100
AcDbArc
50
0
51
44.999997
0
LINE
5
189
100
AcDbEntity
8
PRINCIPAL
6
CONTINUOUS
62
256
370
-1
100
AcDbLine
10
51.000053
20
3.686344
11
51.000053
21
3.000052
0
LINE
5
18A
100
AcDbEntity
8
PRINCIPAL
6
CONTINUOUS
62
256
370
-1
100
AcDbLine
10
51.000053
20
3.000052
11
42.466077
21
3.000055
0
ARC
5
18B
100
AcDbEntity
8
PRINCIPAL
6
CONTINUOUS
62
256
370
-1
100
AcDbCircle
10
42.466077
20
3.500055
40
0.5
100
AcDbArc
50
210.000198
51
270
0
ARC
5
18C
100
AcDbEntity
8
PRINCIPAL
6
CONTINUOUS
62
256
370
-1
100
AcDbCircle
10
41.600053
20
3.000052
40
0.5
100
AcDbArc
50
30.000198
51
240
0
ARC
5
18D
100
AcDbEntity
8
PRINCIPAL
6
CONTINUOUS
62
256
370
-1
100
AcDbCircle
10
41.100053
20
2.134027
40
0.5
100
AcDbArc
50
0
51
60
0
LINE
5
18E
100
AcDbEntity
8
PRINCIPAL
6
CONTINUOUS
62
256
370
-1
100
AcDbLine
10
41.600053
20
2.134027
11
41.600056
21
0.5
0
ARC
5
18F
100
AcDbEntity
8
PRINCIPAL
6
CONTINUOUS
62
256
370
-1
100
AcDbCircle
10
41.100056
20
0.5
40
0.5
100
AcDbArc
50
270
51
0
0
LINE
5
190
100
AcDbEntity
8
PRINCIPAL
6
CONTINUOUS
62
256
370
-1
100
AcDbLine
10
41.100056
20
0
11
36.100059
21
0
0
ARC
5
191
100
AcDbEntity
8
PRINCIPAL
6
CONTINUOUS
62
256
370
-1
100
AcDbCircle
10
36.100059
20
0.5
40
0.5
100
AcDbArc
50
180
51
270
0
LINE
5
192
100
AcDbEntity
8
PRINCIPAL
6
CONTINUOUS
62
256
370
-1
100
AcDbLine
10
35.600059
20
0.5
11
35.600059
21
2.134028
0
ARC
5
193
100
AcDbEntity
8
PRINCIPAL
6
CONTINUOUS
62
256
370
-1
100
AcDbCircle
10
36.100059
20
2.134028
40
0.5
100
AcDbArc
50
120.000198
51
180
0
ARC
5
194
100
AcDbEntity
8
PRINCIPAL
6
CONTINUOUS
62
256
370
-1
100
AcDbCircle
10
35.600056
20
3.000052
40
0.5
100
AcDbArc
50
300.000198
51
150
0
ARC
5
195
100
AcDbEntity
8
PRINCIPAL
6
CONTINUOUS
62
256
370
-1
100
AcDbCircle
10
34.73403
20
3.500052
40
0.5
100
AcDbArc
50
270
51
330
0
LINE
5
196
100
AcDbEntity
8
PRINCIPAL
6
CONTINUOUS
62
256
370
-1
100
AcDbLine
10
34.73403
20
3.000052
11
29.600058
21
3.000052
0
LINE
5
197
100
AcDbEntity
8
PRINCIPAL
6
CONTINUOUS
62
256
370
-1
100
AcDbLine
10
29.600058
20
3.000052
11
29.600058
21
6.000024
0
LINE
5
198
100
AcDbEntity
8
PRINCIPAL
6
CONTINUOUS
62
256
370
-1
100
AcDbLine
10
29.600058
20
6.000024
11
30.875053
21
6.000024
0
LINE
5
199
100
AcDbEntity
8
PRINCIPAL
6
CONTINUOUS
62
256
370
-1
100
AcDbLine
10
30.875053
20
6.000024
11
30.875053
21
10.000052
0
LINE
5
19A
100
AcDbEntity
8
PRINCIPAL
6
CONTINUOUS
62
256
370
-1
100
AcDbLine
10
30.875053
20
10.000052
11
29.600058
21
10.000052
0
LINE
5
19B
100
AcDbEntity
8
PRINCIPAL
6
CONTINUOUS
62
256
370
-1
100
AcDbLine
10
29.600058
20
10.000052
11
29.600058
21
13.000052
0
LINE
5
19C
100
AcDbEntity
8
PRINCIPAL
6
CONTINUOUS
62
256
370
-1
100
AcDbLine
10
29.600058
20
13.000052
11
26.400047
21
13.000052
0
LINE
5
19D
100
AcDbEntity
8
PRINCIPAL
6
CONTINUOUS
62
256
370
-1
100
AcDbLine
10
26.400047
20
13.000052
11
26.400047
21
10.000052
0
LINE
5
19E
100
AcDbEntity
8
PRINCIPAL
6
CONTINUOUS
62
256
370
-1
100
AcDbLine
10
26.400047
20
10.000052
11
25.125053
21
10.000052
0
LINE
5
19F
100
AcDbEntity
8
PRINCIPAL
6
CONTINUOUS
62
256
370
-1
100
AcDbLine
10
25.125053
20
10.000052
11
25.125053
21
6.000024
0
LINE
5
1A0
100
AcDbEntity
8
PRINCIPAL
6
CONTINUOUS
62
256
370
-1
100
AcDbLine
10
25.125053
20
6.000024
11
26.400047
21
6.000024
0
LINE
5
1A1
100
AcDbEntity
8
PRINCIPAL
6
CONTINUOUS
62
256
370
-1
100
AcDbLine
10
26.400047
20
6.000024
11
26.400047
21
3.000052
0
LINE
5
1A2
100
AcDbEntity
8
PRINCIPAL
6
CONTINUOUS
62
256
370
-1
100
AcDbLine
10
26.400047
20
3.000052
11
21.266076
21
3.000055
0
LINE
5
1A3
100
AcDbEntity
8
PRINCIPAL
6
CONTINUOUS
62
256
370
-1
100
AcDbLine
10
9.343197
20
48.656908
11
48.656907
21
9.343197
0
ENDBLK
5
61
330
5F
100
AcDbEntity
8
0
100
AcDbBlockEnd
0
BLOCK
5
63
330
62
100
AcDbEntity
8
0
100
AcDbBlockBegin
2
A$C7764
70
0
10
0
20
0
3
A$C7764
1

0
LINE
5
1A4
100
AcDbEntity
8
PRINCIPAL
6
CONTINUOUS
62
256
370
-1
100
AcDbLine
10
3.000052
20
3.000052
11
3.000055
21
13.534031
0
ARC
5
1A5
100
AcDbEntity
8
PRINCIPAL
6
CONTINUOUS
62
256
370
-1
100
AcDbCircle
10
3.500055
20
13.534031
40
0.5
100
AcDbArc
50
120.000198
51
180
0
ARC
5
1A6
100
AcDbEntity
8
PRINCIPAL
6
CONTINUOUS
62
256
370
-1
100
AcDbCircle
10
3.000052
20
14.400054
40
0.5
100
AcDbArc
50
300.000198
51
150
0
ARC
5
1A7
100
AcDbEntity
8
PRINCIPAL
6
CONTINUOUS
62
256
370
-1
100
AcDbCircle
10
2.134027
20
14.900054
40
0.5
100
AcDbArc
50
270
51
330
0
LINE
5
1A8
100
AcDbEntity
8
PRINCIPAL
6
CONTINUOUS
62
256
370
-1
100
AcDbLine
10
2.134027
20
14.400054
11
0.5
21
14.400051
0
LINE
5
1A9
100
AcDbEntity
8
PRINCIPAL
6
CONTINUOUS
62
256
370
-1
100
AcDbLine
10
0.5
20
20.400049
11
2.134029
21
20.400049
0
ARC
5
1AA
100
AcDbEntity
8
PRINCIPAL
6
CONTINUOUS
62
256
370
-1
100
AcDbCircle
10
2.134029
20
19.900049
40
0.5
100
AcDbArc
50
30.000198
51
90
0
ARC
5
1AB
100
AcDbEntity
8
PRINCIPAL
6
CONTINUOUS
62
256
370
-1
100
AcDbCircle
10
3.000052
20
20.400052
40
0.5
100
AcDbArc
50
210.000198
51
60
0
ARC
5
1AC
100
AcDbEntity
8
PRINCIPAL
6
CONTINUOUS
62
256
370
-1
100
AcDbCircle
10
3.500052
20
21.266077
40
0.5
100
AcDbArc
50
180
51
240
0
LINE
5
1AD
100
AcDbEntity
8
PRINCIPAL
6
CONTINUOUS
62
256
370
-1
100
AcDbLine
10
3.000052
20
21.266077
11
3.000052
21
26.400047
0
LINE
5
1AE
100
AcDbEntity
8
PRINCIPAL
6
CONTINUOUS
62
256
370
-1
100
AcDbLine
10
3.000052
20
26.400047
11
6.000024
21
26.400047
0
LINE
5
1AF
100
AcDbEntity
8
PRINCIPAL
6
CONTINUOUS
62
256
370
-1
100
AcDbLine
10
6.000024
20
26.400047
11
6.000024
21
25.125053
0
LINE
5
1B0
100
AcDbEntity
8
PRINCIPAL
6
CONTINUOUS
62
256
370
-1
100
AcDbLine
10
6.000024
20
25.125053
11
10.000052
21
25.125053
0
LINE
5
1B1
100
AcDbEntity
8
PRINCIPAL
6
CONTINUOUS
62
256
370
-1
100
AcDbLine
10
10.000052
20
25.125053
11
10.000052
21
26.400047
0
LINE
5
1B2
100
AcDbEntity
8
PRINCIPAL
6
CONTINUOUS
62
256
370
-1
100
AcDbLine
10
10.000052
20
26.400047
11
13.000052
21
26.400047
0
LINE
5
1B3
100
AcDbEntity
8
PRINCIPAL
6
CONTINUOUS
62
256
370
-1
100
AcDbLine
10
13.000052
20
26.400047
11
13.000052
21
29.600058
0
LINE
5
1B4
100
AcDbEntity
8
PRINCIPAL
6
CONTINUOUS
62
256
370
-1
100
AcDbLine
10
13.000052
20
29.600058
11
10.000052
21
29.600058
0
LINE
5
1B5
100
AcDbEntity
8
PRINCIPAL
6
CONTINUOUS
62
256
370
-1
100
AcDbLine
10
10.000052
20
29.600058
11
10.000052
21
30.875053
0
LINE
5
1B6
100
AcDbEntity
8
PRINCIPAL
6
CONTINUOUS
62
256
370
-1
100
AcDbLine
10
10.000052
20
30.875053
11
6.000024
21
30.875053
0
LINE
5
1B7
100
AcDbEntity
8
PRINCIPAL
6
CONTINUOUS
62
256
370
-1
100
AcDbLine
10
6.000024
20
30.875053
11
6.000024
21
29.600058
0
LINE
5
1B8
100
AcDbEntity
8
PRINCIPAL
6
CONTINUOUS
62
256
370
-1
100
AcDbLine
10
6.000024
20
29.600058
11
3.000052
21
29.600058
0
LINE
5
1B9
100
AcDbEntity
8
PRINCIPAL
6
CONTINUOUS
62
256
370
-1
100
AcDbLine
10
3.000052
20
29.600058
11
3.000055
21
34.73403
0
ARC
5
1BA
100
AcDbEntity
8
PRINCIPAL
6
CONTINUOUS
62
256
370
-1
100
AcDbCircle
10
3.500055
20
34.73403
40
0.5
100
AcDbArc
50
120.000198
51
180
0
ARC
5
1BB
100
AcDbEntity
8
PRINCIPAL
6
CONTINUOUS
62
256
370
-1
100
AcDbCircle
10
3.000052
20
35.600054
40
0.5
100
AcDbArc
50
300.000198
51
150
0
ARC
5
1BC
100
AcDbEntity
8
PRINCIPAL
6
CONTINUOUS
62
256
370
-1
100
AcDbCircle
10
2.134027
20
36.100054
40
0.5
100
AcDbArc
50
270
51
330
0
LINE
5
1BD
100
AcDbEntity
8
PRINCIPAL
6
CONTINUOUS
62
256
370
-1
100
AcDbLine
10
2.134027
20
35.600054
11
0.5
21
35.600051
0
LINE
5
1BE
100
AcDbEntity
8
PRINCIPAL
6
CONTINUOUS
62
256
370
-1
100
AcDbLine
10
0.5
20
41.600048
11
2.134029
21
41.600048
0
ARC
5
1BF
100
AcDbEntity
8
PRINCIPAL
6
CONTINUOUS
62
256
370
-1
100
AcDbCircle
10
2.134029
20
41.100048
40
0.5
100
AcDbArc
50
30.000198
51
90
0
ARC
5
1C0
100
AcDbEntity
8
PRINCIPAL
6
CONTINUOUS
62
256
370
-1
100
AcDbCircle
10
3.000052
20
41.600051
40
0.5
100
AcDbArc
50
210.000198
51
60
0
ARC
5
1C1
100
AcDbEntity
8
PRINCIPAL
6
CONTINUOUS
62
256
370
-1
100
AcDbCircle
10
3.500052
20
42.466076
40
0.5
100
AcDbArc
50
180
51
240
0
LINE
5
1C2
100
AcDbEntity
8
PRINCIPAL
6
CONTINUOUS
62
256
370
-1
100
AcDbLine
10
3.000052
20
42.466076
11
3.000052
21
51.000052
0
LINE
5
1C3
100
AcDbEntity
8
PRINCIPAL
6
CONTINUOUS
62
256
370
-1
100
AcDbLine
10
3.000052
20
51.000052
11
3.686344
21
51.000052
0
ARC
5
1C4
100
AcDbEntity
8
PRINCIPAL
6
CONTINUOUS
62
256
370
-1
100
AcDbCircle
10
3.686344
20
43.000052
40
8
100
AcDbArc
50
45.000013
51
90.000002
0
ARC
5
1C5
100
AcDbEntity
8
PRINCIPAL
6
CONTINUOUS
62
256
370
-1
100
AcDbCircle
10
21.266076
20
3.500055
40
0.5
100
AcDbArc
50
210.000198
51
270
0
ARC
5
1C6
100
AcDbEntity
8
PRINCIPAL
6
CONTINUOUS
62
256
370
-1
100
AcDbCircle
10
20.400053
20
3.000052
40
0.5
100
AcDbArc
50
30.000198
51
240
0
ARC
5
1C7
100
AcDbEntity
8
PRINCIPAL
6
CONTINUOUS
62
256
370
-1
100
AcDbCircle
10
19.900053
20
2.134027
40
0.5
100
AcDbArc
50
0
51
60
0
LINE
5
1C8
100
AcDbEntity
8
PRINCIPAL
6
CONTINUOUS
62
256
370
-1
100
AcDbLine
10
20.400053
20
2.134027
11
20.400056
21
0.5
0
ARC
5
1C9
100
AcDbEntity
8
PRINCIPAL
6
CONTINUOUS
62
256
370
-1
100
AcDbCircle
10
19.900056
20
0.5
40
0.5
100
AcDbArc
50
270
51
0
0
LINE
5
1CA
100
AcDbEntity
8
PRINCIPAL
6
CONTINUOUS
62
256
370
-1
100
AcDbLine
10
19.900056
20
0
11
14.900058
21
0
0
ARC
5
1CB
100
AcDbEntity
8
PRINCIPAL
6
CONTINUOUS
62
256
370
-1
100
AcDbCircle
10
14.900058
20
0.5
40
0.5
100
AcDbArc
50
180
51
270
0
LINE
5
1CC
100
AcDbEntity
8
PRINCIPAL
6
CONTINUOUS
62
256
370
-1
100
AcDbLine
10
14.400058
20
0.5
11
14.400058
21
2.134028
0
ARC
5
1CD
100
AcDbEntity
8
PRINCIPAL
6
CONTINUOUS
62
256
370
-1
100
AcDbCircle
10
14.900058
20
2.134028
40
0.5
100
AcDbArc
50
120.000198
51
180
0
ARC
5
1CE
100
AcDbEntity
8
PRINCIPAL
6
CONTINUOUS
62
256
370
-1
100
AcDbCircle
10
14.400055
20
3.000052
40
0.5
100
AcDbArc
50
300.000198
51
150
0
ARC
5
1CF
100
AcDbEntity
8
PRINCIPAL
6
CONTINUOUS
62
256
370
-1
100
AcDbCircle
10
13.53403
20
3.500052
40
0.5
100
AcDbArc
50
270
51
330
0
LINE
5
1D0
100
AcDbEntity
8
PRINCIPAL
6
CONTINUOUS
62
256
370
-1
100
AcDbLine
10
13.53403
20
3.000052
11
3.000052
21
3.000052
0
ARC
5
1D1
100
AcDbEntity
8
PRINCIPAL
6
CONTINUOUS
62
256
370
-1
100
AcDbCircle
10
0.5
20
14.900051
40
0.5
100
AcDbArc
50
180
51
270
0
LINE
5
1D2
100
AcDbEntity
8
PRINCIPAL
6
CONTINUOUS
62
256
370
-1
100
AcDbLine
10
0
20
14.900051
11
0
21
19.900049
0
ARC
5
1D3
100
AcDbEntity
8
PRINCIPAL
6
CONTINUOUS
62
256
370
-1
100
AcDbCircle
10
0.5
20
19.900049
40
0.5
100
AcDbArc
50
90
51
180
0
ARC
5
1D4
100
AcDbEntity
8
PRINCIPAL
6
CONTINUOUS
62
256
370
-1
100
AcDbCircle
10
0.5
20
36.100051
40
0.5
100
AcDbArc
50
180
51
270
0
LINE
5
1D5
100
AcDbEntity
8
PRINCIPAL
6
CONTINUOUS
62
256
370
-1
100
AcDbLine
10
0
20
36.100051
11
0
21
41.100048
0
ARC
5
1D6
100
AcDbEntity
8
PRINCIPAL
6
CONTINUOUS
62
256
370
-1
100
AcDbCircle
10
0.5
20
41.100048
40
0.5
100
AcDbArc
50
90
51
180
0
ARC
5
1D7
100
AcDbEntity
8
PRINCIPAL
6
CONTINUOUS
62
256
370
-1
100
AcDbCircle
10
43.000053
20
3.686343
40
8
100
AcDbArc
50
0
51
44.999997
0
LINE
5
1D8
100
AcDbEntity
8
PRINCIPAL
6
CONTINUOUS
62
256
370
-1
100
AcDbLine
10
51.000053
20
3.686344
11
51.000053
21
3.000052
0
LINE
5
1D9
100
AcDbEntity
8
PRINCIPAL
6
CONTINUOUS
62
256
370
-1
100
AcDbLine
10
51.000053
20
3.000052
11
42.466077
21
3.000055
0
ARC
5
1DA
100
AcDbEntity
8
PRINCIPAL
6
CONTINUOUS
62
256
370
-1
100
AcDbCircle
10
42.466077
20
3.500055
40
0.5
100
AcDbArc
50
210.000198
51
270
0
ARC
5
1DB
100
AcDbEntity
8
PRINCIPAL
6
CONTINUOUS
62
256
370
-1
100
AcDbCircle
10
41.600053
20
3.000052
40
0.5
100
AcDbArc
50
30.000198
51
240
0
ARC
5
1DC
100
AcDbEntity
8
PRINCIPAL
6
CONTINUOUS
62
256
370
-1
100
AcDbCircle
10
41.100053
20
2.134027
40
0.5
100
AcDbArc
50
0
51
60
0
LINE
5
1DD
100
AcDbEntity
8
PRINCIPAL
6
CONTINUOUS
62
256
370
-1
100
AcDbLine
10
41.600053
20
2.134027
11
41.600056
21
0.5
0
ARC
5
1DE
100
AcDbEntity
8
PRINCIPAL
6
CONTINUOUS
62
256
370
-1
100
AcDbCircle
10
41.100056
20
0.5
40
0.5
100
AcDbArc
50
270
51
0
0
LINE
5
1DF
100
AcDbEntity
8
PRINCIPAL
6
CONTINUOUS
62
256
370
-1
100
AcDbLine
10
41.100056
20
0
11
36.100059
21
0
0
ARC
5
1E0
100
AcDbEntity
8
PRINCIPAL
6
CONTINUOUS
62
256
370
-1
100
AcDbCircle
10
36.100059
20
0.5
40
0.5
100
AcDbArc
50
180
51
270
0
LINE
5
1E1
100
AcDbEntity
8
PRINCIPAL
6
CONTINUOUS
62
256
370
-1
100
AcDbLine
10
35.600059
20
0.5
11
35.600059
21
2.134028
0
ARC
5
1E2
100
AcDbEntity
8
PRINCIPAL
6
CONTINUOUS
62
256
370
-1
100
AcDbCircle
10
36.100059
20
2.134028
40
0.5
100
AcDbArc
50
120.000198
51
180
0
ARC
5
1E3
100
AcDbEntity
8
PRINCIPAL
6
CONTINUOUS
62
256
370
-1
100
AcDbCircle
10
35.600056
20
3.000052
40
0.5
100
AcDbArc
50
300.000198
51
150
0
ARC
5
1E4
100
AcDbEntity
8
PRINCIPAL
6
CONTINUOUS
62
256
370
-1
100
AcDbCircle
10
34.73403
20
3.500052
40
0.5
100
AcDbArc
50
270
51
330
0
LINE
5
1E5
100
AcDbEntity
8
PRINCIPAL
6
CONTINUOUS
62
256
370
-1
100
AcDbLine
10
34.73403
20
3.000052
11
29.600058
21
3.000052
0
LINE
5
1E6
100
AcDbEntity
8
PRINCIPAL
6
CONTINUOUS
62
256
370
-1
100
AcDbLine
10
29.600058
20
3.000052
11
29.600058
21
6.000024
0
LINE
5
1E7
100
AcDbEntity
8
PRINCIPAL
6
CONTINUOUS
62
256
370
-1
100
AcDbLine
10
29.600058
20
6.000024
11
30.875053
21
6.000024
0
LINE
5
1E8
100
AcDbEntity
8
PRINCIPAL
6
CONTINUOUS
62
256
370
-1
100
AcDbLine
10
30.875053
20
6.000024
11
30.875053
21
10.000052
0
LINE
5
1E9
100
AcDbEntity
8
PRINCIPAL
6
CONTINUOUS
62
256
370
-1
100
AcDbLine
10
30.875053
20
10.000052
11
29.600058
21
10.000052
0
LINE
5
1EA
100
AcDbEntity
8
PRINCIPAL
6
CONTINUOUS
62
256
370
-1
100
AcDbLine
10
29.600058
20
10.000052
11
29.600058
21
13.000052
0
LINE
5
1EB
100
AcDbEntity
8
PRINCIPAL
6
CONTINUOUS
62
256
370
-1
100
AcDbLine
10
29.600058
20
13.000052
11
26.400047
21
13.000052
0
LINE
5
1EC
100
AcDbEntity
8
PRINCIPAL
6
CONTINUOUS
62
256
370
-1
100
AcDbLine
10
26.400047
20
13.000052
11
26.400047
21
10.000052
0
LINE
5
1ED
100
AcDbEntity
8
PRINCIPAL
6
CONTINUOUS
62
256
370
-1
100
AcDbLine
10
26.400047
20
10.000052
11
25.125053
21
10.000052
0
LINE
5
1EE
100
AcDbEntity
8
PRINCIPAL
6
CONTINUOUS
62
256
370
-1
100
AcDbLine
10
25.125053
20
10.000052
11
25.125053
21
6.000024
0
LINE
5
1EF
100
AcDbEntity
8
PRINCIPAL
6
CONTINUOUS
62
256
370
-1
100
AcDbLine
10
25.125053
20
6.000024
11
26.400047
21
6.000024
0
LINE
5
1F0
100
AcDbEntity
8
PRINCIPAL
6
CONTINUOUS
62
256
370
-1
100
AcDbLine
10
26.400047
20
6.000024
11
26.400047
21
3.000052
0
LINE
5
1F1
100
AcDbEntity
8
PRINCIPAL
6
CONTINUOUS
62
256
370
-1
100
AcDbLine
10
26.400047
20
3.000052
11
21.266076
21
3.000055
0
LINE
5
1F2
100
AcDbEntity
8
PRINCIPAL
6
CONTINUOUS
62
256
370
-1
100
AcDbLine
10
9.343197
20
48.656908
11
48.656907
21
9.343197
0
ENDBLK
5
64
330
62
100
AcDbEntity
8
0
100
AcDbBlockEnd
0
ENDSEC
0
SECTION
2
ENTITIES
0
LINE
5
1F3
100
AcDbEntity
8
PRINCIPAL
6
CONTINUOUS
62
256
370
-1
100
AcDbLine
10
395.003153716
20
126.808768852
11
395.003192518
21
130.045169936
0
LINE
5
1F4
100
AcDbEntity
8
PRINCIPAL
6
CONTINUOUS
62
256
370
-1
100
AcDbLine
10
395.003192518
20
130.045169936
11
385.86884828
21
130.045278188
0
ARC
5
1F5
100
AcDbEntity
8
PRINCIPAL
6
CONTINUOUS
62
256
370
-1
100
AcDbCircle
10
385.868728116
20
129.545278203
40
0.5
100
AcDbArc
50
89.986230136
51
149.986032136
0
ARC
5
1F6
100
AcDbEntity
8
PRINCIPAL
6
CONTINUOUS
62
256
370
-1
100
AcDbCircle
10
385.002825306
20
130.045489319
40
0.5
100
AcDbArc
50
119.986230136
51
329.986032136
0
ARC
5
1F7
100
AcDbEntity
8
PRINCIPAL
6
CONTINUOUS
62
256
370
-1
100
AcDbCircle
10
384.503033452
20
130.911635459
40
0.5
100
AcDbArc
50
299.986230136
51
359.986230136
0
LINE
5
1F8
100
AcDbEntity
8
PRINCIPAL
6
CONTINUOUS
62
256
370
-1
100
AcDbLine
10
385.003033438
20
130.911515294
11
385.003407242
21
132.47938225
0
ARC
5
1F9
100
AcDbEntity
8
PRINCIPAL
6
CONTINUOUS
62
256
370
-1
100
AcDbCircle
10
384.503407257
20
132.479502414
40
0.5
100
AcDbArc
50
359.986230136
51
59.986031136
0
ARC
5
1FA
100
AcDbEntity
8
PRINCIPAL
6
CONTINUOUS
62
256
370
-1
100
AcDbCircle
10
385.003618373
20
133.345406224
40
0.5
100
AcDbArc
50
29.986230136
51
239.986032136
0
ARC
5
1FB
100
AcDbEntity
8
PRINCIPAL
6
CONTINUOUS
62
256
370
-1
100
AcDbCircle
10
385.869763513
20
133.845198078
40
0.5
100
AcDbArc
50
209.986230136
51
269.986230136
0
LINE
5
1FC
100
AcDbEntity
8
PRINCIPAL
6
CONTINUOUS
62
256
370
-1
100
AcDbLine
10
385.869643348
20
133.345198093
11
395.003231586
21
133.345089022
0
LINE
5
1FD
100
AcDbEntity
8
PRINCIPAL
6
CONTINUOUS
62
256
370
-1
100
AcDbLine
10
395.003231586
20
133.345089022
11
395.0035937
21
163.870328817
0
ARC
5
1FE
100
AcDbEntity
8
PRINCIPAL
6
CONTINUOUS
62
256
370
-1
100
AcDbCircle
10
383.003601388
20
163.870472768
40
11.999993
100
AcDbArc
50
359.999313136
51
89.999327136
0
CIRCLE
5
1FF
100
AcDbEntity
8
PRINCIPAL
6
CONTINUOUS
62
256
370
-1
100
AcDbCircle
10
359.178219168
20
131.695755781
40
1.6
0
LINE
5
200
100
AcDbEntity
8
PRINCIPAL
6
CONTINUOUS
62
256
370
-1
100
AcDbLine
10
333.354374928
20
133.358082059
11
333.353748196
21
130.866784138
0
ARC
5
201
100
AcDbEntity
8
PRINCIPAL
6
CONTINUOUS
62
256
370
-1
100
AcDbCircle
10
333.853748181
20
130.866663973
40
0.5
100
AcDbArc
50
179.986230136
51
239.986032136
0
ARC
5
202
100
AcDbEntity
8
PRINCIPAL
6
CONTINUOUS
62
256
370
-1
100
AcDbCircle
10
333.353537065
20
130.000761164
40
0.5
100
AcDbArc
50
209.986230136
51
59.986032136
0
ARC
5
203
100
AcDbEntity
8
PRINCIPAL
6
CONTINUOUS
62
256
370
-1
100
AcDbCircle
10
332.487390925
20
129.50096931
40
0.5
100
AcDbArc
50
29.986230136
51
89.986230136
0
LINE
5
204
100
AcDbEntity
8
PRINCIPAL
6
CONTINUOUS
62
256
370
-1
100
AcDbLine
10
332.48751109
20
130.000969295
11
321.828092792
21
130.001010068
0
ARC
5
205
100
AcDbEntity
8
PRINCIPAL
6
CONTINUOUS
62
256
370
-1
100
AcDbCircle
10
322.327976674
20
120.218056648
40
0.5
100
AcDbArc
50
179.986230136
51
239.986032136
0
ARC
5
206
100
AcDbEntity
8
PRINCIPAL
6
CONTINUOUS
62
256
370
-1
100
AcDbCircle
10
321.827765558
20
119.352152839
40
0.5
100
AcDbArc
50
209.986230136
51
59.986032136
0
ARC
5
207
100
AcDbEntity
8
PRINCIPAL
6
CONTINUOUS
62
256
370
-1
100
AcDbCircle
10
320.961619418
20
118.852360985
40
0.5
100
AcDbArc
50
29.986230136
51
89.986230136
0
LINE
5
208
100
AcDbEntity
8
PRINCIPAL
6
CONTINUOUS
62
256
370
-1
100
AcDbLine
10
320.961739583
20
119.35236097
11
319.393872627
21
119.352734775
0
ARC
5
209
100
AcDbEntity
8
PRINCIPAL
6
CONTINUOUS
62
256
370
-1
100
AcDbCircle
10
319.393752463
20
118.852734789
40
0.5
100
AcDbArc
50
89.986230136
51
149.986032136
0
ARC
5
20A
100
AcDbEntity
8
PRINCIPAL
6
CONTINUOUS
62
256
370
-1
100
AcDbCircle
10
318.527848653
20
119.352945906
40
0.5
100
AcDbArc
50
119.986230136
51
329.986032136
0
ARC
5
20B
100
AcDbEntity
8
PRINCIPAL
6
CONTINUOUS
62
256
370
-1
100
AcDbCircle
10
318.028056799
20
120.219092046
40
0.5
100
AcDbArc
50
299.986230136
51
359.986230136
0
LINE
5
20C
100
AcDbEntity
8
PRINCIPAL
6
CONTINUOUS
62
256
370
-1
100
AcDbLine
10
318.528056785
20
120.218971881
11
318.528172706
21
130.001049136
0
CIRCLE
5
20D
100
AcDbEntity
8
PRINCIPAL
6
CONTINUOUS
62
256
370
-1
100
AcDbCircle
10
320.178291945
20
109.351026967
40
1.6
0
LINE
5
20E
100
AcDbEntity
8
PRINCIPAL
6
CONTINUOUS
62
256
370
-1
100
AcDbLine
10
5.00326304965
20
126.808836773
11
5.00322424765
21
130.045237857
0
LINE
5
20F
100
AcDbEntity
8
PRINCIPAL
6
CONTINUOUS
62
256
370
-1
100
AcDbLine
10
5.00322424765
20
130.045237857
11
14.1375684857
21
130.045346109
0
ARC
5
210
100
AcDbEntity
8
PRINCIPAL
6
CONTINUOUS
62
256
370
-1
100
AcDbCircle
10
14.1376886497
20
129.545346124
40
0.5
100
AcDbArc
50
30.013967864
51
90.0137698641
0
ARC
5
211
100
AcDbEntity
8
PRINCIPAL
6
CONTINUOUS
62
256
370
-1
100
AcDbCircle
10
15.0035914597
20
130.04555724
40
0.5
100
AcDbArc
50
210.013967864
51
60.013769864
0
ARC
5
212
100
AcDbEntity
8
PRINCIPAL
6
CONTINUOUS
62
256
370
-1
100
AcDbCircle
10
15.5033833137
20
130.91170338
40
0.5
100
AcDbArc
50
180.013769864
51
240.013769864
0
LINE
5
213
100
AcDbEntity
8
PRINCIPAL
6
CONTINUOUS
62
256
370
-1
100
AcDbLine
10
15.0033833277
20
130.911583215
11
15.0030095237
21
132.479450171
0
ARC
5
214
100
AcDbEntity
8
PRINCIPAL
6
CONTINUOUS
62
256
370
-1
100
AcDbCircle
10
15.5030095087
20
132.479570335
40
0.5
100
AcDbArc
50
120.013968864
51
180.013769864
0
ARC
5
215
100
AcDbEntity
8
PRINCIPAL
6
CONTINUOUS
62
256
370
-1
100
AcDbCircle
10
15.0027983927
20
133.345474145
40
0.5
100
AcDbArc
50
300.013967864
51
150.013769864
0
ARC
5
216
100
AcDbEntity
8
PRINCIPAL
6
CONTINUOUS
62
256
370
-1
100
AcDbCircle
10
14.1366532527
20
133.845265999
40
0.5
100
AcDbArc
50
270.013769864
51
330.013769864
0
LINE
5
217
100
AcDbEntity
8
PRINCIPAL
6
CONTINUOUS
62
256
370
-1
100
AcDbLine
10
14.1367734177
20
133.345266014
11
5.00318517965
21
133.345156943
0
LINE
5
218
100
AcDbEntity
8
PRINCIPAL
6
CONTINUOUS
62
256
370
-1
100
AcDbLine
10
5.00318517965
20
133.345156943
11
5.00282306565
21
163.870396738
0
ARC
5
219
100
AcDbEntity
8
PRINCIPAL
6
CONTINUOUS
62
256
370
-1
100
AcDbCircle
10
17.0028153777
20
163.87054069
40
11.999993
100
AcDbArc
50
90.0006728641
51
180.000686864
0
CIRCLE
5
21A
100
AcDbEntity
8
PRINCIPAL
6
CONTINUOUS
62
256
370
-1
100
AcDbCircle
10
40.8281975977
20
131.695823702
40
1.6
0
LINE
5
21B
100
AcDbEntity
8
PRINCIPAL
6
CONTINUOUS
62
256
370
-1
100
AcDbLine
10
66.6520418377
20
133.35814998
11
66.6526685697
21
130.866852059
0
ARC
5
21C
100
AcDbEntity
8
PRINCIPAL
6
CONTINUOUS
62
256
370
-1
100
AcDbCircle
10
66.1526685847
20
130.866731894
40
0.5
100
AcDbArc
50
300.013967864
51
0.0137698639897
0
ARC
5
21D
100
AcDbEntity
8
PRINCIPAL
6
CONTINUOUS
62
256
370
-1
100
AcDbCircle
10
66.6528797007
20
130.000829085
40
0.5
100
AcDbArc
50
120.013967864
51
330.013769864
0
ARC
5
21E
100
AcDbEntity
8
PRINCIPAL
6
CONTINUOUS
62
256
370
-1
100
AcDbCircle
10
67.5190258407
20
129.501037231
40
0.5
100
AcDbArc
50
90.0137698641
51
150.013769864
0
LINE
5
21F
100
AcDbEntity
8
PRINCIPAL
6
CONTINUOUS
62
256
370
-1
100
AcDbLine
10
67.5189056757
20
130.001037216
11
78.1783239737
21
130.001077989
0
LINE
5
220
100
AcDbEntity
8
PRINCIPAL
6
CONTINUOUS
62
256
370
-1
100
AcDbLine
10
78.1783239737
20
130.001077989
11
78.1784400767
21
120.218244734
0
ARC
5
221
100
AcDbEntity
8
PRINCIPAL
6
CONTINUOUS
62
256
370
-1
100
AcDbCircle
10
77.6784400917
20
120.218124569
40
0.5
100
AcDbArc
50
300.013967864
51
0.0137698639897
0
ARC
5
222
100
AcDbEntity
8
PRINCIPAL
6
CONTINUOUS
62
256
370
-1
100
AcDbCircle
10
78.1786512077
20
119.35222076
40
0.5
100
AcDbArc
50
120.013967864
51
330.013769864
0
ARC
5
223
100
AcDbEntity
8
PRINCIPAL
6
CONTINUOUS
62
256
370
-1
100
AcDbCircle
10
79.0447973477
20
118.852428906
40
0.5
100
AcDbArc
50
90.0137698641
51
150.013769864
0
LINE
5
224
100
AcDbEntity
8
PRINCIPAL
6
CONTINUOUS
62
256
370
-1
100
AcDbLine
10
79.0446771827
20
119.352428891
11
80.6125441387
21
119.352802696
0
ARC
5
225
100
AcDbEntity
8
PRINCIPAL
6
CONTINUOUS
62
256
370
-1
100
AcDbCircle
10
80.6126643027
20
118.85280271
40
0.5
100
AcDbArc
50
30.013967864
51
90.0137698641
0
ARC
5
226
100
AcDbEntity
8
PRINCIPAL
6
CONTINUOUS
62
256
370
-1
100
AcDbCircle
10
81.4785681127
20
119.353013827
40
0.5
100
AcDbArc
50
210.013967864
51
60.013769864
0
ARC
5
227
100
AcDbEntity
8
PRINCIPAL
6
CONTINUOUS
62
256
370
-1
100
AcDbCircle
10
81.9783599667
20
120.219159967
40
0.5
100
AcDbArc
50
180.013769864
51
240.013769864
0
LINE
5
228
100
AcDbEntity
8
PRINCIPAL
6
CONTINUOUS
62
256
370
-1
100
AcDbLine
10
81.4783599807
20
120.219039802
11
81.4782440597
21
130.001117057
0
CIRCLE
5
229
100
AcDbEntity
8
PRINCIPAL
6
CONTINUOUS
62
256
370
-1
100
AcDbCircle
10
79.8281248207
20
109.351094888
40
1.6
0
CIRCLE
5
22A
100
AcDbEntity
8
PRINCIPAL
6
ByLayer
62
256
370
-1
100
AcDbCircle
10
157.50008631
20
131.695776947
40
1.6
0
CIRCLE
5
22B
100
AcDbEntity
8
PRINCIPAL
6
CONTINUOUS
62
256
370
-1
100
AcDbCircle
10
242.50868631
20
131.695776947
40
1.6
0
LINE
5
22C
100
AcDbEntity
8
PRINCIPAL
6
ByLayer
62
256
370
-1
100
AcDbLine
10
318.52818631
20
130.000776947
11
252.50868631
21
130.000776947
0
LINE
5
22D
100
AcDbEntity
8
PRINCIPAL
6
ByLayer
62
256
370
-1
100
AcDbLine
10
81.4781863096
20
130.000776947
11
147.50008631
21
130.000776947
0
LINE
5
22E
100
AcDbEntity
8
PRINCIPAL
6
ByLayer
62
256
370
-1
100
AcDbLine
10
167.50008631
20
130.000776947
11
232.50008631
21
130.000776947
0
ARC
5
22F
100
AcDbEntity
8
PRINCIPAL
6
CONTINUOUS
62
256
370
-1
100
AcDbCircle
10
252.508566146
20
129.500776962
40
0.5
100
AcDbArc
50
89.986230136
51
149.986032136
0
ARC
5
230
100
AcDbEntity
8
PRINCIPAL
6
CONTINUOUS
62
256
370
-1
100
AcDbCircle
10
251.642663336
20
130.000988078
40
0.5
100
AcDbArc
50
119.986230136
51
329.986032136
0
ARC
5
231
100
AcDbEntity
8
PRINCIPAL
6
CONTINUOUS
62
256
370
-1
100
AcDbCircle
10
251.142871482
20
130.867134218
40
0.5
100
AcDbArc
50
299.986230136
51
359.986230136
0
LINE
5
232
100
AcDbEntity
8
PRINCIPAL
6
CONTINUOUS
62
256
370
-1
100
AcDbLine
10
251.642871468
20
130.867014053
11
251.643245272
21
132.434881009
0
ARC
5
233
100
AcDbEntity
8
PRINCIPAL
6
CONTINUOUS
62
256
370
-1
100
AcDbCircle
10
251.143245287
20
132.435001173
40
0.5
100
AcDbArc
50
359.986230136
51
59.986031136
0
ARC
5
234
100
AcDbEntity
8
PRINCIPAL
6
CONTINUOUS
62
256
370
-1
100
AcDbCircle
10
251.643456403
20
133.300904983
40
0.5
100
AcDbArc
50
29.986230136
51
239.986032136
0
ARC
5
235
100
AcDbEntity
8
PRINCIPAL
6
CONTINUOUS
62
256
370
-1
100
AcDbCircle
10
252.509601543
20
133.800696837
40
0.5
100
AcDbArc
50
209.986230136
51
269.986230136
0
LINE
5
236
100
AcDbEntity
8
PRINCIPAL
6
CONTINUOUS
62
256
370
-1
100
AcDbLine
10
252.50918631
20
133.300776947
11
257.50918631
21
133.300776947
0
ARC
5
237
100
AcDbEntity
8
PRINCIPAL
6
CONTINUOUS
62
256
370
-1
100
AcDbCircle
10
167.499966145
20
129.500776962
40
0.5
100
AcDbArc
50
89.986230136
51
149.986032136
0
ARC
5
238
100
AcDbEntity
8
PRINCIPAL
6
CONTINUOUS
62
256
370
-1
100
AcDbCircle
10
166.634063335
20
130.000988078
40
0.5
100
AcDbArc
50
119.986230136
51
329.986032136
0
ARC
5
239
100
AcDbEntity
8
PRINCIPAL
6
CONTINUOUS
62
256
370
-1
100
AcDbCircle
10
166.134271481
20
130.867134218
40
0.5
100
AcDbArc
50
299.986230136
51
359.986230136
0
LINE
5
23A
100
AcDbEntity
8
PRINCIPAL
6
CONTINUOUS
62
256
370
-1
100
AcDbLine
10
166.634271467
20
130.867014053
11
166.634645271
21
132.434881009
0
ARC
5
23B
100
AcDbEntity
8
PRINCIPAL
6
CONTINUOUS
62
256
370
-1
100
AcDbCircle
10
166.134645286
20
132.435001173
40
0.5
100
AcDbArc
50
359.986230136
51
59.986031136
0
ARC
5
23C
100
AcDbEntity
8
PRINCIPAL
6
CONTINUOUS
62
256
370
-1
100
AcDbCircle
10
166.634856402
20
133.300904983
40
0.5
100
AcDbArc
50
29.986230136
51
239.986032136
0
ARC
5
23D
100
AcDbEntity
8
PRINCIPAL
6
CONTINUOUS
62
256
370
-1
100
AcDbCircle
10
167.501001542
20
133.800696837
40
0.5
100
AcDbArc
50
209.986230136
51
269.986230136
0
LINE
5
23E
100
AcDbEntity
8
PRINCIPAL
6
CONTINUOUS
62
256
370
-1
100
AcDbLine
10
167.500586309
20
133.300776947
11
172.500586309
21
133.300776947
0
ARC
5
23F
100
AcDbEntity
8
PRINCIPAL
6
CONTINUOUS
62
256
370
-1
100
AcDbCircle
10
147.500206474
20
129.500776962
40
0.5
100
AcDbArc
50
30.013967864
51
90.0137698641
0
ARC
5
240
100
AcDbEntity
8
PRINCIPAL
6
CONTINUOUS
62
256
370
-1
100
AcDbCircle
10
148.366109284
20
130.000988078
40
0.5
100
AcDbArc
50
210.013967864
51
60.013769864
0
ARC
5
241
100
AcDbEntity
8
PRINCIPAL
6
CONTINUOUS
62
256
370
-1
100
AcDbCircle
10
148.865901138
20
130.867134218
40
0.5
100
AcDbArc
50
180.013769864
51
240.013769864
0
LINE
5
242
100
AcDbEntity
8
PRINCIPAL
6
CONTINUOUS
62
256
370
-1
100
AcDbLine
10
148.365901152
20
130.867014053
11
148.365527348
21
132.434881009
0
ARC
5
243
100
AcDbEntity
8
PRINCIPAL
6
CONTINUOUS
62
256
370
-1
100
AcDbCircle
10
148.865527333
20
132.435001173
40
0.5
100
AcDbArc
50
120.013968864
51
180.013769864
0
ARC
5
244
100
AcDbEntity
8
PRINCIPAL
6
CONTINUOUS
62
256
370
-1
100
AcDbCircle
10
148.365316217
20
133.300904983
40
0.5
100
AcDbArc
50
300.013967864
51
150.013769864
0
ARC
5
245
100
AcDbEntity
8
PRINCIPAL
6
CONTINUOUS
62
256
370
-1
100
AcDbCircle
10
147.499171077
20
133.800696837
40
0.5
100
AcDbArc
50
270.013769864
51
330.013769864
0
ARC
5
246
100
AcDbEntity
8
PRINCIPAL
6
CONTINUOUS
62
256
370
-1
100
AcDbCircle
10
232.500206474
20
129.500776962
40
0.5
100
AcDbArc
50
30.013967864
51
90.0137698641
0
ARC
5
247
100
AcDbEntity
8
PRINCIPAL
6
CONTINUOUS
62
256
370
-1
100
AcDbCircle
10
233.366109284
20
130.000988078
40
0.5
100
AcDbArc
50
210.013967864
51
60.013769864
0
ARC
5
248
100
AcDbEntity
8
PRINCIPAL
6
CONTINUOUS
62
256
370
-1
100
AcDbCircle
10
233.865901138
20
130.867134218
40
0.5
100
AcDbArc
50
180.013769864
51
240.013769864
0
ARC
5
249
100
AcDbEntity
8
PRINCIPAL
6
CONTINUOUS
62
256
370
-1
100
AcDbCircle
10
233.865527333
20
132.435001173
40
0.5
100
AcDbArc
50
120.013968864
51
180.013769864
0
ARC
5
24A
100
AcDbEntity
8
PRINCIPAL
6
CONTINUOUS
62
256
370
-1
100
AcDbCircle
10
233.365316217
20
133.300904983
40
0.5
100
AcDbArc
50
300.013967864
51
150.013769864
0
ARC
5
24B
100
AcDbEntity
8
PRINCIPAL
6
CONTINUOUS
62
256
370
-1
100
AcDbCircle
10
232.499171077
20
133.800696837
40
0.5
100
AcDbArc
50
270.013769864
51
330.013769864
0
LINE
5
24C
100
AcDbEntity
8
PRINCIPAL
6
CONTINUOUS
62
256
370
-1
100
AcDbLine
10
147.49918631
20
133.300776947
11
142.49918631
21
133.300776947
0
LINE
5
24D
100
AcDbEntity
8
PRINCIPAL
6
CONTINUOUS
62
256
370
-1
100
AcDbLine
10
232.49918631
20
133.300776947
11
227.49918631
21
133.300776947
0
LINE
5
24E
100
AcDbEntity
8
PRINCIPAL
6
CONTINUOUS
62
256
370
-1
100
AcDbLine
10
233.36618631
20
130.866776947
11
233.36518631
21
132.434776947
0
LINE
5
24F
100
AcDbEntity
8
PRINCIPAL
6
CONTINUOUS
62
256
370
-1
100
AcDbLine
10
321.828102783
20
130.000983548
11
321.828002783
21
120.218183548
0
ARC
5
250
100
AcDbEntity
8
PRINCIPAL
6
CONTINUOUS
62
256
370
-1
100
AcDbCircle
10
17.0033027831
20
126.809283548
40
12
100
AcDbArc
50
180
51
210.33
0
ARC
5
251
100
AcDbEntity
8
PRINCIPAL
6
CONTINUOUS
62
256
370
-1
100
AcDbCircle
10
78.1787027831
20
17.0012835476
40
12
100
AcDbArc
50
210.33
51
270
0
ARC
5
252
100
AcDbEntity
8
PRINCIPAL
6
CONTINUOUS
62
256
370
-1
100
AcDbCircle
10
383.002702783
20
126.809283548
40
12
100
AcDbArc
50
329.66
51
359.999
0
ARC
5
253
100
AcDbEntity
8
PRINCIPAL
6
CONTINUOUS
62
256
370
-1
100
AcDbCircle
10
321.827702783
20
17.0012835476
40
12
100
AcDbArc
50
270
51
329.66
0
LINE
5
254
100
AcDbEntity
8
PRINCIPAL
6
ByLayer
62
256
370
-1
100
AcDbLine
10
6.64572763647
20
120.749528018
11
67.8211276365
21
10.9415280178
0
LINE
5
255
100
AcDbEntity
8
PRINCIPAL
6
ByLayer
62
256
370
-1
100
AcDbLine
10
393.359220145
20
120.747720372
11
332.184220145
21
10.9397203722
0
LINE
5
256
100
AcDbEntity
8
PRINCIPAL
6
CONTINUOUS
62
256
370
-1
100
AcDbLine
10
78.1787027831
20
5.00128354762
11
78.1788188861
21
14.7841168026
0
ARC
5
257
100
AcDbEntity
8
PRINCIPAL
6
CONTINUOUS
62
256
370
-1
100
AcDbCircle
10
77.6788189011
20
14.7842369676
40
0.5
100
AcDbArc
50
359.986230136
51
59.986032136
0
ARC
5
258
100
AcDbEntity
8
PRINCIPAL
6
CONTINUOUS
62
256
370
-1
100
AcDbCircle
10
78.1790300171
20
15.6501407766
40
0.5
100
AcDbArc
50
29.986230136
51
239.986032136
0
ARC
5
259
100
AcDbEntity
8
PRINCIPAL
6
CONTINUOUS
62
256
370
-1
100
AcDbCircle
10
79.0451761571
20
16.1499326306
40
0.5
100
AcDbArc
50
209.986230136
51
269.986230136
0
LINE
5
25A
100
AcDbEntity
8
PRINCIPAL
6
CONTINUOUS
62
256
370
-1
100
AcDbLine
10
79.0450559921
20
15.6499326456
11
80.6129229481
21
15.6495588406
0
ARC
5
25B
100
AcDbEntity
8
PRINCIPAL
6
CONTINUOUS
62
256
370
-1
100
AcDbCircle
10
80.6130431121
20
16.1495588266
40
0.5
100
AcDbArc
50
269.986230136
51
329.986032136
0
ARC
5
25C
100
AcDbEntity
8
PRINCIPAL
6
CONTINUOUS
62
256
370
-1
100
AcDbCircle
10
81.4789469221
20
15.6493477096
40
0.5
100
AcDbArc
50
299.986230136
51
149.986032136
0
ARC
5
25D
100
AcDbEntity
8
PRINCIPAL
6
CONTINUOUS
62
256
370
-1
100
AcDbCircle
10
81.9787387761
20
14.7832015696
40
0.5
100
AcDbArc
50
119.986230136
51
179.986230136
0
LINE
5
25E
100
AcDbEntity
8
PRINCIPAL
6
CONTINUOUS
62
256
370
-1
100
AcDbLine
10
81.4787387901
20
14.7833217346
11
81.4786228691
21
5.00124447962
0
LINE
5
25F
100
AcDbEntity
8
PRINCIPAL
6
CONTINUOUS
62
256
370
-1
100
AcDbLine
10
318.527782697
20
5.00132261562
11
318.5278988
21
14.7841558706
0
ARC
5
260
100
AcDbEntity
8
PRINCIPAL
6
CONTINUOUS
62
256
370
-1
100
AcDbCircle
10
318.027898815
20
14.7842760356
40
0.5
100
AcDbArc
50
359.986230136
51
59.986032136
0
ARC
5
261
100
AcDbEntity
8
PRINCIPAL
6
CONTINUOUS
62
256
370
-1
100
AcDbCircle
10
318.528109931
20
15.6501798446
40
0.5
100
AcDbArc
50
29.986230136
51
239.986032136
0
ARC
5
262
100
AcDbEntity
8
PRINCIPAL
6
CONTINUOUS
62
256
370
-1
100
AcDbCircle
10
319.394256071
20
16.1499716986
40
0.5
100
AcDbArc
50
209.986230136
51
269.986230136
0
LINE
5
263
100
AcDbEntity
8
PRINCIPAL
6
CONTINUOUS
62
256
370
-1
100
AcDbLine
10
319.394135906
20
15.6499717136
11
320.962002862
21
15.6495979086
0
ARC
5
264
100
AcDbEntity
8
PRINCIPAL
6
CONTINUOUS
62
256
370
-1
100
AcDbCircle
10
320.962123026
20
16.1495978946
40
0.5
100
AcDbArc
50
269.986230136
51
329.986032136
0
ARC
5
265
100
AcDbEntity
8
PRINCIPAL
6
CONTINUOUS
62
256
370
-1
100
AcDbCircle
10
321.828026836
20
15.6493867776
40
0.5
100
AcDbArc
50
299.986230136
51
149.986032136
0
ARC
5
266
100
AcDbEntity
8
PRINCIPAL
6
CONTINUOUS
62
256
370
-1
100
AcDbCircle
10
322.32781869
20
14.7832406376
40
0.5
100
AcDbArc
50
119.986230136
51
179.986230136
0
LINE
5
267
100
AcDbEntity
8
PRINCIPAL
6
CONTINUOUS
62
256
370
-1
100
AcDbLine
10
321.827818704
20
14.7833608026
11
321.827702783
21
5.00128354762
0
LINE
5
268
100
AcDbEntity
8
PRINCIPAL
6
ByLayer
62
256
370
-1
100
AcDbLine
10
81.4786228691
20
5.00124447962
11
318.527782697
21
5.00132261562
0
CIRCLE
5
269
100
AcDbEntity
8
PRINCIPAL
6
CONTINUOUS
62
256
370
-1
100
AcDbCircle
10
79.8281
20
25.6498
40
1.6
0
CIRCLE
5
26A
100
AcDbEntity
8
PRINCIPAL
6
CONTINUOUS
62
256
370
-1
100
AcDbCircle
10
320.178
20
25.6498
40
1.6
0
ARC
5
26B
100
AcDbEntity
8
PRINCIPAL
6
CONTINUOUS
62
256
370
-1
100
AcDbCircle
10
100
20
110
40
5
100
AcDbArc
50
90.0007
51
180.001
0
ARC
5
26C
100
AcDbEntity
8
PRINCIPAL
6
CONTINUOUS
62
256
370
-1
100
AcDbCircle
10
300
20
110
40
5
100
AcDbArc
50
0
51
90
0
ARC
5
26D
100
AcDbEntity
8
PRINCIPAL
6
CONTINUOUS
62
256
370
-1
100
AcDbCircle
10
100
20
25
40
5
100
AcDbArc
50
180
51
270
0
ARC
5
26E
100
AcDbEntity
8
PRINCIPAL
6
CONTINUOUS
62
256
370
-1
100
AcDbCircle
10
300
20
25
40
5
100
AcDbArc
50
270
51
0
0
LINE
5
26F
100
AcDbEntity
8
PRINCIPAL
6
ByLayer
62
256
370
-1
100
AcDbLine
10
300
20
20
11
100
21
20
0
LINE
5
270
100
AcDbEntity
8
PRINCIPAL
6
ByLayer
62
256
370
-1
100
AcDbLine
10
100
20
115
11
300
21
115
0
LINE
5
271
100
AcDbEntity
8
PRINCIPAL
6
ByLayer
62
256
370
-1
100
AcDbLine
10
95
20
25
11
95
21
110
0
LINE
5
272
100
AcDbEntity
8
PRINCIPAL
6
ByLayer
62
256
370
-1
100
AcDbLine
10
305
20
110
11
305
21
25
0
CIRCLE
5
273
100
AcDbEntity
8
PRINCIPAL
6
CONTINUOUS
62
256
370
-1
100
AcDbCircle
10
382.303
20
150.496
40
1.25
0
CIRCLE
5
274
100
AcDbEntity
8
PRINCIPAL
6
CONTINUOUS
62
256
370
-1
100
AcDbCircle
10
365.303
20
162.5
40
5.525
0
CIRCLE
5
275
100
AcDbEntity
8
PRINCIPAL
6
CONTINUOUS
62
256
370
-1
100
AcDbCircle
10
365.303
20
150.496
40
1.25
0
CIRCLE
5
276
100
AcDbEntity
8
PRINCIPAL
6
CONTINUOUS
62
256
370
-1
100
AcDbCircle
10
17.7032
20
150.496
40
1.25
0
CIRCLE
5
277
100
AcDbEntity
8
PRINCIPAL
6
CONTINUOUS
62
256
370
-1
100
AcDbCircle
10
34.7028
20
162.5
40
5.525
0
CIRCLE
5
278
100
AcDbEntity
8
PRINCIPAL
6
CONTINUOUS
62
256
370
-1
100
AcDbCircle
10
34.7028
20
150.496
40
1.25
0
CIRCLE
5
279
100
AcDbEntity
8
PRINCIPAL
6
CONTINUOUS
62
256
370
-1
100
AcDbCircle
10
17.7032
20
162.496
40
3.9
0
CIRCLE
5
27A
100
AcDbEntity
8
PRINCIPAL
6
CONTINUOUS
62
256
370
-1
100
AcDbCircle
10
382.303
20
162.496
40
3.9
0
LINE
5
27B
100
AcDbEntity
8
PRINCIPAL
6
ByLayer
62
256
370
-1
100
AcDbLine
10
142.49918631
20
133.300776947
11
142.49918631
21
133.71493447
0
ARC
5
27C
100
AcDbEntity
8
PRINCIPAL
6
ByLayer
62
256
370
-1
100
AcDbCircle
10
143.49918631
20
133.71493447
40
1
100
AcDbArc
50
118.701979141
51
180
0
ARC
5
27D
100
AcDbEntity
8
PRINCIPAL
6
ByLayer
62
256
370
-1
100
AcDbCircle
10
157.499886309
20
108.144229683
40
30.1527107448
100
AcDbArc
50
61.2980208563
51
118.701979141
0
LINE
5
27E
100
AcDbEntity
8
PRINCIPAL
6
ByLayer
62
256
370
-1
100
AcDbLine
10
172.500586309
20
133.300776947
11
172.500586309
21
133.714934469
0
ARC
5
27F
100
AcDbEntity
8
PRINCIPAL
6
ByLayer
62
256
370
-1
100
AcDbCircle
10
171.500586309
20
133.714934469
40
1
100
AcDbArc
50
0
51
61.2980208563
0
LINE
5
280
100
AcDbEntity
8
PRINCIPAL
6
ByLayer
62
256
370
-1
100
AcDbLine
10
227.49918631
20
133.300776947
11
227.49918631
21
133.71493447
0
ARC
5
281
100
AcDbEntity
8
PRINCIPAL
6
ByLayer
62
256
370
-1
100
AcDbCircle
10
228.49918631
20
133.71493447
40
1
100
AcDbArc
50
118.701979141
51
180
0
ARC
5
282
100
AcDbEntity
8
PRINCIPAL
6
ByLayer
62
256
370
-1
100
AcDbCircle
10
242.499886309
20
108.144229683
40
30.1527107448
100
AcDbArc
50
61.2787492275
51
118.701979141
0
LINE
5
283
100
AcDbEntity
8
PRINCIPAL
6
ByLayer
62
256
370
-1
100
AcDbLine
10
257.50918631
20
133.300776947
11
257.50918631
21
133.71022384
0
ARC
5
284
100
AcDbEntity
8
PRINCIPAL
6
ByLayer
62
256
370
-1
100
AcDbCircle
10
256.50918631
20
133.71022384
40
1
100
AcDbArc
50
360
51
61.2787492275
0
LINE
5
285
100
AcDbEntity
8
PRINCIPAL
6
CONTINUOUS
62
256
370
-1
100
AcDbLine
10
17.0027
20
175.871
11
35.6105
21
175.871
0
ARC
5
286
100
AcDbEntity
8
PRINCIPAL
6
CONTINUOUS
62
256
370
-1
100
AcDbCircle
10
35.6103590758
20
163.871007001
40
11.999993
100
AcDbArc
50
359.999313136
51
89.999327136
0
LINE
5
287
100
AcDbEntity
8
PRINCIPAL
6
CONTINUOUS
62
256
370
-1
100
AcDbLine
10
383.004
20
175.87
11
364.396
21
175.871
0
ARC
5
288
100
AcDbEntity
8
PRINCIPAL
6
CONTINUOUS
62
256
370
-1
100
AcDbCircle
10
364.396140924
20
163.871007001
40
11.999993
100
AcDbArc
50
90.0006728641
51
180.000686864
0
LINE
5
289
100
AcDbEntity
8
PRINCIPAL
6
CONTINUOUS
62
256
370
-1
100
AcDbLine
10
47.6101317224
20
145.353662442
11
47.6103513878
21
163.87086305
0
LINE
5
28A
100
AcDbEntity
8
PRINCIPAL
6
ByLayer
62
256
370
-1
100
AcDbLine
10
59.6180258634
20
133.353522685
11
66.6520418377
21
133.35814998
0
ARC
5
28B
100
AcDbEntity
8
PRINCIPAL
6
ByLayer
62
256
370
-1
100
AcDbCircle
10
59.6101317216
20
145.353520089
40
12
100
AcDbArc
50
179.999320313
51
270.037691754
0
LINE
5
28C
100
AcDbEntity
8
PRINCIPAL
6
CONTINUOUS
62
256
370
-1
100
AcDbLine
10
352.396368278
20
145.353619576
11
352.396148612
21
163.870863049
0
LINE
5
28D
100
AcDbEntity
8
PRINCIPAL
6
ByLayer
62
256
370
-1
100
AcDbLine
10
333.354374928
20
133.358082059
11
340.388516973
21
133.353479792
0
ARC
5
28E
100
AcDbEntity
8
PRINCIPAL
6
ByLayer
62
256
370
-1
100
AcDbCircle
10
340.396368279
20
145.353477223
40
12
100
AcDbArc
50
269.962512773
51
0.000679686942284
0
ARC
5
28F
100
AcDbEntity
8
PRINCIPAL
6
ByLayer
62
256
370
-1
100
AcDbCircle
10
46.8774
20
108.094
40
10
100
AcDbArc
50
276.315
51
263.685
0
LINE
5
290
100
AcDbEntity
8
PRINCIPAL
6
ByLayer
62
256
370
-1
100
AcDbLine
10
45.7774
20
97.0938
11
45.7774
21
98.1545
0
LINE
5
291
100
AcDbEntity
8
PRINCIPAL
6
ByLayer
62
256
370
-1
100
AcDbLine
10
47.9774
20
97.0938
11
47.9774
21
98.1545
0
LINE
5
292
100
AcDbEntity
8
PRINCIPAL
6
ByLayer
62
256
370
-1
100
AcDbLine
10
47.9774
20
97.0938
11
45.7774
21
97.0938
0
CIRCLE
5
293
100
AcDbEntity
8
PRINCIPAL
6
ByLayer
62
256
370
-1
100
AcDbCircle
10
61.6055
20
89.1238
40
1.6
0
ARC
5
294
100
AcDbEntity
8
PRINCIPAL
6
ByLayer
62
256
370
-1
100
AcDbCircle
10
54.6055
20
80.1238
40
3
100
AcDbArc
50
90
51
180
0
LINE
5
295
100
AcDbEntity
8
PRINCIPAL
6
ByLayer
62
256
370
-1
100
AcDbLine
10
54.6055
20
83.1238
11
68.6055
21
83.1238
0
ARC
5
296
100
AcDbEntity
8
PRINCIPAL
6
ByLayer
62
256
370
-1
100
AcDbCircle
10
68.6055
20
80.1238
40
3
100
AcDbArc
50
360
51
90
0
LINE
5
297
100
AcDbEntity
8
PRINCIPAL
6
ByLayer
62
256
370
-1
100
AcDbLine
10
71.6055
20
58.1238
11
71.6055
21
80.1238
0
ARC
5
298
100
AcDbEntity
8
PRINCIPAL
6
ByLayer
62
256
370
-1
100
AcDbCircle
10
68.6055
20
58.1238
40
3
100
AcDbArc
50
270
51
360
0
LINE
5
299
100
AcDbEntity
8
PRINCIPAL
6
ByLayer
62
256
370
-1
100
AcDbLine
10
54.6055
20
55.1238
11
68.6055
21
55.1238
0
ARC
5
29A
100
AcDbEntity
8
PRINCIPAL
6
ByLayer
62
256
370
-1
100
AcDbCircle
10
54.6055
20
58.1238
40
3
100
AcDbArc
50
180
51
270
0
LINE
5
29B
100
AcDbEntity
8
PRINCIPAL
6
ByLayer
62
256
370
-1
100
AcDbLine
10
51.6055
20
58.1238
11
51.6055
21
80.1238
0
CIRCLE
5
29C
100
AcDbEntity
8
PRINCIPAL
6
ByLayer
62
256
370
-1
100
AcDbCircle
10
61.6055
20
49.1238
40
1.6
0
CIRCLE
5
29D
100
AcDbEntity
8
PRINCIPAL
6
ByLayer
62
256
370
-1
100
AcDbCircle
10
343
20
107
40
15
0
CIRCLE
5
29E
100
AcDbEntity
8
PRINCIPAL
6
ByLayer
62
256
370
-1
100
AcDbCircle
10
90
20
92.5
40
2.1
0
CIRCLE
5
29F
100
AcDbEntity
8
PRINCIPAL
6
ByLayer
62
256
370
-1
100
AcDbCircle
10
90
20
42.5
40
2.1
0
CIRCLE
5
2A0
100
AcDbEntity
8
PRINCIPAL
6
ByLayer
62
256
370
-1
100
AcDbCircle
10
310
20
92.5
40
2.1
0
CIRCLE
5
2A1
100
AcDbEntity
8
PRINCIPAL
6
ByLayer
62
256
370
-1
100
AcDbCircle
10
310
20
42.5
40
2.1
0
CIRCLE
5
2A2
100
AcDbEntity
8
PRINCIPAL
6
ByLayer
62
256
370
-1
100
AcDbCircle
10
337
20
70
40
11
0
CIRCLE
5
2A3
100
AcDbEntity
8
PRINCIPAL
6
ByLayer
62
256
370
-1
100
AcDbCircle
10
333
20
43
40
6.5
0
ENDSEC
0
SECTION
2
OBJECTS
0
DICTIONARY
5
C
330
0
100
AcDbDictionary
281
1
3
ACAD_GROUP
350
D
0
DICTIONARY
5
D
330
C
100
AcDbDictionary
281
1
0
ENDSEC
0
EOF
