<?xml version="1.0" standalone="no"?>
<!DOCTYPE svg PUBLIC "-//W3C//DTD SVG 20010904//EN"
 "http://www.w3.org/TR/2001/REC-SVG-20010904/DTD/svg10.dtd">
<svg version="1.0" xmlns="http://www.w3.org/2000/svg"
 width="860.000000pt" height="827.000000pt" viewBox="0 0 860.000000 827.000000"
 preserveAspectRatio="xMidYMid meet">
<metadata>
Created by potrace 1.16, written by Peter Selinger 2001-2019
</metadata>
<g transform="translate(0.000000,827.000000) scale(0.100000,-0.100000)"
fill="#ffffff" stroke="none">
<path d="M1010 7835 c-142 -18 -193 -34 -295 -88 -56 -29 -81 -49 -85 -65 -3
-14 -59 -62 -155 -135 -82 -61 -152 -120 -153 -130 -10 -53 53 -136 133 -176
42 -21 61 -23 164 -23 156 1 410 58 499 112 39 24 71 88 72 141 0 74 68 117
163 105 75 -10 222 -60 311 -106 274 -141 454 -367 511 -643 22 -112 33 -312
24 -447 -25 -376 -171 -687 -535 -1145 -278 -349 -383 -503 -483 -702 -168
-336 -218 -771 -125 -1087 8 -27 14 -58 14 -68 0 -9 -42 -59 -92 -110 -358
-359 -544 -757 -507 -1083 9 -83 53 -224 84 -272 l16 -23 42 21 c192 97 444
321 611 544 22 29 20 18 -19 -118 -118 -410 -70 -785 130 -995 l63 -66 45 37
c135 111 296 366 392 622 42 111 96 319 115 438 7 42 14 77 15 77 2 0 53 -20
115 -45 429 -173 931 -268 1547 -294 101 -4 185 -10 189 -13 3 -4 1 -52 -5
-108 -23 -215 -7 -439 45 -597 56 -173 141 -307 278 -442 l75 -75 23 21 c13
12 38 47 56 77 112 185 191 550 209 971 l8 180 46 3 46 3 6 -156 c8 -184 29
-334 63 -453 99 -343 320 -615 608 -747 41 -19 81 -35 90 -35 31 0 61 207 60
420 -1 265 -42 484 -156 828 -34 100 -59 185 -56 187 8 8 378 -14 523 -31 328
-37 617 -101 920 -204 577 -196 1114 -525 1548 -949 42 -41 77 -70 77 -64 0 6
-16 57 -36 114 -203 584 -633 1123 -1205 1509 -238 161 -478 290 -714 383
-352 139 -643 217 -1029 273 l-119 18 -191 140 c-105 77 -274 199 -376 272
-102 74 -204 147 -228 164 -24 17 -57 54 -73 81 -33 53 -43 58 -134 61 l-60 3
-25 47 c-26 50 -40 58 -108 58 -59 0 -120 33 -137 74 -20 48 -41 61 -93 58
-40 -1 -51 3 -79 30 -30 29 -35 31 -85 25 -67 -8 -127 18 -158 70 -20 34 -23
35 -65 30 -43 -6 -45 -5 -82 40 -21 25 -46 54 -55 65 -23 24 -83 24 -145 -1
-81 -32 -97 -30 -138 11 -45 48 -73 54 -134 34 -78 -25 -104 -21 -156 24 -54
46 -81 50 -141 18 -38 -20 -46 -21 -85 -9 -63 19 -123 83 -143 151 -22 75 -35
260 -25 345 11 91 37 175 111 360 219 549 298 867 285 1144 -18 348 -190 747
-414 962 -165 157 -429 289 -683 340 -131 27 -397 33 -550 14z"/>
</g>
</svg>
