{
    "realm": "{{ config.keycloak.realm }}",
    "auth-server-url": "https://{{ config.keycloak.fqdn }}/auth",
    "ssl-required": "external",
    "resource": "{{ client_id }}",
    "credentials": {
      "secret": "{{ oidc_client_secret }}"
    },
    "confidential-port": 0
}