{
  "rabbit_version": "3.6.11-alpine",
  "users": [
    {
      "name": "guest",
      "password_hash": "o2MJjT8UKSRM7eoLDMWvm4LxqaFvDxd2wLg1KQQQ2jXfG5UE",
      "hashing_algorithm": "rabbit_password_hashing_sha256",
      "tags": "administrator"
    }
  ],
  "vhosts": [
    {
      "name": "/"
    }
  ],
  "permissions": [
    {
      "user": "guest",
      "vhost": "/",
      "configure": ".*",
      "write": ".*",
      "read": ".*"
    }
  ],
  "parameters": [],
  "policies": [],
  "queues": [],
  "exchanges": [
    {
      "name": "event.in",
      "vhost": "/",
      "type": "topic",
      "durable": true,
      "auto_delete": false,
      "internal": false,
      "arguments": {}
    },
    {
      "name": "event.out",
      "vhost": "/",
      "type": "topic",
      "durable": true,
      "auto_delete": false,
      "internal": false,
      "arguments": {}
    }
  ],
  "bindings": []
}