Executing zdCompile.sh
-----------------------------------------------------------------
Descend into 'TestDirectory' directory
 
COMPILING SourceFiles
rm: cannot remove '*.o': No such file or directory
rm: cannot remove 'Aprog': No such file or directory
bison -d -t core2.y
core2.y:89.17-28: warning: type clash on default action: <next> != <> [-Wother]
 	|	if_statement
                 ^^^^^^^^^^^^
core2.y:92.9-13: warning: type clash on default action: <next> != <> [-Wother]
 body:	input
         ^^^^^
core2.y:93.17-22: warning: type clash on default action: <next> != <> [-Wother]
 	|	output
                 ^^^^^^
core2.y:94.17-26: warning: type clash on default action: <next> != <> [-Wother]
 	|	assignment
                 ^^^^^^^^^^
core2.y:117.17-27: warning: type clash on default action: <place> != <> [-Wother]
 	|	subtraction
                 ^^^^^^^^^^^
core2.y:136.17-21: warning: type clash on default action: <place> != <> [-Wother]
 operand:	value
                 ^^^^^
core2.y: warning: 1 nonterminal useless in grammar [-Wother]
core2.y: warning: 1 rule useless in grammar [-Wother]
core2.y:134.1-4: warning: nonterminal useless in grammar: loop [-Wother]
 loop:	WHILE boolean LOOP statement ENDLOOP SEMICOLON
 ^^^^
core2.y:134.9-54: warning: rule useless in grammar [-Wother]
 loop:	WHILE boolean LOOP statement ENDLOOP SEMICOLON
         ^^^^^^^^^^^^^^^^^^^^^^^^^^^^^^^^^^^^^^^^^^^^^^
core2.y: warning: 4 shift/reduce conflicts [-Wconflicts-sr]
cc    -c -o core2.tab.o core2.tab.c
core2.y:11:1: warning: data definition has no type or storage class
 yydebug=1;
 ^
core2.y:11:1: warning: type defaults to ‘int’ in declaration of ‘yydebug’ [-Wimplicit-int]
core2.tab.c:183:5: error: ‘LIST’ redeclared as different kind of symbol
     LIST = 302
     ^
core2.y:27:4: note: previous declaration of ‘LIST’ was here
 } *LIST, LISTNODE;
    ^
core2.y:46:3: error: expected specifier-qualifier-list before ‘LIST’
   LIST  *true;
   ^
core2.y:50:2: error: expected specifier-qualifier-list before ‘LIST’
  LIST  next;
  ^
core2.tab.c: In function ‘yyparse’:
core2.tab.c:1277:16: warning: implicit declaration of function ‘yylex’ [-Wimplicit-function-declaration]
       yychar = yylex ();
                ^
core2.y:87:13: error: ‘YYSTYPE {aka union YYSTYPE}’ has no member named ‘next’
 statement: body NEWLINE statement { $<next>$=$<next>1; yylineno++;}
             ^
core2.y:87:30: error: ‘YYSTYPE {aka union YYSTYPE}’ has no member named ‘next’
 statement: body NEWLINE statement { $<next>$=$<next>1; yylineno++;}
                              ^
core2.y:96:9: warning: implicit declaration of function ‘dl’ [-Wimplicit-function-declaration]
         dl("$<next>1=", $<next>1); 
         ^
core2.y:96:35: error: ‘YYSTYPE {aka union YYSTYPE}’ has no member named ‘next’
         dl("$<next>1=", $<next>1); 
                                   ^
core2.y:98:34: error: ‘YYSTYPE {aka union YYSTYPE}’ has no member named ‘next’
         dl("$<next>3=", $<next>3); 
                                  ^
core2.y:100:9: warning: implicit declaration of function ‘backpatch’ [-Wimplicit-function-declaration]
         backpatch($<next>1,$2);
         ^
core2.y:100:29: error: ‘YYSTYPE {aka union YYSTYPE}’ has no member named ‘next’
         backpatch($<next>1,$2);
                             ^
core2.y:101:15: error: ‘YYSTYPE {aka union YYSTYPE}’ has no member named ‘next’
         $<next>$=$<next>3;
               ^
core2.y:101:31: error: ‘YYSTYPE {aka union YYSTYPE}’ has no member named ‘next’
core2.y:150:10: warning: implicit declaration of function ‘gen’ [-Wimplicit-function-declaration]
          gen($2, $1, $3, VOID);
          ^
core2.y:152:22: error: ‘struct <anonymous>’ has no member named ‘true’
          $$.true = makelist(nextquad -2);
                      ^
core2.y:153:22: error: ‘struct <anonymous>’ has no member named ‘false’
          $$.false = makelist(nextquad -1);
                      ^
core2.y:156:42: error: ‘struct <anonymous>’ has no member named ‘true’
core2.y:157:42: error: ‘struct <anonymous>’ has no member named ‘false’
core2.y:159:41: error: ‘struct <anonymous>’ has no member named ‘true’
core2.y:160:41: error: ‘struct <anonymous>’ has no member named ‘false’
core2.y:161:38: error: ‘struct <anonymous>’ has no member named ‘true’
core2.y:162:24: error: ‘struct <anonymous>’ has no member named ‘true’
            $$.true = $4.true;
                        ^
core2.y:162:47: error: ‘struct <anonymous>’ has no member named ‘true’
core2.y:163:24: error: ‘struct <anonymous>’ has no member named ‘false’
            $$.false = merge($1.false, $4.false);
                        ^
core2.y:163:55: error: ‘struct <anonymous>’ has no member named ‘false’
core2.y:163:78: error: ‘struct <anonymous>’ has no member named ‘false’
core2.y:164:38: error: ‘struct <anonymous>’ has no member named ‘true’
core2.y:165:38: error: ‘struct <anonymous>’ has no member named ‘false’
core2.y:169:22: error: ‘struct <anonymous>’ has no member named ‘true’
          $$.true = $2.true;
                      ^
core2.y:169:46: error: ‘struct <anonymous>’ has no member named ‘true’
core2.y:170:22: error: ‘struct <anonymous>’ has no member named ‘false’
          $$.false = $2.false;
                      ^
core2.y:170:47: error: ‘struct <anonymous>’ has no member named ‘false’
core2.y:177:13: error: ‘YYSTYPE {aka union YYSTYPE}’ has no member named ‘next’
       $$ = makelist(nextquad - 1);
             ^
core2.tab.c:1523:7: warning: implicit declaration of function ‘yyerror’ [-Wimplicit-function-declaration]
       yyerror (YY_("syntax error"));
       ^
core2.y: At top level:
core2.y:183:6: warning: conflicting types for ‘gen’
 void gen(int op, char *p1, char *p2, char *r) {
      ^
core2.y:150:10: note: previous implicit declaration of ‘gen’ was here
          gen($2, $1, $3, VOID);
          ^
core2.y:205:22: error: expected declaration specifiers or ‘...’ before ‘LIST’
 void dl(char *label, LIST p){
                      ^
core2.y:210:1: error: unknown type name ‘LIST’
 LIST makelist(int  q) {
 ^
core2.y:210:6: error: conflicting types for ‘makelist’
 LIST makelist(int  q) {
      ^
core2.y:35:6: note: previous declaration of ‘makelist’ was here
 LIST makelist(int);
      ^
core2.y: In function ‘makelist’:
core2.y:211:12: error: expected ‘;’ before ‘tmp’
    LIST    tmp;
            ^
core2.y:213:4: error: ‘tmp’ undeclared (first use in this function)
    tmp = (LISTNODE *) malloc(sizeof (LISTNODE));
    ^
core2.y:213:4: note: each undeclared identifier is reported only once for each function it appears in
core2.y: At top level:
core2.y:218:16: error: expected declaration specifiers or ‘...’ before ‘LIST’
 void backpatch(LIST  p, int q) {
                ^
core2.y:230:1: error: unknown type name ‘LIST’
 LIST merge(LIST  p1, LIST p2) {
 ^
core2.y:230:12: error: expected declaration specifiers or ‘...’ before ‘LIST’
 LIST merge(LIST  p1, LIST p2) {
            ^
core2.y:230:22: error: expected declaration specifiers or ‘...’ before ‘LIST’
 LIST merge(LIST  p1, LIST p2) {
                      ^
<builtin>: recipe for target 'core2.tab.o' failed
make: *** [core2.tab.o] Error 1
Return To 'WorkingDirectory' directory
 
COMPILING COMPLETE
 
