Executing zdCompile.sh
-----------------------------------------------------------------
Descend into 'TestDirectory' directory
 
COMPILING SourceFiles
rm: cannot remove '*.o': No such file or directory
rm: cannot remove 'Aprog': No such file or directory
bison -d -t core2.y
core2.y: warning: 4 nonterminals useless in grammar [-Wother]
core2.y: warning: 7 rules useless in grammar [-Wother]
core2.y:85.1-11: warning: nonterminal useless in grammar: ifstatement [-Wother]
 ifstatement	:	IF comparison THEN statement ENDIF SEMICOLON
 ^^^^^^^^^^^
core2.y:88.1-4: warning: nonterminal useless in grammar: loop [-Wother]
 loop	:	WHILE comparison LOOP statement ENDLOOP SEMICOLON
 ^^^^
core2.y:85.28-37: warning: nonterminal useless in grammar: comparison [-Wother]
 ifstatement	:	IF comparison THEN statement ENDIF SEMICOLON
                            ^^^^^^^^^^
core2.y:90.32-38: warning: nonterminal useless in grammar: operand [-Wother]
 comparison	:	LPAREN operand RELOP operand RPAREN
                                ^^^^^^^
core2.y:85.25-68: warning: rule useless in grammar [-Wother]
 ifstatement	:	IF comparison THEN statement ENDIF SEMICOLON
                         ^^^^^^^^^^^^^^^^^^^^^^^^^^^^^^^^^^^^^^^^^^^^
core2.y:86.17-75: warning: rule useless in grammar [-Wother]
 	|	IF comparison THEN statement ELSE statement ENDIF SEMICOLON
                 ^^^^^^^^^^^^^^^^^^^^^^^^^^^^^^^^^^^^^^^^^^^^^^^^^^^^^^^^^^^
core2.y:88.17-65: warning: rule useless in grammar [-Wother]
 loop	:	WHILE comparison LOOP statement ENDLOOP SEMICOLON
                 ^^^^^^^^^^^^^^^^^^^^^^^^^^^^^^^^^^^^^^^^^^^^^^^^^
core2.y:90.25-59: warning: rule useless in grammar [-Wother]
 comparison	:	LPAREN operand RELOP operand RPAREN
                         ^^^^^^^^^^^^^^^^^^^^^^^^^^^^^^^^^^^
core2.y:92.17-21: warning: rule useless in grammar [-Wother]
 operand	:	value
                 ^^^^^
core2.y:93.17-18: warning: rule useless in grammar [-Wother]
 	|	ID
                 ^^
core2.y:94.17-20: warning: rule useless in grammar [-Wother]
 	|	expr
                 ^^^^
cc    -c -o core2.tab.o core2.tab.c
core2.y:11:1: warning: data definition has no type or storage class
 yydebug=1;
 ^
core2.y:11:1: warning: type defaults to ‘int’ in declaration of ‘yydebug’ [-Wimplicit-int]
core2.y:16:21: warning: ISO C99 requires whitespace after the macro name
 #define INTEGER_TYPE;
                     ^
core2.y:24:15: error: expected specifier-qualifier-list before ‘=’ token
  INTEGER_TYPE = 1000;
               ^
core2.tab.c: In function ‘yyparse’:
core2.tab.c:1228:16: warning: implicit declaration of function ‘yylex’ [-Wimplicit-function-declaration]
       yychar = yylex ();
                ^
core2.y:61:19: error: ‘struct nlist’ has no member named ‘type’
 declaration : type COLON idlist SEMICOLON NEWLINE declaration {yylval.place -> type = INTEGER_TYPE;}
                   ^
core2.y:16:21: error: expected expression before ‘;’ token
 #define INTEGER_TYPE;
                     ^
core2.y:61:29: note: in expansion of macro ‘INTEGER_TYPE’
 declaration : type COLON idlist SEMICOLON NEWLINE declaration {yylval.place -> type = INTEGER_TYPE;}
                             ^
core2.tab.c:1372:7: warning: implicit declaration of function ‘yyerror’ [-Wimplicit-function-declaration]
       yyerror (YY_("syntax error"));
       ^
<builtin>: recipe for target 'core2.tab.o' failed
make: *** [core2.tab.o] Error 1
Return To 'WorkingDirectory' directory
 
COMPILING COMPLETE
 
