<svg
        viewBox="0 0 22 22"
        fill="none"
        xmlns="http://www.w3.org/2000/svg"
>
    <path fill-rule="evenodd" clip-rule="evenodd" d="M11 21C16.5228 21 21 16.5228 21 11C21 5.47715 16.5228 1 11 1C5.47715 1 1 5.47715 1 11C1 16.5228 5.47715 21 11 21Z" fill="white" stroke="#A7A7A7"/>
    <path fill-rule="evenodd" fill="white" clip-rule="evenodd" d="M5.82751 13.4138C6.97017 13.4138 7.89648 12.4875 7.89648 11.3448C7.89648 10.2022 6.97017 9.27585 5.82751 9.27585C4.68485 9.27585 3.75854 10.2022 3.75854 11.3448C3.75854 12.4875 4.68485 13.4138 5.82751 13.4138Z" stroke="#A7A7A7"/>
    <path fill-rule="evenodd" fill="white" clip-rule="evenodd" d="M11.3448 18.2414C12.4875 18.2414 13.4138 17.3151 13.4138 16.1724C13.4138 15.0298 12.4875 14.1035 11.3448 14.1035C10.2022 14.1035 9.27588 15.0298 9.27588 16.1724C9.27588 17.3151 10.2022 18.2414 11.3448 18.2414Z" stroke="#A7A7A7"/>
    <path fill-rule="evenodd" fill="white" clip-rule="evenodd" d="M11.3448 7.89654C12.4875 7.89654 13.4138 6.97023 13.4138 5.82757C13.4138 4.68491 12.4875 3.75861 11.3448 3.75861C10.2022 3.75861 9.27588 4.68491 9.27588 5.82757C9.27588 6.97023 10.2022 7.89654 11.3448 7.89654Z" stroke="#A7A7A7"/>
    <path d="M13.0689 4.10343L9.2602 7.91218" stroke="#A7A7A7" stroke-linecap="square"/>
    <path d="M10.3104 15.1379L12.7487 17.5762" stroke="#A7A7A7" stroke-linecap="square"/>
    <path d="M12.3793 15.1379L9.94103 17.5762" stroke="#A7A7A7" stroke-linecap="square"/>
    <path fill-rule="evenodd" fill="white" clip-rule="evenodd" d="M16.1725 13.4138C17.3151 13.4138 18.2414 12.4875 18.2414 11.3448C18.2414 10.2022 17.3151 9.27585 16.1725 9.27585C15.0298 9.27585 14.1035 10.2022 14.1035 11.3448C14.1035 12.4875 15.0298 13.4138 16.1725 13.4138Z" stroke="#A7A7A7"/>
    <path d="M10.3104 4.7931L12.3794 6.86207" stroke="#A7A7A7" stroke-linecap="square"/>
</svg>
