<svg viewBox="0 0 24 24" fill="none" xmlns="http://www.w3.org/2000/svg">
    <path d="M5.65045 8.86748V4.39415C5.65045 3.24794 6.57964 2.31876 7.72585 2.31876H13.7477C14.2687 2.31876 14.7707 2.51474 15.1539 2.86778L18.8172 6.2428C19.2438 6.63575 19.4864 7.18923 19.4864 7.76917V18.2301C19.4864 19.3763 18.5572 20.3055 17.411 20.3055H7.72585C6.57964 20.3055 5.65045 19.3763 5.65045 18.2301V17.1182V8.86748Z" stroke="white" stroke-width="1.3" stroke-linecap="round" stroke-linejoin="round"/>
    <path d="M8.5835 9.71671L16.9426 9.71671V16.3732H8.5835V9.71671Z" stroke="white" stroke-width="1.3" stroke-linecap="round" stroke-linejoin="round"/>
    <path d="M8.75586 13.1347H16.7969" stroke="white" stroke-width="1.3" stroke-linecap="round" stroke-linejoin="round"/>
    <path d="M12.7433 10.6767V15.3336" stroke="white" stroke-width="1.3" stroke-linecap="round" stroke-linejoin="round"/>
</svg>
