<svg viewBox="0 0 24 25" fill="none" xmlns="http://www.w3.org/2000/svg">
    <path d="M19.4926 15.7679V18.5068C19.4926 19.2507 18.8422 19.8534 18.04 19.8534H5.45266C4.65042 19.8534 4 19.2507 4 18.5068V5.84658C4 5.10268 4.65042 4.5 5.45266 4.5H18.04C18.8422 4.5 19.4926 5.10268 19.4926 5.84658V8.92496" stroke="white" stroke-width="1.5" stroke-linecap="round" stroke-linejoin="round"/>
    <path fill-rule="evenodd" clip-rule="evenodd" d="M20.1953 15.4383H15.9514C14.1785 15.4383 12.7417 14.0016 12.7417 12.2287C12.7417 10.4558 14.1785 9.01904 15.9514 9.01904H20.1953C20.6634 9.01904 21.0426 9.39829 21.0426 9.86637V14.5904C21.0426 15.0591 20.6634 15.4383 20.1953 15.4383Z" stroke="white" stroke-width="1.5" stroke-linecap="round" stroke-linejoin="round"/>
    <path d="M4 7.25582H8.04903" stroke="white" stroke-width="1.5" stroke-linecap="round" stroke-linejoin="round"/>
    <path d="M4 17.1181H8.04903" stroke="white" stroke-width="1.5" stroke-linecap="round" stroke-linejoin="round"/>
    <path fill-rule="evenodd" clip-rule="evenodd" d="M17.1419 12.2284C17.1419 12.778 16.6963 13.2229 16.1474 13.2229C15.5977 13.2229 15.1528 12.778 15.1528 12.2284C15.1528 11.6794 15.5977 11.2339 16.1474 11.2339C16.6963 11.2339 17.1419 11.6794 17.1419 12.2284Z" fill="white"/>
</svg>
