<svg viewBox="0 -7 32 32" xmlns="http://www.w3.org/2000/svg">
    <path d="M31.3086 16.2466C31.2684 16.1661 31.234 16.0972 31.1995 16.0397C30.6543 15.0568 29.6097 13.8439 28.0715 12.4127L28.0371 12.3782L28.0199 12.3609L28.0027 12.3437H27.9855C27.2852 11.6769 26.8433 11.2285 26.6596 10.9986C26.321 10.5618 26.2464 10.1192 26.4301 9.67082C26.5621 9.33168 27.0557 8.61317 27.9051 7.52104C28.3528 6.94048 28.7086 6.47489 28.9726 6.12426C30.8609 3.6066 31.6816 1.99714 31.4291 1.30162L31.3315 1.14067C31.2684 1.04296 31.0962 0.950987 30.8265 0.870514C30.551 0.790041 30.2009 0.772797 29.7762 0.830278L25.0583 0.864766C24.9837 0.836026 24.8747 0.841774 24.7312 0.870514C24.5877 0.905003 24.5188 0.922247 24.5188 0.922247L24.4385 0.962483L24.3754 1.01422C24.318 1.0487 24.2606 1.10619 24.1974 1.18666C24.1343 1.26713 24.0769 1.36485 24.0367 1.47406C23.5202 2.79612 22.9405 4.02621 22.2805 5.16433C21.8787 5.8426 21.5056 6.4289 21.167 6.92899C20.8284 7.42907 20.5472 7.7912 20.3176 8.02687C20.088 8.26254 19.8814 8.45223 19.692 8.59018C19.5083 8.73388 19.3648 8.79136 19.2673 8.76837C19.1697 8.74538 19.0779 8.72239 18.986 8.70514C18.8311 8.60743 18.7105 8.47522 18.6187 8.30278C18.5269 8.13033 18.4637 7.91766 18.4293 7.66474C18.3949 7.40608 18.3776 7.18765 18.3719 6.99796C18.3662 6.81403 18.3719 6.54961 18.3776 6.21048C18.3891 5.87134 18.3949 5.64142 18.3949 5.52071C18.3949 5.10685 18.4006 4.65275 18.4178 4.16416C18.435 3.67558 18.4465 3.29045 18.458 3.0088C18.4695 2.72714 18.4752 2.42249 18.4752 2.10635C18.4752 1.79021 18.458 1.54304 18.4178 1.3591C18.3776 1.18091 18.3203 1.00272 18.2456 0.836026C18.171 0.669332 18.0562 0.537126 17.907 0.439409C17.7578 0.347439 17.5741 0.272714 17.356 0.215234C16.7763 0.0830278 16.0417 0.0140509 15.1464 0.0025547C13.1146 -0.0204376 11.8117 0.111768 11.2321 0.399172C11.0025 0.519882 10.7959 0.680828 10.6122 0.893507C10.4171 1.13493 10.3884 1.26713 10.5319 1.29012C11.1861 1.38784 11.651 1.62351 11.9265 1.99714L12.0241 2.19257C12.0987 2.33627 12.1791 2.58919 12.2537 2.94557C12.3283 3.3077 12.3799 3.70432 12.4029 4.14117C12.4546 4.94015 12.4546 5.62417 12.4029 6.19323C12.3455 6.76229 12.2939 7.20489 12.2479 7.52104C12.1963 7.83718 12.1274 8.09585 12.0241 8.29128C11.9265 8.48672 11.8577 8.60742 11.829 8.65341C11.7945 8.69939 11.7716 8.72239 11.7486 8.73388C11.6051 8.78562 11.4616 8.81436 11.3067 8.81436C11.1517 8.81436 10.968 8.73963 10.7499 8.58443C10.5319 8.42923 10.3023 8.2223 10.0727 7.95214C9.83738 7.68198 9.57337 7.30836 9.27492 6.82552C8.98221 6.34268 8.67228 5.77362 8.35661 5.11834L8.09259 4.64125C7.92615 4.3366 7.70231 3.88825 7.42108 3.30195C7.13411 2.71565 6.88731 2.15234 6.66922 1.60052C6.58312 1.3706 6.45112 1.19815 6.2732 1.07745L6.19284 1.02571C6.14119 0.979728 6.04936 0.933743 5.92883 0.887759C5.8083 0.836026 5.68203 0.801537 5.55003 0.778545L1.06179 0.813034C0.60264 0.813034 0.292711 0.916499 0.126267 1.12343L0.0631337 1.22115C0.0172183 1.29587 0 1.38209 0 1.5028C0 1.62351 0.0344366 1.77296 0.0975703 1.9454C0.751865 3.49164 1.46929 4.97464 2.23838 6.41166C3.00746 7.84868 3.67897 8.99829 4.24718 9.872C4.81538 10.7457 5.39506 11.5734 5.98622 12.3494C6.57738 13.1254 6.96767 13.6255 7.15707 13.8439C7.34647 14.0624 7.50143 14.229 7.61048 14.3383L8.01798 14.7349C8.28199 14.9993 8.66654 15.3097 9.17161 15.6776C9.68242 16.0454 10.2449 16.4076 10.859 16.7639C11.4789 17.1203 12.1963 17.4077 13.0113 17.6319C13.832 17.8561 14.6298 17.948 15.4046 17.9021H17.2872C17.6717 17.8676 17.9587 17.7469 18.1538 17.5399L18.2169 17.4595C18.2629 17.3962 18.303 17.2928 18.3375 17.1548C18.3776 17.0169 18.3949 16.8674 18.3949 16.7007C18.3834 16.2294 18.4178 15.804 18.5039 15.4304C18.5843 15.051 18.6761 14.7694 18.7851 14.5797C18.8885 14.39 19.009 14.229 19.1353 14.0968C19.2673 13.9646 19.3591 13.8842 19.4165 13.8612C19.4681 13.8324 19.5141 13.8152 19.5485 13.8037C19.8125 13.7175 20.1167 13.8037 20.4725 14.0566C20.8284 14.3153 21.1613 14.6314 21.4712 15.0108C21.7811 15.3902 22.1542 15.8098 22.5961 16.2811C23.0323 16.7525 23.4169 17.1031 23.744 17.333L24.0712 17.5284C24.2893 17.6606 24.5762 17.7814 24.9263 17.8906C25.2764 17.9998 25.5806 18.0285 25.8446 17.971L30.0402 17.9078C30.4534 17.9078 30.7806 17.8388 31.0044 17.7009C31.234 17.5629 31.3717 17.4135 31.4119 17.2468C31.4578 17.0801 31.4578 16.8962 31.4176 16.6892C31.3832 16.4765 31.343 16.3328 31.3086 16.2466Z"/>
</svg>
