<svg viewBox="0 0 15 15" xmlns="http://www.w3.org/2000/svg">
    <path d="M8.73529 7.5L14.7353 1.5C15.0882 1.14706 15.0882 0.617647 14.7353 0.264706C14.3824 -0.0882353 13.8529 -0.0882353 13.5 0.264706L7.5 6.26471L1.5 0.264706C1.14706 -0.0882353 0.617647 -0.0882353 0.264706 0.264706C-0.0882353 0.617647 -0.0882353 1.14706 0.264706 1.5L6.26471 7.5L0.264706 13.5C-0.0882353 13.8529 -0.0882353 14.3824 0.264706 14.7353C0.441176 14.9118 0.617647 15 0.882353 15C1.14706 15 1.32353 14.9118 1.5 14.7353L7.5 8.73529L13.5 14.7353C13.6765 14.9118 13.9412 15 14.1176 15C14.2941 15 14.5588 14.9118 14.7353 14.7353C15.0882 14.3824 15.0882 13.8529 14.7353 13.5L8.73529 7.5Z"/>
</svg>
