<svg viewBox="0 0 36 36" xmlns="http://www.w3.org/2000/svg">
    <path d="M18 0C8.1 0 0 8.1 0 18C0 27.9 8.1 36 18 36C27.9 36 36 27.9 36 18C36 8.1 27.9 0 18 0ZM28.1 19H19.1V28C19.1 28.6 18.7 29 18.1 29C17.5 29 17.1 28.6 17.1 28V19H8.1C7.5 19 7.1 18.6 7.1 18C7.1 17.4 7.5 17 8.1 17H17.1V8C17.1 7.4 17.5 7 18.1 7C18.7 7 19.1 7.4 19.1 8V17H28.1C28.7 17 29.1 17.4 29.1 18C29.1 18.6 28.6 19 28.1 19Z"/>
</svg>
