<svg viewBox="0 0 15.6 18" xmlns="http://www.w3.org/2000/svg">
    <path fill-rule="evenodd" clip-rule="evenodd" d="M13.9765 1.8H13.1029V0H11.3559V1.8H4.36765V0H2.62059V1.8H1.74706C0.777441 1.8 0.0087353 2.61 0.0087353 3.6L0 16.2C0 17.19 0.777441 18 1.74706 18H13.9765C14.9374 18 15.7235 17.19 15.7235 16.2V3.6C15.7235 2.61 14.9374 1.8 13.9765 1.8ZM5.24116 8.10005H3.49411V9.90005H5.24116V8.10005ZM8.7353 8.10005H6.98824V9.90005H8.7353V8.10005ZM10.4823 8.10005H12.2294V9.90005H10.4823V8.10005ZM1.74705 16.2H13.9765V6.3H1.74705V16.2Z"/>
</svg>
