G75*
%MOIN*%
%OFA0B0*%
%FSLAX25Y25*%
%IPPOS*%
%LPD*%
%AMOC8*
5,1,8,0,0,1.08239X$1,22.5*
%
%ADD10OC8,0.05600*%
%ADD11C,0.06000*%
%ADD12R,0.11811X0.05512*%
%ADD13R,0.08661X0.05512*%
%ADD14C,0.05600*%
%ADD15OC8,0.05000*%
%ADD16C,0.04000*%
%ADD17OC8,0.04000*%
%ADD18C,0.02400*%
%ADD19OC8,0.03175*%
%ADD20C,0.03200*%
%ADD21C,0.05000*%
%ADD22C,0.01600*%
%ADD23OC8,0.02781*%
%ADD24OC8,0.03569*%
D10*
X0077420Y0049920D03*
X0091288Y0119595D03*
X0101288Y0119595D03*
X0111170Y0122420D03*
X0101288Y0129595D03*
X0091288Y0129595D03*
X0091288Y0139595D03*
X0101288Y0139595D03*
X0101288Y0149595D03*
X0091288Y0149595D03*
X0091288Y0159595D03*
X0101288Y0159595D03*
X0168670Y0122420D03*
X0177902Y0139595D03*
X0177902Y0149595D03*
X0177902Y0159595D03*
X0187902Y0159595D03*
X0187902Y0149595D03*
X0187902Y0139595D03*
X0202420Y0049920D03*
X0218801Y0229920D03*
X0060390Y0229920D03*
D11*
X0134920Y0204170D02*
X0134920Y0198170D01*
X0144920Y0198170D02*
X0144920Y0204170D01*
X0154920Y0204170D02*
X0154920Y0198170D01*
D12*
X0169221Y0104920D03*
X0188119Y0104920D03*
D13*
X0111219Y0089920D03*
X0098621Y0089920D03*
D14*
X0111170Y0089920D02*
X0111170Y0083670D01*
X0077420Y0049920D01*
X0111170Y0089920D02*
X0111170Y0097420D01*
X0111170Y0122420D01*
X0105845Y0129595D02*
X0101288Y0129595D01*
X0091288Y0129595D01*
X0101288Y0129595D02*
X0101288Y0119595D01*
X0105845Y0129595D02*
X0111170Y0134920D01*
X0111170Y0152420D01*
X0111170Y0162420D01*
X0131170Y0182420D01*
X0147420Y0182420D01*
X0168670Y0161170D01*
X0168670Y0159595D01*
X0168670Y0134920D01*
X0188119Y0115471D01*
X0188119Y0112420D01*
X0188119Y0104920D01*
X0169221Y0104920D02*
X0168670Y0104920D01*
X0168670Y0083670D01*
X0202420Y0049920D01*
X0168670Y0104920D02*
X0168670Y0122420D01*
X0168670Y0159595D02*
X0177902Y0159595D01*
X0218801Y0229920D02*
X0066170Y0229920D01*
X0066170Y0164920D01*
X0069920Y0161170D01*
X0081170Y0149920D01*
X0081170Y0144920D01*
X0086495Y0139595D01*
X0091288Y0139595D01*
X0101288Y0139595D01*
X0101288Y0149595D01*
X0101288Y0159595D01*
X0111170Y0089920D02*
X0111219Y0089920D01*
X0066170Y0229920D02*
X0060390Y0229920D01*
D15*
X0111170Y0152420D03*
X0108670Y0098045D03*
D16*
X0176170Y0087420D02*
X0183670Y0094920D01*
X0218670Y0094920D01*
X0218680Y0112420D02*
X0188119Y0112420D01*
X0188119Y0104920D02*
X0188119Y0101170D01*
X0158670Y0182420D02*
X0149920Y0191170D01*
X0139920Y0191170D01*
X0134920Y0196170D01*
X0134920Y0201170D01*
D17*
X0158670Y0182420D03*
X0218680Y0112420D03*
X0218670Y0094920D03*
X0188119Y0101170D03*
X0176170Y0087420D03*
D18*
X0111170Y0162420D02*
X0108670Y0162420D01*
X0098670Y0172420D01*
X0098670Y0184920D01*
X0069930Y0149920D02*
X0069920Y0149920D01*
X0069930Y0149920D02*
X0069930Y0143660D01*
X0083995Y0129595D01*
X0091288Y0129595D01*
D19*
X0069920Y0149920D03*
X0069920Y0161170D03*
X0098670Y0184920D03*
X0192774Y0168322D03*
X0218670Y0168322D03*
X0214920Y0141519D03*
D20*
X0205822Y0132420D01*
X0183670Y0132420D01*
X0177902Y0138188D01*
X0177902Y0139595D01*
X0192774Y0168322D02*
X0218670Y0168322D01*
X0167420Y0178848D02*
X0164920Y0176348D01*
X0167420Y0178848D02*
X0167420Y0196170D01*
X0128680Y0221180D02*
X0104920Y0197420D01*
X0104920Y0174270D01*
D21*
X0091288Y0119595D02*
X0091288Y0116052D01*
X0098621Y0108719D01*
X0098621Y0089920D01*
X0108670Y0098045D02*
X0111170Y0098045D01*
X0111170Y0097420D01*
D22*
X0048893Y0048893D02*
X0046531Y0051855D01*
X0044888Y0055268D01*
X0044045Y0058961D01*
X0043939Y0060855D01*
X0043939Y0218335D01*
X0044045Y0220229D01*
X0044888Y0223923D01*
X0046531Y0227336D01*
X0048893Y0230297D01*
X0051855Y0232659D01*
X0055268Y0234303D01*
X0058961Y0235146D01*
X0060855Y0235252D01*
X0218335Y0235252D01*
X0220229Y0235146D01*
X0223923Y0234303D01*
X0227336Y0232659D01*
X0230297Y0230297D01*
X0232659Y0227336D01*
X0234303Y0223923D01*
X0235146Y0220229D01*
X0235252Y0218335D01*
X0235252Y0060855D01*
X0235146Y0058961D01*
X0234303Y0055268D01*
X0232659Y0051855D01*
X0230297Y0048893D01*
X0227336Y0046531D01*
X0223923Y0044888D01*
X0220229Y0044045D01*
X0218335Y0043939D01*
X0217785Y0043939D01*
X0060855Y0043939D01*
X0058961Y0044045D01*
X0055268Y0044888D01*
X0051855Y0046531D01*
X0048893Y0048893D01*
X0048679Y0049163D02*
X0230512Y0049163D01*
X0231787Y0050761D02*
X0047404Y0050761D01*
X0046288Y0052360D02*
X0232902Y0052360D01*
X0233672Y0053958D02*
X0143357Y0053958D01*
X0143505Y0054019D02*
X0145447Y0055961D01*
X0146498Y0058498D01*
X0146498Y0061244D01*
X0145447Y0063781D01*
X0143505Y0065722D01*
X0140968Y0066773D01*
X0138222Y0066773D01*
X0135685Y0065722D01*
X0133744Y0063781D01*
X0132693Y0061244D01*
X0132693Y0058498D01*
X0133744Y0055961D01*
X0135685Y0054019D01*
X0138222Y0052969D01*
X0140968Y0052969D01*
X0143505Y0054019D01*
X0145042Y0055557D02*
X0234369Y0055557D01*
X0234733Y0057155D02*
X0145941Y0057155D01*
X0146498Y0058754D02*
X0235098Y0058754D01*
X0235224Y0060352D02*
X0146498Y0060352D01*
X0146205Y0061951D02*
X0235252Y0061951D01*
X0235252Y0063549D02*
X0145543Y0063549D01*
X0144080Y0065148D02*
X0235252Y0065148D01*
X0235252Y0066746D02*
X0141033Y0066746D01*
X0138157Y0066746D02*
X0043939Y0066746D01*
X0043939Y0065148D02*
X0135111Y0065148D01*
X0133648Y0063549D02*
X0043939Y0063549D01*
X0043939Y0061951D02*
X0132986Y0061951D01*
X0132693Y0060352D02*
X0043967Y0060352D01*
X0044092Y0058754D02*
X0132693Y0058754D01*
X0133249Y0057155D02*
X0044457Y0057155D01*
X0044822Y0055557D02*
X0134148Y0055557D01*
X0135833Y0053958D02*
X0045519Y0053958D01*
X0050560Y0047564D02*
X0228630Y0047564D01*
X0226161Y0045966D02*
X0053030Y0045966D01*
X0057550Y0044367D02*
X0221641Y0044367D01*
X0235252Y0068345D02*
X0043939Y0068345D01*
X0043939Y0069943D02*
X0235252Y0069943D01*
X0235252Y0071542D02*
X0043939Y0071542D01*
X0043939Y0073140D02*
X0077450Y0073140D01*
X0078401Y0072591D02*
X0075974Y0073993D01*
X0073993Y0075974D01*
X0072591Y0078401D01*
X0071866Y0081108D01*
X0071866Y0083910D01*
X0072591Y0086617D01*
X0073993Y0089043D01*
X0075974Y0091025D01*
X0078401Y0092426D01*
X0081108Y0093151D01*
X0083910Y0093151D01*
X0086617Y0092426D01*
X0089043Y0091025D01*
X0091025Y0089043D01*
X0091890Y0087544D01*
X0091890Y0093153D01*
X0092256Y0094035D01*
X0092931Y0094711D01*
X0093721Y0095038D01*
X0093721Y0106690D01*
X0088513Y0111898D01*
X0087134Y0113276D01*
X0086388Y0115077D01*
X0086388Y0117141D01*
X0086088Y0117441D01*
X0086088Y0121749D01*
X0088934Y0124595D01*
X0088343Y0125187D01*
X0088343Y0125187D01*
X0087534Y0125995D01*
X0083279Y0125995D01*
X0081956Y0126543D01*
X0067891Y0140608D01*
X0066878Y0141621D01*
X0066330Y0142944D01*
X0066330Y0147871D01*
X0065933Y0148268D01*
X0065933Y0151572D01*
X0068268Y0153907D01*
X0071572Y0153907D01*
X0073907Y0151572D01*
X0073907Y0148268D01*
X0073530Y0147891D01*
X0073530Y0145151D01*
X0085486Y0133195D01*
X0087534Y0133195D01*
X0088343Y0134004D01*
X0088343Y0134004D01*
X0089134Y0134795D01*
X0103691Y0134795D01*
X0105970Y0137074D01*
X0105970Y0160029D01*
X0105888Y0160111D01*
X0105888Y0159695D01*
X0101388Y0159695D01*
X0101388Y0159495D01*
X0101388Y0154995D01*
X0103194Y0154995D01*
X0105888Y0157690D01*
X0105888Y0159495D01*
X0101388Y0159495D01*
X0101188Y0159495D01*
X0101188Y0154995D01*
X0099383Y0154995D01*
X0096688Y0157690D01*
X0096688Y0159495D01*
X0101188Y0159495D01*
X0101188Y0159695D01*
X0096688Y0159695D01*
X0096688Y0161501D01*
X0099383Y0164195D01*
X0101188Y0164195D01*
X0101188Y0159695D01*
X0101388Y0159695D01*
X0101388Y0164195D01*
X0101804Y0164195D01*
X0095618Y0170381D01*
X0095070Y0171704D01*
X0095070Y0182881D01*
X0094683Y0183268D01*
X0094683Y0186572D01*
X0097018Y0188907D01*
X0100322Y0188907D01*
X0100920Y0188309D01*
X0100920Y0198216D01*
X0101529Y0199686D01*
X0124496Y0222653D01*
X0124496Y0222913D01*
X0126947Y0225364D01*
X0130413Y0225364D01*
X0132864Y0222913D01*
X0132864Y0219447D01*
X0130413Y0216996D01*
X0130153Y0216996D01*
X0108920Y0195763D01*
X0108920Y0176188D01*
X0109104Y0176004D01*
X0109104Y0172537D01*
X0106653Y0170086D01*
X0106095Y0170086D01*
X0108789Y0167393D01*
X0126762Y0185366D01*
X0128225Y0186828D01*
X0130136Y0187620D01*
X0148454Y0187620D01*
X0150366Y0186828D01*
X0160736Y0176458D01*
X0160736Y0178081D01*
X0163187Y0180533D01*
X0163420Y0180533D01*
X0163420Y0194253D01*
X0163236Y0194437D01*
X0163236Y0197903D01*
X0163303Y0197970D01*
X0160320Y0197970D01*
X0160320Y0197096D01*
X0159498Y0195111D01*
X0157979Y0193592D01*
X0155994Y0192770D01*
X0153846Y0192770D01*
X0151861Y0193592D01*
X0150342Y0195111D01*
X0149920Y0196130D01*
X0149498Y0195111D01*
X0147979Y0193592D01*
X0145994Y0192770D01*
X0143846Y0192770D01*
X0141861Y0193592D01*
X0140342Y0195111D01*
X0139575Y0196963D01*
X0139368Y0196328D01*
X0139025Y0195654D01*
X0138581Y0195043D01*
X0138047Y0194509D01*
X0137436Y0194065D01*
X0136763Y0193722D01*
X0136044Y0193488D01*
X0135298Y0193370D01*
X0135120Y0193370D01*
X0135120Y0200970D01*
X0134720Y0200970D01*
X0134720Y0193370D01*
X0134542Y0193370D01*
X0133796Y0193488D01*
X0133078Y0193722D01*
X0132404Y0194065D01*
X0131793Y0194509D01*
X0131259Y0195043D01*
X0130815Y0195654D01*
X0130472Y0196328D01*
X0130238Y0197046D01*
X0130120Y0197792D01*
X0130120Y0200970D01*
X0134720Y0200970D01*
X0134720Y0201370D01*
X0130120Y0201370D01*
X0130120Y0204548D01*
X0130238Y0205294D01*
X0130472Y0206013D01*
X0130815Y0206686D01*
X0131259Y0207297D01*
X0131793Y0207831D01*
X0132404Y0208275D01*
X0133078Y0208618D01*
X0133796Y0208852D01*
X0134542Y0208970D01*
X0134720Y0208970D01*
X0134720Y0201370D01*
X0135120Y0201370D01*
X0135120Y0208970D01*
X0135298Y0208970D01*
X0136044Y0208852D01*
X0136763Y0208618D01*
X0137436Y0208275D01*
X0138047Y0207831D01*
X0138581Y0207297D01*
X0139025Y0206686D01*
X0139368Y0206013D01*
X0139575Y0205377D01*
X0140342Y0207229D01*
X0141861Y0208748D01*
X0143846Y0209570D01*
X0145994Y0209570D01*
X0147979Y0208748D01*
X0149498Y0207229D01*
X0149920Y0206210D01*
X0150342Y0207229D01*
X0151861Y0208748D01*
X0153846Y0209570D01*
X0155994Y0209570D01*
X0157979Y0208748D01*
X0159498Y0207229D01*
X0160320Y0205244D01*
X0160320Y0204370D01*
X0170557Y0204370D01*
X0171733Y0203883D01*
X0172633Y0202983D01*
X0175133Y0200483D01*
X0175620Y0199307D01*
X0175620Y0185478D01*
X0185615Y0175483D01*
X0186102Y0174307D01*
X0186102Y0164795D01*
X0190056Y0164795D01*
X0193102Y0161749D01*
X0193102Y0157441D01*
X0190256Y0154595D01*
X0191413Y0153438D01*
X0197970Y0159996D01*
X0197970Y0161509D01*
X0197380Y0162100D01*
X0197380Y0164322D01*
X0191978Y0164322D01*
X0191948Y0164334D01*
X0191123Y0164334D01*
X0190539Y0164918D01*
X0190508Y0164931D01*
X0189383Y0166056D01*
X0189371Y0166086D01*
X0188787Y0166670D01*
X0188787Y0167496D01*
X0188774Y0167526D01*
X0188774Y0169117D01*
X0188787Y0169148D01*
X0188787Y0169973D01*
X0189371Y0170557D01*
X0189383Y0170587D01*
X0190508Y0171713D01*
X0190539Y0171725D01*
X0191123Y0172309D01*
X0191948Y0172309D01*
X0191978Y0172322D01*
X0219466Y0172322D01*
X0219496Y0172309D01*
X0220322Y0172309D01*
X0220905Y0171725D01*
X0220936Y0171713D01*
X0222061Y0170587D01*
X0222074Y0170557D01*
X0222657Y0169973D01*
X0222657Y0169148D01*
X0222670Y0169117D01*
X0222670Y0167526D01*
X0222657Y0167496D01*
X0222657Y0166670D01*
X0222074Y0166086D01*
X0222061Y0166056D01*
X0220936Y0164931D01*
X0220905Y0164918D01*
X0220322Y0164334D01*
X0219496Y0164334D01*
X0219466Y0164322D01*
X0209961Y0164322D01*
X0209961Y0162100D01*
X0209370Y0161509D01*
X0209370Y0157496D01*
X0225655Y0141211D01*
X0226490Y0141211D01*
X0228711Y0138990D01*
X0228711Y0135850D01*
X0226490Y0133630D01*
X0223350Y0133630D01*
X0221130Y0135850D01*
X0221130Y0136685D01*
X0203457Y0154357D01*
X0202970Y0155534D01*
X0202970Y0155945D01*
X0194821Y0147795D01*
X0197435Y0147795D01*
X0199600Y0149961D01*
X0202740Y0149961D01*
X0204961Y0147740D01*
X0204961Y0144600D01*
X0202740Y0142380D01*
X0201905Y0142380D01*
X0201408Y0141882D01*
X0200232Y0141395D01*
X0193102Y0141395D01*
X0193102Y0137441D01*
X0190056Y0134395D01*
X0185748Y0134395D01*
X0182702Y0137441D01*
X0182702Y0141749D01*
X0182972Y0142018D01*
X0180325Y0144664D01*
X0180056Y0144395D01*
X0175748Y0144395D01*
X0173870Y0146274D01*
X0173870Y0142068D01*
X0175997Y0144195D01*
X0177802Y0144195D01*
X0177802Y0139695D01*
X0178002Y0139695D01*
X0178002Y0144195D01*
X0179808Y0144195D01*
X0182502Y0141501D01*
X0182502Y0139695D01*
X0178002Y0139695D01*
X0178002Y0139495D01*
X0178002Y0134995D01*
X0179808Y0134995D01*
X0182502Y0137690D01*
X0182502Y0139495D01*
X0178002Y0139495D01*
X0177802Y0139495D01*
X0177802Y0134995D01*
X0175997Y0134995D01*
X0173870Y0137122D01*
X0173870Y0137074D01*
X0191064Y0119880D01*
X0191064Y0119880D01*
X0192527Y0118417D01*
X0193189Y0116820D01*
X0220502Y0116820D01*
X0221172Y0116150D01*
X0221172Y0116150D01*
X0222410Y0114912D01*
X0222410Y0114912D01*
X0223080Y0114243D01*
X0223080Y0110598D01*
X0222410Y0109928D01*
X0222410Y0109928D01*
X0221172Y0108690D01*
X0221172Y0108690D01*
X0220502Y0108020D01*
X0196424Y0108020D01*
X0196424Y0101687D01*
X0196059Y0100805D01*
X0195384Y0100130D01*
X0194502Y0099764D01*
X0192519Y0099764D01*
X0192519Y0099348D01*
X0192491Y0099320D01*
X0220493Y0099320D01*
X0221162Y0098650D01*
X0221162Y0098650D01*
X0222400Y0097412D01*
X0222400Y0097412D01*
X0223070Y0096743D01*
X0223070Y0093098D01*
X0222400Y0092428D01*
X0222400Y0092428D01*
X0221162Y0091190D01*
X0221162Y0091190D01*
X0220493Y0090520D01*
X0203721Y0090520D01*
X0205198Y0089043D01*
X0206599Y0086617D01*
X0207324Y0083910D01*
X0207324Y0081108D01*
X0206599Y0078401D01*
X0205198Y0075974D01*
X0203217Y0073993D01*
X0200790Y0072591D01*
X0198083Y0071866D01*
X0195281Y0071866D01*
X0192574Y0072591D01*
X0190147Y0073993D01*
X0188166Y0075974D01*
X0186765Y0078401D01*
X0186039Y0081108D01*
X0186039Y0083910D01*
X0186765Y0086617D01*
X0188166Y0089043D01*
X0189643Y0090520D01*
X0185493Y0090520D01*
X0178662Y0083690D01*
X0178662Y0083690D01*
X0177993Y0083020D01*
X0174348Y0083020D01*
X0173678Y0083690D01*
X0173678Y0083690D01*
X0172440Y0084928D01*
X0172440Y0084928D01*
X0171770Y0085598D01*
X0171770Y0089243D01*
X0172440Y0089912D01*
X0172440Y0089912D01*
X0179940Y0097412D01*
X0181178Y0098650D01*
X0182795Y0099320D01*
X0183746Y0099320D01*
X0183719Y0099348D01*
X0183719Y0099764D01*
X0181736Y0099764D01*
X0180854Y0100130D01*
X0180179Y0100805D01*
X0179813Y0101687D01*
X0179813Y0108153D01*
X0180179Y0109035D01*
X0180854Y0109711D01*
X0181736Y0110076D01*
X0182919Y0110076D01*
X0182919Y0113317D01*
X0164262Y0131975D01*
X0164015Y0132571D01*
X0163595Y0130789D01*
X0163595Y0130789D01*
X0160810Y0125330D01*
X0160810Y0125330D01*
X0156807Y0120691D01*
X0156807Y0120691D01*
X0155958Y0120087D01*
X0156075Y0119719D01*
X0156075Y0119719D01*
X0156172Y0114905D01*
X0156172Y0114905D01*
X0154891Y0110263D01*
X0154891Y0110263D01*
X0152340Y0106179D01*
X0152340Y0106179D01*
X0152340Y0106179D01*
X0148729Y0102993D01*
X0148729Y0102993D01*
X0144360Y0100969D01*
X0144360Y0100969D01*
X0139595Y0100275D01*
X0134830Y0100969D01*
X0134830Y0100969D01*
X0130461Y0102993D01*
X0130461Y0102993D01*
X0126851Y0106179D01*
X0126851Y0106179D01*
X0124299Y0110263D01*
X0124299Y0110263D01*
X0123019Y0114905D01*
X0123019Y0114905D01*
X0123115Y0119719D01*
X0123115Y0119719D01*
X0123233Y0120087D01*
X0122384Y0120691D01*
X0122384Y0120691D01*
X0122384Y0120691D01*
X0118380Y0125330D01*
X0118380Y0125330D01*
X0115596Y0130789D01*
X0115596Y0130789D01*
X0115367Y0131763D01*
X0114116Y0130512D01*
X0108791Y0125187D01*
X0106880Y0124395D01*
X0106488Y0124395D01*
X0106488Y0117441D01*
X0105697Y0116650D01*
X0105697Y0116650D01*
X0104234Y0115187D01*
X0104234Y0115187D01*
X0103442Y0114395D01*
X0099874Y0114395D01*
X0102775Y0111495D01*
X0103521Y0109694D01*
X0103521Y0095038D01*
X0104311Y0094711D01*
X0104986Y0094035D01*
X0105241Y0093421D01*
X0105448Y0093781D01*
X0105783Y0094116D01*
X0106194Y0094353D01*
X0106652Y0094476D01*
X0110641Y0094476D01*
X0110641Y0090498D01*
X0111797Y0090498D01*
X0111797Y0094476D01*
X0115787Y0094476D01*
X0116245Y0094353D01*
X0116655Y0094116D01*
X0116990Y0093781D01*
X0117227Y0093371D01*
X0117350Y0092913D01*
X0117350Y0090498D01*
X0111797Y0090498D01*
X0111797Y0089342D01*
X0111797Y0085364D01*
X0115787Y0085364D01*
X0116245Y0085487D01*
X0116655Y0085724D01*
X0116990Y0086059D01*
X0117227Y0086469D01*
X0117350Y0086927D01*
X0117350Y0089342D01*
X0111797Y0089342D01*
X0110641Y0089342D01*
X0110641Y0085364D01*
X0106652Y0085364D01*
X0106194Y0085487D01*
X0105783Y0085724D01*
X0105448Y0086059D01*
X0105241Y0086419D01*
X0104986Y0085805D01*
X0104311Y0085130D01*
X0103429Y0084764D01*
X0093813Y0084764D01*
X0092931Y0085130D01*
X0092785Y0085275D01*
X0093151Y0083910D01*
X0093151Y0081108D01*
X0092426Y0078401D01*
X0091025Y0075974D01*
X0089043Y0073993D01*
X0086617Y0072591D01*
X0083910Y0071866D01*
X0081108Y0071866D01*
X0078401Y0072591D01*
X0075228Y0074739D02*
X0043939Y0074739D01*
X0043939Y0076337D02*
X0073783Y0076337D01*
X0072860Y0077936D02*
X0043939Y0077936D01*
X0043939Y0079534D02*
X0072288Y0079534D01*
X0071866Y0081133D02*
X0043939Y0081133D01*
X0043939Y0082731D02*
X0071866Y0082731D01*
X0071979Y0084330D02*
X0043939Y0084330D01*
X0043939Y0085928D02*
X0072407Y0085928D01*
X0073117Y0087527D02*
X0043939Y0087527D01*
X0043939Y0089125D02*
X0074075Y0089125D01*
X0075673Y0090724D02*
X0043939Y0090724D01*
X0043939Y0092322D02*
X0078222Y0092322D01*
X0086796Y0092322D02*
X0091890Y0092322D01*
X0091890Y0090724D02*
X0089344Y0090724D01*
X0090943Y0089125D02*
X0091890Y0089125D01*
X0093039Y0084330D02*
X0173038Y0084330D01*
X0171770Y0085928D02*
X0116860Y0085928D01*
X0117350Y0087527D02*
X0171770Y0087527D01*
X0171770Y0089125D02*
X0117350Y0089125D01*
X0117350Y0090724D02*
X0173251Y0090724D01*
X0174850Y0092322D02*
X0117350Y0092322D01*
X0116851Y0093921D02*
X0176448Y0093921D01*
X0178047Y0095519D02*
X0103521Y0095519D01*
X0103521Y0097118D02*
X0179645Y0097118D01*
X0181338Y0098716D02*
X0103521Y0098716D01*
X0103521Y0100315D02*
X0139320Y0100315D01*
X0139595Y0100275D02*
X0139595Y0100275D01*
X0139871Y0100315D02*
X0180668Y0100315D01*
X0179813Y0101914D02*
X0176923Y0101914D01*
X0176927Y0101927D02*
X0176927Y0104342D01*
X0169799Y0104342D01*
X0169799Y0100364D01*
X0175364Y0100364D01*
X0175822Y0100487D01*
X0176232Y0100724D01*
X0176567Y0101059D01*
X0176804Y0101469D01*
X0176927Y0101927D01*
X0176927Y0103512D02*
X0179813Y0103512D01*
X0179813Y0105111D02*
X0169799Y0105111D01*
X0169799Y0105498D02*
X0176927Y0105498D01*
X0176927Y0107913D01*
X0176804Y0108371D01*
X0176567Y0108781D01*
X0176232Y0109116D01*
X0175822Y0109353D01*
X0175364Y0109476D01*
X0169799Y0109476D01*
X0169799Y0105498D01*
X0168643Y0105498D01*
X0168643Y0104342D01*
X0161516Y0104342D01*
X0161516Y0101927D01*
X0161638Y0101469D01*
X0161875Y0101059D01*
X0162211Y0100724D01*
X0162621Y0100487D01*
X0163079Y0100364D01*
X0168643Y0100364D01*
X0168643Y0104342D01*
X0169799Y0104342D01*
X0169799Y0105498D01*
X0168643Y0105498D02*
X0168643Y0109476D01*
X0163079Y0109476D01*
X0162621Y0109353D01*
X0162211Y0109116D01*
X0161875Y0108781D01*
X0161638Y0108371D01*
X0161516Y0107913D01*
X0161516Y0105498D01*
X0168643Y0105498D01*
X0168643Y0105111D02*
X0151129Y0105111D01*
X0152671Y0106709D02*
X0161516Y0106709D01*
X0161621Y0108308D02*
X0153669Y0108308D01*
X0154668Y0109906D02*
X0181326Y0109906D01*
X0179877Y0108308D02*
X0176821Y0108308D01*
X0176927Y0106709D02*
X0179813Y0106709D01*
X0182919Y0111505D02*
X0155234Y0111505D01*
X0155675Y0113103D02*
X0182919Y0113103D01*
X0181535Y0114702D02*
X0156116Y0114702D01*
X0156144Y0116300D02*
X0179936Y0116300D01*
X0178338Y0117899D02*
X0156112Y0117899D01*
X0156080Y0119497D02*
X0176739Y0119497D01*
X0175141Y0121096D02*
X0157156Y0121096D01*
X0158536Y0122694D02*
X0173542Y0122694D01*
X0171944Y0124293D02*
X0159915Y0124293D01*
X0161096Y0125891D02*
X0170345Y0125891D01*
X0168747Y0127490D02*
X0161912Y0127490D01*
X0162727Y0129088D02*
X0167148Y0129088D01*
X0165550Y0130687D02*
X0163542Y0130687D01*
X0163947Y0132285D02*
X0164133Y0132285D01*
X0173870Y0137081D02*
X0173911Y0137081D01*
X0175462Y0135482D02*
X0175510Y0135482D01*
X0177060Y0133884D02*
X0223096Y0133884D01*
X0221497Y0135482D02*
X0191143Y0135482D01*
X0192742Y0137081D02*
X0220734Y0137081D01*
X0219135Y0138679D02*
X0193102Y0138679D01*
X0193102Y0140278D02*
X0217537Y0140278D01*
X0215938Y0141876D02*
X0201393Y0141876D01*
X0203835Y0143475D02*
X0214340Y0143475D01*
X0212741Y0145073D02*
X0204961Y0145073D01*
X0204961Y0146672D02*
X0211143Y0146672D01*
X0209544Y0148270D02*
X0204430Y0148270D01*
X0202832Y0149869D02*
X0207946Y0149869D01*
X0206347Y0151467D02*
X0198493Y0151467D01*
X0199508Y0149869D02*
X0196894Y0149869D01*
X0197910Y0148270D02*
X0195296Y0148270D01*
X0192095Y0149595D02*
X0201170Y0158670D01*
X0201170Y0163670D01*
X0206170Y0163670D02*
X0206170Y0156170D01*
X0224920Y0137420D01*
X0227423Y0140278D02*
X0235252Y0140278D01*
X0235252Y0141876D02*
X0224989Y0141876D01*
X0223391Y0143475D02*
X0235252Y0143475D01*
X0235252Y0145073D02*
X0221792Y0145073D01*
X0220194Y0146672D02*
X0235252Y0146672D01*
X0235252Y0148270D02*
X0218595Y0148270D01*
X0216997Y0149869D02*
X0235252Y0149869D01*
X0235252Y0151467D02*
X0215398Y0151467D01*
X0213800Y0153066D02*
X0235252Y0153066D01*
X0235252Y0154664D02*
X0212201Y0154664D01*
X0210603Y0156263D02*
X0235252Y0156263D01*
X0235252Y0157861D02*
X0209370Y0157861D01*
X0209370Y0159460D02*
X0235252Y0159460D01*
X0235252Y0161058D02*
X0209370Y0161058D01*
X0209961Y0162657D02*
X0235252Y0162657D01*
X0235252Y0164255D02*
X0209961Y0164255D01*
X0203330Y0154664D02*
X0201690Y0154664D01*
X0200091Y0153066D02*
X0204749Y0153066D01*
X0201170Y0146170D02*
X0199595Y0144595D01*
X0184920Y0144595D01*
X0182902Y0146613D01*
X0182902Y0173670D01*
X0172420Y0184152D01*
X0172420Y0198670D01*
X0169920Y0201170D01*
X0154920Y0201170D01*
X0160320Y0197824D02*
X0163236Y0197824D01*
X0163236Y0196226D02*
X0159960Y0196226D01*
X0159014Y0194627D02*
X0163236Y0194627D01*
X0163420Y0193029D02*
X0156618Y0193029D01*
X0153222Y0193029D02*
X0146618Y0193029D01*
X0149014Y0194627D02*
X0150826Y0194627D01*
X0143222Y0193029D02*
X0128389Y0193029D01*
X0127740Y0192380D02*
X0129961Y0194600D01*
X0129961Y0197740D01*
X0127740Y0199961D01*
X0124600Y0199961D01*
X0122380Y0197740D01*
X0122380Y0196905D01*
X0112935Y0187461D01*
X0112100Y0187461D01*
X0109880Y0185240D01*
X0109880Y0182100D01*
X0112100Y0179880D01*
X0115240Y0179880D01*
X0117461Y0182100D01*
X0117461Y0182935D01*
X0126905Y0192380D01*
X0127740Y0192380D01*
X0125956Y0191430D02*
X0163420Y0191430D01*
X0163420Y0189832D02*
X0124357Y0189832D01*
X0122759Y0188233D02*
X0163420Y0188233D01*
X0163420Y0186635D02*
X0150559Y0186635D01*
X0152158Y0185036D02*
X0163420Y0185036D01*
X0163420Y0183438D02*
X0153756Y0183438D01*
X0155355Y0181839D02*
X0163420Y0181839D01*
X0162895Y0180241D02*
X0156953Y0180241D01*
X0158552Y0178642D02*
X0161296Y0178642D01*
X0160736Y0177044D02*
X0160151Y0177044D01*
X0175620Y0186635D02*
X0187741Y0186635D01*
X0188179Y0186197D02*
X0190606Y0184796D01*
X0193312Y0184071D01*
X0196114Y0184071D01*
X0198821Y0184796D01*
X0201248Y0186197D01*
X0203230Y0188179D01*
X0204631Y0190606D01*
X0205356Y0193312D01*
X0205356Y0196114D01*
X0204631Y0198821D01*
X0203230Y0201248D01*
X0201248Y0203230D01*
X0198821Y0204631D01*
X0196114Y0205356D01*
X0193312Y0205356D01*
X0190606Y0204631D01*
X0188179Y0203230D01*
X0186197Y0201248D01*
X0184796Y0198821D01*
X0184071Y0196114D01*
X0184071Y0193312D01*
X0184796Y0190606D01*
X0186197Y0188179D01*
X0188179Y0186197D01*
X0190190Y0185036D02*
X0176062Y0185036D01*
X0177660Y0183438D02*
X0235252Y0183438D01*
X0235252Y0185036D02*
X0199237Y0185036D01*
X0201685Y0186635D02*
X0235252Y0186635D01*
X0235252Y0188233D02*
X0203261Y0188233D01*
X0204184Y0189832D02*
X0235252Y0189832D01*
X0235252Y0191430D02*
X0204852Y0191430D01*
X0205280Y0193029D02*
X0235252Y0193029D01*
X0235252Y0194627D02*
X0205356Y0194627D01*
X0205326Y0196226D02*
X0235252Y0196226D01*
X0235252Y0197824D02*
X0204898Y0197824D01*
X0204283Y0199423D02*
X0235252Y0199423D01*
X0235252Y0201021D02*
X0203360Y0201021D01*
X0201858Y0202620D02*
X0235252Y0202620D01*
X0235252Y0204218D02*
X0199536Y0204218D01*
X0189891Y0204218D02*
X0170923Y0204218D01*
X0172996Y0202620D02*
X0187569Y0202620D01*
X0186066Y0201021D02*
X0174594Y0201021D01*
X0175572Y0199423D02*
X0185143Y0199423D01*
X0184529Y0197824D02*
X0175620Y0197824D01*
X0175620Y0196226D02*
X0184101Y0196226D01*
X0184071Y0194627D02*
X0175620Y0194627D01*
X0175620Y0193029D02*
X0184147Y0193029D01*
X0184575Y0191430D02*
X0175620Y0191430D01*
X0175620Y0189832D02*
X0185243Y0189832D01*
X0186166Y0188233D02*
X0175620Y0188233D01*
X0179259Y0181839D02*
X0235252Y0181839D01*
X0235252Y0180241D02*
X0180857Y0180241D01*
X0182456Y0178642D02*
X0235252Y0178642D01*
X0235252Y0177044D02*
X0184054Y0177044D01*
X0185631Y0175445D02*
X0235252Y0175445D01*
X0235252Y0173847D02*
X0186102Y0173847D01*
X0186102Y0172248D02*
X0191061Y0172248D01*
X0189445Y0170649D02*
X0186102Y0170649D01*
X0186102Y0169051D02*
X0188774Y0169051D01*
X0188787Y0167452D02*
X0186102Y0167452D01*
X0186102Y0165854D02*
X0189585Y0165854D01*
X0190596Y0164255D02*
X0197380Y0164255D01*
X0197380Y0162657D02*
X0192195Y0162657D01*
X0193102Y0161058D02*
X0197970Y0161058D01*
X0197434Y0159460D02*
X0193102Y0159460D01*
X0193102Y0157861D02*
X0195836Y0157861D01*
X0194237Y0156263D02*
X0191924Y0156263D01*
X0192639Y0154664D02*
X0190325Y0154664D01*
X0192095Y0149595D02*
X0187902Y0149595D01*
X0181515Y0143475D02*
X0180528Y0143475D01*
X0182127Y0141876D02*
X0182829Y0141876D01*
X0182702Y0140278D02*
X0182502Y0140278D01*
X0182502Y0138679D02*
X0182702Y0138679D01*
X0183063Y0137081D02*
X0181893Y0137081D01*
X0180295Y0135482D02*
X0184661Y0135482D01*
X0180257Y0130687D02*
X0235252Y0130687D01*
X0235252Y0132285D02*
X0178659Y0132285D01*
X0178002Y0135482D02*
X0177802Y0135482D01*
X0177802Y0137081D02*
X0178002Y0137081D01*
X0178002Y0138679D02*
X0177802Y0138679D01*
X0177802Y0140278D02*
X0178002Y0140278D01*
X0178002Y0141876D02*
X0177802Y0141876D01*
X0177802Y0143475D02*
X0178002Y0143475D01*
X0175277Y0143475D02*
X0173870Y0143475D01*
X0173870Y0145073D02*
X0175070Y0145073D01*
X0181856Y0129088D02*
X0235252Y0129088D01*
X0235252Y0127490D02*
X0183454Y0127490D01*
X0185053Y0125891D02*
X0235252Y0125891D01*
X0235252Y0124293D02*
X0186651Y0124293D01*
X0188250Y0122694D02*
X0235252Y0122694D01*
X0235252Y0121096D02*
X0189848Y0121096D01*
X0191447Y0119497D02*
X0235252Y0119497D01*
X0235252Y0117899D02*
X0192742Y0117899D01*
X0196424Y0106709D02*
X0235252Y0106709D01*
X0235252Y0105111D02*
X0196424Y0105111D01*
X0196424Y0103512D02*
X0235252Y0103512D01*
X0235252Y0101914D02*
X0196424Y0101914D01*
X0195569Y0100315D02*
X0235252Y0100315D01*
X0235252Y0098716D02*
X0221096Y0098716D01*
X0222695Y0097118D02*
X0235252Y0097118D01*
X0235252Y0095519D02*
X0223070Y0095519D01*
X0223070Y0093921D02*
X0235252Y0093921D01*
X0235252Y0092322D02*
X0222295Y0092322D01*
X0220696Y0090724D02*
X0235252Y0090724D01*
X0235252Y0089125D02*
X0205116Y0089125D01*
X0206074Y0087527D02*
X0235252Y0087527D01*
X0235252Y0085928D02*
X0206784Y0085928D01*
X0207212Y0084330D02*
X0235252Y0084330D01*
X0235252Y0082731D02*
X0207324Y0082731D01*
X0207324Y0081133D02*
X0235252Y0081133D01*
X0235252Y0079534D02*
X0206903Y0079534D01*
X0206331Y0077936D02*
X0235252Y0077936D01*
X0235252Y0076337D02*
X0205408Y0076337D01*
X0203963Y0074739D02*
X0235252Y0074739D01*
X0235252Y0073140D02*
X0201740Y0073140D01*
X0191623Y0073140D02*
X0087567Y0073140D01*
X0089790Y0074739D02*
X0189401Y0074739D01*
X0187956Y0076337D02*
X0091235Y0076337D01*
X0092157Y0077936D02*
X0187033Y0077936D01*
X0186461Y0079534D02*
X0092730Y0079534D01*
X0093151Y0081133D02*
X0186039Y0081133D01*
X0186039Y0082731D02*
X0093151Y0082731D01*
X0092208Y0093921D02*
X0043939Y0093921D01*
X0043939Y0095519D02*
X0093721Y0095519D01*
X0093721Y0097118D02*
X0043939Y0097118D01*
X0043939Y0098716D02*
X0093721Y0098716D01*
X0093721Y0100315D02*
X0043939Y0100315D01*
X0043939Y0101914D02*
X0093721Y0101914D01*
X0093721Y0103512D02*
X0043939Y0103512D01*
X0043939Y0105111D02*
X0093721Y0105111D01*
X0093701Y0106709D02*
X0043939Y0106709D01*
X0043939Y0108308D02*
X0092103Y0108308D01*
X0090504Y0109906D02*
X0043939Y0109906D01*
X0043939Y0111505D02*
X0088906Y0111505D01*
X0087307Y0113103D02*
X0043939Y0113103D01*
X0043939Y0114702D02*
X0086544Y0114702D01*
X0086388Y0116300D02*
X0043939Y0116300D01*
X0043939Y0117899D02*
X0086088Y0117899D01*
X0086088Y0119497D02*
X0043939Y0119497D01*
X0043939Y0121096D02*
X0086088Y0121096D01*
X0087033Y0122694D02*
X0043939Y0122694D01*
X0043939Y0124293D02*
X0088632Y0124293D01*
X0087638Y0125891D02*
X0043939Y0125891D01*
X0043939Y0127490D02*
X0081009Y0127490D01*
X0079411Y0129088D02*
X0043939Y0129088D01*
X0043939Y0130687D02*
X0077812Y0130687D01*
X0076214Y0132285D02*
X0043939Y0132285D01*
X0043939Y0133884D02*
X0074615Y0133884D01*
X0073017Y0135482D02*
X0043939Y0135482D01*
X0043939Y0137081D02*
X0071418Y0137081D01*
X0069820Y0138679D02*
X0043939Y0138679D01*
X0043939Y0140278D02*
X0068221Y0140278D01*
X0066772Y0141876D02*
X0043939Y0141876D01*
X0043939Y0143475D02*
X0066330Y0143475D01*
X0066330Y0145073D02*
X0043939Y0145073D01*
X0043939Y0146672D02*
X0066330Y0146672D01*
X0065933Y0148270D02*
X0043939Y0148270D01*
X0043939Y0149869D02*
X0065933Y0149869D01*
X0065933Y0151467D02*
X0043939Y0151467D01*
X0043939Y0153066D02*
X0067427Y0153066D01*
X0072413Y0153066D02*
X0087405Y0153066D01*
X0086088Y0151749D02*
X0088934Y0154595D01*
X0086088Y0157441D01*
X0086088Y0161749D01*
X0089134Y0164795D01*
X0093442Y0164795D01*
X0096488Y0161749D01*
X0096488Y0157441D01*
X0093642Y0154595D01*
X0096488Y0151749D01*
X0096488Y0147441D01*
X0093442Y0144395D01*
X0089134Y0144395D01*
X0086088Y0147441D01*
X0086088Y0151749D01*
X0086088Y0151467D02*
X0073907Y0151467D01*
X0073907Y0149869D02*
X0086088Y0149869D01*
X0086088Y0148270D02*
X0073907Y0148270D01*
X0073530Y0146672D02*
X0086858Y0146672D01*
X0088456Y0145073D02*
X0073608Y0145073D01*
X0075207Y0143475D02*
X0088662Y0143475D01*
X0089383Y0144195D02*
X0086688Y0141501D01*
X0086688Y0139695D01*
X0091188Y0139695D01*
X0091188Y0139495D01*
X0091388Y0139495D01*
X0091388Y0134995D01*
X0093194Y0134995D01*
X0095888Y0137690D01*
X0095888Y0139495D01*
X0091388Y0139495D01*
X0091388Y0139695D01*
X0095888Y0139695D01*
X0095888Y0141501D01*
X0093194Y0144195D01*
X0091388Y0144195D01*
X0091388Y0139695D01*
X0091188Y0139695D01*
X0091188Y0144195D01*
X0089383Y0144195D01*
X0091188Y0143475D02*
X0091388Y0143475D01*
X0091388Y0141876D02*
X0091188Y0141876D01*
X0091188Y0140278D02*
X0091388Y0140278D01*
X0091188Y0139495D02*
X0086688Y0139495D01*
X0086688Y0137690D01*
X0089383Y0134995D01*
X0091188Y0134995D01*
X0091188Y0139495D01*
X0091188Y0138679D02*
X0091388Y0138679D01*
X0091388Y0137081D02*
X0091188Y0137081D01*
X0091188Y0135482D02*
X0091388Y0135482D01*
X0093681Y0135482D02*
X0098896Y0135482D01*
X0099383Y0134995D02*
X0096688Y0137690D01*
X0096688Y0139495D01*
X0101188Y0139495D01*
X0101388Y0139495D01*
X0101388Y0134995D01*
X0103194Y0134995D01*
X0105888Y0137690D01*
X0105888Y0139495D01*
X0101388Y0139495D01*
X0101388Y0139695D01*
X0105888Y0139695D01*
X0105888Y0141501D01*
X0103194Y0144195D01*
X0101388Y0144195D01*
X0101388Y0139695D01*
X0101188Y0139695D01*
X0101188Y0139495D01*
X0101188Y0134995D01*
X0099383Y0134995D01*
X0101188Y0135482D02*
X0101388Y0135482D01*
X0101388Y0137081D02*
X0101188Y0137081D01*
X0101188Y0138679D02*
X0101388Y0138679D01*
X0101188Y0139695D02*
X0096688Y0139695D01*
X0096688Y0141501D01*
X0099383Y0144195D01*
X0101188Y0144195D01*
X0101188Y0139695D01*
X0101188Y0140278D02*
X0101388Y0140278D01*
X0101388Y0141876D02*
X0101188Y0141876D01*
X0101188Y0143475D02*
X0101388Y0143475D01*
X0101388Y0144995D02*
X0103194Y0144995D01*
X0105888Y0147690D01*
X0105888Y0149495D01*
X0101388Y0149495D01*
X0101388Y0144995D01*
X0101388Y0145073D02*
X0101188Y0145073D01*
X0101188Y0144995D02*
X0101188Y0149495D01*
X0101388Y0149495D01*
X0101388Y0149695D01*
X0105888Y0149695D01*
X0105888Y0151501D01*
X0103194Y0154195D01*
X0101388Y0154195D01*
X0101388Y0149695D01*
X0101188Y0149695D01*
X0101188Y0149495D01*
X0096688Y0149495D01*
X0096688Y0147690D01*
X0099383Y0144995D01*
X0101188Y0144995D01*
X0101188Y0146672D02*
X0101388Y0146672D01*
X0101388Y0148270D02*
X0101188Y0148270D01*
X0101188Y0149695D02*
X0096688Y0149695D01*
X0096688Y0151501D01*
X0099383Y0154195D01*
X0101188Y0154195D01*
X0101188Y0149695D01*
X0101188Y0149869D02*
X0101388Y0149869D01*
X0101388Y0151467D02*
X0101188Y0151467D01*
X0101188Y0153066D02*
X0101388Y0153066D01*
X0104323Y0153066D02*
X0105970Y0153066D01*
X0105970Y0154664D02*
X0093711Y0154664D01*
X0095171Y0153066D02*
X0098253Y0153066D01*
X0096688Y0151467D02*
X0096488Y0151467D01*
X0096488Y0149869D02*
X0096688Y0149869D01*
X0096688Y0148270D02*
X0096488Y0148270D01*
X0095719Y0146672D02*
X0097706Y0146672D01*
X0099305Y0145073D02*
X0094120Y0145073D01*
X0093914Y0143475D02*
X0098662Y0143475D01*
X0097064Y0141876D02*
X0095513Y0141876D01*
X0095888Y0140278D02*
X0096688Y0140278D01*
X0096688Y0138679D02*
X0095888Y0138679D01*
X0095279Y0137081D02*
X0097297Y0137081D01*
X0103272Y0145073D02*
X0105970Y0145073D01*
X0105970Y0143475D02*
X0103914Y0143475D01*
X0105513Y0141876D02*
X0105970Y0141876D01*
X0105970Y0140278D02*
X0105888Y0140278D01*
X0105888Y0138679D02*
X0105970Y0138679D01*
X0105970Y0137081D02*
X0105279Y0137081D01*
X0104378Y0135482D02*
X0103681Y0135482D01*
X0111094Y0127490D02*
X0117279Y0127490D01*
X0116463Y0129088D02*
X0112692Y0129088D01*
X0114291Y0130687D02*
X0115648Y0130687D01*
X0118094Y0125891D02*
X0109495Y0125891D01*
X0106488Y0124293D02*
X0119276Y0124293D01*
X0120655Y0122694D02*
X0106488Y0122694D01*
X0106488Y0121096D02*
X0122034Y0121096D01*
X0123111Y0119497D02*
X0106488Y0119497D01*
X0106488Y0117899D02*
X0123079Y0117899D01*
X0123047Y0116300D02*
X0105347Y0116300D01*
X0103748Y0114702D02*
X0123075Y0114702D01*
X0123516Y0113103D02*
X0101167Y0113103D01*
X0102765Y0111505D02*
X0123957Y0111505D01*
X0124522Y0109906D02*
X0103433Y0109906D01*
X0103521Y0108308D02*
X0125521Y0108308D01*
X0126520Y0106709D02*
X0103521Y0106709D01*
X0103521Y0105111D02*
X0128062Y0105111D01*
X0129873Y0103512D02*
X0103521Y0103512D01*
X0103521Y0101914D02*
X0132791Y0101914D01*
X0146399Y0101914D02*
X0161519Y0101914D01*
X0161516Y0103512D02*
X0149317Y0103512D01*
X0168643Y0103512D02*
X0169799Y0103512D01*
X0169799Y0101914D02*
X0168643Y0101914D01*
X0168643Y0106709D02*
X0169799Y0106709D01*
X0169799Y0108308D02*
X0168643Y0108308D01*
X0184098Y0089125D02*
X0188248Y0089125D01*
X0187290Y0087527D02*
X0182499Y0087527D01*
X0180901Y0085928D02*
X0186580Y0085928D01*
X0186152Y0084330D02*
X0179302Y0084330D01*
X0220790Y0108308D02*
X0235252Y0108308D01*
X0235252Y0109906D02*
X0222388Y0109906D01*
X0223080Y0111505D02*
X0235252Y0111505D01*
X0235252Y0113103D02*
X0223080Y0113103D01*
X0222621Y0114702D02*
X0235252Y0114702D01*
X0235252Y0116300D02*
X0221022Y0116300D01*
X0226744Y0133884D02*
X0235252Y0133884D01*
X0235252Y0135482D02*
X0228343Y0135482D01*
X0228711Y0137081D02*
X0235252Y0137081D01*
X0235252Y0138679D02*
X0228711Y0138679D01*
X0235252Y0165854D02*
X0221859Y0165854D01*
X0222657Y0167452D02*
X0235252Y0167452D01*
X0235252Y0169051D02*
X0222670Y0169051D01*
X0221999Y0170649D02*
X0235252Y0170649D01*
X0235252Y0172248D02*
X0220383Y0172248D01*
X0235252Y0205817D02*
X0160083Y0205817D01*
X0159312Y0207415D02*
X0235252Y0207415D01*
X0235252Y0209014D02*
X0157337Y0209014D01*
X0152503Y0209014D02*
X0147337Y0209014D01*
X0149312Y0207415D02*
X0150529Y0207415D01*
X0142503Y0209014D02*
X0122171Y0209014D01*
X0123769Y0210612D02*
X0235252Y0210612D01*
X0235252Y0212211D02*
X0125368Y0212211D01*
X0126966Y0213809D02*
X0235252Y0213809D01*
X0235252Y0215408D02*
X0128565Y0215408D01*
X0130424Y0217006D02*
X0235252Y0217006D01*
X0235237Y0218605D02*
X0132022Y0218605D01*
X0132864Y0220203D02*
X0235147Y0220203D01*
X0234787Y0221802D02*
X0132864Y0221802D01*
X0132377Y0223400D02*
X0234422Y0223400D01*
X0233784Y0224999D02*
X0130778Y0224999D01*
X0126581Y0224999D02*
X0045406Y0224999D01*
X0044769Y0223400D02*
X0124983Y0223400D01*
X0123645Y0221802D02*
X0044404Y0221802D01*
X0044043Y0220203D02*
X0122046Y0220203D01*
X0120448Y0218605D02*
X0043954Y0218605D01*
X0043939Y0217006D02*
X0118849Y0217006D01*
X0117251Y0215408D02*
X0043939Y0215408D01*
X0043939Y0213809D02*
X0115652Y0213809D01*
X0114054Y0212211D02*
X0043939Y0212211D01*
X0043939Y0210612D02*
X0112455Y0210612D01*
X0110857Y0209014D02*
X0043939Y0209014D01*
X0043939Y0207415D02*
X0109258Y0207415D01*
X0107660Y0205817D02*
X0043939Y0205817D01*
X0043939Y0204218D02*
X0079655Y0204218D01*
X0080369Y0204631D02*
X0077942Y0203230D01*
X0075961Y0201248D01*
X0074560Y0198821D01*
X0073835Y0196114D01*
X0073835Y0193312D01*
X0074560Y0190606D01*
X0075961Y0188179D01*
X0077942Y0186197D01*
X0080369Y0184796D01*
X0083076Y0184071D01*
X0085878Y0184071D01*
X0088585Y0184796D01*
X0091012Y0186197D01*
X0092993Y0188179D01*
X0094394Y0190606D01*
X0095120Y0193312D01*
X0095120Y0196114D01*
X0094394Y0198821D01*
X0092993Y0201248D01*
X0091012Y0203230D01*
X0088585Y0204631D01*
X0085878Y0205356D01*
X0083076Y0205356D01*
X0080369Y0204631D01*
X0077333Y0202620D02*
X0043939Y0202620D01*
X0043939Y0201021D02*
X0075830Y0201021D01*
X0074907Y0199423D02*
X0043939Y0199423D01*
X0043939Y0197824D02*
X0074293Y0197824D01*
X0073864Y0196226D02*
X0043939Y0196226D01*
X0043939Y0194627D02*
X0073835Y0194627D01*
X0073911Y0193029D02*
X0043939Y0193029D01*
X0043939Y0191430D02*
X0074339Y0191430D01*
X0075007Y0189832D02*
X0043939Y0189832D01*
X0043939Y0188233D02*
X0075930Y0188233D01*
X0077505Y0186635D02*
X0043939Y0186635D01*
X0043939Y0185036D02*
X0079954Y0185036D01*
X0089001Y0185036D02*
X0094683Y0185036D01*
X0094683Y0183438D02*
X0043939Y0183438D01*
X0043939Y0181839D02*
X0095070Y0181839D01*
X0095070Y0180241D02*
X0043939Y0180241D01*
X0043939Y0178642D02*
X0095070Y0178642D01*
X0095070Y0177044D02*
X0043939Y0177044D01*
X0043939Y0175445D02*
X0095070Y0175445D01*
X0095070Y0173847D02*
X0043939Y0173847D01*
X0043939Y0172248D02*
X0095070Y0172248D01*
X0095507Y0170649D02*
X0043939Y0170649D01*
X0043939Y0169051D02*
X0096948Y0169051D01*
X0098547Y0167452D02*
X0043939Y0167452D01*
X0043939Y0165854D02*
X0100145Y0165854D01*
X0101744Y0164255D02*
X0093982Y0164255D01*
X0095580Y0162657D02*
X0097844Y0162657D01*
X0096688Y0161058D02*
X0096488Y0161058D01*
X0096488Y0159460D02*
X0096688Y0159460D01*
X0096688Y0157861D02*
X0096488Y0157861D01*
X0095310Y0156263D02*
X0098115Y0156263D01*
X0101188Y0156263D02*
X0101388Y0156263D01*
X0101388Y0157861D02*
X0101188Y0157861D01*
X0101188Y0159460D02*
X0101388Y0159460D01*
X0101388Y0161058D02*
X0101188Y0161058D01*
X0101188Y0162657D02*
X0101388Y0162657D01*
X0105888Y0159460D02*
X0105970Y0159460D01*
X0105970Y0157861D02*
X0105888Y0157861D01*
X0105970Y0156263D02*
X0104461Y0156263D01*
X0105888Y0151467D02*
X0105970Y0151467D01*
X0105970Y0149869D02*
X0105888Y0149869D01*
X0105888Y0148270D02*
X0105970Y0148270D01*
X0105970Y0146672D02*
X0104870Y0146672D01*
X0088865Y0154664D02*
X0043939Y0154664D01*
X0043939Y0156263D02*
X0087267Y0156263D01*
X0086088Y0157861D02*
X0043939Y0157861D01*
X0043939Y0159460D02*
X0086088Y0159460D01*
X0086088Y0161058D02*
X0043939Y0161058D01*
X0043939Y0162657D02*
X0086996Y0162657D01*
X0088594Y0164255D02*
X0043939Y0164255D01*
X0076805Y0141876D02*
X0087064Y0141876D01*
X0086688Y0140278D02*
X0078404Y0140278D01*
X0080002Y0138679D02*
X0086688Y0138679D01*
X0087297Y0137081D02*
X0081601Y0137081D01*
X0083199Y0135482D02*
X0088896Y0135482D01*
X0088223Y0133884D02*
X0084798Y0133884D01*
X0108729Y0167452D02*
X0108849Y0167452D01*
X0110447Y0169051D02*
X0107130Y0169051D01*
X0107217Y0170649D02*
X0112046Y0170649D01*
X0113644Y0172248D02*
X0108815Y0172248D01*
X0109104Y0173847D02*
X0115243Y0173847D01*
X0116841Y0175445D02*
X0109104Y0175445D01*
X0108920Y0177044D02*
X0118440Y0177044D01*
X0120038Y0178642D02*
X0108920Y0178642D01*
X0108920Y0180241D02*
X0111739Y0180241D01*
X0110140Y0181839D02*
X0108920Y0181839D01*
X0108920Y0183438D02*
X0109880Y0183438D01*
X0109880Y0185036D02*
X0108920Y0185036D01*
X0108920Y0186635D02*
X0111274Y0186635D01*
X0108920Y0188233D02*
X0113708Y0188233D01*
X0115306Y0189832D02*
X0108920Y0189832D01*
X0108920Y0191430D02*
X0116905Y0191430D01*
X0118503Y0193029D02*
X0108920Y0193029D01*
X0108920Y0194627D02*
X0120102Y0194627D01*
X0121700Y0196226D02*
X0109383Y0196226D01*
X0110981Y0197824D02*
X0122464Y0197824D01*
X0124062Y0199423D02*
X0112580Y0199423D01*
X0114178Y0201021D02*
X0134720Y0201021D01*
X0134720Y0199423D02*
X0135120Y0199423D01*
X0135120Y0197824D02*
X0134720Y0197824D01*
X0134720Y0196226D02*
X0135120Y0196226D01*
X0135120Y0194627D02*
X0134720Y0194627D01*
X0131675Y0194627D02*
X0129961Y0194627D01*
X0129961Y0196226D02*
X0130524Y0196226D01*
X0130120Y0197824D02*
X0129877Y0197824D01*
X0130120Y0199423D02*
X0128278Y0199423D01*
X0130120Y0202620D02*
X0115777Y0202620D01*
X0117375Y0204218D02*
X0130120Y0204218D01*
X0130408Y0205817D02*
X0118974Y0205817D01*
X0120572Y0207415D02*
X0131377Y0207415D01*
X0134720Y0207415D02*
X0135120Y0207415D01*
X0135120Y0205817D02*
X0134720Y0205817D01*
X0134720Y0204218D02*
X0135120Y0204218D01*
X0135120Y0202620D02*
X0134720Y0202620D01*
X0139432Y0205817D02*
X0139757Y0205817D01*
X0140529Y0207415D02*
X0138463Y0207415D01*
X0139317Y0196226D02*
X0139881Y0196226D01*
X0140826Y0194627D02*
X0138165Y0194627D01*
X0126170Y0196170D02*
X0113670Y0183670D01*
X0115601Y0180241D02*
X0121637Y0180241D01*
X0123235Y0181839D02*
X0117200Y0181839D01*
X0117963Y0183438D02*
X0124834Y0183438D01*
X0126432Y0185036D02*
X0119562Y0185036D01*
X0121160Y0186635D02*
X0128031Y0186635D01*
X0106061Y0204218D02*
X0089299Y0204218D01*
X0091622Y0202620D02*
X0104463Y0202620D01*
X0102864Y0201021D02*
X0093124Y0201021D01*
X0094047Y0199423D02*
X0101420Y0199423D01*
X0100920Y0197824D02*
X0094662Y0197824D01*
X0095090Y0196226D02*
X0100920Y0196226D01*
X0100920Y0194627D02*
X0095120Y0194627D01*
X0095044Y0193029D02*
X0100920Y0193029D01*
X0100920Y0191430D02*
X0094615Y0191430D01*
X0093948Y0189832D02*
X0100920Y0189832D01*
X0096344Y0188233D02*
X0093025Y0188233D01*
X0091449Y0186635D02*
X0094746Y0186635D01*
X0050267Y0231393D02*
X0228923Y0231393D01*
X0230698Y0229794D02*
X0048492Y0229794D01*
X0047218Y0228196D02*
X0231973Y0228196D01*
X0233015Y0226597D02*
X0046176Y0226597D01*
X0052545Y0232991D02*
X0226645Y0232991D01*
X0222664Y0234590D02*
X0056527Y0234590D01*
X0105034Y0093921D02*
X0105588Y0093921D01*
X0110641Y0093921D02*
X0111797Y0093921D01*
X0111797Y0092322D02*
X0110641Y0092322D01*
X0110641Y0090724D02*
X0111797Y0090724D01*
X0111797Y0089125D02*
X0110641Y0089125D01*
X0110641Y0087527D02*
X0111797Y0087527D01*
X0111797Y0085928D02*
X0110641Y0085928D01*
X0105579Y0085928D02*
X0105037Y0085928D01*
D23*
X0111170Y0076170D03*
X0061170Y0098670D03*
X0071170Y0182420D03*
X0098670Y0221170D03*
X0126170Y0196170D03*
X0113670Y0183670D03*
X0148670Y0213670D03*
X0201170Y0163670D03*
X0206170Y0163670D03*
X0201170Y0146170D03*
X0197420Y0128670D03*
X0224920Y0137420D03*
X0219920Y0086170D03*
X0179920Y0077420D03*
D24*
X0104920Y0174270D03*
X0128680Y0221180D03*
X0167420Y0196170D03*
X0164920Y0176348D03*
M02*
