<svg xmlns="http://www.w3.org/2000/svg" xmlns:xlink="http://www.w3.org/1999/xlink" width="81.471" height="31.551" viewBox="0 0 81.471 31.551">
  <defs>
    <filter id="パス_423" x="0" y="0" width="81.471" height="31.551" filterUnits="userSpaceOnUse">
      <feOffset input="SourceAlpha"/>
      <feGaussianBlur stdDeviation="2" result="blur"/>
      <feFlood flood-color="#0000fd"/>
      <feComposite operator="in" in2="blur"/>
      <feComposite in="SourceGraphic"/>
    </filter>
  </defs>
  <g transform="matrix(1, 0, 0, 1, 0, 0)" filter="url(#パス_423)">
    <path id="パス_423-2" data-name="パス 423" d="M11.629-16.275H4.52v6.3H11.1v1.917H4.52V0H2.387V-18.205h9.242Zm12.553,5.383a2.546,2.546,0,0,0-1.574-.419,2.657,2.657,0,0,0-2.228,1.257,5.811,5.811,0,0,0-.9,3.428V0H17.4V-13h2.082v2.679h.051a4.539,4.539,0,0,1,1.358-2.139,3.1,3.1,0,0,1,2.044-.768,3.4,3.4,0,0,1,1.244.178ZM39.49-5.979H30.311a4.862,4.862,0,0,0,1.168,3.352,4.026,4.026,0,0,0,3.072,1.181,6.387,6.387,0,0,0,4.037-1.447V-.939A7.545,7.545,0,0,1,34.056.3a5.5,5.5,0,0,1-4.329-1.771,7.249,7.249,0,0,1-1.574-4.983,7.109,7.109,0,0,1,1.72-4.945A5.516,5.516,0,0,1,34.145-13.3a4.887,4.887,0,0,1,3.948,1.65,6.881,6.881,0,0,1,1.4,4.583ZM37.357-7.744a4.236,4.236,0,0,0-.87-2.806,2.963,2.963,0,0,0-2.38-1,3.363,3.363,0,0,0-2.5,1.054,4.782,4.782,0,0,0-1.27,2.755ZM54.544,0H52.462V-2.031h-.051a4.359,4.359,0,0,1-4,2.336A4.274,4.274,0,0,1,45.372-.724a3.563,3.563,0,0,1-1.1-2.729q0-3.644,4.291-4.24l3.9-.546q0-3.313-2.679-3.313a6.4,6.4,0,0,0-4.24,1.6v-2.133A8.056,8.056,0,0,1,49.961-13.3q4.583,0,4.583,4.85ZM52.462-6.576l-3.136.432a5.091,5.091,0,0,0-2.184.717,2.069,2.069,0,0,0-.736,1.822,1.984,1.984,0,0,0,.679,1.555,2.625,2.625,0,0,0,1.809.6,3.342,3.342,0,0,0,2.558-1.085,3.878,3.878,0,0,0,1.009-2.749ZM71.858,0h-2.92L63.2-6.246h-.051V0H61.067V-19.246h2.082v12.2H63.2L68.659-13h2.729l-6.03,6.271Z" transform="translate(3.61 25.25)" fill="#cbf9ff"/>
  </g>
</svg>